##TITLE=31P_DE-80H_X3
 64 sc D2O
 26.2.2025
##JCAMPDX= 6.0         $$ Bruker NMR JCAMP-DX V2.0
##DATA TYPE= NMR SPECTRUM
##DATA CLASS= NTUPLES
##ORIGIN= UXNMR, Bruker Analytische Messtechnik GmbH
##OWNER= root
$$ XWIN-NMR		Version 3.5
$$ Wed Mar 19 14:41:10 2025 Russian Standard Time (UT+4h)  Yarkov@DPX200
##.OBSERVE FREQUENCY= 81.013821
##.OBSERVE NUCLEUS= ^31P
##.ACQUISITION MODE= SIMULTANEOUS
##.ACQUISITION SCHEME= undefined
##.AVERAGES= 64
##.DIGITISER RES= 17
##SPECTROMETER/DATA SYSTEM= spect
##.PULSE SEQUENCE= zgpg30
##.SOLVENT NAME= CDCl3
##.SHIFT REFERENCE= (INTERNAL, CDCl3, 0, 198.062)
##AUDIT TRAIL= $$ (NUMBER, WHEN, WHO, WHERE, WHAT)
$$ ##TITLE= Audit trail, XWIN-NMR		Version 3.5
$$ ##JCAMPDX= 5.01
$$ ##ORIGIN= Bruker BioSpin GmbH
$$ ##OWNER= Yarkov
$$ C:/Bruker/XWIN-NMR/data/yarkov2/nmr/P31/2/pdata/1/auditp.txt
$$ ##AUDIT TRAIL=  $$ (NUMBER, WHEN, WHO, WHERE, WHAT)
(   1,<2025-03-19 14:39:46.34 +0400>,<Yarkov>,<DPX200>,
      <created by zg, POWCHK disabled, PULCHK disabled
       configuration hash MD5:
       00 E9 B6 7A A2 85 ED C7 34 08 36 98 17 FE 4E 26
       data hash MD5: 32K
       42 FF C7 87 6B AB C7 09 F5 3C D3 AE 35 37 F1 75>)
(   2,<2025-03-19 14:39:51.45 +0400>,<Yarkov>,<DPX200>,
      <Start of raw data processing
       efp BC_mod = 2 LB = 1.5 FT_mod = 6 PKNL = 1 PHC0 = 1775.687 PHC1 = 6.895418 SI = 64K 
       data hash MD5: 64K
       38 B1 3C 76 E1 CD 08 50 6D 35 0D E1 31 2E 31 73>)
(   3,<2025-03-19 14:40:15.87 +0400>,<Yarkov>,<DPX200>,
      <pk PHC0 = 8.762818 PHC1 = 0 
       data hash MD5: 64K
       C7 0D F0 48 90 E2 B3 58 A5 9C C2 72 56 3B 26 29>)
$$ ##END=
$$ 
$$ hash MD5
$$ 5D BF 16 24 F8 6F 0B AB 51 FD F2 42 57 C1 23 C1
##$RELAX= 
##$RELAX= 
##$RELAX= 
##$RELAX= 
##$RELAX= 
##$RELAX= 
##$RELAX= 
##$RELAX= 
$$ Bruker specific parameters
$$ --------------------------
##$DU= <C:/Bruker/XWIN-NMR>
##$EXPNO= 2
##$NAME= <P31>
##$PROCNO= 1
##$TYPE= <nmr>
##$USER= <yarkov2>
##$AMP= (0..31)
100 100 100 100 100 100 100 100 100 100 100 100 100 100 100 100 100 100 
100 100 100 100 100 100 100 100 100 100 100 100 100 100 
##$AQSEQ= 0
##$AQ_mod= 1
##$AUNM= <au_zg>
##$AUTOPOS= <>
##$BF1= 81.014009
##$BF2= 200.13
##$BF3= 200.13
##$BF4= 200.13
##$BF5= 200.13
##$BF6= 200.13
##$BF7= 200.13
##$BF8= 200.13
##$BYTORDA= 1
##$CFDGTYP= 0
##$CFRGTYP= 5
##$CHEMSTR= <none>
##$CNST= (0..31)
1 1 145 1 1 1 1 1 1 1 1 1 1 1 1 1 1 1 1 1 1 1 1 1 1 1 1 1 1 1 1 1 
##$CPDPRG= <waltz16>
##$CPDPRG1= <>
##$CPDPRG2= <waltz16>
##$CPDPRG3= <>
##$CPDPRG4= <mlev>
##$CPDPRG5= <mlev>
##$CPDPRG6= <mlev>
##$CPDPRG7= <mlev>
##$CPDPRG8= <mlev>
##$CPDPRGB= <>
##$CPDPRGT= <>
##$D= (0..31)
0 1 0 0 0 0 0 0 0 0.06 0 0.03 2e-05 3e-06 0 0 0.0002 0 0 0 0 0 0 0 0 0 
0 0 0 0 0 0 
##$DATE= 1742380785
##$DBL= (0..7)
120 120 120 11 120 120 24 19 
##$DBP= (0..7)
150 150 150 150 150 150 150 150 
##$DBP07= 0
##$DBPNAM0= <>
##$DBPNAM1= <>
##$DBPNAM2= <>
##$DBPNAM3= <>
##$DBPNAM4= <>
##$DBPNAM5= <>
##$DBPNAM6= <>
##$DBPNAM7= <>
##$DBPOAL= (0..7)
$$ [...]
##$SUBNAM2= <"">
##$SUBNAM3= <"">
##$SUBNAM4= <"">
##$SUBNAM5= <"">
##$SUBNAM6= <"">
##$SUBNAM7= <"">
##$SUBNAM8= <"">
##$SUBNAM9= <"">
##$SW= 400.765351723535
##$SWIBOX= (0..15)
0 1 3 0 0 0 0 0 0 0 0 0 0 0 0 0 
##$SW_h= 32467.5324675325
##$TD= 32768
##$TD0= 1
##$TE= 0
##$TE2= 300
##$TE3= 300
##$TEG= 300
##$TL= (0..7)
0 120 53 12 22 120 120 120 
##$TP= (0..7)
150 150 150 150 150 150 150 150 
##$TP07= 0
##$TPNAME0= <>
##$TPNAME1= <>
##$TPNAME2= <>
##$TPNAME3= <>
##$TPNAME4= <>
##$TPNAME5= <>
##$TPNAME6= <>
##$TPNAME7= <>
##$TPOAL= (0..7)
0.5 0.5 0.5 0.5 0.5 0.5 0.5 0.5 
##$TPOFFS= (0..7)
0 0 0 0 0 0 0 0 
##$TUNHIN= 0
##$TUNHOUT= 0
##$TUNXOUT= 0
##$USERA1= <user>
##$USERA2= <user>
##$USERA3= <user>
##$USERA4= <user>
##$USERA5= <user>
##$V9= 5
##$VALIST= <valist>
##$VCLIST= <CCCCCCCCCCCCCCC>
##$VD= 0
##$VDLIST= <DDDDDDDDDDDDDDD>
##$VPLIST= <PPPPPPPPPPPPPPP>
##$VTLIST= <TTTTTTTTTTTTTTT>
##$WBST= 1024
##$WBSW= 4
##$XGAIN= (0..3)
0 0 0 0 
##$XL= 0
##$YL= 0
##$YMAX_a= 80296
##$YMIN_a= -91639
##$ZGOPTNS= <>
##$ZL1= 120
##$ZL2= 120
##$ZL3= 120
##$ZL4= 120
##$ABSF1= 0
##$ABSF2= 0
##$ABSG= 0
##$ABSL= 0
##$ALPHA= 0
##$AQORDER= 0
##$ASSFAC= 0
##$ASSFACI= 0
##$ASSFACX= 0
##$ASSWID= 0
##$AUNMP= <proc_1d>
##$AZFE= 0.1
##$AZFW= 0.5
##$BCFW= 0
##$BC_mod= 2
##$BYTORDP= 0
##$COROFFS= 0
##$CY= -3
##$DATMOD= 1
##$DC= 0
##$DFILT= <>
##$DTYPP= 0
##$F1P= 0
##$F2P= 0
##$FCOR= 1
##$FTSIZE= 65536
##$FT_mod= 6
##$GAMMA= 0
##$GB= 0
##$INTBC= 1
##$INTSCL= 9.790993e-09
##$ISEN= 30
##$LB= 1.5
##$LEV0= 0
##$LPBIN= 0
##$MAXI= 10000
##$MC2= 0
##$MEAN= 0
##$ME_mod= 0
##$MI= 50
##$NCOEF= 0
##$NC_proc= -6
##$NLEV= 6
##$NOISF1= 182.463
##$NOISF2= 159.3651
##$NSP= 0
##$NTH_PI= 0
##$NZP= 0
##$OFFSET= 198.0616
##$PC= 4
##$PHC0= 1784.45
##$PHC1= 6.895418
##$PH_mod= 1
##$PKNL= yes
##$PPARMOD= 0
##$PSCAL= 0
##$PSIGN= 0
##$REVERSE= no
##$SF= 81.0140089999434
##$SI= 65536
##$SIGF1= 159.3651
##$SIGF2= -187.1042
##$SINO= 113.3802
##$SIOLD= 16384
##$SREGLST= <1H.CDCl3>
##$SSB= 0
##$STSI= 65536
##$STSR= 0
##$SW_p= 32467.5324675325
##$SYMM= 0
##$S_DEV= 0
##$TDeff= 32768
##$TDoff= 0
##$TI= <>
##$TILT= no
##$TM1= 0
##$TM2= 0
##$TOPLEV= 0
##$USERP1= <user>
##$USERP2= <user>
##$USERP3= <user>
##$USERP4= <user>
##$USERP5= <user>
##$WDW= 1
##$XDIM= 65536
##$YMAX_p= 333523092
##$YMIN_p= -61497937
$$ End of Bruker specific parameters
$$ ---------------------------------
##NTUPLES= NMR SPECTRUM
##VAR_NAME=  FREQUENCY,     SPECTRUM/REAL,   SPECTRUM/IMAG
##SYMBOL=    X,             R,               I
##VAR_TYPE=  INDEPENDENT,   DEPENDENT,       DEPENDENT
##VAR_FORM=  AFFN,          ASDF,            ASDF
##VAR_DIM=   65536,         65536,           65536
##UNITS=     HZ,            ARBITRARY UNITS, ARBITRARY UNITS
##FACTOR=    0.49542278885378, 1,            1
##FIRST=     16045.7642231865, 0,            0
##LAST=      -16421.768244346, 0,            0
##MIN=       -16421.768244346, -61497937,    0
##MAX=       16045.7642231865, 333523092,    0
$$ Real data points
##PAGE= N=1
##DATA TABLE= (X++(R..R)), XYDATA
$$ [...]
48201 -2368417 -1992842 -1184074 -701117 -1045367 -1956462 -2778826 -3140835 -3100005 -2799826 -2269748
48191 -2269748 -1567519 -906550 -505203 -324247 -60966 449132 827954 450783 -611365
48182 -611365 -1262351 -551608 926566 1519653 557029 -860757 -1476220 -1408207 -1328467 -949929
48172 -949929 361718 1835609 1712282 -312157 -2399366 -2905842 -2266209 -1819679 -1876441
48163 -1876441 -2013118 -2373847 -3289617 -4096898 -3784224 -2693082 -2224065 -2760566 -3181365
48154 -3181365 -2721645 -2052845 -1969788 -2132575 -1871654 -1333044 -958073 -537502 282784 1059337
48144 1059337 1054404 379615 -210798 -449864 -664787 -899145 -758684 -152459 530550 1052758
48134 1052758 1484457 1644180 1056882 -281128 -1624205 -2272106 -2301175 -2276113 -2509214
48125 -2509214 -2798755 -2722123 -2088501 -1212108 -661421 -566415 -400284 205246 707858 320137
48115 320137 -701053 -1195418 -689107 -133854 -663955 -2118464 -3272257 -3262127 -2385925
48106 -2385925 -1620163 -1620377 -2154124 -2444324 -2154722 -1894065 -2397579 -3324265 -3446090 -2142194
48096 -2142194 -137454 1460119 2300612 2683516 2879514 2977659 2924912 2294442 539611
48087 539611 -1983009 -3781482 -3771384 -2682147 -2092391 -2326195 -2308316 -1506986 -912736
48078 -912736 -1616628 -3219991 -4307964 -4038333 -2691140 -1030607 214948 435636 -563937
48069 -563937 -2184881 -3390741 -3628139 -3132415 -2299726 -1201845 69713 1044056 1339761
48060 1339761 1258787 1362993 1532380 1070307 -117261 -1097104 -1064971 -413187 -99812 -350060
48050 -350060 -651180 -756568 -886742 -1018270 -842301 -537079 -692869 -1177594 -987877 218268
48040 218268 1257711 895563 -397777 -1085024 -620604 86611 166054 -196374 -387278
48031 -387278 -236996 33901 158974 -185910 -1238097 -2610823 -3264511 -2478028 -763212
48022 -763212 501759 394270 -719808 -1688613 -1817359 -1484004 -1451598 -1785154 -1854497 -1397029
48012 -1397029 -987731 -1150670 -1557282 -1644451 -1588225 -1941793 -2547524 -2610989 -1861965 -944750
48002 -944750 -550836 -750063 -1269406 -1844916 -2161067 -1999552 -1620725 -1514815 -1681041 -1689881
47992 -1689881 -1516340 -1624101 -2040141 -2087550 -1383199 -415222 284315 841006 1364230 1266645
47982 1266645 74077 -1505677 -2189741 -1643178 -657482 109592 812922 1716576 2490766
47973 2490766 2607506 2117733 1659481 1725341 2125033 2278830 1991265 1699810 1771708 1822308
47963 1822308 1213240 117197 -575888 -532587 -449747 -938301 -1612172 -1769830 -1385649 -857353
47953 -857353 -313567 197514 369714 226265 519897 1651538 2648265 2308664 1070797
47944 1070797 475053 809504 697739 -588147 -1732526 -1122470 916673 2566045 2668180
47935 2668180 1622865 501106 52289 419147 1131216 1333412 485552 -1061206 -2369557
47926 -2369557 -2734925 -2127733 -1121338 -589458 -1124151 -2393117 -3301136 -3109987 -2198541
47917 -2198541 -1470944 -1339604 -1644619 -2212806 -2938455 -3476631 -3405673 -2691193 -1616044
47908 -1616044 -363513 889698 1591896 1135088 -323193 -1845822 -2733638 -3190384 -3764077
47899 -3764077 -4468787 -4784096 -4369076 -3491229 -2746071 -2480210 -2504420 -2355765 -1857693 -1352510
47889 -1352510 -1280477 -1619715 -1940165 -1984238 -1957248 -2166704 -2551928 -2711451 -2357511 -1669216
47879 -1669216 -1148601 -1075395 -1166755 -978451 -642386 -843805 -1861000 -2999708 -3374383
47870 -3374383 -2965468 -2416724 -2050765 -1758117 -1714895 -2318129 -3229021 -3386716 -2481344 -1660558
47860 -1660558 -2040627 -3067161 -3249547 -2221840 -1078249 -651956 -456623 273074 1252291
47851 1252291 1496210 641423 -655644 -1541495 -1783829 -1771958 -1973088 -2449203 -2813683
47842 -2813683 -2648630 -1928528 -915386 276070 1690239 3065662 3763970 3428427 2460528
47833 2460528 1589743 1196429 1292530 1837311 2622751 3045706 2558723 1394729 390610
47824 390610 -27799 -274835 -811066 -1283126 -863881 587587 1999898 1916031 -99298
47815 -99298 -2919410 -4852707 -5221250 -4784341 -4571014 -4700060 -4679830 -4454869 -4454571 -4691961
47805 -4691961 -4574895 -3819959 -2925867 -2425472 -2213624 -1986395 -1807915 -1741219 -1397201 -511281
47795 -511281 336572 295591 -573664 -1345070 -1428170 -1098615 -794833 -541868 -274755 -166178
47785 -166178 -313949 -499544 -546648 -615429 -923216 -1470669 -2199171 -3023230 -3486039 -2861034
47775 -2861034 -1038003 1002276 2068633 1937168 1262182 557788 -186165 -981611 -1580650
47766 -1580650 -1910252 -2283325 -2888062 -3377588 -3261031 -2519583 -1598409 -937306 -729233
47757 -729233 -993622 -1591848 -2190148 -2454729 -2329710 -1956306 -1318314 -208500 1336890
47748 1336890 2751769 3275709 2551116 868162 -1004036 -2139819 -1922929 -582118 821386
47739 821386 1344529 1144166 1149369 1726544 2196497 1923781 1311202 1134300 1258782 808994
47729 808994 -415706 -1477265 -1542020 -1000455 -897583 -1604047 -2516172 -2868791 -2385720
47720 -2385720 -1219298 242090 1346700 1344417 -24116 -2077907 -3539598 -3500507 -2126667
47711 -2126667 -465584 397902 47597 -1157421 -2411649 -2930257 -2427258 -1336193 -414784
47702 -414784 -31301 -40475 -387410 -1340767 -2791026 -3807110 -3528472 -2248141 -951447
47693 -951447 17650 1039778 2087520 2511881 2146551 1619956 1163045 140359 -1530979
47684 -1530979 -2491416 -1604534 92088 398930 -1260974 -3288398 -4202111 -4268233 -4418183
47675 -4418183 -4617063 -4147647 -2938116 -1721641 -999559 -511710 159075 892345 1175506
47666 1175506 783978 98439 -319587 -363420 -400926 -630791 -691037 -137204 870424 1652600
47656 1652600 1706479 1078532 155649 -639055 -1025969 -1017953 -836575 -515240 176049 1125756
47646 1125756 1545263 794090 -624077 -1499365 -1333442 -770445 -613768 -991702 -1572154
47637 -1572154 -2043195 -2247280 -2315700 -2714456 -3621210 -4284080 -3750354 -2361884 -1682661
47628 -1682661 -2585683 -4172103 -5024865 -4792701 -4004654 -3085483 -2314996 -2163742 -2795200
47619 -2795200 -3594675 -3965473 -4249772 -5047875 -5918129 -5688678 -4016508 -1824750 -147550
47610 -147550 764410 1159871 1309573 1442471 1604154 1502467 973403 533073 863442 1788509
47600 1788509 2417017 2281810 1619234 535896 -1195108 -3296455 -4839879 -5342659 -5265188
47591 -5265188 -5019516 -4284384 -2869147 -1499837 -969616 -1034019 -930416 -587772 -517055
47582 -517055 -793271 -986096 -982313 -1099073 -1383762 -1484344 -1245821 -804536 -68774 1202569
47572 1202569 2672195 3471768 3266681 2692911 2406495 2267344 1920983 1667291 2063258
47563 2063258 2898087 3274539 2745883 1788110 993493 350618 -326219 -708591 -299521
47554 -299521 663815 1279737 1088992 552917 123700 -579495 -2012315 -3493714 -3692747
47545 -3692747 -2396258 -886723 -205651 93042 812010 1526462 1198010 -4883 -712174
47536 -712174 -258025 500029 583068 94918 -550694 -1663627 -3550600 -5289565 -5391751
47527 -5391751 -3699926 -1707028 -759202 -680366 -525551 -37668 262082 110781 -42049
47518 -42049 311515 1046145 1555377 1410162 725909 -18089 -375952 -169662 504033 1317060
47508 1317060 1733320 1211892 -307771 -2070168 -2925969 -2365883 -1120721 -537924 -1268326
47499 -1268326 -2627401 -3303911 -2669865 -1361507 -593810 -953654 -1900497 -2424738 -2088635
47490 -2088635 -1335958 -869925 -929579 -1210599 -1279298 -906010 -138654 734113 1346577 1579372
47480 1579372 1694550 1973495 2281514 2247700 1863206 1572117 1658622 1846495 1691071 1111950
47470 1111950 335596 -413406 -893969 -818023 -244003 216729 75680 -288077 -128547 477284
47460 477284 657929 142656 -154151 511846 1364728 941942 -886467 -2525502 -2471418
47451 -2471418 -983484 365587 490087 -216161 -619045 -270634 142600 -186164 -1014296
47442 -1014296 -1353678 -951810 -809883 -1750052 -2974905 -2873527 -1151894 668758 1057494
47433 1057494 66016 -1202884 -2046944 -2508923 -2707796 -2557379 -2129574 -1779441 -1758423
47424 -1758423 -1931224 -1934540 -1499522 -672046 164244 573683 486508 208203 -57191 -450594
47414 -450594 -1082433 -1722256 -2129109 -2406419 -2688923 -2757997 -2423364 -2063825 -2204321 -2614979
47404 -2614979 -2441974 -1355202 -62384 476207 -93277 -1531403 -3269150 -4367791 -3858739
47395 -3858739 -1769268 481606 1339833 714833 -124102 -151319 414920 694285 164378
47386 164378 -1080731 -2617588 -3898762 -4445028 -4194761 -3599105 -3169622 -2992291 -2797105
47377 -2797105 -2355934 -1647704 -787508 -21396 307840 30190 -659170 -1459097 -2295217
47368 -2295217 -3129328 -3588736 -3262437 -2425505 -1965122 -2321455 -2906270 -2926470 -2428121 -2046150
47358 -2046150 -1985016 -1869557 -1557124 -1466883 -1924898 -2634721 -2990378 -2585846 -1372779 203085
47348 203085 1132043 559969 -1086099 -2297904 -2290299 -2024620 -2765130 -4127687 -4508765
47339 -4508765 -3261736 -1453779 -349847 -34545 151615 559650 1073086 1464033 1465692
47330 1465692 889532 27143 -464095 -410143 -399821 -804864 -1009403 -227271 1235597 2218627
47320 2218627 2094994 1341670 784911 817670 1312494 1714990 1187325 -692668 -3142824
47311 -3142824 -4624892 -4407428 -3279775 -2434840 -2135167 -1952142 -1858906 -2278181 -3108771
47302 -3108771 -3524940 -3067438 -2343910 -2154753 -2330213 -2079037 -1327930 -968595 -1566652
47293 -1566652 -2405735 -2240824 -721441 1264300 2442125 2096867 488413 -1295345 -2141684
47284 -2141684 -1940212 -1566408 -1542993 -1249915 -109100 1019879 762430 -651827 -1511324
47275 -1511324 -1058652 -463603 -818030 -1463139 -1263511 -481774 -162782 -383817 -430117 -262180
47265 -262180 -488430 -1086935 -1400703 -1326815 -1315928 -1215279 -382534 905552 1450952 888196
47255 888196 212362 55499 -365288 -1838518 -3717619 -4772746 -4706901 -3971405 -2772755
47246 -2772755 -1206078 145038 702259 694702 705250 732446 416783 -159470 -665509 -1199883
47236 -1199883 -2008600 -2822127 -3237429 -3423796 -3610832 -3276385 -1933109 -455654 -296465
47227 -296465 -1305055 -1685727 -537382 822867 761532 -542640 -1827143 -2755533 -3960833
47218 -3960833 -5412240 -5962185 -4765359 -2411140 -327281 546795 315183 -285393 -579399
47209 -579399 -358976 180931 759172 1144747 1066690 326817 -831180 -1727704 -1883247 -1516453
47199 -1516453 -1215935 -1254532 -1399970 -1237304 -488991 799139 2148365 2860462 2572117
47190 2572117 1518284 177330 -1031059 -1526076 -610412 1606893 3622086 3748733 2055602
47181 2055602 366437 40302 439925 101555 -1179107 -2219020 -2144400 -1381480 -871353
47172 -871353 -971726 -1394755 -1734952 -1729015 -1322630 -777330 -480353 -454394 -343858 -70047
47162 -70047 -89639 -659044 -1234074 -1095992 -300771 521348 1065901 1431615 1495406 1000959
47152 1000959 286843 101949 468822 482955 -413065 -1648037 -2420885 -2673259 -2617263 -2009588
47142 -2009588 -729518 401894 351392 -718669 -1591858 -1504990 -783569 5929 765058
47133 765058 1575296 2359560 3072288 3753923 4232637 4178566 3525102 2435036 916762
47124 916762 -952651 -2470619 -2737986 -1816281 -745375 -174242 289936 1055712 1694529
47115 1694529 1671969 1230749 861428 474373 -143222 -569281 -370741 -124497 -734579 -1809409
47105 -1809409 -1869036 -474960 860109 523627 -1138504 -2383657 -2268120 -1422724 -753966
47096 -753966 -294305 303046 825976 788621 429916 649030 1721412 2650684 2262535 645328
47086 645328 -984952 -1697588 -1623286 -1387414 -1339545 -1475337 -1632345 -1528292 -969973 -225125
47076 -225125 162592 96238 39533 186646 30629 -823497 -1856094 -2204467 -1762114 -1138508
47066 -1138508 -715906 -365539 -29767 82501 28625 296643 1125860 2003839 2141958 1277766
47056 1277766 -166917 -1508370 -2163095 -1798547 -521097 982893 1754939 1318025 169449
47047 169449 -675126 -741279 -513855 -632811 -952465 -818858 -120435 528990 703371 637864
47037 637864 592271 399945 41200 32754 642865 1210271 961363 156849 -348590 -437864
47027 -437864 -744454 -1411264 -1785380 -1547372 -1291647 -1593995 -2205026 -2667583 -3143443 -3956598
47017 -3956598 -4656062 -4299518 -2747362 -1145946 -809494 -1761098 -2634804 -2142713 -540680
47008 -540680 650906 499428 -159832 150637 1510821 2441972 1893003 607800 17536
46999 17536 350311 619632 284552 41537 677366 1774058 2172766 1512869 637894 303330
46989 303330 79435 -905975 -2442706 -3248516 -2631206 -1403333 -692546 -427852 287806
46980 287806 1621166 2655731 2624835 1797745 920160 312691 -155278 -557262 -735052
46971 -735052 -515663 77482 761604 1107862 846349 91091 -792270 -1444260 -1588502 -1149476
46961 -1149476 -518886 -362347 -793060 -1089090 -723079 -286710 -673384 -1619509 -1961915
46952 -1961915 -1288789 -389702 59716 313238 754499 1164358 1232347 1055918 671951 -201789
46942 -201789 -1449247 -2250909 -2076696 -1416188 -969682 -685858 -188414 415173 803295
46933 803295 988364 938164 231320 -1117353 -2043598 -1624867 -512409 -142475 -740435
46924 -740435 -1186636 -830196 -348947 -585365 -1441460 -2271836 -2658042 -2450372 -1642881 -587030
46914 -587030 70106 -65912 -885936 -2038938 -3025132 -3144889 -2038571 -395873 503176
46905 503176 179289 -601420 -893763 -536761 66036 487254 360514 -452425 -1447768 -1764270
46895 -1764270 -1201448 -452534 -52811 293248 956945 1616888 1824892 1803753 2004695 2282433
46885 2282433 2258432 2225239 2848235 3975962 4492003 3556622 1505487 -648707 -2178423
46876 -2178423 -2912691 -2944163 -2446915 -1743365 -1329229 -1635829 -2588787 -3428448 -3305403 -2248382
46866 -2248382 -1234508 -1022239 -1260817 -1188222 -856432 -950890 -1505936 -1641073 -814855 370041
46856 370041 1048944 1233081 1515218 2028358 2344558 2242006 1951892 1661499 1340605 1120625
46846 1120625 1254933 1488899 1038918 -381583 -1926749 -2521729 -2129922 -1532726 -998835
46837 -998835 62718 1895880 3511060 3605357 2150334 522582 15688 607307 1324856
46828 1324856 1495759 1325228 1361038 1763766 2252434 2509091 2339654 1578121 270356
46819 270356 -1001900 -1495004 -1276147 -1321088 -2145569 -2794781 -1992763 -101218 1018423
46810 1018423 245853 -1558435 -2859108 -3148394 -2853164 -2357256 -1896114 -1875487 -2440929
46801 -2440929 -3029299 -3085330 -2928478 -3121695 -3241587 -2236335 -33667 2069791 2821318
46792 2821318 2167617 897219 -173301 -489108 20605 618480 191301 -1573286 -3741996
46783 -3741996 -5081951 -5124171 -4186636 -2838531 -1604270 -785987 -254514 364038 1155121
46774 1155121 1805903 2008923 1603747 424265 -1370629 -2807260 -2758560 -1405848 -314233
46765 -314233 -614066 -1749547 -2513242 -2627412 -2575510 -2417959 -1742264 -656236 28724
46756 28724 -213830 -993140 -1583659 -1841994 -2328537 -3545346 -5114254 -5906533 -5270284
46747 -5270284 -3967174 -3339767 -3573434 -3545614 -2595286 -1524218 -1289664 -1566217 -1475203
46738 -1475203 -1090849 -1153539 -1641996 -1736920 -1137579 -445470 -191007 -338311 -828886 -1754193
46728 -1754193 -2790921 -3236401 -2886190 -2284091 -1940085 -1895467 -2109846 -2500532 -2468820 -1324019
46718 -1324019 447986 1253167 306384 -1306032 -2133537 -2144326 -2143007 -2131454 -1467343 -340261
46708 -340261 217650 -67970 -224953 450976 1292296 1245928 329628 -515584 -632207 -169785
46698 -169785 298067 198359 -734830 -2087913 -2884269 -2499111 -1277328 80885 1307445
46689 1307445 2167091 1840169 -181716 -2751593 -3930123 -3465706 -3134323 -4043805 -4944582
46680 -4944582 -4279076 -2741739 -2252984 -3072188 -3652459 -3133900 -2261023 -1702775 -1131505
46671 -1131505 -407705 -141889 -428207 -420447 78491 11140 -1005044 -1588449 -762735 79790
46661 79790 -876442 -2872597 -3513777 -2286298 -1097862 -1239624 -1743472 -1282302 -56402
46652 -56402 1014742 1668955 1947978 1514122 372526 -406014 274668 2071160 3558583
46643 3558583 3860887 3284789 2471253 1572116 433169 -776907 -1441500 -1087337 -8090
46634 -8090 960580 1367277 1476982 1488215 1033906 44950 -492400 364042 1943319 2580284
46624 2580284 1730326 367007 -725077 -1758286 -2763975 -2968083 -2028820 -805123 -117834
46615 -117834 306017 859348 1005548 243751 -664567 -640795 17437 56633 -894210 -2007137
46605 -2007137 -2646393 -3015319 -3350563 -3404580 -2982093 -2355272 -1943503 -1981547 -2454847 -2915667
46595 -2915667 -2570079 -1196137 170526 246526 -790043 -1406162 -721407 354820 388819
46586 388819 -771748 -2002379 -2402623 -2258370 -2498604 -3493541 -4545158 -4584829 -3327400
46577 -3327400 -1580773 -367609 5407 -139459 -478877 -794454 -686089 228007 1726926
46568 1726926 2966843 3171719 2206176 584744 -824830 -1296182 -904261 -668812 -1582478
46559 -1582478 -3411490 -4874506 -5154559 -4814759 -4904555 -5455029 -5351715 -3758996 -1286135
46550 -1286135 585729 1093479 768314 344498 -318894 -1688123 -3317061 -4024198 -3371659
46541 -3371659 -2214682 -1545519 -1454207 -1520410 -1549708 -1496135 -1259587 -1031140 -1288945 -1993935
46531 -1993935 -2382157 -2060096 -1655552 -1767469 -1951656 -1530328 -795265 -505441 -681896
46522 -681896 -811588 -786246 -710405 -289591 534397 871765 76120 -801203 -247900 1248164
46512 1248164 1622822 171421 -1626724 -2519357 -2988541 -3703961 -4099481 -3509383 -2465498
46503 -2465498 -1790728 -1393852 -945944 -793545 -1142186 -1197031 -275440 894604 1132906
46494 1132906 547745 240436 698175 1490299 2157773 2404436 1797025 317997 -1107485
46485 -1107485 -1662361 -1871832 -2683493 -3674233 -3539177 -2270101 -1359776 -1542340 -1695136
46476 -1695136 -602038 1269036 2493148 2414240 1445500 265579 -587519 -765268 -407533
46467 -407533 -141746 -329602 -604802 -564712 -560271 -1253594 -2580779 -3671322 -3772796 -2911879
46457 -2911879 -1695660 -780387 -527218 -890863 -1509163 -1929725 -1778290 -874918 515857
46448 515857 1576190 1516916 466829 -581487 -946739 -973553 -1223646 -1413973 -822024
46439 -822024 448596 1363123 1226733 451327 -144177 -239932 46820 543299 881341 481908
46429 481908 -687944 -1697774 -1728531 -1333554 -1757786 -3058682 -3934127 -3664062 -3117331
46420 -3117331 -3164710 -3074136 -1577372 1036110 3121200 3805495 3754444 3724994 3480154 2562351
46410 2562351 1267988 255075 -297413 -665842 -1093442 -1644183 -2183149 -2302052 -1706955
46401 -1706955 -852944 -648618 -1293344 -1988854 -2086566 -1869782 -1786032 -1555018 -636893 850390
46391 850390 2202053 2767145 2208917 707200 -694923 -683944 725838 1849425 1360283
46382 1360283 25787 -516404 -121517 -66427 -907718 -1716172 -1562777 -684123 117908
46373 117908 411400 207251 -229960 -460266 -353680 -567984 -1894612 -4052898 -5774291
46364 -5774291 -6151070 -5324300 -3949572 -2746007 -2441836 -3166250 -3848527 -3285959 -1969825
46355 -1969825 -1691659 -3009590 -4355208 -4247316 -3159004 -2318261 -1803535 -1048607 -411367
46346 -411367 -815423 -2151216 -3252408 -3362963 -2663539 -1507701 -142887 874412 1002635
46337 1002635 572780 482495 956787 1432451 1677154 1982905 2043478 853030 -1584923
46328 -1584923 -3439649 -3003857 -971429 261983 -602187 -2581740 -3995780 -4270654 -3880149
46319 -3880149 -3343231 -2942472 -2970615 -3495769 -3951364 -3567334 -2336547 -1132449 -713442
46310 -713442 -960637 -1274206 -1350505 -1240731 -918560 -278153 417182 457396 -712734 -2835902
46300 -2835902 -4822865 -5458903 -4352988 -2344744 -846160 -620835 -1272598 -1942198 -2225434
46291 -2225434 -2255190 -2210772 -2072936 -1691291 -879270 301849 1171484 823286 -676611
46282 -676611 -1956191 -1842621 -843639 -386552 -875468 -1406981 -1283465 -797409 -409607
46273 -409607 -131092 -2951 -295379 -844363 -993740 -625581 -495910 -1086158 -1868090 -2245863
46263 -2245863 -2491276 -3066380 -3639960 -3558326 -2897149 -2351736 -2336114 -2670663 -2831312 -2159482
46253 -2159482 -390409 1562318 2039214 535485 -1447666 -2208265 -1872392 -1727789 -2172013
46244 -2172013 -2516424 -2471479 -2542188 -2981960 -3481005 -3947771 -4544812 -4851596 -4076190 -2366558
46234 -2366558 -928478 -477720 -442183 -91432 364704 304192 -333676 -1088291 -1501969 -1268926
46224 -1268926 -372652 632107 995072 678940 349797 300755 121273 -301834 -367428 99810
46214 99810 167175 -889709 -2221199 -2361087 -1212869 -73013 232174 248274 739605
46205 739605 1461240 1540530 619725 -816218 -2002197 -2408472 -1825385 -359388 1456316
46196 1456316 2716200 2631541 1164481 -870929 -2455768 -3095541 -2909761 -2260901 -1541543
46187 -1541543 -1117167 -1072010 -1049801 -697778 -225417 -141221 -473189 -699780 -485095 -32499
46177 -32499 332565 431049 8583 -1158102 -2682559 -3604794 -3334725 -2218978 -995851
46168 -995851 -126948 162308 -239539 -1035949 -1544600 -1371902 -726436 110913 1089517 1941661
46158 1941661 2143602 1741169 1489989 1620223 1230608 -317638 -2139315 -2978221 -3033747
46149 -3033747 -3386324 -3937828 -3377547 -1311530 953228 2225994 2871616 3718338 4449350
46140 4449350 4055176 2456447 799059 191691 695097 1539594 1945840 1690381 1089224
46131 1089224 531608 145877 67355 742572 2359656 4001483 4167543 2502574 351296
46122 351296 -883252 -1294391 -1738602 -2195340 -1910947 -926149 -288973 -551722 -1057322
46113 -1057322 -1124566 -1038019 -1231975 -1277819 -594053 326119 428629 -349316 -1061352 -1270408
46103 -1270408 -1480943 -1823327 -1517713 -315884 621729 361490 -125664 672412 2211872
46094 2211872 2313515 311842 -1820769 -2137607 -1151287 -620116 -958889 -1138347 -565802
46085 -565802 270503 861855 1192230 1108156 227587 -1192919 -2099878 -1791264 -713749
46076 -713749 230816 747701 1160239 1659440 1936416 1554091 536626 -494649 -916934
46067 -916934 -861735 -1060848 -1785985 -2414435 -2405922 -2117561 -1973843 -1421888 188638 2000815
46057 2000815 2318500 1039628 29311 510308 1389261 1134475 223324 346262 1752031
46048 1752031 2876016 2608312 1668126 1373931 1980344 2724561 2888685 2317244 1292213
46039 1292213 353781 18613 318980 735130 795030 593367 524474 661682 658315 228603
46029 228603 -467316 -952009 -863286 -278090 308361 355310 -222242 -850347 -733446 289310
46019 289310 1345585 1293447 49507 -1149921 -1177335 -479507 -541437 -1872735 -3186776
46010 -3186776 -2925351 -1103070 856522 1793547 1748253 1372100 1018704 575608 -171878
46001 -171878 -1215707 -2234435 -2801079 -2799775 -2534960 -2228540 -1589836 -279399 1268319
45992 1268319 2006627 1458488 358070 -160670 273261 1242516 2418363 3895277 5522831
45983 5522831 6378910 5418577 2678765 -488855 -2565769 -3095263 -2663666 -1964130 -1286010
45974 -1286010 -819030 -880441 -1548031 -2382985 -2830716 -2733113 -2245650 -1505368 -685950 -150423
45964 -150423 -114335 -208072 238626 1404121 2695496 3281626 2753906 1363025 -161829
45955 -161829 -1122921 -1451951 -1737285 -2451375 -3340216 -3870345 -3984724 -3896577 -3385756 -2079976
45945 -2079976 -448406 334036 -179125 -1108888 -1460470 -1234663 -837242 -132342 1070953
45936 1070953 2101096 2057660 1246788 969533 1714605 2475093 2264816 1540346 1447403 2097957
45926 2097957 2360845 1336143 -539751 -2063774 -2620595 -2666718 -2899765 -3231912 -2886776
45917 -2886776 -1518620 140848 1037455 940442 449897 74391 -160629 -277399 -172659
45908 -172659 30616 110407 393866 1517015 3151169 3781215 2501715 463850 -361453
45899 -361453 461114 1601238 1860170 1294542 455137 -428335 -1163917 -1362457 -993040
45890 -993040 -612437 -659909 -1018019 -1516074 -2211797 -2819873 -2585043 -1277383 289938
45881 289938 1310355 1940146 2554895 2740927 1991967 923280 632430 1015768 886367
45872 886367 -125005 -890010 -384632 920359 1807604 1828351 1524674 1529276 1901762 2164152
45862 2164152 1760991 675516 -355301 -533836 103609 841644 1191645 1084620 346777
45853 346777 -1118591 -2544474 -2705474 -1493440 -198149 217622 158497 140869 -351772
45844 -351772 -1682129 -2659900 -1820604 286026 1572619 1178590 393977 555612 1281582
45835 1281582 1395467 644605 -259579 -708541 -608406 -122417 377661 338678 -463144 -1520893
45825 -1520893 -2052880 -1784977 -1069640 -396434 -18451 93494 165696 386550 592536 349002
45815 349002 -457010 -1258934 -1307077 -488154 532544 962738 532544 -457309 -1505290
45806 -1505290 -2200650 -2278044 -1660315 -604628 347614 849109 1164889 1808016 2697566
45797 2697566 3051303 2316564 860211 -544707 -1573666 -2328769 -2805893 -2887745 -2651338
45788 -2651338 -2179299 -1262025 155084 1400153 1620918 885285 112700 -111302 -33343
45779 -33343 -40212 -192780 -563070 -1259484 -1862577 -1613189 -559397 217083 29872 -456457
45769 -456457 -364014 -64434 -592926 -1919908 -2761343 -2148007 -457446 1234227 2215624
45760 2215624 2371402 1921923 1342125 1264238 2002303 3062718 3332703 2047017 -284710
45751 -284710 -2115301 -2363588 -1609347 -1357422 -2121421 -2856298 -2514747 -1476469 -885741
45742 -885741 -1092821 -1483757 -1580086 -1539423 -1599721 -1685673 -1665575 -1515930 -1174889 -655591
45732 -655591 -286418 -360863 -584998 -471659 -328944 -1096730 -2843971 -4114703 -3443770
45723 -3443770 -1185675 857181 1525643 1353187 1427521 1885074 2019060 1501087 817129
45714 817129 443285 160441 -484141 -1387982 -2005735 -2106306 -1996191 -2015589 -2198751 -2456653
45704 -2456653 -2704552 -2724902 -2294081 -1602132 -1213713 -1456196 -2142974 -2966957 -3719945 -3983266
45694 -3983266 -3197235 -1454893 229901 960199 959899 1061662 1467005 1556967 792949 -680187
45684 -680187 -2252593 -3285179 -3449196 -3000834 -2580805 -2423155 -2032075 -1067552 -198540
45675 -198540 -377302 -1396011 -1926053 -1127440 390643 1452561 1705145 1835966 2645688
45666 2645688 4113180 5328773 5370328 4288780 3026258 2274261 1813698 1208242 557230
45657 557230 24022 -796868 -2197106 -3435907 -3508628 -2655010 -2037697 -1923990 -1338871
45648 -1338871 183798 1577306 1543009 142858 -1412085 -1978083 -1124300 759291 2543685
45639 2543685 3150783 2722993 2482044 3071359 3702803 3415303 2465647 1788680 1639686
45630 1639686 1548669 1265495 1009682 963944 1106506 1389378 1607460 1300616 274923 -922103
45620 -922103 -1443326 -931946 360523 1933640 3217993 3748789 3518349 2899683 2072344
45611 2072344 1017533 216423 502375 1726710 2456765 1819623 903769 1306015 2849174
45602 2849174 3911649 3688350 2892052 2299253 1817044 1177763 528102 12092 -435353
45593 -435353 -623563 -146568 880684 1746483 1961871 1611020 928765 247615 271238 1407581
45583 1407581 2703178 2524181 704442 -946849 -812682 682604 1917721 1933609 836927
45574 836927 -790831 -2043677 -1957298 -630227 350331 -438248 -2454104 -3923709 -4086307
45565 -4086307 -3684800 -3334377 -2591090 -1011444 784953 1746264 1608106 979630 516647
45556 516647 418836 523585 500446 31894 -894346 -1849760 -2270820 -1915040 -990849 54403
45546 54403 792739 970496 559143 -281548 -1223677 -1715284 -1117590 712223 2892058
45537 2892058 3967965 3261187 1620680 507728 427606 644190 398564 -125709 -264797
45528 -264797 172808 811821 1239334 1187925 486901 -598893 -1183664 -613043 527333
45519 527333 983002 489824 66638 428322 992635 949898 467245 85647 -369368 -1325555
45509 -1325555 -2383434 -2706821 -2252384 -1684802 -1262076 -754390 -314472 -359590 -584893
45500 -584893 -214864 582636 673504 -259633 -1000777 -490094 692529 1297252 1117311 863767
45490 863767 838375 647436 51229 -642866 -1036326 -1031975 -807621 -675241 -824122 -1012177
45480 -1012177 -763916 -32983 687518 1055323 1180463 1041146 265055 -1073393 -2055800
45471 -2055800 -1913041 -961713 -5071 719223 1376210 1798229 1693338 1316769 1199416
45462 1199416 1351694 1341462 991514 432641 -329554 -1313425 -2210240 -2675657 -2753390 -2525208
45452 -2525208 -1751570 -533821 131041 -572756 -1885697 -2205145 -1194483 -153125 -168656
45443 -168656 -893589 -1444684 -1605000 -1672110 -1816746 -2102096 -2685620 -3622870 -4771339 -5993474
45433 -5993474 -7041539 -7288582 -6243000 -4396159 -2814236 -1762621 -583822 846743
45425 846743 1592193 1158304 591007 1202264 2813600 4144615 4505507 4200709 3532455
45416 3532455 2372815 777874 -734325 -1728969 -2197736 -2225678 -1724144 -671810 619398
45407 619398 1609264 1837842 1218240 144185 -844163 -1646219 -2639022 -3930917 -4840436
45398 -4840436 -4471734 -2734965 -573088 767451 648783 -493365 -1459174 -1387791 -711150
45389 -711150 -593018 -1240221 -1419069 -132418 1877354 3109907 3337466 3629286 4494507
45380 4494507 5117289 4697502 3603490 2680579 2091895 1426552 506025 -478363 -1355269
45371 -1355269 -2044227 -2453963 -2677928 -3040098 -3565951 -3690771 -2980627 -1925241 -1425076
45362 -1425076 -1558110 -1470547 -579553 710045 1716532 2341917 2801450 2937308 2425696
45353 2425696 1530100 1033659 1272378 1645151 1329982 283923 -676118 -729048 98604
45344 98604 924663 925272 329755 296047 1530180 3237512 3914885 3106340 1788168 949825
45334 949825 499847 -96728 -785325 -1132719 -1106553 -970995 -690893 -87020 615878 1010394
45324 1010394 1094016 1042423 661966 -182098 -827835 -465805 503597 773763 -70625 -1090058
45314 -1090058 -1568514 -1894939 -2343037 -2166818 -862789 583592 875092 252496 17979
45305 17979 594587 1222284 1368159 1244591 944912 254931 -484794 -464237 266072 585912
45295 585912 -38709 -646050 -255941 553780 481442 -636895 -1818898 -2489325 -2967461
45286 -2967461 -3404176 -3283859 -2346637 -1215990 -608565 -473429 -402121 -385987 -552718 -543470
45276 -543470 64421 837801 789612 -256346 -1267055 -1228661 -224962 990068 1927869
45267 1927869 2463768 2521126 2198023 1823193 1369002 249528 -1639981 -3128646 -2936011
45258 -2936011 -1429375 -246835 -218931 -694063 -1005761 -1408864 -2116420 -2547094 -2319375
45249 -2319375 -2123054 -2676294 -3461211 -3506946 -3003081 -3040380 -3840669 -4240107 -3149847 -864958
45239 -864958 1316720 2350046 2192388 1673906 1752617 2674941 3833828 4548209 4778130
45230 4778130 4859071 4829717 4439176 3684862 2953627 2625362 2713086 2816669 2403093 1396648
45220 1396648 473582 294358 446237 -100433 -1324510 -1937742 -1313810 -544711 -729731
45211 -729731 -1267288 -1073388 -617919 -1157538 -2429149 -2836327 -1855719 -597766 189528
45202 189528 1005303 2005697 2131645 747495 -1026209 -1650022 -1055922 -295365 81722
45193 81722 393221 929937 1480180 1677177 1412581 991731 982561 1626100 2400553 2606523
45183 2606523 2299537 2028868 1789008 1108044 162476 -234416 89661 465735 642308
45174 642308 1003249 1212263 131803 -2164382 -3742184 -3274217 -1934912 -1539069 -1846305
45165 -1846305 -1268207 456745 1941203 2185298 1457514 284634 -1046520 -1942276 -1752702
45156 -1752702 -844851 -431617 -1046476 -1956499 -2274468 -1966653 -1603492 -1687928 -2329209 -3135398
45146 -3135398 -3465053 -3139804 -2659681 -2369349 -1957925 -1329643 -1210088 -1971973 -2592259
45137 -2592259 -2009349 -928436 -798262 -1387173 -1094500 391098 1565470 1541765 1246207
45128 1246207 1589644 2126247 2424921 3230792 5030090 6668194 6792453 5846053 5279443
45119 5279443 5389608 5289386 4622213 3937359 3461630 2756602 1749981 1047762 910173
45110 910173 762552 111730 -707931 -1118959 -1115555 -1028805 -830595 -189755 899556 2012442
45100 2012442 2871625 3629346 4343966 4506402 3570047 1902070 678214 638789 1387001
45091 1387001 2164250 2808299 3520983 4206234 4685004 5177202 5824613 6041065 5187606
45082 5187606 3693550 2582331 1997998 1228057 197681 -205825 441652 1429656 2062823
45073 2062823 2487046 2920820 3068832 2891068 3031504 3817579 4671231 5158465 5717771
45064 5717771 6577614 6882479 5889720 4260131 3076423 2240747 1022342 -349029 -958155
45055 -958155 -788092 -715598 -960524 -761277 218694 1209601 1423972 1089086 1037628 1703722
45045 1703722 2691519 3085395 2315669 977475 393143 968487 1592739 1278161 607953
45036 607953 581422 820039 338408 -438033 -124914 1305988 2406026 2566477 2697614
45027 2697614 3245020 3364137 2772306 2629842 3511645 4129521 3442392 2625225 3281625
45018 3281625 4801033 5367720 4869590 4792869 5516625 5748809 4853089 3875484 3655330
45009 3655330 3482013 2515468 1342277 1088968 1783372 2552972 2879826 2775111 2178909
45000 2178909 1149135 410970 741653 1736836 2025921 1024629 -151527 5672 1525637
44991 1525637 2898218 2779203 1297674 -398413 -1423107 -1625405 -1121142 -26861 1225561
44982 1225561 1925557 1862956 1651329 1735028 1441292 -155350 -2510335 -3759118 -2986070
44973 -2986070 -1502003 -1167003 -2078676 -2871341 -2942234 -3160711 -4164567 -5062500 -4547813
44964 -4547813 -2676693 -762345 191608 242528 -123438 -591699 -870198 -596881 256591
44955 256591 1241763 1964757 2508123 3125988 3782495 4221771 4289009 3971420 3304708 2435835
44945 2435835 1613976 963417 462041 262586 696600 1697753 2579760 2823002 2824460 3325782
44935 3325782 4225761 4590764 3937726 2924691 2479624 2677319 2882563 2763709 2706794
44926 2706794 3180013 3964521 4206632 3270589 1525239 183003 203612 1341100 2395565
44917 2395565 2418743 1543846 632837 333848 651306 1308109 2201560 3279725 4095783
44908 4095783 3925000 2620836 1079778 362123 466274 614201 771746 1967902 4626962
44899 4626962 7471875 9021507 9602495 10714697 12649911 14025474 13809590 12572497
44891 12572497 11301129 10102136 8766219 7652703 7091425 6580224 5549379 4464851
44883 4464851 4191605 4554437 4530567 3759740 2880156 2310881 1679523 755129 91710 228686
44873 228686 851610 1308570 1549582 1959526 2464138 2401658 1382762 -84934 -1048859
44864 -1048859 -1106284 -801322 -937256 -1529056 -1677976 -680795 949912 1959990 1789436
44855 1789436 1088562 728156 784879 781396 524657 279978 337959 830360 1838154 3229474
44845 3229474 4403456 4641876 3868311 2777732 2104164 2013534 2270958 2614005 2743016
44836 2743016 2332907 1471354 860722 1113235 1922221 2379660 2100219 1567589 1332055
44827 1332055 1401432 1589494 1886325 2129819 1843986 936182 152111 204347 717917 731396
44817 731396 81154 -480136 -518873 -432772 -537222 -469785 39015 446209 30184 -1161666
44807 -1161666 -2504751 -3571622 -4189370 -4059138 -2972668 -1302464 276498 1521367
44799 1521367 2608164 3439989 3522888 2674435 1447633 661303 764668 1735179 3241917
44790 3241917 4694438 5429889 5245642 4751757 4916635 6085083 7532493 8199106 7901299
44781 7901299 7553404 7965420 8668665 8410097 6790991 4874212 3957511 4197948 4756383
44772 4756383 4900401 4545143 3989358 3596025 3633214 4067218 4560982 4890387 5207698 5700961
44762 5700961 6250010 6661907 6924637 6916472 6250941 4863035 3398017 2467025 1803996
44753 1803996 768262 -560569 -1467254 -1607831 -1223724 -487992 554488 1409669 1367402
44744 1367402 508998 -245746 -300355 93717 619840 1368566 2200043 2469072 1922422 1210524
44734 1210524 961731 956554 789581 702112 986986 1079360 185724 -1382403 -2400622 -2318260
44724 -2318260 -1949909 -2394166 -3739560 -5041504 -5310761 -4421512 -3177379 -2441021 -2161763
44715 -2161763 -1562293 -415882 392099 14677 -1117477 -1834931 -1660694 -998918 -206758
44706 -206758 605666 933774 72238 -1739322 -3152691 -3108354 -1844048 -236258 1206992
44697 1206992 2296587 2772147 2607474 2323360 2402661 2629269 2475012 1870177 1108126
44688 1108126 284022 -572144 -1013135 -532155 572235 1292166 1010923 63923 -870335
44679 -870335 -1461941 -1695223 -1642660 -1518766 -1576928 -1704736 -1434886 -563637 562204 1565631
44669 1565631 2474470 3392656 4137325 4545143 4778146 4930651 4681484 3813968 2778114
44660 2778114 2192546 2041512 1957757 2032585 2556447 3067192 2593504 1056177 -379904
44651 -379904 -697863 -112364 558452 911343 943197 732315 689117 1465055 2933582 3865379
44641 3865379 3452595 2673105 3146855 4888332 6232252 5990834 4735687 3778672 3715293
44632 3715293 4238870 4683146 4423111 3305615 1990033 1417671 1751368 2294723 2566798
44623 2566798 2869470 3580141 4470413 5040427 5060498 4531726 3594760 2718446 2456255 2719175
44613 2719175 2765952 2172946 1312729 652871 197454 -92322 -32576 222713 109130 -316293
44603 -316293 -55938 1362470 2823825 2999459 2234444 1957769 2567374 3135394 3137280 3183544
44593 3183544 3726398 4157864 3802005 3032961 2728030 3062470 3443619 3396557 3039220 2779472
44583 2779472 2863731 3201593 3486387 3519966 3417060 3375315 3342730 3168500 2991369 3094290
44573 3094290 3358433 3277480 2644563 1855535 1333452 969232 399824 -377416 -972628 -1108298
44563 -1108298 -892315 -539491 -4903 931285 2219481 3366167 3859676 3672320 3160755
44554 3160755 2610933 2182695 2129844 2525590 2770592 2037002 400942 -1117465 -1913546
44545 -1913546 -2456798 -3179744 -3565392 -3059702 -2120513 -1430334 -741285 365048 1126173
44536 1126173 413425 -1317162 -2337435 -1990073 -1352960 -1341766 -1543141 -1404247 -1238158
44527 -1238158 -1290085 -924531 362790 1986347 3169806 4020201 4840536 5126130 4279349
44518 4279349 2806312 1785525 1487627 1441095 1543323 2112128 2983153 3527222 3616798
44509 3616798 3764819 4187568 4436190 4149271 3600357 3261396 3210978 3163368 2849727 2307551
44499 2307551 1940905 2179945 2894752 3384224 3224703 2823877 2729474 2705559 2070171 782047
44489 782047 -415262 -911268 -765419 -313142 260552 850764 1344290 1755129 2209285
44480 2209285 2742440 3286585 3778165 4057115 3796961 2842470 1535431 437830 -166492
44471 -166492 -267745 150624 1020640 1948331 2438472 2342567 1884009 1393975 1229969 1693229
44461 1693229 2698402 3702869 4213317 4147597 3564657 2494338 1275008 435184 -192436
44452 -192436 -1513785 -3636738 -5017099 -4176081 -1811339 -63781 61137 -611061 -1140525
44443 -1140525 -1584170 -2229569 -2892080 -3321417 -3382714 -2625550 -683830 1654064 2896949
44434 2896949 2786302 2676824 3457525 4233312 3831771 2567990 1547103 1076034 823165
44425 823165 832033 1198351 1253109 321357 -933275 -1094546 98089 1445913 1944956 1782203
44415 1782203 1520154 1203243 654368 5525 -463880 -617795 -393670 152244 613226
44406 613226 516654 -8152 -313234 -140021 72499 27327 155229 897544 1800976 1923401
44396 1923401 1030259 -114274 -677770 -576443 -248779 57517 548620 1579156 3215834
44387 3215834 4959041 5816419 4966841 2689322 433792 -496449 -267323 -15813 -118913
44378 -118913 186542 1185212 1732671 836240 -539310 -523648 1053748 2442606 2455220
44369 2455220 1839257 1726955 1974023 1883884 1631393 1894176 2577045 2882613 2419889 1484153
44359 1484153 424369 -603282 -1392269 -1761340 -1772122 -1494945 -824802 92990 666215
44350 666215 591732 373740 531635 725286 362619 -311513 -541196 -220586 69352 12421
44340 12421 -219767 -560722 -1130713 -1841044 -2580116 -3573821 -4836549 -5570216 -5004242 -3571621
44330 -3571621 -2258567 -1079935 540497 2030596 1894730 20384 -1716820 -1827035
44322 -1827035 -955668 -505008 -667723 -792105 -716764 -593421 -65338 1220664 2709256
44313 2709256 3581003 3960700 4466776 4819850 4026866 2013344 99971 -446089 312064
44304 312064 1390606 2021387 2084586 1805801 1415310 1080696 1009267 1444187 2356865 3204310
44294 3204310 3374594 2962956 2679625 2840443 2966694 2633720 2114229 1761498 1348158
44285 1348158 589854 -187773 -551676 -674569 -854778 -782889 -114362 615027 618122 168150
44275 168150 230238 844160 998132 315739 -202478 413426 1805405 2951433 3448865
44266 3448865 3525627 3291008 2668559 1861578 1341452 1387950 1879715 2431673 2630260 2378503
44256 2378503 2125866 2446865 3260214 3830257 3698371 3167087 2617142 1881846 800384
44247 800384 -8043 382887 2019104 3910647 5123157 5562159 5574137 5296455 4779405
44238 4779405 4394697 4507519 4725307 4100839 2486304 1226473 1763956 3645569 4789204
44229 4789204 4048473 2682627 2590856 3746760 4432573 3758040 2759732 2776826 3753381
44220 3753381 4690512 5057765 5087635 5077548 5013163 4726161 4043601 2949279 1864085 1507331
44210 1507331 2158327 3244708 3910658 3792821 3081980 2185899 1606370 1750666 2436854
44201 2436854 2861725 2474094 1626584 935317 284617 -933435 -2696628 -4081929 -4218296
44192 -4218296 -3083381 -1282997 526503 1830978 2256278 1715048 522509 -741264
44184 -741264 -1510716 -1516939 -972915 -407382 -135434 15674 276128 443349 219453 -66004
44174 -66004 364491 1640436 2799282 2836043 1920536 1094923 878072 754564 216003 -283615
44164 -283615 15313 860830 1128646 427941 -176968 448301 1931281 2876348 2606638
44155 2606638 1682342 869484 440921 504196 1110107 1785791 1785321 1167375 856374 1227217
44145 1227217 1482726 1055601 770390 1649157 3130121 3571759 2335775 441968 -770189
44136 -770189 -821586 5849 1141110 1993732 2341700 2503469 2734348 2711174 2165662 1624568
44126 1624568 1696874 1968687 1627366 956219 1009757 1831163 2295957 1938995 1617966 1931400
44116 1931400 2281733 2176390 2226267 2922943 3454595 2846716 1553396 820799 979755
44107 979755 1372066 1565636 1700668 1932712 2342818 3074713 3831404 3680506 2170029
44098 2170029 183108 -1148939 -1822090 -2271713 -1998986 -304624 1982927 3121835 2824510
44089 2824510 2499106 2921101 3184760 2449914 1299013 610932 294536 11149 138078
44080 138078 1043883 2174086 2790101 3024695 3388595 3810203 3983630 4129494 4562656
44071 4562656 4962097 4896146 4646921 4676580 4674141 4022369 2904273 2067092 1732585 1578409
44061 1578409 1531768 1698199 1767855 1456951 1315310 2051028 3239949 3880872 4104230 4899056
44051 4899056 6000487 5694766 3420118 1090353 707545 1741181 2177671 1420145 696484
44042 696484 900845 1465721 1565668 1332260 1409790 1956839 2511037 2524972 1835375 823086
44032 823086 138002 52458 185201 111088 19914 383029 1172944 1879636 2148565 1946499
44022 1946499 1302535 447035 23395 486627 1361391 1753878 1505592 1094304 533817
44013 533817 -565903 -1721901 -1613612 4501 1495985 1335569 108934 -462945 147887
44004 147887 1054614 1623710 2077240 2500923 2487549 2020222 1709103 1824977 1991099 2192043
43994 2192043 3144914 5057082 6800994 7122338 6179046 5147037 4705072 4686884 4923068
43985 4923068 5514417 6272187 6680274 6592941 6387158 6286015 6105715 5842154 5875882 6241684
43975 6241684 6259357 5443093 4421416 4297344 5164848 5857443 5347088 3991698 3102269
43966 3102269 3443935 4444626 4912443 4363868 3486156 3284880 3973403 4924868 5613189
43957 5613189 6178929 6900966 7533295 7607659 7172782 6710524 6385742 5942392 5390060 5125461
43947 5125461 5084385 4453670 2843575 1272234 1147885 2411078 3525322 3426827 2706805
43938 2706805 2532581 3069715 3518184 3292574 2590361 1996709 2013591 2857319 4273113
43929 4273113 5546080 5980681 5371705 3945195 2162665 811720 793998 2217723 3951574
43920 3951574 4726541 4565094 4493884 4968305 5384480 5235247 4899185 4915719 5151662 5168487
43910 5168487 4940616 4754983 4756098 4961175 5382653 5817729 5888581 5579864 5297348 5117712
43900 5117712 4589418 3711765 3384097 4127993 4978545 4661810 3521982 3161000 4254487
43891 4254487 5845753 6922662 7559928 8113256 8344187 8043587 7749118 8033529 8564527
43882 8564527 8619947 8177019 7743886 7376200 6709997 5961553 6058983 7456739 9394486
43873 9394486 10783393 11485889 12195831 13158077 13608339 12801016 11233203 10261074 10445031
43864 10445031 10832101 10236875 8801693 7693922 7482380 7578379 7390438 7290280 7990040
43855 7990040 9414122 10701146 11151696 10815500 10244214 9918156 9851585 9646161 9045190
43846 9045190 8406911 8320146 8770342 9198848 9502552 10295417 11781643 13030899 13046584
43837 13046584 12089301 11163129 10506094 9469500 7777065 5986943 4585394 3443153
43829 3443153 2427287 1835997 1881095 2332393 3010794 4055458 5328179 6151574 6143336
43820 6143336 5790719 5632535 5377741 4549469 3568861 3265776 3491531 3241447 2280599
43811 2280599 1654068 2157211 3148303 3556945 3466674 3859729 5072342 6333745 6842901
43802 6842901 6619487 6145804 5726727 5454244 5415994 5687434 6339625 7519146 9186837
43793 9186837 10728051 11311375 10873826 10329823 10519615 11362325 12359111 13401956 14508932
43784 14508932 15183497 14846369 13799373 13003924 12829537 12680848 11996635 10961078 9969213
43775 9969213 9004112 7953857 7066050 6583314 6210317 5431654 4263956 3332259 3200180
43766 3200180 3810170 4557661 4844116 4640235 4489702 4804869 5289749 5399941 5225427
43757 5225427 5327417 5683012 5536707 4593598 3654509 3558411 4053105 4310369 4128699 3984324
43747 3984324 4185923 4597022 5022074 5379385 5680630 6195615 7247406 8413109 8505905
43738 8505905 7049539 5191018 4188808 3519291 1829037 -425289 -944013 1296116
43730 1296116 4279836 5287739 4106328 2834381 2995869 3983699 4363387 3780964 3139021
43721 3139021 3282329 3978743 4279022 3685458 2697493 2153941 2365700 3130654 4205814
43712 4205814 5256432 5639286 4953776 3747768 3005160 2943010 2988314 2906467 3124463 3837039
43702 3837039 4654014 5313932 5844159 5810652 4537481 2572094 1768619 3058125 5083400
43693 5083400 6018879 5882308 5877976 6187581 5882632 4737227 3703637 3533742 4097296
43684 4097296 5143513 6592711 7891361 8217610 7688617 7330833 7396586 6720237 4423269
43675 4423269 1429394 -536074 -874677 -240374 758551 1986360 3074015 3330306 2704031
43666 2704031 2178237 2701992 4021229 5027653 5175412 5086830 5588786 6537560 7052011
43657 7052011 6790927 6424186 6638143 7169102 7231466 6568538 5598075 4734645 4089818 3753292
43647 3753292 3878570 4470364 5411858 6580181 7581365 7651958 6442923 4770147 3908736
43638 3908736 4163918 4787720 5211782 5487282 5457648 4586616 3049974 2023110 2201025
43629 2201025 2811360 2852151 2596867 2945522 3839725 4397520 4311416 4016134 3598383 2687273
43619 2687273 1553111 1209480 2019285 3081532 3467512 3298338 3105789 2909741 2613513
43610 2613513 2638823 3292078 3936598 3720623 2898873 2530811 2984694 3674167 4273306 5149820
43600 5149820 6347323 7190353 7421812 7764069 8584817 8875141 7643076 5750691 5074890
43591 5074890 6014685 7122795 7359282 7448847 8473333 10158577 11381482 11754070 11895590
43582 11895590 12430176 13316157 13989761 13813760 12664032 11324575 10835055 11129618 10919801
43573 10919801 9393438 7383156 6224256 6117941 6440866 7014466 7948295 8676102 8472996
43564 8472996 7812765 7895766 8734056 9032112 8290634 7693433 8251460 9226898 9313718 8532240
43554 8532240 7974147 8260642 9197824 10521945 12034682 13248472 13795197 14114138 14975603
43545 14975603 16331547 17304863 17350650 16841744 16469593 16638203 17520002 19097235 20887211
43536 20887211 22090266 22371562 22274215 22595150 23481359 24323645 24431155 23619530 22154425
43527 22154425 20306575 18155554 15890525 14111163 13485812 13973481 14592502 14192746 12457506
43518 12457506 10095121 8138853 7136333 6935107 7125667 7592197 8513589 9846394 11113010
43509 11113010 11915799 12383117 12793227 13086670 13256246 13900207 15605831 17866880 19476239
43500 19476239 20116254 20692674 21812716 22814632 22814245 21984070 21206156 21027034 21461785
43491 21461785 22221246 22599050 21798401 20006421 18485127 17904065 17333650 15800035 14076906
43482 14076906 13673826 14529717 15137539 14814286 14423071 14709010 15293660 15747893 16459938
43473 16459938 17778454 19190364 20028532 20334650 20457463 20433185 20346749 20687938 21608008
43464 21608008 22216061 21379053 19126965 16721288 15348652 15111768 15255143 15038754 14331750
43455 14331750 13545647 13111270 13078614 13214328 13251149 12857278 11697966 9989867 8739105
43446 8739105 8762348 9540411 9775561 9157397 8775047 9506281 10796805 11567507 11715131
43437 11715131 12027142 12930661 13961381 14385995 13905861 12753594 11378727 10097372 9040229
43428 9040229 8499571 9052191 10830150 12779419 13411948 12539429 11585549 11820945 12939312
43419 12939312 13840450 14135946 14160536 14005988 13449871 12678420 12269932 12408504 12733676
43410 12733676 13060066 13696839 14850976 16104468 16746769 16479905 15673266 14996886 14834556
43401 14834556 15023576 15188578 15254910 15436524 15769093 16001980 16019602 15986592 15923001 15528034
43391 15528034 14667322 13717586 13209383 13414596 14395584 16017119 17726659 18848399 19393686
43382 19393686 20070686 21176353 22086837 22316626 22476426 23519808 25465887 27506053 29011565
43373 29011565 29844173 30096715 30221804 31038754 32845755 34800529 35910900 36364693 37141587
43364 37141587 38610822 40324973 41921714 43349044 44430490 45127510 46035401 47701103
43356 47701103 49739640 51705371 54499472 59508975 66501901 74030369 82057800 92317755
43348 92317755 105469588 119810800 133994999 149435494 168478833 191358737 216530991
43341 216530991 242941301 269917727 295250075 315451081 328253324 333523092 331733693
43334 331733693 323191516 309212419 292580118 276006158 261047052 249017721 241712186
43327 241712186 240144245 243313062 249289201 257095055 266506002 276260544 283623873 286048057
43319 286048057 282637847 273788014 260081191 242111412 221074889 198855892 177302298
43312 177302298 157625126 140540364 126573417 115811814 107563150 100869121 95513642
43305 95513642 92028261 90468130 89754438 88701434 87174904 85542840 83405624 79845946
43297 79845946 74843902 69439043 64326876 59238260 54000080 49199848 45192414 41311596
43289 41311596 36905126 32550408 29348115 27396157 25822152 24047786 22173202 20337637
43281 20337637 18632969 17575202 17688077 18476127 18678640 17794656 16603894 15919347 15585460
43272 15585460 15071930 14350731 13733699 13440525 13750237 14945216 16587285 17465689 16914626
43263 16914626 15709306 15047123 15165660 15688903 16766164 18809130 21362907 23390234
43255 23390234 24775972 26551066 29348291 32491728 35008911 36830570 38511305 40303143
43247 40303143 41969964 43086032 43092052 41481381 38460925 35160144 32638893 30752705
43239 30752705 28426399 25088204 21510992 19067484 18257273 18163071 17517598 16209940 15316582
43230 15316582 15476390 15835525 15228205 13935228 13263864 13494382 13420666 12252873 10883437
43221 10883437 10614164 11503195 12776317 14155377 15794537 17346519 18132252 18127394 17962398
43212 17962398 18008048 18164778 18439186 18937507 19274850 18781023 17487133 16267282 15748586
43203 15748586 15590323 15110608 14228282 13506231 13508656 14313234 15505825 16545156 17190710
43194 17190710 17545265 17705207 17681240 17781685 18582133 20120582 21543959 22054685 21852894
43185 21852894 21657813 21770102 22219445 23238155 24672437 25483432 25068772 24708648 26180404
43176 26180404 28977456 30600511 30013121 29135702 30111442 32644457 35223025 37629378
43168 37629378 40653081 44207750 47483114 50586924 54400237 58893176 63162645 67355953
43160 67355953 73070544 81270994 91021196 101069079 111772122 124540275 139987786
43153 139987786 157614863 177006592 198285795 221119387 243894166 264252493 280197504
43146 280197504 290464854 294119085 290347488 278978857 261123873 239014402 215053269
43139 215053269 191073450 168449849 148455110 131964861 118793791 107787049 97897973
43132 97897973 89061384 81802436 76123823 71165438 66144090 61379762 58006173 56628348
43124 56628348 56598337 56764102 56582233 56201870 55859526 55834519 56854611 59691897 63999633
43115 63999633 68135335 70686917 71942920 73451899 76302410 80201511 84132531 87565450
43107 87565450 90999020 95493693 101661649 109065631 116737118 124270602 132090425 140580963
43099 140580963 149449731 158263246 167150534 176445581 185936111 195154364 204434555 215101721
43091 215101721 228319213 243882893 260088104 274448887 284570115 288871368 286980772
43084 286980772 279528958 267485670 251714276 233186226 213451985 194532667 177991180
43077 177991180 164056605 151958840 141309675 132828160 127314993 124185694 121654391
43070 121654391 118383474 114406257 110428092 106941610 104236810 102487433 101256741 99416697
43062 99416697 96166772 91906294 87718511 84281684 81613096 79489605 77667568 75955700
43054 75955700 74427771 73305025 72449848 71486214 70665282 70855114 72124916 73090833 72473204
43045 72473204 70707391 69122870 68097317 67135241 66379053 66713182 68334062 70369275
43037 70369275 72125514 73732018 75278622 76220597 76058870 74988858 73582691 72335839
43029 72335839 71629004 71535450 71577691 71285645 70990948 71317313 71874728 71394905 69376738
43020 69376738 66662642 64017261 61053307 57151890 52719588 48834544 46057214 44104204
43012 44104204 42359352 40316492 37835518 35286262 33225760 31840734 30974560 30530341
43004 30530341 30302840 29676455 28373852 27332289 27667665 28747662 28710926 27236494 26225519
42995 26225519 26964197 28147621 27928735 26625921 25862411 25973193 25985428 25622389 25591661
42986 25591661 26058157 26425026 26690041 27569088 29030817 29992956 29858386 29308959 29227122
42977 29227122 29769338 30800760 32264219 33697645 34274529 33828722 33129779 32749314 32427515
42968 32427515 32028752 32310173 34012926 36705670 39210626 40857106 41822581 42641367 43959680
42959 43959680 46457103 50337010 54917914 59132991 62382296 64673278 66229020 67401190
42951 67401190 68743089 70563157 72315216 72852578 71504192 68752383 65765228 63349698
42943 63349698 61362971 59063791 56064565 52968646 50919973 50399264 50640701 50478352
42935 50478352 49658843 49008096 49325797 50505633 51912117 53258565 54734029 56491662
42927 56491662 58571703 61350957 65405972 70522528 75324213 78524924 80354305 82106578
42919 82106578 84360779 86355512 87208137 87012817 86459032 86068806 86261366 87558956 90112388
42910 90112388 93407068 96994527 101213156 106727380 113749368 122243670 132436017 144380949
42902 144380949 157372533 170661663 184610451 200194127 217192395 233599257 247098072
42895 247098072 256702006 262930739 266951582 269675232 271194996 270936826 268623188 264919362
42887 264919362 260618012 255365204 247900385 237528760 224663008 209981785 193973924
42880 193973924 177500794 161894921 148034402 135877524 125104912 115482463 106375663
42873 106375663 96888828 87090609 78340630 71735501 66866873 62763459 59360809 57144384
42865 57144384 55822819 54351754 52112020 49269540 46117622 42850209 39919795 37818853
42857 37818853 36369252 34841989 32947218 31225793 30301950 30113190 30004776 29358308 28169241
42848 28169241 27259812 27765501 30023700 33067428 35590526 37280590 38805699 40738322
42840 40738322 43159435 46275638 50637645 56387498 62711168 68340975 72379515 74537536
42832 74537536 74878389 73480432 70188090 64794598 57807671 50840663 45568342 42163498
42824 42163498 39333220 36034424 32508727 29425176 26852784 24674700 23310484 23138563
42816 23138563 23554383 23479403 22666543 21713793 20912288 20010305 19178500 19148055 19935995 20354623
42806 20354623 19562871 18506775 18936729 21278470 24297892 26755697 28600350 30487573
42798 30487573 32894587 35973367 39689820 43738900 47629958 51032872 53753355 55381292
42790 55381292 55475903 54173475 52018048 49064876 44897380 39830412 35228838 31999615
42782 31999615 29504826 26775541 24138566 22571006 21883882 20839308 19053950 17565586
42774 17565586 17218279 17518653 17559862 17249454 17067760 17223131 17585164 18045783 18593043
42765 18593043 19443983 21301542 24825991 29465617 33459120 35544840 36169115 36496417
42757 36496417 36782054 36400711 35044864 33093733 30978736 28881941 26993976 25480007
42749 25480007 24199031 22919363 21771634 21091731 20911959 21005708 21326076 22013827 23101329
42740 23101329 24569851 26472268 28546856 29999917 30356953 30421564 31600629 34075945
42732 34075945 36260697 36411642 34418260 31740593 29866879 29054715 28356033 26642759
42724 26642759 23697404 20422485 17972313 16736265 16223474 15713946 14772075 13348448
42716 13348448 11821629 10896699 11023858 11820321 12372944 12175266 11499369 10857348 10486761
42707 10486761 10484762 11055746 12282651 13755310 14711136 14705806 14162562 14108301 15105392 16441470
42697 16441470 16756747 15651850 14247989 13792457 14135514 14193065 13642525 13348514 14022254
42688 14022254 15183146 15814229 15621601 15273599 15592458 16754528 18187213 19147347 19475663
42679 19475663 19728344 20399109 21170653 21322449 20855140 20739853 21839457 23878285 25744047
42670 25744047 26715779 27244747 28528668 31323516 35167320 38845919 41576112 43472090
42662 43472090 44860653 45667172 45774691 45465968 44977590 44014278 42329822 40454059 39094917
42653 39094917 38026645 36374072 33914646 31305163 29065771 27188732 25756624 24975729
42645 24975729 24417592 23232131 21486808 20339680 20358211 20565690 19863030 18636528 18103258
42636 18103258 18606813 19456218 20109154 20609260 20940865 20738347 19790843 18393767 17111365
42627 17111365 16409558 16400050 16709060 16792341 16618003 16783555 17708428 19016516 19980623 20215306
42617 20215306 19656659 18354196 16732157 15580132 15195099 14913178 14137819 13496357 14178777
42608 14178777 16226689 18236914 18881979 18179702 17135574 16584749 16585189 16707321 16744112
42599 16744112 17050013 17970717 19023885 19248171 18596413 18276198 19180103 20627319 21372909
42590 21372909 21264659 21003180 20783388 20298885 19790812 19854310 20248464 20113177 19496024
42581 19496024 19484276 20555686 21936691 22948149 23803671 24544090 24406092 23126663 21884311
42572 21884311 21893195 22769067 23341188 23508118 24109480 25242386 25892314 25349427 24147411
42563 24147411 23413849 23827138 25233313 26827083 27810627 28316619 29415469 31640962 33877524
42554 33877524 34550885 33688931 32810991 32862322 33418433 34098349 35447293 37763338 40181520
42545 40181520 41936020 43726270 46614339 50028630 52246335 52905548 53757446 56439072
42537 56439072 60493798 64360719 67663955 71571604 77099420 83954621 91221904 98535848
42529 98535848 106252566 114922338 124993902 136738748 149996926 164061651 178119508
42522 178119508 191674338 204187929 214504422 221266026 224004078 223252917 219432926 212353914
42514 212353914 202273377 190686669 179196588 168070319 156943912 146622126 138765237
42507 138765237 133580808 129278654 124570505 120486169 118599270 118440771 118160881 117209944
42499 117209944 116719163 117358170 118554504 120175726 123272539 128266444 133806318 138691858
42491 138691858 143977002 151759618 162412384 174334471 186077124 197249974 207302883
42484 207302883 214859450 218800654 219076330 216000725 209610024 200263543 189139333 177429446
42476 177429446 165442486 153014841 140429505 128422127 117554705 108000268 99684832
42469 99684832 92279033 85337938 78825078 73225189 68779578 64927268 60937144 56804355
42461 56804355 53027965 49766565 46839156 44448503 43185339 43108492 43336858 42893076 41684832
42452 41684832 40357652 39340037 38378002 37090320 35734009 35076370 35383021 35797358 35105604
42443 35105604 33117976 30948076 29832843 29991611 30776488 31586371 32333720 33195504 34186578
42434 34186578 34993746 35234098 34975285 34804799 35007378 34886686 33633475 31907077 31610140
42425 31610140 33598658 36392675 37873362 37675446 37090103 37065195 37288685 37096240 36337838
42416 36337838 35216731 33962025 32821505 31900123 30990735 30018271 29526452 30128265 31553677
42407 31553677 32898427 33786828 34579094 35405067 35824412 35708081 35718862 36485414 37813159
42398 37813159 39103590 40134860 41065624 42023090 43048366 44215908 45552963 47026451
42390 47026451 48714567 50725767 52912715 55067406 57495058 60928883 65666546 71189472
42382 71189472 76816703 82248973 87133640 90532634 91386904 89499101 85824690 81841087
42374 81841087 78716244 76914700 76403648 77167624 79397082 83092090 87740396 92661753
42366 92661753 97418502 101524369 104077036 104288173 102231344 98490187 93245134 86377582
42358 86377582 78317459 70011595 62128326 55040004 49357743 45422579 42348848 38818267
42350 38818267 34962130 32163453 30764548 29482511 27623505 26235256 26103066 26167374
42342 26167374 25309549 24396576 24849641 26104445 26345662 25281502 24422317 24799025 26015435
42333 26015435 27472222 28919632 29686208 28938895 27132099 25926653 26204526 27170811 27711942
42324 27711942 27601682 27079080 26316363 25699610 25663989 25882989 25536876 24637757 24039876
42315 24039876 23872604 23227935 21912902 21188419 21924075 23162899 23543719 23217707 23240827
42306 23240827 23794099 24161636 23971323 23385786 22466486 21381544 20916058 21726055 23235923
42297 23235923 24173496 24057295 23366811 22535390 21748092 21530588 22401722 23851281 24670639
42288 24670639 24490309 24079204 23929044 23549605 22581962 21644820 21371636 21306685 20586669
42279 20586669 19330111 18539057 18722571 19276955 19307784 18610463 17721897 17329056 17755989
42270 17755989 18785964 19805033 20241757 20054289 19784969 19985235 20515657 20573041 19624290
42261 19624290 18220005 17518673 17929328 18654678 18857203 18864108 19694078 21594870 23638302
42252 23638302 24760649 24676979 23683305 22082500 20084630 17972357 16123196 14971621
42244 14971621 14877138 15685806 16479895 16309874 15334721 14727930 15213996 16208639 16725549
42235 16725549 16562106 16047161 15114730 13451645 11429882 10089262 9996332 10636793 11148651
42226 11148651 11280474 11422915 11960286 12771505 13265035 12937474 12056857 11595591 12122824
42217 12122824 12963057 13003012 12191028 11459501 11107684 10259092 8428960 6731999 6620472
42208 6620472 7930836 9162650 9450424 9262119 9175071 9008637 8501681 8015164 8035515
42199 8035515 8496355 9025437 9432969 9571407 9159444 8229734 7429981 7396086 8029195 8766455
42189 8766455 9297413 9582599 9449992 8774988 7992347 7864935 8616622 9635656 10112389
42180 10112389 9724063 8718989 7639133 7003061 7013839 7487149 8090190 8484357 8193532
42171 8193532 6821423 4814404 3559781 4010520 5411978 6160801 5841712 5522059 5926395
42162 5926395 6359820 5956391 5101124 4768749 4998748 4965451 4349766 3777711 3879460 4627649
42152 4627649 5710995 6906473 7855103 8046251 7411556 6591448 6281083 6565216 7160675
42143 7160675 7977228 8974132 9629812 9149685 7417644 5406716 4341837 4553052 5350564
42134 5350564 5926405 6093737 6099457 6028114 5699515 5086666 4504632 4236014 4177572 4092262
42124 4092262 4092899 4538158 5384101 5976298 5744099 4884870 4021496 3339917 2568576 1837080
42114 1837080 1918377 3223782 5017182 6193996 6576560 6824872 7241042 7426917 7187332
42105 7187332 6983312 7168356 7425089 7384471 7250411 7317418 7368142 7149361 7043380 7559674
42095 7559674 8386596 8676038 8234204 7785468 7958947 8519826 8762430 8333463 7548997
42086 7548997 7065277 7204046 7522742 7310546 6625945 6332378 6786620 7163008 6709678
42077 6709678 6000933 5990752 6355080 5989022 4888247 4223016 4566729 5372111 6314203
42068 6314203 7726280 9354445 10138142 9847385 9559653 9723719 9140874 6963112 4449284
42059 4449284 3362245 3600744 3890137 3974983 4425400 4844836 4206249 2912828 2685081
42050 2685081 4044847 5486014 5697163 5234373 5272506 5878736 6407644 6693125 6893017
42041 6893017 6802716 6280482 5945258 6537711 7758149 8531230 8423978 8131755 8397795
42032 8397795 8974459 9013952 8279814 7577154 7827390 8908577 9757062 9674384 9138535 9043494
42022 9043494 9493272 9808634 9498912 8719669 7933229 7650719 8335010 9881546 11240646
42013 11240646 11269988 10038201 8633593 7680438 6873725 6077151 5814020 6189646 6327992
42004 6327992 5667763 5020884 5369829 6211260 6263093 5540388 5469061 6798478 8525955
41995 8525955 9329329 9136666 8625407 7924723 6778804 5665830 5673482 7022546 8491378
41986 8491378 8795662 8073044 7472040 7608095 8094302 8458363 8705355 8765093 8175415 6891058
41976 6891058 5873144 6126445 7377489 8407402 8596953 8441406 8528211 8762225 8828961
41967 8828961 8749277 8582951 8099875 7197719 6265950 5678009 5216856 4492927 3749666 3743931
41957 3743931 4828229 6535590 8108250 9101532 9388166 8927303 7844408 6644479 6019901
41948 6019901 6274072 7055623 7833250 8510188 9261079 9832834 9572864 8435016 7439581
41939 7439581 7570169 8513884 9118806 8900487 8379563 8017503 7681138 7347105 7500024
41930 7500024 8367979 9365433 9803079 9702749 9438490 9013142 8281252 7586957 7508006 7998536
41920 7998536 8317629 7917698 7067898 6482288 6538678 6973748 7260168 7186415 6985351 6878130
41910 6878130 6711968 6292580 5874942 5880984 6184647 6182532 5648939 5044448 4866944 5166377
41900 5166377 5789520 6545085 6988557 6697013 6009859 5805599 6190774 6169869 5164265
41891 5164265 4121675 4340005 5736595 7114692 7702843 7535434 6690604 5260518 4029312
41882 4029312 4092931 5480261 6874436 7019525 5926093 4572279 3953557 4514325 5884555
41873 5884555 6960877 6820674 5830300 5344668 6031676 7016109 7080303 6260228 5701319
41864 5701319 6152023 7148723 7703072 7360615 6393907 5212111 3921429 2551516 1486312
41855 1486312 1334213 2274450 3754191 4992981 5628975 5744521 5508332 5058629 4561276
41846 4561276 4080450 3493360 2790526 2335068 2529745 3310617 4253923 5120548 6016977
41837 6016977 7041252 8007288 8549005 8414403 7739430 7047465 6735724 6516976 5747470
41828 5747470 4428159 3389856 3255025 3790365 4624433 5875631 7432873 8317701 7724818
41819 7724818 6289635 5359092 5308501 5556815 5907661 6635168 7355390 7194999 6290562
41810 6290562 5802715 6054799 5975541 4999662 4208586 4631372 5529349 5593035 5038414 5129239
41800 5129239 6042046 6614732 6205477 5579938 5682836 6464252 7282587 7747940 7771756 7337950
41790 7337950 6660588 6229645 6340086 6753281 7006738 6847222 6239689 5262838 4246807
41781 4246807 3768742 4148516 4990386 5532428 5532445 5557388 6177526 7015741 6963114 5471328
41771 5471328 3351945 2011719 2028910 2762471 3240909 3060445 2445723 1887701 1870987
41762 1870987 2562660 3503810 3880530 3401762 2768716 3017478 4447074 6365242 7845568
41753 7845568 8574023 8907794 9190800 9205524 8535373 7432803 6880548 7482209 8636410
41744 8636410 9270392 9136323 8820483 8666559 8411812 7885070 7320223 6829438 6281223
41735 6281223 5935161 6441647 7772367 8804027 8567638 7490668 6825808 7132697 7835496
41726 7835496 8061897 7423182 6070465 4419682 2906251 1870123 1634040 2473031 4118768
41717 4118768 5445171 5348850 4092931 3080885 3034737 3172168 2653531 2042734 2525399
41708 2525399 4166933 5800193 6447995 6182020 5683117 5495561 5671407 5820935 5625714
41699 5625714 5383389 5600303 5962286 5533402 4347149 3786870 4618064 5620336 5278724
41690 5278724 4006547 3327558 3511900 3680793 3904873 5267888 7619532 9102874 8638912
41681 8638912 7408845 6972698 7151533 6849788 6019178 5567983 5824713 6184965 6076230
41672 6076230 5456387 4511474 3513290 2827424 2534240 2246224 1771747 1641080 2376907
41663 2376907 3514458 4068615 3897022 3892052 4709843 5915239 6641649 6637262 6292040 5901191
41653 5901191 5347599 4526020 3719855 3307551 3239221 3111481 2760016 2443196 2349056 2325663
41643 2325663 2323239 2644464 3359814 3929102 3956069 3878837 4195410 4442397 3926796 3175167
41633 3175167 3422809 4680346 5655060 5847330 6285455 7563099 8551984 8076377 6718719
41624 6718719 5756717 5236480 4450772 3597096 3433350 3698963 3430674 2716984 2639286 3380499
41614 3380499 3822197 3308324 2497329 2066561 1834370 1707585 2268512 3629807 4709083
41605 4709083 4516258 3392896 2222868 1250758 533273 658907 1843531 2980060 2920364
41596 2920364 2299433 2700467 4201531 5226389 4929467 4240946 4132436 4276611 4174446
41587 4174446 4333960 5243268 6128144 6001363 5357847 5539615 6728717 7822982 8175382
41578 8175382 8174700 8002602 7133418 5515676 4096386 3502542 3174193 2611371 2586512 3993417
41568 3993417 6043115 6893245 5997838 4689352 4220027 4222971 3600494 2212438 1024930
41559 1024930 912181 1853945 3201748 4314838 4882661 4888785 4487219 4019412 4061609 5092270
41549 5092270 6848722 8287894 8616238 8205986 8007462 8195276 8083285 7433412 7006827
41540 7006827 7357437 7759373 7101841 5546600 4482261 4771373 5707847 6017629 5447568
41531 5447568 4892092 5082257 5652450 5744316 5252040 5003477 5627758 6670365 7180953
41522 7180953 6921897 6512185 6447268 6522549 6383226 6172174 6287829 6747057 7111011 6949109
41512 6949109 6184850 5086685 4075727 3451382 3183692 3047228 2994287 3235190 3879949
41503 3879949 4669565 5155210 5023720 4245712 3120135 2208030 1964846 2341441 2942920
41494 2942920 3576617 4331153 5121840 5661832 6079831 7022241 8682303 10111330 10109731
41485 10109731 8692300 7117209 6429996 6466026 6415191 5881568 5047213 4135082 3242822
41476 3242822 2680044 2946967 4097132 5427833 6157906 6217221 5974618 5420103 4285323
41467 4285323 2931230 2213853 2130766 1522592 -172613 -1670791 -1368784 443843 2110532
41458 2110532 2994941 3910296 5164085 5747220 5028520 3968239 3826396 4593284 5468109
41449 5468109 6054315 6274638 5888467 5031224 4618274 5241808 6120905 6092670 5295739 4934943
41439 4934943 5614413 6803749 7803046 8348750 8281582 7439704 6054936 4712517 3803467
41430 3803467 3341845 3198938 3140587 2829102 2196028 1611632 1364314 1317461 1389256 1809876
41420 1809876 2459938 2686164 2454567 2863997 4492372 5962739 5501183 3490209 2013514
41411 2013514 2026075 2471006 2293533 1840203 1862243 2420168 3306588 4455950 5380035 5199630
41401 5199630 3871658 2574007 2301501 2786257 3250142 3432943 3370541 2943620 2252475
41392 2252475 1786119 1659741 1286408 314919 -704117 -1060551 -675021 278260 1773646
41383 1773646 3353108 3888636 2779568 986775 148939 881493 2378024 3346037 2997769
41374 2997769 1626786 598539 1194553 3029608 4243576 3727447 2413129 1766045 1870889
41365 1870889 1930958 1923359 2540893 3814160 4929219 5366572 5333746 5117421 4806023 4609149
41355 4609149 4691666 4694611 4096175 3017004 2031579 1283912 516653 -87423 56625 900436
41345 900436 1542966 1399244 1019967 1323355 2356479 3238108 3233135 2581404 2138075 2265647
41335 2265647 2357587 1751052 890347 921130 2023722 2922838 2492498 1173481 171515
41326 171515 -192501 -561820 -1346636 -2239672 -2760560 -2663613 -1999003 -1318612 -1533774 -2953570
41316 -2953570 -4716964 -5730951 -5809944 -5321743 -4303895 -2834371 -1756525 -1862659 -2612497
41307 -2612497 -2849019 -2623461 -2988362 -3944906 -4060782 -2590918 -720855 -5920 -533220
41298 -533220 -1326605 -1740816 -1694609 -1202251 -503508 -225935 -666185 -1163086 -800638 414906
41288 414906 1540769 1737403 994860 -21516 -559836 -327755 351273 970652 1369862
41279 1369862 1598914 1420548 491799 -893488 -1798563 -1625994 -752238 -48222 -105585
41270 -105585 -957694 -2104449 -2736108 -2392147 -1483867 -770432 -412712 -113917 -30797 -646636
41260 -646636 -1639044 -1852666 -807989 550954 1075496 705108 109220 -279145 -348713
41251 -348713 -24681 526013 820992 628694 222253 -182614 -674522 -1068970 -822489 40493
41241 40493 637193 381996 -259663 -701664 -1136585 -1805680 -2131415 -1498984 -404904 31555
41231 31555 -643897 -2043940 -3506538 -4177472 -3266015 -1175774 246047 -321496 -1952102
41222 -1952102 -2811966 -2639940 -2526556 -2694323 -2234676 -1055625 -313202 -435410 -294125
41213 -294125 888532 2147999 2272461 1630177 1381802 1629141 1553913 974789 551963
41204 551963 470369 -39634 -1554345 -3494117 -4712784 -4741956 -4149674 -3786518 -3893500
41195 -3893500 -3993511 -3572592 -2706765 -1894997 -1394251 -978354 -352966 464754 1261099
41186 1261099 1871823 2160970 1920217 985771 -521184 -2095937 -3042869 -2941597 -2037363
41177 -2037363 -1017679 -279628 350997 992998 1186786 488637 -620721 -1057521 -440780
41168 -440780 452491 731190 445616 289130 541723 714626 239972 -737665 -1403187 -1096907
41158 -1096907 -18584 974030 1223769 810188 307342 241202 742765 1424780 1599820
41149 1599820 961070 19752 -536282 -774021 -1152578 -1392454 -769115 341436 543932
41140 543932 -406550 -945625 -184227 405691 -680159 -2217059 -1917461 -150944 388667
41131 388667 -1302496 -3178185 -3281778 -2157033 -1285290 -945922 -752805 -839907 -1267190
41122 -1267190 -1357381 -780659 -393921 -975712 -1966028 -2400339 -2236299 -1821117 -952389 472382
41112 472382 1685819 2017868 1910740 1954135 1729242 754555 -262075 -478999 -530656 -1590675
41102 -1590675 -3325327 -4311627 -4172136 -3778110 -3550834 -3126485 -2639992 -2736969 -3168126
41093 -3168126 -2929282 -2104132 -2042099 -3186957 -4161864 -3768227 -2676767 -2219553 -2445404
41084 -2445404 -2358808 -1466234 -168634 1035607 1981293 2594070 2726010 2282192 1424326
41075 1424326 708144 753297 1371300 1367060 -75240 -2086527 -3118182 -3046806 -3107902 -3763648
41065 -3763648 -4058125 -3464661 -2963489 -3524084 -4654590 -5325512 -5391742 -5219594 -4764885
41056 -4764885 -3983867 -3443482 -3538566 -3660731 -3036901 -1854699 -719413 366716 1514216
41047 1514216 2086809 1539416 685794 830488 1802493 2111775 1095454 -292032 -1062843
41038 -1062843 -1471908 -2224937 -3211920 -3635559 -3046348 -1879547 -1095051 -1310212 -2117907
41029 -2117907 -2455148 -1897351 -1184195 -1036203 -1040803 -494283 214287 203857 -243003 -3565
41019 -3565 893603 1073619 7556 -1021205 -905813 -418749 -810523 -1632849 -1363335 164059
41009 164059 1318664 833618 -596026 -1301867 -640027 446198 601233 -554842 -2183952
41000 -2183952 -3161438 -3081278 -2313957 -1330316 -319945 610176 1339427 1941596 2549567
40991 2549567 2872947 2365510 1154526 279339 523580 1370401 1645415 965758 16829
40982 16829 -495938 -647693 -1002344 -1895642 -3102291 -4013314 -4134985 -3550589 -2829993 -2414868
40972 -2414868 -2294145 -2355480 -2634761 -2916286 -2551140 -1274049 53477 235644 -713439
40963 -713439 -1482692 -1100603 -73962 437932 116857 -337306 -305075 -12844 -124246 -871507
40953 -871507 -1772694 -2130464 -1699979 -866329 -239045 -135674 -439027 -850784 -1207275 -1564015
40943 -1564015 -1999901 -2365319 -2347403 -1899892 -1451275 -1403423 -1523796 -1271623 -757695 -818592
40933 -818592 -1872774 -3239533 -4028265 -4202791 -4154457 -3694962 -2418858 -921428 -570336
40924 -570336 -1747466 -3186478 -3573817 -3127379 -2955922 -3395564 -3776726 -3563606 -2906678
40915 -2906678 -2106350 -1306318 -887569 -1462532 -3064479 -4797654 -5746833 -5948513 -6028308
40906 -6028308 -6131765 -5807230 -4928302 -4102530 -3869395 -3919046 -3518472 -2466629 -1198071
40897 -1198071 -110927 678608 949634 404390 -639911 -1157024 -543591 493401 803611
40888 803611 389911 430389 1612665 3136933 3729887 3102710 1896428 614836 -658735
40879 -658735 -1635667 -1760327 -1053934 -387561 -415627 -620122 5534 1490958 2704845
40870 2704845 2671797 1552261 183903 -823561 -1244952 -972003 -102112 891060 1486260
40861 1486260 1541518 1192500 606796 130677 269582 1015287 1583715 1489611 1466374 2344756
40851 2344756 3315687 2686123 534370 -886255 -93118 1616373 2174577 1623569 1524515
40842 1524515 2241778 2549226 1784633 766257 293388 98831 -222899 -379743 -112965
40833 -112965 92306 -292409 -976535 -1204352 -564377 830270 2450199 3403791 3018301
40824 3018301 1724783 816414 987666 1601190 1629663 750209 -686617 -2069688 -2650432
40815 -2650432 -2022676 -801145 -36642 300172 1211902 2656136 2987243 1333377 -726178
40806 -726178 -1193936 -391884 -104865 -709774 -1004015 -644698 -811085 -2060741 -3146088
40797 -3146088 -2704737 -1007644 678944 1618581 1868909 1748319 1679144 2072069 2849494
40788 2849494 3397594 3259115 2534761 1520621 450639 -332213 -545711 -412383 -325650
40779 -325650 -34633 1068896 2714074 3665074 3210914 2019527 1202143 1237004 2050152
40770 2050152 3271689 4025154 3408616 1776103 700807 1021758 1748288 1623543 917059
40761 917059 715090 1143632 1409767 1151629 641705 -72019 -1142103 -2124849 -2173173 -1093392
40751 -1093392 485931 1908269 2754316 2526554 995453 -1099979 -2514004 -2779936 -2375427
40742 -2375427 -1617934 -228523 1791091 3576935 4099283 3109693 1308020 -80518 -36739
40733 -36739 1315395 2505304 2098319 359838 -1054491 -1094089 -315259 186748 68319
40724 68319 -313684 -571041 -517955 -177298 198093 458290 908143 1809994 2642133 2641972
40714 2641972 2088394 2074836 2837834 3401400 3244404 3099451 3398285 3139891 1423666
40705 1423666 -808170 -1860854 -1505717 -789808 -105287 1046537 2505247 3234469 2962748
40696 2962748 2714858 3178884 3634603 3144449 1910910 738151 -130355 -866407 -1281827
40687 -1281827 -982133 -11067 1261009 2623122 3854448 4361900 3625811 1919517 110644
40678 110644 -1161540 -1749854 -1679927 -1062898 -188283 740815 1807113 2900421 3355079
40669 3355079 2717158 1643870 1205208 1327472 858910 -620061 -1997277 -2104871 -1188178
40660 -1188178 -282006 194907 476677 650286 714279 1076975 2056936 3077474 3312634
40651 3312634 3055785 3401569 4460400 5038297 4527722 3984616 4460101 5119406 4227046
40642 4227046 1671049 -699080 -1368150 -786331 -314925 -351214 -213958 494096 1233228
40633 1233228 1359636 1016233 765345 627404 81528 -928223 -1626975 -1463513 -1012293
40624 -1012293 -1111055 -1406634 -723840 1074869 2641527 2954678 2607243 2589544 2641423 1844741
40614 1844741 334988 -738694 -810717 -395271 43596 690568 1575488 2044813 1511343
40605 1511343 209159 -1113271 -1800526 -1432579 4894 1732430 2484107 1670306 -23331
40596 -23331 -1426842 -1932289 -1600250 -778993 -32621 -26938 -942953 -2138279 -2752554 -2560160
40586 -2560160 -2005959 -1561865 -1279909 -866311 -35263 1122483 2096121 2461688 2407730
40577 2407730 2477260 2825478 3102350 3035548 2666827 2034403 1215110 730211 1168280 2154803
40567 2154803 2446209 1475689 124164 -577012 -852093 -1572182 -2739905 -3442699 -3139749
40558 -3139749 -2251413 -1449696 -901106 -309099 582238 1569107 2057349 1807300 1556430
40549 1556430 2262775 3566915 3882662 2555107 1056714 1144638 2497217 3287849 2717909
40540 2717909 1800275 1710637 2427000 3104629 2930957 1529666 -662689 -2334386 -2408316
40531 -2408316 -1331593 -529254 -539055 -532391 205383 1258238 1861424 1885875 1649730 1427940
40521 1427940 1513721 2134999 2949840 3204917 2709104 2069878 1712313 1368962 892743 801592
40511 801592 1441368 2217371 2294319 1645637 889256 479133 516816 919372 1277218 981473
40501 981473 25804 -735989 -705823 -496840 -1051328 -2053596 -2037648 -196620 2447932
40492 2447932 3915562 3138638 947277 -722578 -679571 473577 1319703 1438905 1638991
40483 1638991 2437777 3262458 3561791 3816306 4694999 5861433 6479198 6448264 6259087
40474 6259087 5967927 5274552 4444251 4170455 4479467 4668176 4511934 4702377 5698853
40465 5698853 6778841 6767960 5440142 3775953 2891168 2960684 3275846 3261180 3162069 3473561
40455 3473561 3967779 3974772 3644885 4005182 5334170 6412877 6174280 5288653 5059151
40446 5059151 5389897 5165503 4284706 3831912 4195683 4438805 3855857 2885500 2015891
40437 2015891 987482 -254350 -866348 -208345 1109023 2026895 2250530 2014001 1362988
40428 1362988 473708 56501 533465 1261666 1440785 1393383 2035337 3406171 4717765
40419 4717765 5668015 6641811 7583737 7718051 6665652 4989164 3313698 1710825 369423
40410 369423 64988 1229349 3024225 4089891 4014026 3446202 2950747 2502792 2177888
40401 2177888 2522043 3722154 4890188 4875716 3725526 2735266 2901969 3822024 4402662
40392 4402662 4209068 3626662 3020603 2435133 2108876 2563726 3847471 5152598 5593182
40383 5593182 5102455 4237608 3353087 2377487 1288903 384350 -17015 83634 409088
40374 409088 705909 977492 1434313 2160341 2866427 3162205 3103622 3229001 3924634 4941664
40364 4941664 5656435 5636672 4904024 3922357 3425218 3890520 4970122 5774170 5943131
40355 5943131 6015191 6405781 6573547 5863457 4779003 4467571 4957539 4886785 3352593
40346 3352593 1228214 14806 -59414 -10379 -444503 -815466 -455967 399924 1057036
40337 1057036 1353057 1671985 2175663 2560144 2563401 2238646 1629113 629154 -596829 -1432357
40327 -1432357 -1379072 -589372 415122 1285570 1844600 1917062 1601291 1396271 1531071 1451935
40317 1451935 614638 -466469 -766735 -214867 332010 597114 1271918 2581967 3583634
40308 3583634 3556361 3179069 3477015 4284220 4636746 4181798 3349301 2565554 2124756 2398930
40298 2398930 3265684 3692665 2839271 1280051 201481 -259411 -772747 -1237025 -822870
40289 -822870 408510 1347283 1573870 1914243 2791782 3333190 2861621 2161963 2319434
40280 2319434 3118780 3532349 3184991 2483217 1828368 1531898 2038543 3383681 4762212
40271 4762212 5379961 5413390 5455309 5426303 4829981 3748001 2733464 1937713 1148593 511503
40261 511503 411311 762195 1147878 1493688 1861131 1869477 1272700 875798 1706252 3297364
40251 3297364 4083153 3724153 3672093 4848931 6069468 5723141 4007297 2375986 1563911
40242 1563911 1408370 2013346 3546173 5017338 4839920 2979553 1235553 785408 662024
40233 662024 -395704 -1643360 -1343491 386344 1402092 496126 -892208 -727772 904284
40224 904284 2260769 2508155 2508818 3136737 4080859 4659009 4743515 4285133 2850035 531568
40214 531568 -1302684 -1257908 292773 1608130 1717188 1213340 822311 255088 -936858
40205 -936858 -2153529 -2271104 -1126503 219840 690197 169436 -729041 -1402925 -1585618
40196 -1585618 -1249502 -473437 636945 2010043 3528333 4804909 5185924 4287154 2646696
40187 2646696 1567135 1950377 3322548 4326595 4174544 3248119 2271113 1476956 843465
40178 843465 503921 357748 -222787 -1523962 -2624527 -2288511 -688324 634604 700149
40169 700149 199868 377621 1482332 2753600 3440210 3410404 3079324 3001712 3250553 3159950
40159 3159950 2186249 1010700 976134 2241708 3477801 3837971 4130664 5198496 6203613
40150 6203613 5848421 4604728 4149108 4811416 5178608 4368116 3127540 2187401 1047801
40141 1047801 -611900 -1541151 -373545 2083414 3439066 2589446 841779 -72903 -108959
40132 -108959 -451139 -1623212 -2856740 -3191721 -2539545 -1505994 -625257 -78451 108278
40123 108278 10354 -86702 101798 448055 510355 169063 -124836 101680 844887 1858561
40113 1858561 2998385 3990691 4241364 3423896 2075774 1083228 689915 525679 457898
40104 457898 731575 1261105 1528204 1406229 1422986 1847219 2089109 1524269 557939 320562
40094 320562 1374749 3050821 4054721 3626015 2229647 1178857 1389337 2462268 3218605
40085 3218605 3099807 2655641 2607944 2913133 2978479 2459910 1613124 1051700 1188091 1644818
40075 1644818 1348928 -295923 -2447913 -3693976 -3773387 -3542821 -3236340 -2016470 288143
40066 288143 2256382 2564661 1647802 762572 329597 274847 1060523 2899075 4537023
40057 4537023 4408253 2763055 1214932 380518 -494223 -1653366 -2314970 -2313331 -2579232
40048 -2579232 -3395254 -3675010 -2747219 -1523623 -1015807 -894955 -498210 -161678 -432936
40039 -432936 -868221 -788182 -507342 -665924 -979351 -836349 -601982 -1072089 -1978563 -2252731
40029 -2252731 -1582928 -612975 223404 967764 1387007 1112393 538224 508362 1021443 1227572
40019 1227572 771156 136446 -413489 -1155650 -1965757 -2153454 -1611664 -1158426 -1302807
40010 -1302807 -1542186 -1312278 -800770 -396139 -166642 -301767 -1131726 -2155061 -2023553
40001 -2023553 -279874 1711456 2425449 2044565 1751892 1858060 1770911 1376154 1204751
39992 1204751 1339268 1280974 1009094 1204238 2154124 3170734 3380430 2571332 1095262
39983 1095262 -563844 -1946852 -2753451 -2966637 -2616167 -1582577 -73725 945487 556529
39974 556529 -825341 -1688735 -1179614 -16101 613302 468624 139025 -55870 -457765
39965 -457765 -1408642 -2572520 -3097863 -2490833 -1276232 -520591 -529732 -409107 635851
39956 635851 1953162 2179022 1171724 260930 389447 950492 952870 535827 596511 1410983
39946 1410983 2358979 2740292 2249650 906099 -810450 -1871304 -1440220 156016 1623643
39937 1623643 1981771 1387518 737814 797825 1709827 2988791 3891607 4012150 3573409
39928 3573409 3014469 2406416 1528769 425143 -465694 -777930 -572975 -202009 -39362
39919 -39362 -358143 -1187287 -2141814 -2540662 -1888281 -340069 1288703 2114214 2019633 1877755
39909 1877755 2631192 4116899 5220196 5318652 5006552 5020099 5038196 4247727 2741044
39900 2741044 1519446 1183636 1380079 1586125 1695528 1642208 1150839 240020 -497666
39891 -497666 -460804 413338 1777834 3087757 3543137 2451046 87426 -2187968 -3093450
39882 -3093450 -2494774 -1159738 113125 850837 903396 567461 414352 624339 798022
39873 798022 708960 750995 1197771 1554476 1291644 774978 662627 672488 -133628 -1880446
39863 -1880446 -3543608 -4196651 -3878429 -3098698 -2203946 -1467250 -1158946 -1198505 -1187566 -968470
39853 -968470 -676896 -193565 743015 1687213 1598760 283937 -1017759 -1122557 -360401
39844 -360401 172476 261014 576189 1382567 2204073 2659124 2717768 2144870 660576 -1129582
39834 -1129582 -1905724 -1244634 -377322 -734620 -2178387 -3244247 -2825018 -1081296 1047705
39825 1047705 2623118 3098132 2563299 1767281 1502838 1799326 1970024 1540010 837379
39816 837379 511410 707056 948432 747610 163618 -218076 181249 1304458 2298010
39807 2298010 2167869 790678 -832837 -1548814 -1213253 -647712 -496791 -538040 -312622
39798 -312622 -55186 -509450 -1865225 -3320099 -3875800 -3326248 -2291368 -1470333 -1070836
39789 -1070836 -869969 -625125 -387009 -426376 -781099 -921589 -138606 1601986 3438982
39780 3438982 4457465 4522154 4032044 3174706 1933597 673503 42233 128374 274450
39771 274450 16119 -281131 -128605 175039 -50971 -744262 -1036441 -388242 748711
39762 748711 1590933 1881185 1780637 1278680 206928 -1217444 -2271658 -2311070 -1340333
39753 -1340333 47165 1187375 1783164 1960503 1978142 1863644 1368509 386808 -602227
39744 -602227 -715422 535008 2646700 4432672 4938088 4078722 2552683 1305142 965590
39735 965590 1468456 2085876 2042042 1270558 441902 142426 262422 402171 577881 1065796
39725 1065796 1684236 1813576 1237372 451826 -59219 -355316 -559847 -393453 310451
39716 310451 1042010 1180499 849035 595391 509543 417638 710241 1944650 3558383 4090206
39706 4090206 3091965 1834510 1542768 1885189 1988117 1993331 2454901 2886228 2330135 1099533
39696 1099533 534329 1021920 1637198 1942788 2702817 4269913 5611472 5803713 5399438
39687 5399438 5298646 5171207 4193582 2728719 2014918 2463954 3328219 3835840 3691875
39678 3691875 2742643 1234877 216941 504972 1301421 1047282 -329722 -1359642 -1406730
39669 -1406730 -1552983 -2491910 -3090502 -2227758 -888207 -896898 -2194171 -2929983 -2126717
39660 -2126717 -823990 -333920 -550605 -564731 -154360 67405 -329893 -1043258 -1557556
39651 -1557556 -1884729 -2505025 -3523656 -4189562 -3708812 -2481076 -1881420 -2575377 -3710117
39642 -3710117 -4218083 -4229769 -4444456 -4650627 -3915587 -2118426 -344949 366684 -27783
39633 -27783 -948774 -1807050 -2112029 -1602795 -486565 863638 2413402 4148474 5437479
39624 5437479 5559381 4886021 4582478 4899187 4755233 3481793 2006225 1536648 1819187
39615 1819187 1639355 592952 -608269 -1379652 -1861846 -2223835 -2201974 -1647600 -961258
39606 -961258 -553409 -176563 746691 2149735 3067079 2620006 1090678 -385218 -1208791
39597 -1208791 -1845816 -2690062 -3104035 -2380022 -1175144 -842137 -1393865 -1366614 -20655
39588 -20655 1496885 1798636 1055848 351406 72660 -106990 -262582 -227056 -172555 -288384
39578 -288384 -197943 469294 1229931 1307450 775723 335136 246423 352928 841923 1941528
39568 1941528 3016276 3052421 2080073 1144417 831038 793517 771941 980113 1287606 1118825
39558 1118825 512189 249098 513640 445181 -445314 -1405795 -1656128 -1548906 -1698663 -1741980
39548 -1741980 -947897 448759 1489772 1800776 1856961 2133661 2666167 3271770 3594646
39539 3594646 3114931 1728275 207043 -453254 -80970 664914 1142325 1184289 991197
39530 991197 1058261 1940600 3508091 4614367 4115670 2168630 28891 -1335422 -1931523
39521 -1931523 -2186957 -2333802 -2402123 -2316032 -1866231 -926643 245248 1167929 1521556 1160774
39511 1160774 35243 -1472722 -2426165 -2182046 -1234921 -568831 -242826 635375 2444300
39502 2444300 4330842 5254557 5105526 4394880 3401981 2168716 973034 205227 -151995
39493 -151995 -499280 -1053750 -1542961 -1461006 -506773 1135371 2816941 3846726 4041835
39484 4041835 3750236 3210371 2112266 107960 -2328153 -3963726 -3940694 -2639768 -1190596
39475 -1190596 -266668 322103 920506 1432824 1688418 1941341 2470640 2918112 2653537
39466 2653537 1739575 870695 310578 -341550 -1107425 -1227740 -357096 593938 615751 69444
39456 69444 72936 723282 945763 133047 -967279 -1258681 -550824 461440 1020072 892770
39446 892770 472135 412508 949181 1655778 2134214 2649665 3556090 4358377 4113089 2756404
39436 2756404 1326064 764275 1094404 1802986 2353191 2244259 1295489 57024 -716603
39427 -716603 -1123696 -1894459 -2958590 -3162364 -1872117 -63163 801985 409436 -433658
39418 -433658 -923523 -774941 -54829 877103 1469390 1427275 914080 222286 -347168 -293834
39408 -293834 619590 1524890 1031665 -842164 -2240603 -1679921 116334 1377972 1486388
39399 1486388 1068670 643611 350737 519818 1267870 1817887 1412421 712393 1076300
39390 1076300 2519115 3607377 3450817 2607774 1848951 1245342 842199 1068158 1892912
39381 1892912 2529630 2577884 2613227 3022269 3114964 2227533 1023539 690228 1185400 1276438
39371 1276438 310595 -885468 -1122048 -311198 561197 695231 335851 305129 930701
39362 930701 1758115 2312021 2704753 3226785 3716770 3774077 3337981 2621123 1759703 1037412
39352 1037412 1098257 2219060 3609295 4203564 3943721 3455748 2767847 1506557 237023
39343 237023 173215 1259220 1923737 1309914 453946 485600 919358 811824 577214 1322058
39333 1322058 2991955 4443392 5024467 5021781 4809679 4523090 4355491 4318759 3937693 2961620
39323 2961620 2043605 1882154 2084362 1844760 1396122 1689230 2847599 4065092 4925549
39314 4925549 5677782 6214754 5966285 4976925 4030162 3523949 3254040 3439103 4719203
39305 4719203 6723014 7836357 7113924 5546324 4734851 5028303 5635257 5949652 6046722
39296 6046722 6233288 6622897 6912368 6424714 4865889 3103997 2433597 2892859 3217930
39287 3217930 2744398 2270263 2515446 2890966 2660932 2312969 2687665 3515606 3964765
39278 3964765 4064908 4451428 5136501 5640018 5983968 6486116 6891634 6785592 6560372
39269 6560372 6856495 7337748 7239044 6886420 7289159 8273600 8488301 7469298 6303033
39260 6303033 5880760 5833974 5665896 5590309 5596095 4980990 3677676 2879285 3343425 4112418
39250 4112418 4056400 3756385 4490994 6028744 6959720 6923351 6955226 7505719 7532846 6114010
39240 6114010 3965338 2641445 2722773 3361857 3418730 2683265 1986709 2198393 3181827
39231 3181827 3978915 4069724 3950821 4154167 4294249 3734829 2722009 2002878 1613796
39222 1613796 1001952 236151 82475 765611 1583801 1952757 1939795 1529870 373938
39213 373938 -1234072 -2063210 -1376750 4440 829701 1081953 1698719 2989897 4196233
39204 4196233 4556425 4144463 3613037 3573434 4212975 5127901 5547244 5004545 3712074
39195 3712074 2117050 412564 -1216505 -2290623 -2510206 -2253756 -2066820 -1898098 -1391926
39186 -1391926 -666856 -130166 296190 1028016 1974269 2561206 2558495 2141255 1184102 -596311
39176 -596311 -2670970 -3838759 -3690465 -3079816 -2741721 -2354712 -1561629 -1005159 -1435519
39167 -1435519 -2402642 -2803385 -2365276 -1717919 -1295746 -1044616 -996564 -1264232 -1602195 -1779490
39157 -1779490 -2175882 -3087685 -3681588 -2851848 -1128846 -359266 -1105537 -1712940 -689721
39148 -689721 1187480 2134284 1709311 689296 -608376 -2386251 -4101058 -4659155 -3985464
39139 -3985464 -3153619 -2747590 -2258650 -1412266 -869863 -992286 -978414 -123257 840610 648788
39129 648788 -715664 -2077344 -2606403 -2430745 -1929918 -1356068 -1151564 -1720345 -2621516
39120 -2621516 -2709929 -1443068 459122 1955637 2795343 3331180 3674883 3560886 2873788
39111 2873788 1864974 853453 364 -588407 -727152 -228388 830126 1871382 2027552
39102 2027552 923293 -720547 -1623035 -1232005 -198152 521380 607727 228219 -505879
39093 -505879 -1399777 -1877048 -1537169 -903405 -916061 -1632488 -2135986 -1944231 -1764454 -2340486
39083 -2340486 -3142932 -2977053 -1630068 -91193 890705 1661914 2753214 3789746 3935481
39074 3935481 3101621 2049629 1337934 760046 -23364 -791325 -1025956 -594068 139723
39065 139723 726438 923339 723341 350136 133891 188314 319722 421108 712248 1259715
39055 1259715 1499604 789242 -575078 -1442877 -1079599 80796 1117951 1594285 1592997
39046 1592997 1286108 913841 858947 1258915 1759328 2072677 2504210 3370245 4128589 3844281
39036 3844281 2559096 1461217 1444749 2132511 2673073 2877211 2985841 2806126 1928731
39027 1928731 719967 279673 1122072 2430088 3004512 2630274 2104938 2097798 2407140
39018 2407140 2367138 1682564 744810 249389 520460 1119689 1225535 598018 19529 405792
39008 405792 1567307 2420994 2523747 2643268 3336210 3708786 2556064 382172 -877272
38999 -877272 -271020 1069413 1617442 1297494 1048245 1336204 1902211 2444825 2717347
38990 2717347 2302043 1109637 -126166 -626145 -645703 -993193 -1651292 -1811512 -1297513
38981 -1297513 -979107 -1475532 -2243847 -2371013 -1692358 -750945 -110293 -12677 -319393 -566340
38971 -566340 -439654 -258244 -489563 -776166 -146018 1639031 3637346 4809220 4809528 3614989
38961 3614989 1465192 -418995 -347012 1658098 3202207 2241309 -267222 -1690821 -1091040
38952 -1091040 189988 948569 1447241 2164036 2738012 2724953 2302929 1680479 711666
38943 711666 -436020 -1137089 -1329823 -1781090 -2765022 -3405499 -3062904 -2476689 -2584898
38934 -2584898 -2982742 -2713450 -2033834 -2045304 -2771109 -2973662 -2043823 -837476 -252347
38925 -252347 -98342 26051 -228911 -1142312 -1880136 -1370644 124394 1354259 1850937
38916 1850937 2284482 2937455 2932525 1528985 -617269 -2209235 -2828835 -3029156 -3314680
38907 -3314680 -3784835 -4535998 -5572269 -6309700 -5926352 -4394857 -2626416 -1464461 -1022625
38898 -1022625 -1039347 -1270738 -1439350 -1440807 -1712936 -2685883 -3771028 -3842324 -3002878 -2741814
38888 -2741814 -3718553 -4573085 -3973147 -2798360 -2835043 -3961597 -4301042 -2980192 -1107877
38879 -1107877 133237 814355 1230168 954583 -273733 -1723158 -2537077 -2721275 -2611984
38870 -2611984 -2065954 -942845 98316 52486 -1310311 -3127441 -4065747 -3262390 -1204215
38861 -1204215 291069 -236672 -2050095 -2975573 -2240365 -1377999 -1767439 -2595038 -2308999
38852 -2308999 -990753 88803 501799 766289 900235 411835 -432046 -784465 -712269
38843 -712269 -1167605 -2297081 -3077608 -2976803 -2762781 -3147780 -3686993 -3664614 -3211149 -2859923
38833 -2859923 -2661232 -2376664 -2041066 -1811131 -1717878 -1952778 -2828288 -4040540 -4606892
38824 -4606892 -4054264 -3076706 -2492994 -2229360 -1978833 -2080401 -2734360 -2954886 -1620477
38815 -1620477 638613 1966720 1820131 1602780 2284917 2769308 1703449 -78242 -428487
38806 -428487 1112667 2670175 2572380 1216652 -125421 -1131016 -2066604 -2539470 -1988084
38797 -1988084 -1021209 -828708 -1258272 -919825 457545 1240905 255527 -1357596 -1808715
38788 -1808715 -1173372 -814631 -1021368 -929523 -510280 -777044 -1736418 -1876092 -457037
38779 -457037 1098513 1135957 15361 -704290 -516567 -150229 -1915 302327 890004
38770 890004 1345804 1571832 1986119 2588370 2629817 1634859 193617 -697534 -734275 -399732
38760 -399732 -256690 -519002 -1185302 -2236005 -3591211 -4967609 -5877620 -5901182 -5057281
38751 -5057281 -3806730 -2545631 -1221820 327906 1804067 2592137 2499093 1935696 1218849
38742 1218849 131908 -1430089 -2690485 -2524491 -887384 825617 1249748 605482 316213
38733 316213 1168769 2371497 2574274 1398546 -292724 -1316330 -1071282 189258 1612995
38724 1612995 2403980 2487927 2405036 2443098 2274541 1715208 1279149 1369787 1366030 368109
38714 368109 -1325807 -2372954 -2040755 -918586 66496 510744 310728 -471621 -1198235
38705 -1198235 -991824 51597 734136 286698 -721334 -1458518 -1953937 -2485733 -2680047
38696 -2680047 -2109799 -1196729 -645434 -479434 -456576 -848852 -1799880 -2425218 -1776329 -454107
38686 -454107 -32063 -919660 -1987692 -2401688 -2608194 -3157228 -3651623 -3471871 -2780337
38677 -2780337 -2220111 -2122619 -2417060 -2863787 -3071535 -2723073 -1997367 -1328167 -684913 280683
38667 280683 1296170 1493499 643589 -450896 -1165649 -1779380 -2437910 -2318689 -762564
38658 -762564 1369229 2513381 2289029 1603325 1048912 260354 -956829 -1834270 -1576008
38649 -1576008 -567314 9344 -337537 -820398 -462354 503165 719066 -693660 -2920997
38640 -2920997 -4199733 -3694302 -2266743 -1381477 -1636453 -2430362 -2642991 -1508767 725039
38631 725039 2780600 3405633 2682113 1849303 1627066 1372524 370537 -738694 -702961
38622 -702961 512826 1596483 1563514 704651 -268294 -1168515 -2020413 -2483522 -2231839
38613 -2231839 -1587902 -1179240 -1055021 -655130 284321 1240255 1555973 1302478 1143602
38604 1143602 1441612 1882952 2068580 2069690 2103567 1995211 1470229 831130 706927 1031527
$$ [...]
##END NTUPLES=NMR SPECTRUM
##END=
