##TITLE=31P_DE-80H_X3
 64 sc D2O
 26.2.2025
##JCAMPDX= 6.0         $$ Bruker NMR JCAMP-DX V2.0
##DATA TYPE= NMR SPECTRUM
##DATA CLASS= NTUPLES
##ORIGIN= UXNMR, Bruker Analytische Messtechnik GmbH
##OWNER= root
$$ XWIN-NMR		Version 3.5
$$ Thu Mar 20 15:14:31 2025 Russian Standard Time (UT+4h)  Yarkov@DPX200
##.OBSERVE FREQUENCY= 81.013821
##.OBSERVE NUCLEUS= ^31P
##.ACQUISITION MODE= SIMULTANEOUS
##.ACQUISITION SCHEME= undefined
##.AVERAGES= 64
##.DIGITISER RES= 17
##SPECTROMETER/DATA SYSTEM= spect
##.PULSE SEQUENCE= zgpg30
##.SOLVENT NAME= CDCl3
##.SHIFT REFERENCE= (INTERNAL, CDCl3, 0, 198.062)
##AUDIT TRAIL= $$ (NUMBER, WHEN, WHO, WHERE, WHAT)
$$ ##TITLE= Audit trail, XWIN-NMR		Version 3.5
$$ ##JCAMPDX= 5.01
$$ ##ORIGIN= Bruker BioSpin GmbH
$$ ##OWNER= Yarkov
$$ C:/Bruker/XWIN-NMR/data/yarkov2/nmr/P31/2/pdata/1/auditp.txt
$$ ##AUDIT TRAIL=  $$ (NUMBER, WHEN, WHO, WHERE, WHAT)
(   1,<2025-03-20 15:12:35.10 +0400>,<Yarkov>,<DPX200>,
      <created by zg, POWCHK disabled, PULCHK disabled
       configuration hash MD5:
       00 E9 B6 7A A2 85 ED C7 34 08 36 98 17 FE 4E 26
       data hash MD5: 32K
       C6 10 08 2D D1 D8 18 E1 23 60 F3 96 E1 99 62 39>)
(   2,<2025-03-20 15:13:11.50 +0400>,<Yarkov>,<DPX200>,
      <Start of raw data processing
       efp BC_mod = 2 LB = 1.5 FT_mod = 6 PKNL = 1 PHC0 = 1809.452 PHC1 = 6.895418 SI = 64K 
       data hash MD5: 64K
       C2 80 89 1A 0B E0 25 12 BE CC 28 67 CC 93 46 35>)
(   3,<2025-03-20 15:13:52.35 +0400>,<Yarkov>,<DPX200>,
      <pk PHC0 = -7.107504 PHC1 = -0.8000042 
       data hash MD5: 64K
       0E F2 30 CE 2B 1D 41 E0 FA 41 6F 89 9A F5 79 FF>)
$$ ##END=
$$ 
$$ hash MD5
$$ 1E 47 1F 7D 75 94 52 64 3E FB C9 46 80 A6 F5 D2
##$RELAX= 
##$RELAX= 
##$RELAX= 
##$RELAX= 
##$RELAX= 
##$RELAX= 
##$RELAX= 
##$RELAX= 
$$ Bruker specific parameters
$$ --------------------------
##$DU= <C:/Bruker/XWIN-NMR>
##$EXPNO= 2
##$NAME= <P31>
##$PROCNO= 1
##$TYPE= <nmr>
##$USER= <yarkov2>
##$AMP= (0..31)
100 100 100 100 100 100 100 100 100 100 100 100 100 100 100 100 100 100 
100 100 100 100 100 100 100 100 100 100 100 100 100 100 
##$AQSEQ= 0
##$AQ_mod= 1
##$AUNM= <au_zg>
##$AUTOPOS= <>
##$BF1= 81.014009
##$BF2= 200.13
##$BF3= 200.13
##$BF4= 200.13
##$BF5= 200.13
##$BF6= 200.13
##$BF7= 200.13
##$BF8= 200.13
##$BYTORDA= 1
##$CFDGTYP= 0
##$CFRGTYP= 5
##$CHEMSTR= <none>
##$CNST= (0..31)
1 1 145 1 1 1 1 1 1 1 1 1 1 1 1 1 1 1 1 1 1 1 1 1 1 1 1 1 1 1 1 1 
##$CPDPRG= <waltz16>
##$CPDPRG1= <>
##$CPDPRG2= <waltz16>
##$CPDPRG3= <>
##$CPDPRG4= <mlev>
##$CPDPRG5= <mlev>
##$CPDPRG6= <mlev>
##$CPDPRG7= <mlev>
##$CPDPRG8= <mlev>
##$CPDPRGB= <>
##$CPDPRGT= <>
##$D= (0..31)
0 1 0 0 0 0 0 0 0 0.06 0 0.03 2e-05 3e-06 0 0 0.0002 0 0 0 0 0 0 0 0 0 
0 0 0 0 0 0 
##$DATE= 1742469154
##$DBL= (0..7)
120 120 120 11 120 120 24 19 
##$DBP= (0..7)
150 150 150 150 150 150 150 150 
##$DBP07= 0
##$DBPNAM0= <>
##$DBPNAM1= <>
##$DBPNAM2= <>
##$DBPNAM3= <>
##$DBPNAM4= <>
##$DBPNAM5= <>
##$DBPNAM6= <>
##$DBPNAM7= <>
##$DBPOAL= (0..7)
$$ [...]
##$SUBNAM3= <"">
##$SUBNAM4= <"">
##$SUBNAM5= <"">
##$SUBNAM6= <"">
##$SUBNAM7= <"">
##$SUBNAM8= <"">
##$SUBNAM9= <"">
##$SW= 400.765351723535
##$SWIBOX= (0..15)
0 1 3 0 0 0 0 0 0 0 0 0 0 0 0 0 
##$SW_h= 32467.5324675325
##$TD= 32768
##$TD0= 1
##$TE= 0
##$TE2= 300
##$TE3= 300
##$TEG= 300
##$TL= (0..7)
0 120 53 12 22 120 120 120 
##$TP= (0..7)
150 150 150 150 150 150 150 150 
##$TP07= 0
##$TPNAME0= <>
##$TPNAME1= <>
##$TPNAME2= <>
##$TPNAME3= <>
##$TPNAME4= <>
##$TPNAME5= <>
##$TPNAME6= <>
##$TPNAME7= <>
##$TPOAL= (0..7)
0.5 0.5 0.5 0.5 0.5 0.5 0.5 0.5 
##$TPOFFS= (0..7)
0 0 0 0 0 0 0 0 
##$TUNHIN= 0
##$TUNHOUT= 0
##$TUNXOUT= 0
##$USERA1= <user>
##$USERA2= <user>
##$USERA3= <user>
##$USERA4= <user>
##$USERA5= <user>
##$V9= 5
##$VALIST= <valist>
##$VCLIST= <CCCCCCCCCCCCCCC>
##$VD= 0
##$VDLIST= <DDDDDDDDDDDDDDD>
##$VPLIST= <PPPPPPPPPPPPPPP>
##$VTLIST= <TTTTTTTTTTTTTTT>
##$WBST= 1024
##$WBSW= 4
##$XGAIN= (0..3)
0 0 0 0 
##$XL= 0
##$YL= 0
##$YMAX_a= 9471
##$YMIN_a= -10557
##$ZGOPTNS= <>
##$ZL1= 120
##$ZL2= 120
##$ZL3= 120
##$ZL4= 120
##$ABSF1= 0
##$ABSF2= 0
##$ABSG= 0
##$ABSL= 0
##$ALPHA= 0
##$AQORDER= 0
##$ASSFAC= 0
##$ASSFACI= 0
##$ASSFACX= 0
##$ASSWID= 0
##$AUNMP= <proc_1d>
##$AZFE= 0.1
##$AZFW= 0.5
##$BCFW= 0
##$BC_mod= 2
##$BYTORDP= 0
##$COROFFS= 0
##$CY= -3
##$DATMOD= 1
##$DC= 0
##$DFILT= <>
##$DTYPP= 0
##$F1P= 0
##$F2P= 0
##$FCOR= 1
##$FTSIZE= 65536
##$FT_mod= 6
##$GAMMA= 0
##$GB= 0
##$INTBC= 1
##$INTSCL= 9.790993e-09
##$ISEN= 30
##$LB= 1.5
##$LEV0= 0
##$LPBIN= 0
##$MAXI= 10000
##$MC2= 0
##$MEAN= 0
##$ME_mod= 0
##$MI= 50
##$NCOEF= 0
##$NC_proc= -8
##$NLEV= 6
##$NOISF1= 182.463
##$NOISF2= 159.3651
##$NSP= 0
##$NTH_PI= 0
##$NZP= 0
##$OFFSET= 198.0616
##$PC= 4
##$PHC0= 1802.344
##$PHC1= 6.095414
##$PH_mod= 1
##$PKNL= yes
##$PPARMOD= 0
##$PSCAL= 0
##$PSIGN= 0
##$REVERSE= no
##$SF= 81.0140089999434
##$SI= 65536
##$SIGF1= 159.3651
##$SIGF2= -187.1042
##$SINO= 113.3802
##$SIOLD= 16384
##$SREGLST= <1H.CDCl3>
##$SSB= 0
##$STSI= 65536
##$STSR= 0
##$SW_p= 32467.5324675325
##$SYMM= 0
##$S_DEV= 0
##$TDeff= 32768
##$TDoff= 0
##$TI= <>
##$TILT= no
##$TM1= 0
##$TM2= 0
##$TOPLEV= 0
##$USERP1= <user>
##$USERP2= <user>
##$USERP3= <user>
##$USERP4= <user>
##$USERP5= <user>
##$WDW= 1
##$XDIM= 65536
##$YMAX_p= 260559543
##$YMIN_p= -147140968
$$ End of Bruker specific parameters
$$ ---------------------------------
##NTUPLES= NMR SPECTRUM
##VAR_NAME=  FREQUENCY,     SPECTRUM/REAL,   SPECTRUM/IMAG
##SYMBOL=    X,             R,               I
##VAR_TYPE=  INDEPENDENT,   DEPENDENT,       DEPENDENT
##VAR_FORM=  AFFN,          ASDF,            ASDF
##VAR_DIM=   65536,         65536,           65536
##UNITS=     HZ,            ARBITRARY UNITS, ARBITRARY UNITS
##FACTOR=    0.49542278885378, 1,            1
##FIRST=     16045.7642231865, 0,            0
##LAST=      -16421.768244346, 0,            0
##MIN=       -16421.768244346, -147140968,   0
##MAX=       16045.7642231865, 260559543,    0
$$ Real data points
##PAGE= N=1
##DATA TABLE= (X++(R..R)), XYDATA
$$ [...]
44327B375170k316467l172412k810239m66455J361795J64749j953653q06191L178709
44318d444994M992263K336804j151971j494466L02512P95297o11022j622297q40758
44309a738632Q12190J781854J274130m75457k059418j759292K99150J781558J210746
44300A126829K78203J295159L215315K626452j232480m817098m606616j327093
44292c441329J559360K388532K484493L130018L261811J086508k974598o162437
44284A332358o172408l316981K26083K624239L412317K866040J283218q50560
44276A404306k493937k464147n12716K025861K979010J236560j906518l701477
44268c433058k628234O3491J783903J258826o70755k468760l231304k648467p39973
$$ plain form
44327 2375170 58703 -3113709 -5923948 -6390403 -5028608 -4863859 -6817512 -7623703 -4444994
44318 -4444994 547269 2884073 1732102 237636 540148 1335445 724423 -897874 -1738632
44309 -1738632 -926442 855412 2129542 1654085 -405333 -2164625 -1865475 -83917 1126829
44300 1126829 1405032 2700191 5915506 8541958 7309478 2492380 -2114236 -3441329
44292 -3441329 -1881969 506563 2991056 6121074 9382885 10469393 7494795 1332358
44284 1332358 -4840050 -8157031 -7930948 -5306709 -1894392 971648 2254866 1404306
44276 1404306 -1089631 -3553778 -4066494 -2040633 938377 2174937 268419 -3433058
44268 -3433058 -6061292 -5997801 -4213898 -2955072 -3625827 -6094587 -9325891 -11974358 -12714331
44259a2714331J757877L411925L319039K126670J219638J006798O46689m80636
44251B93669j707229j894191r53131k6176j23761r18341j098688J30238K053084
44242d244526L085993K433953Q98092j91401o04984j191775k202403k506932j140721
44233e664704J010728K131606J855420J507970J797080J575353l12780k910005
44225I90668l967531k505113K90487K464394K929143K018609J049799J054765
44217D325221J523862J004086n99308j430361m40441M85210j001777l894880m824308
44208d852696k772447l33913K83980J16340J094233K887732L788035L333315K347845
44199E892424J359701N20549J94946J08606j124580l797546n236976k452809L383944
$$ plain form
44259 -12714331 -10956454 -7544529 -4225490 -2098820 -879182 127616 774305 293669
44251 293669 -1413560 -3307751 -4260882 -4287058 -4410819 -5329160 -6427848 -6297610 -4244526
44242 -4244526 -1158533 1275420 2173512 1982111 1377127 185352 -2017051 -4523983 -5664704
44233 -5664704 -4653976 -2522370 -666950 841020 2638100 4213453 3900673 990668
44225 990668 -2976863 -5481976 -5191489 -2727095 202048 2220657 3270456 4325221
44217 4325221 5849083 6853169 6253861 4823500 4383059 4868269 3866492 -28388 -4852696
44208 -4852696 -7625143 -7959056 -7675076 -7558736 -6464503 -3576771 211264 3544579 5892424
44199 5892424 7252125 7772674 7967620 8076226 6951646 3154100 -2082876 -4535685 -1151741
44190a151741P321492O062027J293551l031277m967120m995350l780770j528961
44182d778149Q38059J769297Q96116l79172p45755n50271o76256o73980N62582
44173c737529K454642K815881R08818j145925j264470l95299p97636k204372k100011
44164e465901J79472K090813J523872j82003k95326J479485K753596J575625j246095
44155B413538k917335j508368J760754L455609J855049q08558j405102k13610
44147B631977J65324o07285n86336j15588k019977n713863n716197O68094P894290
44138c399561Q741615L809780k67266m91588k08568k395316n276520n901619m275315
44129i664358k152539l25529J289421K572425L298037L265755K213419O81051
$$ plain form
44190 -1151741 6169751 12231778 13525329 10494052 5526932 531582 -3249188 -4778149
44182 -4778149 -3940090 -2170793 -1274677 -1653849 -2399604 -2949875 -3626131 -4300111 -3737529
44173 -3737529 -1282887 1532994 2441812 1295887 31417 -363882 -1161518 -3365890 -5465901
44164 -5465901 -5286429 -3195616 -1671744 -1853747 -2149073 -669588 2084008 3659633 2413538
44155 2413538 -503797 -2012165 -251411 3204198 5059247 4250689 2845587 2631977
44147 2631977 2797301 2190016 1603680 1488092 -531885 -6245748 -11961945 -11293851 -3399561
44138 -3399561 5342054 9151834 8884568 8392980 8184412 5789096 512576 -5389043 -9664358
44129 -9664358 -11816897 -12142426 -10853005 -8280580 -4982543 -1716788 496631 1177682
44121A177682K30743J197445J415766n70001k509059j714655J50624m29489k575872
44112c626816k099013J335809L365440J989126J74168m3412o46814k494658k410970
44103d457140J204079M487321L708658P62450q63865j659381l179019l386909
44095c383806k91234K785401J482041k133998k454866O29880J872075n24307k512594
44086d531408j360321N45655N18041q16815k385123m501245n998257m058284P89503
44077b1798254L746165K524894J079980L332640O813135O601985K919980L16312
44069E536837P44717J745074J119368l45432j168685j164533m45438J174956K888515
44060A0085379K808883K15657l205745n139842m949282l690118k395225r83501
$$ plain form
44121 1177682 1408425 2605870 4021636 3451635 942576 -772079 -621455 -1050944 -3626816
44112 -3626816 -5725829 -4390020 -1024580 964546 1138714 1095302 448488 -2046170 -4457140
44103 -4457140 -3253061 1234260 4942918 5705368 4841503 3182122 3103 -3383806
44095 -3383806 -3675040 -889639 592402 -1541596 -3996462 -3366582 -1494507 -2018814 -4531408
44086 -4531408 -5891729 -5346074 -4828033 -5644848 -8029971 -12531216 -18529473 -22587757 -21798254
44077 -21798254 -18052089 -15527195 -14447215 -11114575 -4301440 2300545 5220525 5536837
44069 5536837 6281554 8026628 9145996 8800564 7631879 6467346 6021908 7196864 10085379
44060 10085379 12894262 13109919 9904174 4764332 -184950 -3875068 -6270293 -7253794
44052g253794J048673L113840L384326R40432k273848l082268j025497Q58042
44044d290094J21268j725386j549736P23290J909894K3257k979081l686220j299201
44035a2752009J829340L235161K838103K102038J516067J12317k259378l519328
44027f897689j640917K223417M669049M155909K385652J159729R088j782328k781286
44018A500624j246558J676860K947594J528773p58718k222508k967937l147641
44010b689511j799482J170102L402371K424905r04818k987011j692790J291940
44002a784294K867234K271459J424325J865885K573436J473953j456887l675851
43994E559260k982739k46459J582283J025558l36646l38041N98453J28294k217283
$$ plain form
44052 -7253794 -6205121 -3091281 293045 1233477 -1040371 -4122639 -5148136 -4290094
44044 -4290094 -4168826 -5894212 -7443948 -6720658 -4810764 -4787507 -7766588 -11452808 -12752009
44035 -12752009 -10922669 -7687508 -4849405 -2747367 -1231300 -1118983 -3378361 -6897689
44027 -6897689 -8538606 -6315189 -1646140 2509769 4895421 6055150 6064238 4281910 1500624
44018 1500624 254066 1930926 4878520 6407293 5648575 3426067 458130 -2689511
44010 -2689511 -4488993 -3318891 83480 2508385 1603567 -1383444 -3076234 -1784294
44002 -1784294 1082940 3354399 4778724 6644609 9218045 10691998 9235111 5559260
43994 5559260 2576521 2330062 3912345 4937903 4601257 4263216 4861669 4989963 2772680
43985B772680l676747j924632J199747J796107n66644j986823K65464L799400
43977A678552M533040K256557J88509n0942p9680j320673k668497k460342p68360
43968A308164J196031K337764J667939j104979m073143m167275r75562K275522
43960a535539K960144K257932K175292J544265j777793n900814o070657j352696
43952g699866L306657L277593q7004k062153r17102R67092J460130J250677J533233
43943A029257J503095j77720k593069l257605j565813K29154K55312k44122J055930
43934c765581L697782M724286K853561K40258o79375j61941K63486L92935P08757
43925H274168N90466n36577j196591L90394K919149L095063L38055k299053k552517
$$ plain form
43985 2772680 -904067 -2828699 -1628952 167155 -399489 -2386312 -2120848 1678552
43977 1678552 6211592 8468149 8656658 8605716 8526036 7205363 4536866 2076524 1308164
43968 1308164 2504195 4841959 6509898 5404919 1331776 -2835499 -3811061 -1535539
43960 -1535539 1424605 3682537 5857829 7402094 5624301 -276513 -6347170 -7699866
43952 -7699866 -4393209 -1115616 -1202620 -3264773 -4181875 -3214783 -1754653 -503976 1029257
43943 1029257 2532352 2354632 -238437 -3496042 -5061855 -4832701 -4577389 -4821511 -3765581
43934 -3765581 -67799 4656487 7510048 7750306 7070931 6908990 7172476 7565411 8274168
43925 8274168 8864634 8328057 7131466 7521860 10441009 13536072 13874127 11575074 9022557
43916I022557j564072r64259j90150J288691J550858j133780m781133n782713
43908b554001l696369j167330L08798J504213K517232K052400L34083l43085P69037
43899b75022J455315K94009q42304j34134P91751m34640k722279l183556j742258
43890f793118o76813k57230J422300M048660M288802P14347l471306m431141k229561
43881g385060L14483J396147J092435R3860n81977J86563K075585L064006K072276
43872B328318N60340J37381K01205k72491l32294J106655K386969J030924k102575
43863E044432l569528k185760k81121K15185J49639P08753J111383K47348j104589
43854C35742j303071j02128J388004K331780K671722K326495Q37565j844470m432587
$$ plain form
43916 9022557 7458485 6494226 6304076 7592767 9143625 8009845 3228712 -2554001
43908 -2554001 -6250370 -7417700 -7108902 -5604689 -3087457 -1035057 -700974 -1044059 -275022
43899 -275022 1180293 1474302 631998 497864 1289615 854975 -1867304 -5050860 -6793118
43890 -6793118 -7469931 -7727161 -6304861 -2256201 2032601 2746948 -724358 -5155499 -7385060
43881 -7385060 -7070577 -5674430 -4581995 -4488135 -5070112 -4883549 -2807964 256042 2328318
43872 2328318 2888658 3026039 3227244 2954753 2622459 3729114 6116083 7147007 5044432
43863 5044432 1474904 -710856 -991977 -776792 -627153 81600 1192983 1440331 335742
43854 335742 -967329 -1069457 318547 2650327 5322049 7648544 8486109 6641639 2209052
43845B209052m790784k187816J131358K062575N82716l52584M79900O74644j233278
43836a424217k386742o5060L062843K591833l83451q84560J733708K859554M87971
43827E591879j718662r51358N42624L23152j31610O57506P20223j149114j901935
43818A982705P13173L280359J750158j724997k281089k52744J53207j447386j346333
43809H27053J111819K000763n88625l400432l110168o58950J201421J566578J028126
43800b2415J69088k97148K09605J044931J133873P27158N08784k16994j899153
43791A357729k459312j06564K550131J511377j953523k641711K80424J835166
43783C73717m60831k522517p66696J890926J163756j513237j758016N55500J681647
$$ plain form
43845 2209052 -2581732 -4769548 -3638190 -1575615 -992899 -1345483 -865583 -190939 -1424217
43836 -1424217 -3810959 -3876019 -813176 1778657 1395206 510646 2244354 5103908 5591879
43827 5591879 3873217 2921859 3464483 3787635 3656025 4313531 5033754 3884640 1982705
43818 1982705 2695878 5976237 7726395 6001398 3720309 3467565 3620772 2173386 827053
43809 827053 1938872 3939635 3351010 -49422 -3159590 -3818540 -2617119 -1050541 -22415
43800 -22415 146673 -150475 59130 1104061 2237934 2965092 3473876 3256882 1357729
43791 1357729 -1101583 -1208147 1341984 2853361 899838 -1741873 -1461449 373717
43783 373717 -87114 -2609631 -3376327 -1485401 -321645 -1834882 -3592898 -3037398 -1355751
43774a355751K59651j118881k98604J818462L167258K730205Q72742r60247j281656
43765C833179l43523J18891k80356J38098J820395K406811M50843j679546j249240
43756E215552N28284O13669j035825j957787j358446o19462l60155J4968L02093
43747A342891k27535r17460n78795K26773J24480n50614o18224n12724j114758
43738b825966j182482P10239K524396J021685k529885l250217Q9502L002307K000074
43729d40347o27483j066416L87420R32908P2103l96145J61181O23721L96718J8100
43719F1760k30604n58363o44825K48986K127050M007949M682439L392056L93917
43710A3480365k765521m344380m144800l281054k133556o3484K402314L086481
$$ plain form
43774 -1355751 -1096100 -2214981 -2513585 -695123 2472135 5202340 6075082 5114835 3833179
43765 3833179 3489656 3608547 3328191 3466289 5286684 7693495 8144338 6464792 5215552
43756 5215552 5743836 6357505 5321680 3363893 2005447 1385985 1025830 1040798 1342891
43747 1342891 1115356 197896 -380899 -154126 -29646 -580260 -1198484 -1711208 -2825966
43738 -2825966 -4008448 -3298209 -773813 247872 -2282013 -5532230 -5442728 -2440421 -440347
43729 -440347 -1067830 -2134246 -1746826 -813918 -741815 -1137960 -976779 -353058 43660 61760
43719 61760 -168844 -727207 -1372032 -1123046 1004004 5011953 9694392 13086448 13480365
43710 13480365 10714844 6370464 2225664 -1055390 -3188946 -3252430 -850116 2236365
43702B236365J127061j249411j618117p26790j020447k690716l417629j862985
43694i222669O09290K035551K068881J567227J263572J517640K390036L207724
43686E437252K793891R35435q79799j026094K49797J240062J035745K98826l73278
43677I711837j469869l065656l596247j850174N34609P52117j065143j860497
43669a909023l06497J253590Q50774J01603J032361K109849P32938j911321k309782
43660c55508k89108P56459m76853j237202M82576K691105K729903J034057m45670
43651D889759j298163k049360k308632j544979m00503L84682J082737J719491
43643D75032J295370k95570j243343l66321R16442Q79017J37404J15381M86001
$$ plain form
43702 2236365 3363426 2114015 495898 -230892 -1251339 -3942055 -7359684 -9222669
43694 -9222669 -8613379 -6577828 -4508947 -2941720 -1678148 -160508 2229528 5437252
43686 5437252 8231143 9166578 8286779 7260685 7510482 8750544 9786289 10085115 9711837
43677 9711837 8241968 5176312 1580065 -270109 264500 1016617 -48526 -1909023
43669 -1909023 -2215520 -961930 -111156 -9553 1022808 3132657 3865595 1954274 -355508
43660 -355508 -644616 111843 -365010 -1602212 -1119636 1571469 4301372 5335429 4889759
43651 4889759 3591596 1542236 -766396 -2311375 -2711878 -2327196 -1244459 475032
43643 475032 1770402 1474832 231489 -134832 781610 1660627 1798031 1913412 2399413
43634B399413L04697J71253P88198O67869j878630n213233n705976k460926J697487
43625i229848L864358L502815J523040o54136j074603J250726M342967M829371
43617H354690K060851j156590k340559j914459j421491j118953m70758L60345
43609B353076P37291N40938J03684m30874j215237k336187l335634l109313j091784
43600g784040J154726J013638j520116l028433j288664J197592R75829p98419
43592a0077887l55948K092597K446945k04828j539134J036517L826277K502797
43584b72664j081661j822686R23723K884409J545041o98570p81628P04579J042384
43575B442927m47542j559765l00753K248934K854870j5788l997766n412565l599806
$$ plain form
43634 2399413 2704110 2875363 3663561 4331430 2452800 -2760433 -8466409 -10927335 -9229848
43625 -9229848 -5365490 -1862675 -339635 -993771 -2068374 -817648 3525319 8354690
43617 8354690 10415541 9258951 6918392 5003933 3582442 2463489 1992731 2353076
43609 2353076 3090367 3631305 3734989 3304115 2088878 -247309 -3582943 -6692256 -7784040
43600 -7784040 -6629314 -5615676 -7135792 -10164225 -11452889 -10255297 -9279468 -10077887
43592 -10077887 -10433835 -8341238 -5894293 -6099121 -7638255 -6601738 -2775461 -272664
43584 -272664 -1354325 -3177011 -2253288 631121 2176162 1477592 695964 1400543 2442927
43575 2442927 1995385 435620 134867 2383801 5238671 5222883 1225117 -4187448 -7787254
43566g787254j213171l34885k75920K46147Q77493Q43217O91855J302293K357492
43557c292733L098629L428590L143724J497885j152626k774737k253679j088518
43549F06535q92339q66752K53789J461723J209032M24006Q46160J449646o5375
43540D426425k693893k756958M50518L189846K687686Q57990O68368J374046J57351
43531H361379k802367l923616j214189K508712K828022o08402l391497j998238
43523b40196J351781J544165k251533n217195l594543L29955K132454J434762
43515d510350R71147J479210J442867Q93667J383437K447944K067609P31474R57484
43506G864489K293840J179062k969669n847873m446150j231691K45493K18655
$$ plain form
43566 -7787254 -9000425 -9335310 -9611230 -9365083 -8487590 -7644373 -6952518 -5650225 -3292733
43557 -3292733 -194104 3234486 6378210 7876095 6723469 3948732 1695053 606535
43549 606535 -285804 -1152556 -898767 562956 1771988 2195994 3042154 4491800 4426425
43540 4426425 1732532 -1024426 -573908 2615938 5303624 6161614 6829982 8204028 8361379
43531 8361379 5559012 1635396 421207 2929919 5757941 5149539 1758042 -240196
43523 -240196 1111585 2655750 404217 -4812978 -8407521 -8077566 -5945112 -4510350
43515 -4510350 -3539203 -2059993 -617126 276541 1659978 4107922 6175531 6907005 7864489
43506 7864489 10158329 11337391 8367722 2519849 -1926301 -3157992 -2912499 -2693844
43498b693844K90529l35963k541838l959737k040394J342031K279387O18862l69814
43489g410781P07781K095556K603703L062911L727173L253981J097436j228444
43481G909316j994858j004108N71461R30795j191392m653577o040213l409117
43473h881693R33932L188477K524931Q28465o34998j701942j658943j25385J201423
43464d325733O84083j79702R40954K722901J922810q30957j410604J256213L443037
43455D223002K471548L8823j713041l158139m247946k882830R75253L284281J316869
43446C07820j943886k151044L04741J978021J760630Q95893l92960k341948l154978
43437d737711j058157K034359K675682J061511L13282J054691P40977j387920
$$ plain form
43498 -2693844 -2403315 -2739278 -5281116 -9240853 -11281247 -9939216 -7659829 -7040967 -7410781
43489 -7410781 -6703000 -4607444 -2003741 1059170 4786343 8040324 9137760 7909316
43481 7909316 5914458 4910350 5481811 6412606 5221214 567637 -5472576 -8881693
43473 -8881693 -7947761 -4759284 -2234353 -1405888 -2040886 -3742828 -5401771 -5527156 -4325733
43464 -4325733 -3641650 -3821352 -2880398 -157497 1765313 934356 -476248 779965 4223002
43455 4223002 6694550 6733373 5020332 1862193 -2385753 -5268583 -4293330 -1009049 307820
43446 307820 -1636066 -3787110 -3482369 -1504348 256282 1152175 759215 -1582733 -4737711
43437 -4737711 -5795868 -3761509 -1085827 -24316 288966 1343657 2084634 696714
43429F96714k692117j491848M10972R98758R28093J526707K287628K080175J023863
43420E768945l46134k134895l889237l944790j641181R86502J420871j27829j161887
43411e069635q9910K282236M209370M779651M052111K263784m36284l396703n074562
43402C520058m083564r81952J787917K482687J869363J574392J557218O99077
43394H425196q01967j566510j384684j442540k010250j876987o13246M89904N56422
43385b24662M64249R75798J068512m74130k836252l885884k568885K93302K969284
43376d218668L873101K449064j50509j845256j688289n58548M33881J085500J202106
43367E82382J30640j729787k362414o06108J809606K322432R02389k86108m2976
$$ plain form
43429 696714 -1995403 -3487251 -3076279 -2077521 -1149428 377279 2664907 4745082 5768945
43420 5768945 5422811 3287916 -601321 -4546111 -6187292 -5200790 -3779919 -3907748 -5069635
43411 -5069635 -5159545 -2877309 1332061 6111712 10163823 12427607 11991323 8594620 3520058
43402 3520058 -563506 -1545458 242459 2725146 4594509 6168901 7726119 8425196
43394 8425196 7623229 6056719 4672035 3229495 1219245 -657742 -1270988 -781084 -224662
43385 -224662 239587 1215385 2283897 1809767 -1026485 -4912369 -7481254 -7187952 -4218668
43376 -4218668 -345567 2103497 1952988 107732 -1580557 -2139105 -1705224 -619724 582382
43367 582382 713022 -1016765 -3379179 -3985287 -2175681 146751 1049140 763032 720056
43358G20056P82222J088894O59161n22125k401340m006343l943877k238287m96729
43349a0358368J57856K00722M38663Q84607J355801J902615K044912R72865o35768
43340c036095n02507K157629M680074L898252K49827k989270l987969l619251
43332c149310k691606p44146J684811K426295J010172K12688J900872L345192
43324C994968R12733l722789m953547j004501L464288L835822J269607k44643
43316C551938J82942M26544k80096m42272N57092J297074O85019o79892k014506
43307C283843l410511m749822n087324l936012k117155o42291M69074J731683
43299a4458515L191327M309238M453446L379571J602667J80772l13090l23489
$$ plain form
43358 720056 1502278 2591172 3250333 2728208 326868 -3679475 -7623352 -9861639 -10358368
43349 -10358368 -10200512 -9999790 -9561127 -8676520 -7320719 -5418104 -3373192 -2400327 -3036095
43340 -3036095 -3538602 -1380973 3299101 7197353 7447180 4457910 469941 -3149310
43332 -3149310 -5840916 -6585062 -4900251 -2473956 -1463784 -1251096 649776 3994968
43324 3994968 4907701 1184912 -3768635 -4773136 -1308848 2526974 3796581 3551938
43316 3551938 3734880 4161424 3881328 3439056 3996148 5293222 5978241 5298349 3283843
43307 3283843 -126668 -4876490 -9963814 -13899826 -16016981 -16659272 -16190198 -14458515
43299 -14458515 -11267188 -6957950 -2504504 875067 2477734 2658506 2345416 2021927
43291B021927l62848j45758N60023R86935M81522o2765N82480J683065J197555
43282F942136j149338l051270k366330M58847L101978L641776J981709k09074
43274I350434j010143l33688j2275j098101k184612j755881q35355j133725j754571
43265g67917o36958J423330J574655l48011j476326p65612l98934j254555r57288
43256c607616J537338L148012J303660j705581k264382p92932j0661J39622J817028
43247d35512M592052N416435L255584M78413p33250p43316q78852j715634l231316
43238F004604m714853m388859j083214L441964N617136L903439J71301k834658
43230F116860m030689l931955l408391k820801j716386M12123K673135L153874
$$ plain form
43291 2021927 1659079 1513321 2073344 3060279 3541801 3479036 4061516 5744581 6942136
43282 6942136 5792798 2741528 375198 834045 3936023 7577799 9559508 9350434
43274 9350434 8340291 8006603 7994328 6896227 4711615 2955734 2120379 986654 -767917
43265 -767917 -1404875 18455 1593110 1245099 -231227 -996839 -1395773 -2650328 -3607616
43256 -3607616 -2070278 1077734 2381394 675813 -1588569 -2381501 -2392162 -2252540 -435512
43247 -435512 4156540 9572975 12828559 13306972 12573722 11830406 10951554 9235920 6004604
43238 6004604 1289751 -3099108 -4182322 -740358 4876778 8780217 8951518 6116860
43230 6116860 2086171 -1845784 -5254175 -8074976 -9791362 -9379239 -6706104 -3552230
43222c552230J593212J94167M10832O69347o56071j734706L06841M462252O542919
43213H236563M591983P68675k129624l290450k919716j380961J93738O60860N67189
43204E298257J166705J961391J507286K51775k05226l21542j818912l783261l313779
43195G42694n09248J194750O59474Q15447L127879M547733K556849o06786j919610
43186A0609182k284318l586420m188524j869767J030589M75470k393649k407773
43178d615210J555255M565906K914610q46683k212469p79473O26426O56655M35665
43169B300682Q82479J553697K042188K615501L045270K141020p13076m147038
43161I720723n812330m841642k640531r22561L13088K003795L802756M138976
$$ plain form
43222 -3552230 -1959018 -1764851 -1354019 -684672 -1340743 -3075449 -2768608 1693644 8236563
43213 8236563 12828546 13597221 11467597 8177147 5257431 3876470 4070208 4731068 5298257
43204 5298257 6464962 8426353 9933639 10185414 9980188 9658646 7839734 4056473 742694
43195 742694 233446 1428196 2087670 2903117 6030996 10578729 13135578 12528792 10609182
43186 10609182 8324864 4738444 549920 -1319847 -289258 186212 -2207437 -4615210
43178 -4615210 -3059955 1505951 4420561 3573878 1361409 581936 1208362 1865017 2300682
43169 2300682 3183161 4736858 6779046 9394547 12439817 14580837 13867761 9720723
43161 9720723 3908393 -933249 -3573780 -4496341 -4183253 -2179458 1623298 5762274
43153E762274K659069J060057P29676Q66705O7589j227647j280066M12404K368250
43144A1418311K838019J443785p99391k499596l033906k991343l208583l391385
43136b24089k514449o98982N69603O52973Q55242K352199M204593M626848L289819
43127A3113757J163675j009349k753951l236816k170908q28179o84484j425464
43119B168281j619876r17620j39570M17976J171170J924267J957449J423581J063813
43110G449471M51745j640945m537249n142842j576554L669600N831947L117406
43102G622579j284868k790676k89817L140323L925402J489689j945680l907856
43094E959096l319252o58736K165279K698544L17143k488818k822385j109684
$$ plain form
43153 5762274 8421343 9481400 10211076 11077781 11145370 9917723 8637657 9050061 11418311
43144 11418311 14256330 15700115 14900724 12401128 9367222 6375879 3167296 -224089
43136 -224089 -2738538 -3437520 -2867917 -2214944 -1359702 992497 5197090 9823938 13113757
43127 13113757 14277432 13268083 10514132 7277316 5106408 4278229 3593745 2168281
43119 2168281 548405 -369215 -508785 -90809 1080361 3004628 4962077 6385658 7449471
43110 7449471 7901216 6260271 1723022 -3419820 -4996374 -1326774 4505173 7622579
43102 7622579 6337711 3547035 3257218 6397541 10322943 11812632 9866952 5959096
43094 5959096 2639844 1981108 4146387 6844931 7162074 4673256 1850871 741187
43086G41187q4146k24029Q70641L761571N087069K296946k143507m038645l011789
43077C255298j742494j208331k72196P19718j57417k467806k929313k15058K568711
43068b448888K032068r13506k651419j722324J1260N21891k0049l33570m0156
43059e564693L41407P87435J938381L561367L910492J780463j283257k384626
43051C086969j014222K45096o84489k713404l506561k564598j051402K78010J535932
43042f388669K853558M157264N051652M378363J334323k267899k922559J0852
43034F206885K748566J870707j329033l264361k708121p33511J694537L253217
43026G738886J725007k609251n147883k519875J873036K317001p93469k086818
$$ plain form
43086 741187 657041 433012 1303653 5065224 10152293 12449239 10305732 6267087 3255298
43077 3255298 1512804 304473 32277 751995 594578 -1873228 -4802541 -5017599 -2448888
43068 -2448888 -416820 -1330326 -3981745 -5704069 -5692809 -5170918 -5190967 -5524537 -5564693
43059 -5564693 -5223286 -4435851 -2497470 1063897 4974389 6754852 5471595 3086969
43051 3086969 2072747 2317843 1633354 -1080050 -4586611 -7151209 -8202611 -7924601 -6388669
43042 -6388669 -3535111 622153 5673805 10052168 11386491 9118592 6196033 6206885
43034 6206885 8955451 10826158 9497125 6232764 3524643 2791132 4485669 7738886
43026 7738886 9463893 6854642 1706759 -813116 1059920 3376921 2583452 496634
43018D96634K81054K874451L394891K911787J369416k744018o928427n485828
43010c830040J576508O598109M681324L47938l59925J140661L71115j515892k56507
43001H753291L023634K825513j898145n969774n494538k293504N0065O15299L79564
42992h595l1814m88681q44796q47190J66766K630616M866339L775962p50332m347489
42982D120786l674493j143094r41211k581660k497164l18489J155607J266998
42974d612720J821373K444757P54847k415265l089539o05595R02159p63381k343883
42965g907247p99769J792212K140482R02016M04804J93157j240171k459591r65279
42956g939386K104898L040365R44285j339651j694988r96942m49870M45268K122323
$$ plain form
43018 496634 777688 3652139 7047030 9958817 11328233 8584215 1655788 -3830040
43010 -3830040 -2253532 4344577 9025901 9373839 9013914 10154575 10525690 9009798 8753291
43001 8753291 11776925 14602438 12704293 6734519 1239981 -1053523 -1003458 -388159 -8595
42992 -8595 -40409 -529090 -1373886 -2221076 -2054310 576306 5442645 9218607 8468275 4120786
42982 4120786 446293 -696801 -1638012 -4219672 -6716836 -7035325 -5879718 -4612720
42974 -4612720 -2791347 -346590 408257 -2007008 -5096547 -5702142 -4799983 -5563364 -7907247
42965 -7907247 -8707016 -6914804 -4774322 -3872306 -3467502 -3274345 -4514516 -6974107 -7939386
42956 -7939386 -5834488 -2794123 -1849838 -3189489 -4884477 -5881419 -6331289 -5886021 -3763698
42947c763698L370785L033839J878084J335002J306069O51434o33684j247828
42939E930003p15791l16579j143877k297908k259183j404014j407707k219384
42931e834440j766127N93005K530246K216911J282544J970678L017772J543127
42923E553716j791041l143401j247913P16188R8297j536580j460819O3270Q95180
42914a853103M43443k45880n74430n64078P6929J222126J511159R9378j431328
42905a315784p88883J703622L266040K209605j45788j390054p03138Q26209J744016
42896E405845J484035L79911r47730j811842j313591R74199L568372L522128j37909
42887A1123418m234365m796719k151726q9301q9853J95072J852542K058920j016553
$$ plain form
42947 -3763698 -392913 2640926 4519010 5854012 7160081 7811515 7177831 5930003
42939 5930003 5214212 4897633 3753756 1455848 -803335 -2207349 -3615056 -5834440
42931 -5834440 -7600567 -7007562 -4477316 -2260405 -977861 992817 4010589 5553716
42923 5553716 3762675 619274 -628639 87549 185846 -1350734 -2811553 -2748283 -1853103
42914 -1853103 -1409660 -1655540 -2229970 -2794048 -2717119 -1494993 16166 115544 -1315784
42905 -1315784 -2104667 -401045 2864995 5074600 4928812 3538758 2835620 3661829 5405845
42896 5405845 6889880 7269791 6322061 4510219 3196628 4170827 7739199 11261327 11123418
42887 11123418 6889053 2092334 -59392 -148693 -238546 -43474 1809068 3867988 2851435
42878B851435m089578l203948J20797J427838M53708Q84293L358526L900442O00137
42869F303650k790523k491008l11698l78711k761736m014898k708860p98982J84911
42860i767855J002798K260570K860614J976757N60734k78024p88061j317877j046156
42851d536500N64227K194611K196876R26050p4712n47989j286905j859744q97890
42842c321976J109442J720136J53303j219902m00268J265433J526861Q27961R87005
42833B647995J626496Q66201j070882k015240j515826j260430j545774o35196
42825b902656J447860J922354j85378j679153O6828K784323K961076J581095K196321
42816H192670M469169M139738k96953m980270o038813m179583k153722o08881
$$ plain form
42878 2851435 -1238143 -4442091 -4321294 -2893456 -2439748 -1555455 1803071 5703513 6303650
42869 6303650 3513127 1022119 710421 331710 -2430026 -6444924 -9153784 -9952766 -9767855
42860 -9767855 -8765057 -6504487 -3643873 -1667116 -1106382 -1384406 -2172467 -3490344 -4536500
42851 -4536500 -3972273 -1777662 419214 1345264 1270552 722563 -564342 -2424086 -3321976
42842 -3321976 -2212534 -492398 -339095 -1558997 -1959265 -693832 833029 1660990 2647995
42833 2647995 4274491 5140692 4069810 2054570 538744 -721686 -2267460 -2902656
42825 -2902656 -1454796 467558 282180 -1396973 -1330145 1454178 4415254 5996349 8192670
42816 8192670 12661839 16801577 16504624 11524354 5485541 1305958 -847764 -1456645
42808a456645J040464J834980M55388j824232k274602o28284O38382J77338m14360
42799b451571N61821K261475K796007J917629P48430j00250n92605l07501Q26370
42790E659805J405330J37904j711025j688002j1951N70627n81192o14872J844805
42781E011429L435913Q37737l499535m352185j248220J258798N76254j065318
42773I54873j387521j286241j591311o69221K118853L898253K340694l46949p67958
42764C263472M53444L39063j149785j292036O54263K473825K627127J755979N49985
42755I675337r76069j919718j016107R03667J551957O35105J02530N79255L50337
42746I886294j309097k563608k037902r72425q76931j156389o91712O4997K71922
$$ plain form
42808 -1456645 -416181 1418799 1874187 49955 -2224647 -2852931 -2214549 -2037211 -2451571
42799 -2451571 -1889750 371725 3167732 5085361 5833791 5733541 5140936 4833435 5659805
42790 5659805 7065135 7203039 5492014 3804012 3792061 4362688 3781496 3166624 5011429
42781 5011429 8447342 9285079 5785544 1433359 185139 1443937 2020191 954873
42773 954873 -432648 -1718889 -3310200 -3979421 -1860568 2037685 4378379 4031430 3263472
42764 3263472 3716916 4055979 2906194 1614158 2268421 4742246 7369373 9125352 9675337
42755 9675337 8699268 6779550 5763443 6667110 8219067 8854172 8956702 9535957 9886294
42746 9886294 8577197 6013589 3975687 3003262 2126331 969942 278230 343227 615149
42737F15149L59155P59067M25189j432953l238481k754280l41355J386810J002099
42728c219600k52373n09676M95007J596159J756840J051011L92020M33824P98578
42719B541790O65434j1118n15288n54313n24166m90287n084P60310R52690O25174
42709C445142R67230K027499J707711j342579m851716n053222j538038K009524
42701b628449K445875Q25656K82356J514315K247292R82733p65178r67599k21924
42692C715077m78879j460508r35944J217116K089263K30568j606670n53706J764160
42683C980477J868675J30828j1715K043399L058668J294033j062714j920769k082205
42674G298677k407035j686268M66211J758770Q74261J71923J790492L585196K390542
$$ plain form
42737 615149 974304 1733371 2158560 725607 -2512874 -5267154 -5608509 -4221699 -3219600
42728 -3219600 -3471973 -3981649 -3486642 -1890483 -133643 917368 1309388 1743212 2541790
42719 2541790 3207224 3196106 2680818 2126505 1602339 1112052 1106968 1867278 2819968 3445142
42709 3445142 4412372 6439871 8147582 6805003 1953287 -3099935 -4637973 -2628449
42701 -2628449 -182574 643082 925438 2439753 4687045 5669778 4904600 3937001 3715077
42692 3715077 3236198 1775690 839746 2056862 4146125 4376693 2770023 2216317 3980477
42683 3980477 5849152 5979980 5968265 8011664 11070332 12364365 11301651 9380882 7298677
42674 7298677 4891642 3205374 3671585 5430355 6304616 6476539 8267031 11852227 14242769
42665A4242769o92610k088227j440049j482279k847284l075225j104775Q54708
42657B367028Q66700j62901m72720K77763J545827K675796K475567P3131l102294
42648F543897m217472k732455j241988j652636k471892j340975J250131K559742
42640c303648J282839q19152j075677R83552L003059K478350j8709j174620R68211
42631B324205M361818N452286L189243p88455m542232o459449n024454q31875
42623b318913K159586P02947k849985l238729K87397L185836K628893R08003N75520
42614B040555O70059J8359J04860J643205K031689k19802j887946L7289K800769
42605G239037K062780p11278o09213K239306K601537j173032m285807l026381
$$ plain form
42665 14242769 13550159 11461932 10021883 8539604 5692320 2617095 1512320 2367028
42657 2367028 3233728 3070827 2598107 2875870 4421697 7097493 9573060 9646191 6543897
42648 6543897 2326425 -406030 -1648018 -3300654 -5772546 -7113521 -5863390 -3303648
42640 -3303648 -2020809 -2839961 -3915638 -2932086 70973 2549323 2530614 1355994 2324205
42631 2324205 6686023 12138309 15327552 14539097 9996865 3537416 -1487038 -2318913
42623 -2318913 -159327 543620 -2306365 -5545094 -5257697 -2071861 557032 1465035 2040555
42614 2040555 2710614 2728973 2833833 4477038 6508727 6288925 4400979 4438268 7239037
42605 7239037 9301817 8590539 7981326 10220632 12822169 11649137 7363330 4336949
42597D336949j45730j2690k336518l858979l421237k117265m23291J651431K796674
42588c530656J740692k00612m39130J176483K144927R74634q56596j236995k57995
42579d85248L53046p7647l10935P23032J945579J338496j067368k887815k620078
42570c088938j580727j361343j026612R31554L100474K664280Q4480j011679R06703
42561c81808L290025L723171K922303K046333K72685k667061m422965l352894
42553A429789j554293j505366j844577o2370K438796K237168j66103q84070R56043
42544A045017J955778L77706j131183m28531N65485l53580j757786j429762m24715
42535a581571r82842k325788j978637r6213Q92204M12380L64849J605489K634664
$$ plain form
42597 4336949 4191219 4178529 1842011 -2016968 -5438205 -7555470 -7978761 -6327330 -3530656
42588 -3530656 -1789964 -1990576 -2429706 -1253223 891704 1866338 1009742 -227253 -485248
42579 -485248 -132202 -209849 -520784 202248 2147827 3486323 2418955 -468860 -3088938
42570 -3088938 -4669665 -6031008 -7057620 -6126066 -3025592 -361312 -276832 -1288511 -381808
42561 -381808 2908217 6631388 9553691 11600024 11872709 9205648 4782683 1429789
42553 1429789 -124504 -1629870 -3474447 -3536817 -1098021 1139147 973044 88974 1045017
42544 1045017 3000795 3378501 2247318 1818787 2384272 2030692 272906 -1156856 -1581571
42535 -1581571 -2564413 -4890201 -6868838 -6965051 -6072847 -5660467 -5295618 -3690129 -1055465
42526a055465K279074J339126Q54285N80692o5022r58578j716795k053155j471084
42517b266922J97487J889219K263619J561989J109731J119232P41035J89257N57492
42508G362139J184513k14105l690338n741447l568938J141790M437382M503345
42500E414341K144311j341139m424374m918423k133130J156225J544756m78117
42492c035550j356429L55332K345312K285163M74564j854373m111620n146571
42484a0044172l169872J366752M926683M840679K465207P11650K64558L00489
42476A661974J066513K912025M031052K388480o23200j689492p26583j097317
42468G923452l882785n412450k527312K393068M453539K716032O92840R64657
$$ plain form
42526 -1055465 1223609 2562735 3417020 3997712 3932690 2974112 1257317 -795838 -2266922
42517 -2266922 -2069435 -180216 2083403 3645392 4755123 5874355 6615390 6804647 7362139
42508 7362139 8546652 8332547 4642209 -1099238 -4668176 -3526386 910996 5414341
42500 5414341 7558652 6217513 1793139 -3125284 -5258414 -4102189 -2557433 -3035550
42492 -3035550 -4391979 -4036647 -1691335 593828 1068392 -785981 -4897601 -10044172
42484 -10044172 -13214044 -11847292 -6920609 -2079930 385277 1096927 1361485 1661974
42476 1661974 2728487 5640512 9671564 12060044 11436844 9747352 9020769 7923452
42468 7923452 4040667 -1371783 -3899095 -1506027 2947512 5663544 6356384 7321041
42460G321041K226131K182330R66239K67875M54795K31965j198609k995429l889057
42451E567281l549221k277301j84566K368545L944800K988783l2071k514314k407674
42442C904262k41076K068696L346098L213093J333157j725189l710107k776628
42434E412306o1317J673041J607002R51405j19065k602351n292641m699829j24665
42425c256114M028724L520289j90119k322251j087549J231461K365568K140211
42417F430220R20577j071843k679869k420392n15843J465359K839302L771599
42409H739110L506420J145685j931738l134466k349477j858953k283000j681868
42401A51713N28621K026484J360904J95237k9848o13592k414609l116355q46307
$$ plain form
42460 7321041 9547172 11729502 12695741 12963616 13418411 13650376 12451767 9456338 5567281
42451 5567281 2018060 -259241 -443807 1924738 5869538 8858321 8826250 6311936 3904262
42442 3904262 3663186 5731882 9077980 12291073 13624230 11899041 8188934 5412306
42434 5412306 5350989 7024030 8631032 9582437 9463372 6861021 1568380 -3131449 -3256114
42425 -3256114 772610 4292899 4102780 1780529 692980 1924441 4290009 6430220
42417 6430220 7350797 6278954 3599085 1178693 662850 2128209 4967511 8739110
42409 8739110 12245530 13391215 11459477 8325011 5975534 4116581 1833581 151713
42401 151713 680334 2706818 4067722 4262959 4233111 3619519 1204910 -1911445 -2757752
42392b757752J850984J389533j136672j638351M47035J609226L25974o13094R30045
42383D06928K907795K684816J321465J506985K944932K729238j72316l294334
42375A1035509l921004k244874n00173m312j45598l2604L149q01253k015469k400128
42365a026757j920289j949759k831560k711477j82762L009528L792266J844512
42357a976298m3164K95495K041188L038937K256366J77590j882198k410839r03810
42348E93267J180222J887096J371152J462971K360093J865572j013475l738620
42340E968278l326491l85273J913495J973900Q54317j64319q49121r57782j61245
42331D865759N47642n14171k792844l209463l09068K957991K756578l01836j922149
$$ plain form
42392 -2757752 -906768 482765 -653907 -2292258 -1845223 -235997 89977 -523117 406928
42383 406928 3314723 5999539 7321004 8827989 11772921 14502159 14329843 11035509
42375 11035509 7114505 4869631 4369458 4365146 4219548 4186944 4190093 3388840 1373371 -1026757
42365 -1026757 -2947046 -4896805 -7728365 -10439842 -10622604 -7613076 -3820810 -1976298
42357 -1976298 -2019462 -1723967 317221 3356158 5612524 5790114 3907916 1497077 593267
42348 593267 1773489 3660585 5031737 6494708 8854801 10720373 9706898 5968278
42340 5968278 2641787 2256514 4170009 6143909 6998226 6833907 5984786 5027004 4865759
42331 4865759 5413401 4899230 2106386 -1103077 -1412145 1545846 4302424 4000588 2078439
42322B078439j19959K274142J987765l46056k024818k425268k718305k700378
42314c994438j051449J491590K398794J324773P86139J795348J924938l93964
42306D281731k563360j577982J176154K150578J045327M07357Q27752M51734q65555
42297E333736q23432J167227K522282J387804q75498k337537k890463k650395
42289H33724p69309K288990L744293K010744o83688j405609o15784q17182k381055
42280B205124l253550k259530m65189P09120J063218J146414J293635J310328
42272A749570P62448j80246l65732Q61360K031398J161215r41274j314497O56340
42263D420582K061907R21156j031108j664622j598094j766590q67676J700645
$$ plain form
42322 2078439 1958480 4232622 6220387 5874331 3849513 1424245 -1294060 -3994438
42314 -3994438 -5045887 -3554297 -1155503 169270 955409 2750757 4675695 4281731
42306 4281731 1718371 140389 1316543 3467121 4512448 4919805 5747557 6199291 5333736
42297 5333736 4510304 5677531 8199813 9587617 8712119 6374582 3484119 833724
42289 833724 64415 2353405 6097698 8108442 7424754 6019145 5403361 4586179 2205124
42280 2205124 -1048426 -3307956 -3773145 -3064025 -2000807 -854393 439242 1749570
42272 1749570 2512018 2331772 1966040 2827400 4858798 6020013 5078739 3764242 4420582
42263 4420582 6482489 7403645 6372537 4707915 3109821 1343231 475555 2176200
42255B176200L094107J007370j787024j153404J802067K541259M63964p09217
42247G435322K23215J95619j962709k881908m60667K147091J424579j097696j691920
42238C330926p2145J318857J808052K654293L591519K613843o18731l697783m364713
42229F564118k828001p44012P91023J642461J875161J342087P1596j178350j269032
42220F267051o6451R85007N89482m66120l91400P99400J266973M03552N1751J748705
42210A1187950M218776M825671K647116q43880l452883l876543k340201l56041
42202A2009965N62473K82716k41591m67370n90809n92410j88660K81859K06508
42193A1262681r1169J56778O12159L71172j74347N01K17589j056589k850538k168899
$$ plain form
42255 2176200 5270307 6277677 4490653 3337249 5139316 7680575 8144539 7435322
42247 7435322 7658537 7854156 5891447 3009539 2548872 4695963 6120542 5022846 3330926
42238 3330926 3258781 4577638 6385690 9039983 12631502 15245345 14626614 10928831 6564118
42229 6564118 3736117 2992105 3783128 5425589 7300750 8642837 8714433 7536083 6267051
42220 6267051 6200600 7185607 7775089 7308969 6917569 7716969 8983942 9387494 9439245 11187950
42210 11187950 15406726 20232397 22879513 22035633 18582750 14706207 12366006 12009965
42202 12009965 12572438 12855154 12613563 12146193 11555384 10962974 10774314 11056173 11262681
42193 11262681 11171512 11328290 11940449 12311621 12137274 12137775 12355364 11298775 8448237 6279338
42183F279338J247293L662160K479801n2003l55270J530074K856856K236015M11963
42174B0296227j629037l068048k914134j313090j43329m92794q34865L50517J637514
42165A1888961P61764j517891k348443r25448Q08575J274834Q33248M45558O43489
42156A1864647J488626J928547J5409m259343p306040n605758m68786L446103
42148A103405M011239L320594L557257M039574L047120K94783l182587n862078
42140A0329307o092214l444062J9125J649639J527711J881842L195691L428110
42132A2495149J646165k25739m78066j39252q84147k269753k767881k199768j488302
42123C688406r57082l83191m1130l00356n60106K48030K141511L771903L666761
$$ plain form
42183 6279338 7526631 11188791 13668592 13616589 13261319 14791393 17648249 19884264 20296227
42174 20296227 18667190 15599142 12685008 11371918 11228589 10735795 9900930 10251447 11888961
42165 11888961 12650725 11132834 8784391 7858943 8667518 9942352 10775600 11221158 11864647
42156 11864647 13353273 15281820 15297229 11037886 3731846 -1873912 -2342698 1103405
42148 1103405 5114644 8435238 11992495 16032069 19079189 19373972 16191385 10329307
42140 10329307 4237093 793031 812156 2461795 3989506 5871348 9067039 12495149
42132 12495149 14141314 13915575 13437509 13298257 12414110 10144357 7376476 5176708 3688406
42123 3688406 2731324 2348133 2307003 2006647 1446541 1694571 3836082 7607985 11274746
42114A1274746J622007q90433j746772j63307K292979L245635K035368J53247
42106A7823470o57494m3113J017570J246605L12517m95103M19213K414562K795249
42097B4833476P11092r45105K93926K148615P03719l196025m700479k197382M18367
42088A8070204q8794j869270j921500r65674j284991k196978j267950J205942
42080I680989K357955J170959j31905L83834J602211J157133j169036k999323
42072A2052817k278946J9923Q94664p99012k618339j801081R24627K781994L229712
42063A2406359L915486M699201L353478n8978k295356k040332k164835m393083
42055A3421940n372687j820183L221163L946229K30388k244187j81884L350914
$$ plain form
42114 11274746 12896753 12006320 10259548 10096241 12389220 15634855 17670223 17823470
42106 17823470 17165976 17122863 18140433 19387038 19699555 19204452 19623665 22038227 24833476
42097 24833476 25544568 24599463 24893389 27042004 27745723 24549698 19849219 17651837 18070204
42088 18070204 17981410 16112140 14190640 13224966 11939975 9742997 8475047 9680989
42080 9680989 12038944 13209903 13077998 13461832 15064043 16221176 15052140 12052817
42072 12052817 9773871 9793794 10688458 9889446 7271107 5470026 6394653 9176647 12406359
42063 12406359 16321845 21021046 24374524 24315546 22020190 19979858 17815023 13421940
42055 13421940 8049253 6229070 9450233 13396462 13626850 11382663 11200779 14551693
42047A4551693L988743J475364j436716k723184k094216k64026J256825R98712
42039A5753195p10958j928035j718707j297555j791786k286456j281661Q60426
42031E598463K217926J729920L76928p7209R50885K268248K204261M41169j701873
42022A4008718k817818k634983j481391M64841K563868L259447J601250j071127
42014A3892805k191965p49156J831572L455498L230568J748030K53623n33765
42006B0937210j144344k429251l697934l023972k44189J847389R15168j542623
41998A1617454k328759j127830l54437q05805n09531J470173K985823K148611
41990A3095699M85096O36661K340615L039089J835716M86735L37260N00034K8896
$$ plain form
42047 14551693 18540436 20015800 18579084 15855900 13761684 13497658 14754483 15753195
42039 15753195 15042237 13114202 11395495 10097940 8306154 6019698 4738037 5598463
42031 5598463 7816389 9546309 9923237 9846028 10796913 13065161 15269422 15710591 14008718
42022 14008718 11190900 8555917 7074526 7539367 10103235 13362682 14963932 13892805
42014 13892805 11700840 10951684 12783256 16238754 19469322 21217352 21470975 20937210
42006 20937210 19792866 17363615 13665681 10641709 10397520 12244909 13160077 11617454
41998 11617454 9288695 8160865 7806428 7000623 6491092 7961265 10947088 13095699
41990 13095699 13580795 14217456 16558071 19597160 21432876 21919611 22256871 22756905 22785801
41981B2785801M3516J847141L938993L338118O4342k136116p38875K053572K808890
41972C4005382K022129K717887M962744N636362L833251K431788L013720L178401
41964F1801664J174547m88003O57888K144225P2588m452251o704803n130903k624515
41955D6450437j478870j096196q46978j401182k521931k722475j801050r22543
41947C3659212J08801K554231N373227N648727L277350J776324L022983M426769
41939E9847624L128041J31273j802087j985867j502399j106167j331733k887692
41931E2490993n227080o393181n710119m791579m576899l601002r00944J605682
41923B2895871J774828M49744p8274P16273J782176K310187J598365j119710m760339
$$ plain form
41981 22785801 22829317 24676458 28615451 31953569 32017911 29881795 29142920 31196492 34005382
41972 34005382 36027511 38745398 43708142 49344504 53177755 55609543 58623263 61801664
41964 61801664 62976211 62488208 63146096 65290321 65362909 60910658 54205855 49074952 46450437
41955 46450437 44971567 43875371 43028393 41627211 39105280 36382805 34581755 33659212
41947 33659212 33768013 36322244 41695471 47344198 50621548 52397872 55420855 59847624
41939 59847624 62975665 63106938 61304851 59318984 57816585 56710418 55378685 52490993
41931 52490993 47263913 40870732 35160613 30369034 25792135 22191133 21290189 22895871
41923 22895871 24670699 25120443 25042169 25758442 27540618 29850805 31449170 30329460 25569121
41914B5569121o092653l522951L94719K263536J937564J205435L92003j049642
41906B1097132k251830k119691j459445j246345l39472K140928L904457K541144
41898B2266878K1872N0242J916961J569888j497649l338357k129024p33024j123373
41889A7004414r32778J792684M342913L300493Q657j448953M8440K234023L441942
41880B9791835L823045L315018J533521l44049l22724J380509K353227J596670
41872D3127052R31781J852476L051788K717485J683389J966797K911255J598845
41864E9840868k377796n293125m223184j487346j384874l701292m006199n30670
41856C6836382K957349K611055l01945j905933r40245J112690L093541M475642
$$ plain form
41914 25569121 19476468 15953517 16348236 18611772 20549336 21754771 22146774 21097132
41906 21097132 18845302 16725611 15266166 14019821 13680349 15821277 19725734 22266878
41898 22266878 22288750 22338992 24255953 25825841 24328192 20989835 18860811 18127787 17004414
41889 17004414 16071636 17864320 22207233 25507726 25516383 24067430 24115870 26349893 29791835
41880 29791835 33614880 36929898 38463419 38119370 37796646 39177155 41530382 43127052
41872 43127052 44058833 45911309 48963097 51680582 53363971 55330768 58242023 59840868
41864 59840868 57463072 52169947 47946763 46459417 45074543 41373251 37367052 36836382
41856 36836382 39793731 42404786 42102841 40196908 39256663 40369353 43462894 47938536
41848D7938536M205142K289271J285032L035958N047548L629411k46783k271932
41840F4912183j616541j871193m558962o348964m534715j279282O3592l48437
41832D4417681m47395M6892J41415k89890j152025k910761m697352l971309m24388
41823C0712868K202517J013587j595794j596697O37641J704943J003921R66716
41815C5049702K183652K509559J083687n66730j713497l023302l537419j021230
41807C0964422L536825N610898L160458l64797j164628j12458k4888p21695j81956
41798D0702181J243826J387653J89408j99755R72638K160792K287588J887214
41790E0631545J277067L4645j186944o15013K017179M762302O292519P517511
$$ plain form
41848 47938536 52143678 54432949 55717981 58753939 63801487 67430898 67184115 64912183
41840 64912183 63295642 61424449 56865487 50516523 45981808 44702526 44766118 44417681
41832 44417681 43970286 44017178 44158593 43868703 42716678 39805917 35108565 31137256 30712868
41823 30712868 32915385 33928972 32333178 30736481 31374122 33079065 34082986 35049702
41815 35049702 37233354 39742913 40826600 40259870 38546373 35523071 31985652 30964422
41807 30964422 34501247 40112145 43272603 42907806 41743178 41630720 41605832 40884137 40702181
41798 40702181 41946007 43333660 43523068 43323313 44295951 46456743 48744331 50631545
41790 50631545 51908612 51943257 50756313 50141300 52158479 56920781 63213300 70730811
41782G0730811R182108R778722P771171M666168L679021N698242Q454432R780208
41774A29740883J0035887J0733055J2009769J2522152J1469409R819442R095820
41767B05426417R174279Q065065M554384M50814j314880r10383j935028o473318
41759B17037350j1735608j3604028j2086861j0665360j1077072j1802295j1619854
41752A34446272j1350442j1272057r946224p097077m879627m456337l953305k064690
41744G9426513j056456l117147n845590n123871j259876J636936J845259J528774
41736F8034542J863688Q88939k384904n276689n016631k582836q95283j013978
41728E3616848j960789k746175k797757j625980L45014J655541J836445K453645
$$ plain form
41782 70730811 79912919 89691641 97462812 102128980 105808001 111506243 119960675 129740883
41774 129740883 139776770 150509825 162519594 175041746 186511155 196330597 205426417
41767 205426417 214600696 222665761 227220145 227670959 226356079 225445696 223510668 217037350
41759 217037350 205301742 191697714 179610853 168945493 157868421 146066126 134446272
41752 134446272 123095830 111823773 101877549 94780472 89900845 85444508 81491203 79426513
41744 79426513 78370057 75252910 69407320 64283449 63023573 64660509 66505768 68034542
41736 68034542 69898230 70787169 68402265 63125576 58108945 55526109 54630826 53616848
41728 53616848 51656059 48909884 46112127 44486147 44831161 46486702 48323147 50776792
41720E0776792M808953P615880Q331317O149868K746987P31395J819608N379556
41712H8360356Q333953Q013121N591524M812108O721665Q170739O700886M033185
41704A40737537K603956J393629j756657n716050p423927o497715n200908m655283
41696A13484582m331592m663322o640584q835786q291196m952150k187689k059861
41688G1522402k768143j834738M91934K173848J953266J28865j794469j934292
41680F7938673q7510J213562k26809k540565k026574R75168K104469k87412k340288
41671F4722714n62789L020696M365795L228183K296356K599905L167812L933548
41663H6772220N669481P649484Q253484P603454P187181P222577O690879N606088
$$ plain form
41720 50776792 55585745 63201625 71532942 77682810 80429797 81161192 82980800 88360356
41712 88360356 96694309 104707430 110298954 115111062 121832727 130003466 136704352 140737537
41704 140737537 143341493 144735122 142978465 137262415 129838488 123340773 118139865 113484582
41696 113484582 109152990 104489668 97849084 89013298 80722102 75769952 73582263 71522402
41688 71522402 68754259 66919521 67411455 69585303 71538569 71667434 69872965 67938673
41680 67938673 67851163 69064725 68837916 66297351 64270777 65245945 67350414 67063002 64722714
41671 64722714 64159925 67180621 71546416 74774599 77070955 79670860 82838672 86772220
41663 86772220 92441701 100091185 108344669 115948123 123135304 130357881 137048760 142654848
41655A42654848M905866M334762K772807N32356j048548k289451m894732q605453
41647A38362455j0619221r225915n961230l270743k017891k267376m355052p496218
41639I3148809q984622o862483k656074K05132K04728j399236k935920l872183
41631F6848151m127777l521990k411102j700746j562516r83334O58157K175076
41623E5373919J682731r86731l786223m564127l127368j015087J74888j53773
41615D3598229j571686k900562k874906j430621k22701q99641k781091l307659
41607B7609362j211516J701725K586601P13680k018670l200226k009838L13143
41599B4484261J662753J192383M15089J385187L664167M462830K423938l14946
$$ plain form
41655 142654848 147560714 151895476 154668283 155200639 154152091 151862640 146967908 138362455
41647 138362455 127743234 118517319 112556089 109285346 107267455 105000079 100645027 93148809
41639 93148809 84164187 77301704 74645630 74850762 75055490 73656254 70720334 66848151
41631 66848151 62720374 59198384 56787282 55086536 53524020 52540686 53198843 55373919
41623 55373919 57056650 56069919 52283696 47719569 44592201 43577114 43752002 43598229
41615 43598229 42026543 39125981 36251075 34820454 34597753 33698112 30917021 27609362
41607 27609362 26397846 28099571 30686172 31399852 29381182 26180956 24171118 24484261
41599 24484261 26147014 27339397 27754486 29139673 32803840 37266670 39690608 39375662
41591C9375662j100257l96681o30587k344036l614977l002816j103963Q59405
41583B8041750K219761K441251J225437m91610j058802j42133Q66492P38940m06661
41574C3434425j857992k832900k156333Q08329M336899N183635K238703j950904
41566C7203862m173270l750695j910362L93268K497813L127639J483479j066851
41558C3804883k016359o23463J236426J327500m74859k160598j853433j25653
41550B9114444K74649k283994n633076n847232k153327J908635K908038J300514
41542A9588651l57284j077233j452671j493839q21891k24054o58028j113508J82636
41533A2572779K517240L058387Q65017j705114k367780j717359j580949k206124
$$ plain form
41591 39375662 38275405 37878724 37248137 34904101 31289124 28286308 27182345 28041750
41583 28041750 30261511 32702762 33928199 33436589 32377787 32235654 33102146 33841086 33434425
41574 33434425 31576433 28743533 26587200 27395529 31732428 36916063 39154766 37203862
41566 37203862 33030592 29279897 27369535 27762803 30260616 33388255 34871734 33804883
41558 33804883 31788524 31165061 32401487 33728987 33254128 31093530 29240097 29114444
41550 29114444 29389093 27105099 21472023 15624791 13471464 15380099 18288137 19588651
41542 19588651 19231367 18154134 16701463 15207624 14385733 14161679 13503651 12390143 12572779
41533 12572779 15090019 18148406 19013423 17308309 14940529 13223170 11642221 9436097
41525I436097k441906j661192k54398J180311K246905K800041L067057L164653
41517A7537568K392242J20639k341490k380501M01894K722715J293647k828229
41509A6918485n316994l814928m67022J105182k672j686887j981728j251947r37159
41500B564330r74415L02800L393427N916699M960905Q14048l006245l593430j354794
41491I023325J287343K527607K032342N55913m58235l7429P32044m88663l864262
41482A1309985o101764m146372P76051M486731M585672K214614k83152j484558
41474A1357207r07842R30534K115194Q78890j803022k820754r13794J557489J914774
41465A2308676P56946O60772K260172L551433K971608J409396N77267O30995L88820
$$ plain form
41525 9436097 6994191 5332999 5078601 6258912 8505817 11305858 14372915 17537568
41517 17537568 19929810 20050449 17708959 15328458 15730352 18453067 19746714 16918485
41509 16918485 11601491 7786563 7319541 8424723 8422051 6735164 4753436 3501489 2564330
41500 2564330 1589915 1892715 5286142 11202841 16163746 16977794 13971549 10378119 9023325
41491 9023325 10310668 12838275 14870617 15426530 14968295 14930866 15662910 15174247 11309985
41482 11309985 5208221 1061849 1837900 6324631 10910303 13124917 12841765 11357207
41474 11357207 10449365 11379899 13495093 14373983 12570961 9750207 8836413 10393902 12308676
41465 12308676 13065622 13726394 15986566 19537999 22509607 23919003 24496270 25127265 25516085
41456B5516085p00775j883049k327832k105236j649106j066463n31304n72224
41448A4680096j078208p99337P80026J748704O2727k631717k285598J578970M242411
41439A6298074K202164j569224j943598Q75927K203784J66832k231476k391825
41431A3610658j210178r1480J085392J734510K87686k054576j323694L008926
41423A5047244N838078L730941N52299J397136M238549L270046j439862l970653
41415B8663778j876843P30300N08970m04288P28683K491185K488032J541356J452627
41406C6323800J497543M20588m60662N05603J808529Q78964j631743k941681k551193
41397C3849748k289055k470654j348425J390906L527575L431960K019737Q88912
$$ plain form
41456 25516085 24815310 22932261 20604429 18499193 16850087 15783624 15252320 14680096
41448 14680096 13601888 12802551 13582577 15331281 15394008 12762291 10476693 12055663 16298074
41439 16298074 18500238 16931014 14987416 15863343 18067127 18233959 16002483 13610658
41431 13610658 12400480 12309000 13394392 15128902 15416588 13362012 12038318 15047244
41423 15047244 20885322 24616263 25168562 26565698 30804247 34074293 32634431 28663778
41415 28663778 26786935 27517235 28026205 27621917 28350600 30841785 33329817 34871173 36323800
41406 36323800 37821343 38241931 37781269 38286872 40095401 40974365 39342622 36400941 33849748
41397 33849748 31560693 29090039 27741614 29132520 32660095 36092055 38111792 39000704
41389C9000704M16026L15747L18292l36084k403459m939806n642897l691076r47584
41380B2089863L68613j3969j065203k064397k720413k808328k529718k313605
41372H942843j724123J77858K720129L449954J297732j516361k314653j456438
41364I576941j042487j122135K35043L200743N163065M308915K234996J732664
41356B4287745L305265N068390N119852L001907k50325k554027k267229k66637
41348C5444941N45512j009201k448775j134696J639110K522980J166170L13399
41340C7039440J044147J384741L37825l21029J52908n72349l635065n916853m661892
41331B4851873k395914k947176m639248k710028K297217M352117R46675l214866
$$ plain form
41389 39000704 39416730 39732477 40050769 39714685 37311226 32371420 26728523 23037447 22089863
41380 22089863 22458476 22444507 21379304 19314907 16594494 13786166 11256448 8942843
41372 8942843 7218720 7396578 10116707 13566661 14864393 13348032 11033379 9576941
41364 9576941 8534454 7412319 7647362 10848105 16011170 20320085 22555081 24287745
41356 24287745 27593010 32661400 37781252 40783159 40532834 37978807 35711578 35444941
41348 35444941 35990453 34981252 32532477 31397781 33036891 35559871 36726041 37039440
41340 37039440 38083587 39468328 39806153 39485124 39638032 39065683 35430618 29513765 24851873
41331 24851873 22455959 19508783 14869535 12159507 14456724 18808841 19755516 16540650
41323A6540650l588441j886980j718713k413157j325546P39948R72676k81058
41315G039379j24906J830887K821036J253904j399273l103947l133513j609714
41307C573853M66450J054073p01554k535467j795630N25707J322251L60369L35010
41298B605062J952249K650603J090865m90744N8884J543106J527049l21681k426288
41289H189105l173854j722413J223800K877012R03697k818995l649571l85699
41281A443082K886924K599426K96716p00545l71436q67947k396336l248771k682655
41272c041542j218310Q57770L076491M019608L038534J524954O19374o23092k593650
41263E660137k825146M63796M188834L645760p45864l754380k401762Q18086K273114
$$ plain form
41323 16540650 12952209 11065229 9346516 6933359 5607813 6347761 7320437 7039379
41315 7039379 6914473 8745360 11566396 12820300 11421027 8317080 5183567 3573853
41307 3573853 4040303 5094376 4392822 1857355 61725 587432 1909683 2270052 2605062
41298 2605062 4557311 7207914 8298779 7808035 7866919 9410025 10937074 10615393 8189105
41289 8189105 5015251 3292838 4516638 7393650 8297347 5478352 1828781 1443082
41281 1443082 4330006 6929432 7226148 6525603 6154167 5286220 2889884 -358887 -3041542
41272 -3041542 -4259852 -3402082 -325591 3694017 6732551 8257505 8876879 8253787 5660137
41263 5660137 2834991 3298787 7487621 11133381 10387517 6633137 4231375 5049461 7322575
41254G322575J486887R4648q01940r33721l78720J94115N2643m75372o00797n13660
41244E446658o73323k99993J275092K343108O26561k745267l934662j465846J990531
41235B562859L341132K100245n97012l264245l869265j295732K179309K696779
41227C854070K8280j886323o33398J531636J673376K38341p92239j110092j335685
41218A567966j303878r37571p35518m7572K469721N344802M731540M22230k456271
41209I055449p63149J573004j40961l652978l680844p59524J40794j517687j136387
41200h82283K504958M540107J804758k123368k620932n36935L63169n76979r64478
41191A508017L11943J893346K331358J468809j30289j666898k371239k141628
$$ plain form
41254 7322575 8809462 8904110 8102170 7168449 6789729 6983844 7036487 6561115 5960318 5446658
41244 5446658 4773335 4473342 5748434 8091542 8718103 5972836 2038174 572328 2562859
41235 2562859 5903991 8004236 7407224 4142979 273714 -1022018 1157291 3854070
41227 3854070 3882350 1996027 1362629 2894265 4567641 4805982 4013743 2903651 1567966
41218 1567966 264088 -673483 -1409001 -1456573 1013148 6357950 11089490 11511720 9055449
41209 9055449 8292300 9865304 9724343 6071365 2390521 1630997 1771791 254104 -882283
41200 -882283 1622675 6162782 7967540 5844172 3223240 2686305 3049474 2472495 1508017
41191 1508017 1819960 3713306 6044664 7513473 7383184 5716286 3345047 1203419
41183A203419j533990q94626k69574k1209k53358J45659K139798M316271M076783
41174H909173J228686j699536k895936k752688j830507j24727J188048L81107
41166B403620j515229j263662J416316K703981O26261j469334k83125J886355
41158D505183Q20896k770912m430109k658286j46870J205498K299474L484857
41150B309731L079782O11128j321928j87088L103108N273072M215219P74160k258072
41141A5599112k692600j053838J22320m59917j396425j279387j129724k243157
41133E466384l251719k057780M18480J483708R09600O05107N86272q36048k759638
41124E64366j954608J434634K754801m15001m160881l762059k45498J913319J317090
$$ plain form
41183 1203419 -330571 -1225197 -1494771 -1515980 -1769338 -1623679 516119 4832390 8909173
41174 8909173 10137859 8438323 5542387 2789699 959192 834465 2022513 2403620
41166 2403620 888391 -375271 1041045 3745026 4371287 2901953 2618828 4505183
41158 4505183 5326079 2555167 -1874942 -4533228 -4680098 -3474600 -1175126 2309731
41150 2309731 5389513 6000641 4678713 4491625 7594733 12867805 17083024 17857184 15599112
41141 15599112 12906512 11852674 11974994 11515077 10118652 8839265 7709541 5466384
41133 5466384 2214665 156885 575365 2059073 2968673 3573780 4160052 3324004 564366
41124 564366 -1390242 44392 2799193 2384192 -1776689 -5538748 -5784246 -3870927 -2553837
41115b553837L14491O08135J581374K261318K177834R40777p12433n55885J910775
41106E972549L307477O59997l372481l552262J47881K330166L13210k165439j202719
41097B438379J560060K411706J359530P40678L84982j642253m472093m714820
41089a933831j574294J699354K359633J423723J103658J230734R5767k384421
41081B020323m177014l586822j123271J109518J438516J74725o87988L68285K500524
41072a963204L266257J307682k236895m920617m954829k258995J384470L260749
41064g115382K091930k35539n41765J714902L793809L481324J833020J011682
41056F033981J021060L05571j472787l062490l403272k301481j03099J807192
$$ plain form
41115 -2553837 -2239346 -1631211 -49837 2211481 4389315 5330092 4617659 4061774 5972549
41106 5972549 9280026 9940023 6567542 3015280 3163161 5493327 5806537 3641098 2438379
41097 2438379 3998439 6410145 7769675 8510353 8895335 7253082 2780989 -1933831
41089 -1933831 -3508125 -1808771 550862 1974585 3078243 4308977 4404744 2020323
41081 2020323 -2156691 -5743513 -6866784 -5757266 -4318750 -4144025 -4832013 -4463728 -1963204
41072 -1963204 1303053 2610735 373840 -4546777 -9501606 -11760601 -10376131 -7115382
41064 -7115382 -5023452 -5258991 -5800756 -4085854 -292045 3189279 5022299 6033981
41056 6033981 7055041 7360612 5887825 2825335 -577937 -2879418 -2982517 -1175325
41048a175325J273671j834050m102921k403451J488227L077298J529340K41669
41040a905542Q14257P39910j348324k430283p5551K873876K491244K5806m76158
41031G09235R18916N06991k185240l205194p64821J697604J076360p04862l12915
41022b263926J725266K605984J999087J764195K062818J198159q16116j643561
41014F631906l11852R44907j43969k529043l302457j728764p9779k68870j139409
41005a927330k96993K028763K792060L62397k788840l236245j231919J11157k80110
40996d467060k49450J380717K401326O74552k343189l725524l017840j716323
40988a1062791k30108J861770L360593K368406k42032j133343R46576L278954
$$ plain form
41048 -1175325 98346 -1735704 -5838625 -8242076 -6753849 -3676551 -2147211 -1905542
41040 -1905542 -1091285 -351375 -1699699 -4129982 -4205533 -1331657 1159587 1185393 709235
41031 709235 1628151 2135142 -50098 -3255292 -4020113 -2322509 -1246149 -1951011 -2263926
41022 -2263926 -538660 2067324 4066411 5830606 7893424 9091583 8275467 6631906
41014 6631906 6320054 7264961 7120992 4591949 1289492 -439272 -519051 -787921 -1927330
41005 -1927330 -2224323 -195560 2596500 2958897 170057 -3066188 -4298107 -4186950 -4467060
40996 -4467060 -4716510 -3335793 -934467 -259915 -2603104 -6328628 -9346468 -11062791
40988 -11062791 -11292899 -9431129 -6070536 -3702130 -3944162 -5077505 -4130929 -851975
40980h51975K926733M24592j569582j717824o36213P07831J648721J568795M31520
40971B932598p35937r77994p39136j102754k028073k384872j582809j47903J264725
40962e502155K351361K549816J224402q93642j580776K96051K604076J941704
40954B990837j915461n066730m014715n7902K431582J612124J0149L85375J935116
40945a689625K157622R37157M14499J252735J554728J47970j176650k30572K033122
40936E400986K438424j94140l377234l976979j824018M74472P65006n41258j593760
40927b428501j497482r77864r50473j174738o37394J051526L000787L792880K879702
40918C058443J294836P75530J838082K959282K294280L6927j889966k531029k928733
$$ plain form
40980 -851975 2074758 2499350 929768 -788056 -1424269 -716438 932283 2501078 2932598
40971 2932598 2196661 1218667 479531 -623223 -2651296 -5036168 -6618977 -6766880 -5502155
40962 -5502155 -3150794 -600978 623424 -270218 -1850994 -1554943 1049133 2990837
40954 2990837 1075376 -3991354 -8006069 -8063971 -5632389 -4020265 -4010116 -3624741 -1689625
40945 -1689625 467997 1405154 1819653 3072388 4627116 4775086 3598436 3367864 5400986
40936 5400986 7839410 7645270 4268036 291057 -1532961 -1058489 -293483 -834741 -2428501
40927 -2428501 -3925983 -4903847 -5854320 -7029058 -7666452 -6614926 -3614139 178741 3058443
40918 3058443 4353279 5128809 6966891 9926173 12220453 12257380 10367414 7836385 4907652
40909D907652l879662m171294k441303K68797J631606J245150Q83267J579158
40901B3371K274785J744571K57284j245138k199221k053888l57117J889690K350795
40892B685132O4174k943666l922059k485056m08673P47522O10627n20354j674078
40883g846431j317563R75075L358615L706991K361822J277013Q67635j74987j921768
40874A286402k485859j067628M17990N1060j447596k202491j846727j117170r2054
40865h504073J311059K044256J121524n01799j124607q20801p70868o26980R99808
40856f872481L506702M398870K884349Q45805m55427j925043l727209l722840
40848e067274q73971K173194K407337N45703o92295p15278o95293o10228J45861
$$ plain form
40909 4907652 1027990 -3143304 -5584607 -5315810 -3684204 -2439054 -1555787 23371
40901 23371 2298156 4042727 4300011 3054873 855652 -1198236 -1555353 334337 2685132
40892 2685132 2749306 -194360 -4116419 -6601475 -7010148 -6262626 -5651999 -6172353 -7846431
40883 -7846431 -9163994 -8188919 -4830304 -1123313 1238509 2515522 3383157 3208170 1286402
40874 1286402 -1199457 -2267085 -1849095 -1798035 -3245631 -5448122 -7294849 -8412019 -8504073
40865 -8504073 -7193014 -5148758 -4027234 -4529033 -5653640 -6474441 -7245309 -7872289 -6872481
40856 -6872481 -3365779 1033091 3917440 4763245 4307818 2382775 -1344434 -5067274
40848 -5067274 -5941245 -3768051 -1360714 -815011 -1507306 -2222584 -2917877 -3528105 -3382244
40839c382244L21617j546715l729547l137400j99241J803745K036061K525403
40831e308321L150016J197273k780564l822967J28633M353971M095417J077193
40823B090651n48465q91452k178868l059273o38488L601683N377346M076474K549836
40814A0379444J353479j308412m276974l968803p92776O86466q36266j538101
40806c01943K49994Q41573j876893m013386k138404Q14430Q62212j48072J469605
40797d240884L841109K514763j271607k069468O65929J654323j176854l078753
40789c161442l10202L722406L776667M77347j400306j55142J387314Q57877p67660
40780D426859j587329j392153r14251k65956O51762J235025R36115M59488R42331
$$ plain form
40839 -3382244 -3060627 -4607342 -8336889 -11474289 -11673530 -9869785 -7833724 -5308321
40831 -5308321 -2158305 -961032 -3741596 -7564563 -7435930 -3081959 1013458 2090651
40823 2090651 1542186 650734 -1528134 -4587407 -5225895 -1624212 3753134 7829608 10379444
40814 10379444 11732923 10424511 6147537 2178734 1385958 2072424 1236158 -301943
40806 -301943 -51949 789624 -1087269 -5100655 -7239059 -6424629 -5562417 -5710489 -4240884
40797 -4240884 -399775 2114988 843381 -1226087 -560158 1094165 -82689 -3161442
40789 -3161442 -3471644 250762 4027429 4504776 3104470 2949328 4336642 5194519 4426859
40780 4426859 2839530 1447377 533126 267170 918932 2153957 3090072 3549560 4491891
40771D491891J966807J740487j66326j583487n36371J678793K074443K20107j281453
40762H604891p62627L95853M30808k77380o69222r63327j467994j235149J35359
40753D191212Q82024n64609k857893l578827k715424j999658j768929j019005
40745i431109J59476Q60483J580508L393393N152815M445224J559859l26152M50086
40736G844583K022147K187598J205162L50107j63596n39197m09154K41277M70276
40727A3209203l07821j496865k388619k822017k392577n42294J992072L310408
40719H561490K545020O29031j373871l066179l642401k148727M86395J741889
40711C732647P63725n64749o99465m69119q58734r70837J08105J291252J281285
$$ plain form
40771 4491891 6458698 8199185 8032859 6449372 5913001 7591794 9666237 9886344 8604891
40762 8604891 7842264 8238117 8668925 8391545 7722323 6758996 5291002 4055853 4191212
40753 4191212 5073236 4508627 1650734 -1928093 -4643517 -6643175 -8412104 -9431109
40745 -9431109 -9271633 -8411150 -6830642 -3437249 1715566 6160790 7720649 7394497 7844583
40736 7844583 9866730 12054328 13259490 13609597 13446001 12906804 12497650 12738927 13209203
40727 13209203 12901382 11404517 9015898 6193881 3801304 3259010 5251082 8561490
40719 8561490 11106510 11735541 10361670 7295491 3653090 1504363 1990758 3732647
40711 3732647 4496372 3931623 3232158 2763039 1904305 933468 1041573 2332825 3614110
40702C614110Q61406J385044K192080J638438o0559r87607j94373J320873K099569
40693A1868981J569855J90082r68636j226195j308666k458612m168846m268691
40685g70728k032158M38921J079079N06962M14256Q54613Q45639M08320K12880
40676A957784J50376j51141l10367n7086N8504J28158J398486L595486L733517
40667A0503717K03631l648534l388347K3172J349201j361868m135124l041184
40659c495336M90889K340700J440834L93537J185517K450845J526004j709786
40651D623204m086559k770839R29395K858085J311900r11294q05412O63408O75778
40642B487666j010490k469749l085040l439872k591027Q91582N123035N834959
$$ plain form
40702 3614110 4475516 5860560 8052640 9691078 9630519 8642912 8448539 9769412 11868981
40693 11868981 13438836 13628918 12660282 11434087 10125421 7666809 3497963 -770728
40685 -770728 -2802886 -2363965 -1284886 -777924 -363668 490945 1336584 1744904 1957784
40676 1957784 2108160 1957019 1646652 1589566 1648070 1776228 3174714 6770200 10503717
40667 10503717 10707348 7058814 3670467 3693639 5042840 3680972 -454152 -3495336
40659 -3495336 -3004447 -663747 777087 1170624 2356141 4806986 6332990 4623204
40651 4623204 536645 -2234194 -1304799 1553286 2865186 1953892 1148480 1811888 2487666
40642 2487666 1477176 -992573 -4077613 -7517485 -10108512 -9216930 -4093895 1741064
40634A741064K118096j844460k160980K14142J816869J336153J63359j49675O62897
40625C897465J733034J641993k59545k611646l262592j955620l56546O16786J482454
40616I25783K021962R48271j457820k896233k383150j564027j352505l9125L124397
40607b672447N065991K684803k113615m408564k584257L00953J297385R06564
40599a523187J035408J836824J886675N24013j073078j178338L74858J751582
40591C634757J294564k56960r10155m73667n01928j009677P0823K930939M178945
40582H957641J441994k531076l358766j136836K19353j072286k803578k812593
40574c096147j570858j58195J335867K333130J413168r95609j829050O98049L962219
$$ plain form
40634 1741064 3859160 2014700 -146280 67862 1884731 3220884 3384243 3234568 3897465
40625 3897465 5630499 7272492 7012947 4401301 1138709 -816911 -1173457 -556671 925783
40616 925783 2947745 3896016 2438196 -458037 -2841187 -4405214 -5757719 -5796844 -2672447
40607 -2672447 2393544 5078347 2964732 -1443832 -4028089 -3727136 -2429751 -1523187
40599 -1523187 -487779 1349045 3235720 3759733 2686655 1508317 1883175 3634757
40591 3634757 4929321 4672361 3762206 3288539 2786611 1776934 1847757 4778696 8957641
40582 8957641 10399635 7868559 4509793 3372957 3592310 2520024 -283554 -3096147
40574 -3096147 -4667005 -4825200 -3489333 -1156203 256965 -738644 -2567694 -1869645 2092574
40565B092574L931937M85359k455224k042436K19116J058933j48509j091674k66538
40556A783538P77486j23869k307784l097755j726589l21766m58362q45778K55068
40547f065811K077861K605874J542960J89584o78847r92944l86549J029302J738965
40538A060395P36289m79972p4165R15780K82094j257055j032303Q25911J430331
40529B407305K77875K18395K104879K719438K35291k204380j445224N59283L56653
40520E229515j091384n61740J305481R95606j561310k658982j054174K29631n45981
40511B86662r54290R08973K773744K010576N2m97364J6368p33723k232146j848416
40501b69564M44764J556286j13998k420009k656242p57944J589948L150804L442206
$$ plain form
40565 2092574 6024511 6509870 4054646 2012210 2231326 3290259 3141750 2050076 1783538
40556 1783538 2561024 2437155 129371 -2968384 -4694973 -5016739 -5475101 -6320879 -6065811
40547 -6065811 -3987950 -1382076 160884 350468 -328379 -1321323 -1707872 -678570 1060395
40538 1060395 1796684 1316712 1242547 2158327 2440421 1183366 151063 976974 2407305
40529 2407305 2685180 2903575 5008454 7727892 7963183 5758803 4313579 4872862 5229515
40520 5229515 4138131 3576391 4881872 5877478 4316168 1657186 603012 832643 286662
40511 286662 -667628 241345 3015089 5025665 5025717 4528353 4544721 3810998 1578852 -269564
40501 -269564 175200 1731486 1617488 -802521 -3458763 -4216707 -2626759 524045 3966251
40492C966251K428152R90768N07467J036021J000468n09209k251244k548167j463498
40483C157009l16490R7587o4889k32056K84822J539681K021643M6290l133308
40474C400289l714476m26951K978607K735484M60041J66651J555635Q56880k042424
40465E969736k595197Q80353L631206J386081l107103m360542k180047r87265
40457a362778k578207m018041k639162N93894L242239M021908K747564J31632
40449A39049j876797j748864o22914o72531j290810J77246L479476M673156J807059
40440D064070j772799k196147n98540p55895k799694k946226N84069M595390N028295
40431C202523K016514o88734l97230J817419K966973J658950p64958k177361j921151
$$ plain form
40492 3966251 6394403 7385171 7892638 8928659 9929127 9419918 7168674 4620507 3157009
40483 3157009 2840519 2938106 2873217 2641161 2925983 4465664 6487307 6533597 3400289
40474 3400289 -314187 -741138 2237469 4972953 5432994 5599645 7155280 8012160 5969736
40465 5969736 3374539 4254892 7886098 9272179 6165076 1804534 -375513 -1362778
40457 -1362778 -3940985 -7959026 -10598188 -10004294 -6762055 -2740147 7417 139049
40449 139049 -1737748 -3486612 -4109526 -4782057 -6072867 -5895621 -2416145 2257011 4064070
40440 4064070 2291271 95124 -503416 -1259311 -4059005 -7005231 -6421162 -1825772 3202523
40431 3202523 5219037 4530303 4133073 5950492 8917465 10576415 9811457 7634096 5712945
40422E712945q56178N3832L52679k33833j558408k526802j972957k71535R53152
40413c47105R41961N52685O61920J027920J160232J095382P66096j75395j288724
40404D394972j389805m01876J95565l38330p35532O6668R66658N98968j47881
40395C209407L96756J617409J393791l99094j581684j044122j39600o3910P856
40386C396809R43778J548173J89781k361514l506866k103006K22902J306006R03885
40377E39948L15240K56829R8766p71157j686439j454884p9030J022477O99189
40368a059061n16577j012958R1605J969580K863726J836667k13556j494522j347335
40359A117569p73468o15876j79898J302024K715275K291363M33789o63457l29417
$$ plain form
40422 5712945 4856767 4910599 5263278 5029445 3471037 944235 -1028722 -1300257 -347105
40413 -347105 594856 1147541 1809461 2837381 3997613 5092995 5859091 5683696 4394972
40404 4394972 3005167 2603291 2798856 2460526 1724994 1791662 2758320 3357288 3209407
40395 3209407 3606163 5223572 6617363 6218269 4636585 3592463 3452863 3388953 3396809
40386 3396809 4340587 5888760 6078541 3717027 210161 -1892845 -1669943 -363937 539948
40377 539948 855188 1112017 1210783 439626 -1246813 -2701697 -2780727 -1758250 -1059061
40368 -1059061 -1575638 -2588596 -2496991 -527411 2336315 4172982 3959426 2464904 1117569
40359 1117569 344101 -271775 -451673 850351 3565626 5856989 6290778 5627321 5297904
40350E297904k54567j496228k798754k880735k351706k020116j202354O20551
40342g086005K122307J962624R41005N49367P31037Q50795J314064K130755J589054
40333E105003j007094k909608j481086J114719O36633k470493l363063j60388
40325d535377L343264L603822J951287J250313J412759R15293J58232M07334J108569
40316I615496Q42847k51436j103795j569829j787418r75304J117931K677827J755135
40307A0321454j060493l512083m228523k965164J67546L687916M450369J021367
40299G882389l505648m688217k186945N05343J268665J301513J733271J424752
40291C735123o21954k944000l315069j491086R46565K591107L075594K534471
$$ plain form
40350 5297904 5043337 3547109 748355 -2132380 -4484086 -6504202 -7706556 -7086005
40342 -7086005 -4963698 -3001074 -2060069 -1510702 -779665 71130 1385194 3515949 5105003
40333 5105003 4097909 1188301 -292785 821934 1458567 -1011926 -4374989 -4535377
40325 -4535377 -1192113 2411709 4362996 5613309 7026068 7941361 8099593 8506927 9615496
40316 9615496 10458343 10206907 9103112 7533283 5745865 4770561 5888492 8566319 10321454
40307 10321454 9260961 5748878 1520355 -1444809 -1277263 2410653 6861022 7882389
40299 7882389 4376741 -311476 -2498421 -1993078 -724413 577100 2310371 3735123
40291 3735123 3113169 169169 -3145900 -4636986 -3690421 -1099314 1976280 4510751
40283D510751J069352j161117l382427m016214k098141P20318J202514j151556
40275d306520k568846n001L910030M183964Q37125j105657P09392K701331J477392
40266E833210q93110q08060Q45583O43234j259630j424349Q27868J939903l16202
40257E388447l293874l390532j005307P48328O71107K31665L77725K41220o27581
40248f58802j024407k20521M37350k59517q41152Q59895L651947L640566l56223
40239E229136m506850m610911j151798K133955L093000K302320P50047q15009
40231B423890r27764J210991L507686K992873J85035j473620p79967o6954o77643
40222F394527q83326J62395K14914j837604l069929j157329J116520O9653k487472
$$ plain form
40283 4510751 5580103 4418986 1036559 -2979655 -5077796 -4357478 -3154964 -4306520
40275 -4306520 -6875366 -6880367 -2970337 1213627 2050752 945095 1654487 4355818 5833210
40266 5833210 4940100 4132040 4977623 5620857 4361227 2936878 3764746 5704649 5388447
40257 5388447 2094573 -1295959 -2301266 -1552938 -881831 -650166 -272441 -31221 -658802
40248 -658802 -1683209 -1903730 -1466380 -1725897 -2567049 -1707154 1944793 5585359 5229136
40239 5229136 722286 -3888625 -5040423 -2906468 186532 2488852 3238899 2423890
40231 2423890 1496126 2707117 6214803 9207676 9392711 7919091 7139124 7072170 6394527
40222 6394527 5511201 5673596 5888510 4050906 980977 -176352 940168 1009821 -1477651
40213a477651j835627J937979L870520J739710j071259j305572j55879j26827
40205A575394j072984j463872r44036L07669K508522M777665M836175K020912
40197A2545445j274509k804588l122577l330719k513441J10591K373886J512409
40189C496497j623144l426106k113858P79544K879621K762872K7453l925402n700327
40180f842850l188606J156254L029693K130370K151098M554301N990993L504972
40172A2486225r21120l480723l734851l763975l858399k403486N12524K448701
40164b715104J864540k36643k203576l288066l064937j377240N89161J059654
40156i372211J48735j94576O94599J210693N17768K33283J506903K674341J996870
$$ plain form
40213 -1477651 -3313278 -1375299 2495221 4234931 3163672 1858100 1702221 1575394
40205 1575394 502410 -961462 -1905498 -1597829 910693 5688358 10524533 12545445
40197 12545445 11270936 8466348 5343771 2013052 -500389 -389798 1984088 3496497
40189 3496497 1873353 -1552753 -3666611 -2887067 -7446 2755426 2782879 -1142523 -6842850
40180 -6842850 -10031456 -8875202 -5845509 -3715139 -1564041 2990260 8981253 12486225
40172 12486225 11565105 8084382 4349531 585556 -3272843 -5676329 -5163805 -2715104
40164 -2715104 -850564 -1087207 -3290783 -6578849 -9643786 -11021026 -10431865 -9372211
40156 -9372211 -9223476 -9418052 -8723453 -7512760 -6994992 -6761709 -5254806 -2580465 -583595
40147e83595O91149M93306Q5223k451828m935057l332692J430567L774055J609976
40138c218896p04665K86786J787276L66692j555652j12084K346976M22606m885938
40129e266899o674283k489218K180197K477202L94597l25324j59156p88708n65569
40120a1217161K221921M706876L138778q00176k299395o95492M88216K7359L70162
40111d058912K306281L271232K170547J404742K246573K227659l95367l002765
40103F169990k500977l05157j07945k256145l628578k467536m60783P7657j031377
40094f510851k249327k102563l20494J892448K772361J842751M72623J7330J85223
40085d000499J07337Q4846R40460K229027K514818J230129q17699k481095k836504
$$ plain form
40147 -583595 107554 600860 686083 -1765745 -6700802 -10033494 -8602927 -4828872 -3218896
40138 -3218896 -3923561 -3636775 -1849499 -1482807 -3038459 -3150543 -803567 -380961 -5266899
40129 -5266899 -11941182 -14430400 -12250203 -9773001 -9378404 -9703728 -9862884 -10651592 -11217161
40120 -11217161 -8995240 -4288364 -1149586 -1949762 -4249157 -4944649 -4456433 -4429074 -4058912
40111 -4058912 -1752631 1518601 3689148 5093890 7340463 9568122 9172755 6169990
40103 6169990 3669013 3363856 3255911 999766 -2628812 -5096348 -5557131 -5479474 -6510851
40094 -6510851 -8760178 -10862741 -11183235 -9290787 -6518426 -4675675 -4203052 -4185722 -4000499
40085 -4000499 -3893162 -3808316 -2867856 -638829 1875989 3106118 2288419 -192676 -3029180
40076c029180j307796J424542L072458J921718o72351j573810J04712J861155
40068A801448J303879p26458j705796j088392q89392k701980n298518n717805
40060a5023014k419288K892617O561339O193049K754353n64978j566729q22186
40052a994837j80959k52396k47235M8717l15932j421106j303993J510311N059128
40043I01698N731375L087552M88749J09831q247k030401m022756k887428m9754
40034A320619R009l152651m675223j643925K299954K228485j084235k758636p19274
40025h175877K362929L426491K346442P90755P3887N84623J732891K162384J158649
40016F463174k85840r07127j100137j895066k588896j469305J088934K364098
$$ plain form
40076 -3029180 -4336976 -2912434 160024 2081742 1409391 -164419 -59707 1801448
40068 1801448 3105327 2378869 673073 -415319 -1304711 -4006691 -9305209 -15023014
40060 -15023014 -17442302 -14549685 -7988346 -1795297 959056 394078 -1172651 -1994837
40052 -1994837 -2175796 -2428192 -2675427 -2626710 -2942642 -4363748 -5667741 -4157430 901698
40043 901698 6633073 9720625 10209374 10319205 10310958 8280557 4257801 1370373 1320619
40034 1320619 1329628 -1823023 -6498246 -8142171 -5842217 -3613732 -4697967 -7456603 -8175877
40025 -8175877 -5812948 -2386457 -40015 750740 824627 1409250 3142141 5304525 6463174
40016 6463174 6177334 5270207 4170070 2275004 -313892 -1783197 -694263 1669835
40008A669835Q06592j763355k374439l37043K264284K926426J184854r30993r64688
39999B481473J073231K418623Q83851k258322l853052k676782l21763J155694
39991a097047R28463p88036k894950l622872k220193j82996P21683J003632K068597
39982f083719L158907K442110O67455L49045J164578L9974l140889m045961m37261
39973e885761L450357K465676k128881m677512k849916N10246K435699K904700
39965c775392K738252J827190L94281m17359k28313m508l35634o41228m99243
39956i41954k64264K87P13333J519874J330881J13327p23745k89888O08366P20063
39946B786280k57040j785939k877606k338803j15441J526935J19836l174298m070968
$$ plain form
40008 1669835 2476427 713072 -1661367 -1998410 265874 3192300 4377154 3446161 2481473
39999 2481473 3554704 5973327 6857178 4598856 745804 -1930978 -2252741 -1097047
39991 -1097047 -168584 -956620 -3851570 -7474442 -9694635 -9877631 -9155948 -8152316 -6083719
39982 -6083719 -2924812 -482702 184753 533798 1698376 1738350 -1402539 -5448500 -5885761
39973 -5885761 -2435404 30272 -2098609 -6776121 -9626037 -9115791 -6680092 -3775392
39965 -3775392 -1037140 790050 1184331 766972 538659 534151 198517 -442711 -941954
39956 -941954 -1206218 -1205931 -492598 1027276 2358157 2471484 1747739 1457851 2066217 2786280
39946 2786280 2529240 743301 -2134305 -4473108 -4588549 -3061614 -2941778 -6116076 -10187044
39937a0187044p52675L199771L464929Q12113m65198J032524K292809J114510
39929E11739m64213K04229J709310M52480l610381o110928l907272O57495K746631
39920g810910R94872j462433j492033N63401K396381K929120K685420K020992
39912H24810O62488j122686k301341k388030k020100j776863j247715P4641J581920
39903g712876K092965J398163M64572R8325J79529L84512P58710J051465M49617
39894h35018r52768j222270J132271M182515M141216N52774k486816j918695j99833
39885B393376j388686m448006m420255n8430L990478L909935J749353J296408
39877C024173K119166J210585j423817k766378j778087q16061j735129l485246
$$ plain form
39937 -10187044 -10939719 -7739948 -4275019 -3462906 -3928104 -2895580 -602771 511739
39929 511739 47526 251755 1961065 2413545 -1196836 -7307764 -11215036 -10557541 -7810910
39920 -7810910 -6816038 -8278471 -9770504 -9207103 -6810722 -3881602 -1196182 824810
39912 824810 1487298 364612 -1936729 -4324759 -6344859 -8121722 -9369437 -9294796 -7712876
39903 -7712876 -5619911 -4221748 -3757176 -3658851 -3479322 -3094810 -2336100 -1284635 -835018
39894 -835018 -1787786 -3010056 -1877785 2304730 6445946 6998720 4511904 2593209 2393376
39885 2393376 1004690 -3443316 -7863571 -7922001 -3931523 -21588 1727765 3024173
39877 3024173 5143339 6353924 4930107 2163729 385642 -430419 -2165548 -5650794
39869e650794m308143l908520k532676j0775L035900M618241L397418M60450j775467
39860f674366j756738M68478L607700N636054N049501K436106N1899p36373p13719
39851G368542j003258j233937o56332p9933r45634k618011k400966R06599M656737
39842C993807N007360J662277j633713j918872p55698j486417l779100l673114
39834b583470M56079M741998M501776K22910l453616l652009j706846j85360L2521
39825a626017n16581j008577o83690M48786J055041K4105j548050j630094l62889
39816e847966K28139k53415J39695K133592L473220K253118J7928l79218J280630
39807C045723K673021K226952O43789o12065j015443j041672j210770j306068
$$ plain form
39869 -5650794 -9958937 -13867457 -16400133 -16410908 -13375008 -8756767 -5359349 -4898899 -6674366
39860 -6674366 -8431104 -7962626 -4354926 1281128 6330629 8766735 8818634 8082261 7368542
39851 7368542 6365284 5131347 4475015 4395082 3449448 831437 -1569529 -662930 3993807
39842 3993807 9001167 10663444 9029731 7110859 6355161 4868744 1089644 -2583470
39834 -2583470 -2127391 2614607 7116383 7339293 3885677 233668 -1473178 -1658538 -1626017
39825 -1626017 -2142598 -3151175 -3834865 -3386079 -2331038 -2306933 -3854983 -5485077 -5847966
39816 -5847966 -5619827 -5873242 -5733547 -3599955 -126735 2126383 2144311 1765093 3045723
39807 3045723 5718744 7945696 8589485 7977420 6961977 5920305 4709535 3403467
39799C403467o91701L68834M22414j098052k253152q65344J997238L118930J732764
39790F135398L19218K93434l8504j855846l152900j891509N61814J615059J141980
39781C128144N13012k57251j623177k286616r12191R66491Q14000q29820j217939
39772a705347N7612N90508o21714j560361n35150J392566K327166J923606R46535
39763B815421l4343p92465j377020k093128k600874j616004R69679K562659Q01635
39754a364440k547027l422731j075455J197737J201383M24011N45916O85694j56667
39745d511579p56807J03547J313854J442692J064172R93172K62662j615814k234972
39736c939073O73013M788252N173220P61557m002593m682529j690952J379447
$$ plain form
39799 3403467 2711766 3080600 3503014 2404962 151810 -713534 1283704 4402634 6135398
39790 6135398 6454616 6748050 6709546 4853700 1700800 -190709 371105 1986164 3128144
39781 3128144 3641156 3383905 1760728 -525888 -1438079 -471588 342412 -487408 -1705347
39772 -1705347 -1647735 -1057227 -1678941 -3239302 -3774452 -2381886 -54720 1868886 2815421
39763 2815421 2781078 1988613 611593 -1481535 -4082409 -5698413 -4728734 -2166075 -1364440
39754 -1364440 -3911467 -7334198 -8409653 -7211916 -6010533 -5586522 -5040606 -4354912 -4511579
39745 -4511579 -5268386 -5164839 -3850985 -2408293 -1344121 -350949 -88287 -1704101 -3939073
39736 -3939073 -3266060 1522192 6695412 7456969 3454376 -1228153 -2919105 -1539658
39728a539658K343317J793840R94452K78760k87562o1291J226819K130491O57648
39719G536816k640892m305944k221977R95648J216088j253025j978605J009106
39711a642785M247781L903718Q63942j413342j757778j388070r61685l55003k14011
39702A282767j037957j570392n79146O66002L11410n97755L82935K636737K963560
39693D458161P46496p84333M94500K331820J423736k105239n169795n251614k265605
39684f121873J858246M514722M411868K780623J564802N54862j785668m717730
39676C059852n281029k833241o08545j003257j982088o71556J667550J520258
39668f132056j169451k631208p37416K075531K349297P7726j733535j032994J032039
$$ plain form
39728 -1539658 803659 2597499 3591951 3870711 3583149 3521858 4748677 6879168 7536816
39719 7536816 4895924 589980 -1631997 -636349 579739 -673286 -2651891 -1642785
39711 -1642785 2604996 6508714 7372656 5959314 4201536 2813466 1851781 1496778 1282767
39702 1282767 244810 -1325582 -1904728 -1238726 -927316 -1525071 -1142136 1494601 4458161
39693 4458161 5204657 4420324 4914824 7246644 8670380 6565141 1395346 -3856268 -6121873
39684 -6121873 -4263627 251095 4662963 7443586 9008388 9563250 7777582 3059852
39676 3059852 -2221177 -5054418 -5662963 -6666220 -8648308 -9319864 -7652314 -6132056
39668 -6132056 -7301507 -9932715 -10670131 -8594600 -6245303 -6167577 -7901112 -8934106 -7902067
39659g902067J893407Q75625j09367M91238J361066M12355j227628j18280L933219
39650c90432O261233L324909k143886m688665k999294j93120J337221J800241
39642B308207J448073m0590j429341p05070J332411J516435p32285k139561o25825
39633I32454J508572J344242m67705j535860j442245j199527q90356k88679k15368
39624b254472q83805m91865J962520M032450L005714M93649L82747K802574L789525
39615A2839037J181515k570101m268215l626082j985752j89484Q15747k59910
39607A936755k834636l928219j764712J555271K768636J561644J36468k60023
39599h28816l25180p30378j063799p55684K84357J911297L493519L592058J213210
$$ plain form
39659 -7902067 -6008660 -5133035 -5242402 -4751164 -3390098 -2977743 -4205371 -4323651 -390432
39650 -390432 5870801 9195710 7051824 2363159 -636135 -829255 507966 2308207
39642 2308207 3756280 3715690 2286349 1581279 2913690 4430125 3697840 1558279 932454
39633 932454 2441026 3785268 3317563 1781703 339458 -860069 -1750425 -2039104 -2254472
39624 -2254472 -3138277 -3630142 -1667622 2364828 5370542 5864191 6246938 9049512 12839037
39615 12839037 14020552 11450451 7182236 3556154 1570402 1380918 2196665 1936755
39607 1936755 -897881 -4826100 -6590812 -5035541 -2266905 -705261 -568793 -828816
39599 -828816 -1153996 -1884374 -2948173 -3703857 -3419500 -1508203 1985316 5577374 6790584
39590F790584k395876m318922k930123K57129K196035J551131q9797l82679P84879
39581A462361J280000q1255j523105p25933J599194K470379P68770j529182k540006
39572A181223k569747k230120r77534Q90032J109855j362646l831687l192526
39564a0983150m75002Q93129M61696R70767L256789M559674K977876M60407n16959
39555A605227p76078k445401m723069m532274j168821K209306K520306N64949
39547f745855l27071J304077L363920L044304K64327k484168l114390j705300
39539f400156M68913K321990L099092K501146J366166J094678J678369J519224
39531G649422n063j338713j285643j005723j708116k076836m73034J643877J521144
$$ plain form
39590 6790584 4394708 75786 -2854337 -2597208 -401173 1149958 1060161 677482 1462361
39581 1462361 2742361 2661106 1138001 412068 2011262 4481641 5250411 3721229 1181223
39572 1181223 -1388524 -3618644 -4596178 -3706146 -2596291 -3958937 -7790624 -10983150
39564 -10983150 -11458152 -10565023 -10103327 -9132560 -5875771 -1316097 1661779 2122186 1605227
39555 1605227 829149 -1616252 -6339321 -10871595 -12040416 -9831110 -7310804 -6745855
39547 -6745855 -7072926 -5768849 -2404929 639375 903702 -1580466 -4694856 -6400156
39539 -6400156 -5931243 -3609253 -510161 1990985 3357151 4451829 6130198 7649422
39531 7649422 7644359 6305646 5020003 4014280 2306164 229328 -243706 1400171 2921315
39522B921315l97194j049886K93392R66059p60244l384499m994684n398158m449411
39513a6253310j323330K977386N131354L458216K49085j516557j648971j342430
39505a0268557o83511L62465O16379l61307p87897O22259K181319J759076J04618
39496f455156p35678o32830m68203K84614K189607L530464K429224Q6343j090579
39487h62194j259000j760969j476710J337824M575874M349532J353577K44261
39479F502195K091730K585194o22207l795323l156234p85223q22794k930548l551375
39470d484585j695424L66584J082808R48889M94037j65702j62078J162700K394013
39461e8758J533104p70301j774429n99216N50102k76882k014909k243243n66068
$$ plain form
39522 2921315 2524121 1474235 1767627 2733686 1973442 -1411057 -6405741 -11803899 -16253310
39513 -16253310 -17576640 -14599254 -9467900 -6009684 -5760599 -7277156 -8926127 -10268557
39505 -10268557 -10952068 -10589603 -9973224 -10334531 -11122428 -10500169 -8318850 -6559774 -6455156
39496 -6455156 -7190834 -7823664 -8291867 -8007253 -5817646 -2287182 142042 228385 -862194
39487 -862194 -2121194 -3882163 -5358873 -4021049 554825 4904357 6257934 6502195
39479 6502195 8593925 11179119 10556912 6761589 3605355 2820132 1997338 -933210 -4484585
39470 -4484585 -6180009 -5813425 -4730617 -3781728 -3287691 -3453393 -3615471 -2452771 -58758
39461 -58758 1474346 704045 -1070384 -1669600 -1119498 -1396380 -3411289 -5654532 -6220600
39452f220600R22313N47318m55333O16026L809417N374464K410314k463796l916287
39443F23836j133214J309395N31192q50602j41351M86992j659823l970211k199420
39434g003206K133474L704543J831938J016579K849016L555487J172847q20598
39426H440080R3126Q58420j441173l961629l039147q63621j478714l012793n92051
39417d997502M349018M912583m77268n022872l609247J54199N82428j467310j465335
39408g041306Q67277J959110Q48570o950K71543j3030j011056o62162J089133
39399c698871J555374Q0945l64028J721799L341465J730201j015577j361818J9087
39390B008577j36554j908172k128336K56439K532802K372411M74538j610793l386024
$$ plain form
39452 -6220600 -5298287 -4750969 -5206302 -4590276 -780859 4593605 7003919 4540123 623836
39443 623836 -509378 800017 1331209 480607 339256 826248 -833575 -4803786 -7003206
39434 -7003206 -4869732 -1165189 666749 1683328 4532344 8087831 9260678 8440080
39426 8440080 8533206 9391626 7950453 3988824 949677 86056 -1392658 -4405451 -4997502
39417 -4997502 -648484 4264099 3786831 -1236041 -4845288 -4691089 -4108661 -5575971 -7041306
39408 -7041306 -6174029 -4214919 -3366349 -3373299 -3101756 -3114786 -4125842 -4788004 -3698871
39399 -3698871 -2143497 -2062552 -2426580 -704781 2636684 4366885 3351308 1989490 2008577
39390 2008577 1872023 -36149 -2164485 -1908046 624756 2997167 3471705 1860912 -1525112
39381a525112m185521k791533L54660K788655L197173K882311K817644J660839
39373E199116j412654m112866l795965j312206M45194O73825P36552J059888Q91689
39364a627427P04295J713977K837202J331693k566826m629301k040693K459017
39356a818063M040848J845742p63571j103022J33986J036619J180751J364354
39348E917644J847151J803839L33334k232055m065339l416115q70564P02891n87083
39339e66297l074127l559194j522455M90668Q38405R85237K608710M405290L887894
39330D494131J400247j28422N08792J044488p90237l829043n009508l362847q83430
39321f555829K91692K13952M04184J671683L139757L312656J964644O49819Q18425
$$ plain form
39381 -1525112 -5710633 -8502166 -8147506 -5358851 -2161678 720633 3538277 5199116
39373 5199116 3786462 -326404 -4122369 -5434575 -4989381 -4315556 -3579004 -2519116 -1627427
39364 -1627427 -923132 790845 3628047 4959740 2392914 -2236387 -4277080 -1818063
39356 -1818063 2222785 4068527 3304956 2201934 2335920 3372539 4553290 5917644
39348 5917644 7764795 9568634 9901968 7669913 3604574 188459 -682105 20786 -566297
39339 -566297 -3640424 -7199618 -8722073 -8231405 -7393000 -6407763 -3799053 606237 4494131
39330 4494131 5894378 5765956 6274748 7319236 6528999 2699956 -2309552 -5672399 -6555829
39321 -6555829 -6264137 -6050185 -5646001 -3974318 -834561 2478095 4442739 5092558 5910983
39312E910983J747143J529824J43900k74105J030345J725182q519k096780j533224
39303H174749N81801M61306k246699l642647j684410O83846L76453j179890r19926
39294F04583R28507J958119J813757J927755K092262O94219j938292l474151k970638
39285A636121j740763p83839Q4077M26809p50366k655240l026814j460689Q8233
39276h182471P76446J997303L911508L903824N62309l288721m043914k010287
39268f374003j58661L13489M86234Q62864Q87381R28340K088629L903260M427798
39259G365331K919796O33673j210965k494438l103381k646643j658264j369581
39251a564472j796283j647103n90818J16641o1810J77816J692946L076047K591963
$$ plain form
39312 5910983 7658126 9187950 9331850 9057745 10088090 11813272 11804753 9707973 8174749
39303 8174749 8756550 9217856 6971157 3328510 1644100 2327946 2704399 1524509 604583
39294 604583 1533090 3491209 5304966 7232721 9324983 10019202 8080910 4606759 1636121
39285 1636121 -104642 -888481 -804404 -377595 -1127961 -3783201 -6810015 -8270704 -8182471
39276 -8182471 -7406025 -5408722 -1497214 2406610 2968919 -319802 -4363716 -6374003
39268 -6374003 -6532664 -6219175 -5732941 -4870077 -3982696 -3054356 -965727 2937533 7365331
39259 7365331 10285127 10918800 9707835 7213397 4110016 1463373 -194891 -1564472
39251 -1564472 -3360755 -5007858 -5598676 -5482035 -5543845 -5366029 -3673083 -597036 1994927
39242A994927P79099m76015p17836j133298k230364k800133j517803J292419L854071
39233i54933M540420L182921R76694q62605k116991k911581k635986p76007J313611
39224b44457J259767j067648k884095k161712k33604P92851J360905K804707L862158
39215C488872K160507j280988k661476j114393k68738k490153m753058k917409
39207i836836K101276N549792N015618K320755k31385k382945m294063n095265
39199f853053m266739k730290j416372L4524K122677M012411M275791K642942
39191b178109K84497j329265j417501j65329J460506K292688J664633k78966k607689
39182b274535l824562k805741j84318J857605K059594J658943K344133L403281
$$ plain form
39242 1994927 2774026 2298011 1580175 446877 -1783487 -4583620 -6101423 -4809004 -954933
39233 -954933 3585487 6768408 7745102 6882497 4765506 1853925 -782061 -1558068 -244457
39224 -244457 1015310 -52338 -2936433 -5098145 -5331749 -4538898 -3177993 -373286 3488872
39215 3488872 5649379 4368391 1706915 592522 323784 -2166369 -6919427 -9836836
39207 -9836836 -7735560 -2185768 2829850 5150605 4919220 2536275 -1757788 -6853053
39199 -6853053 -11119792 -13850082 -15266454 -15231930 -13109253 -9096842 -4821051 -2178109
39191 -2178109 -1893612 -3222877 -4640378 -4805707 -3345201 -1052513 612120 333154 -2274535
39182 -2274535 -6099097 -8904838 -9089156 -7231551 -5171957 -3513014 -1168881 2234400
$$ [...]
##END NTUPLES=NMR SPECTRUM
##END=
