##TITLE=31P_DE-80H_X3
 64 sc D2O
 26.2.2025
##JCAMPDX= 6.0         $$ Bruker NMR JCAMP-DX V2.0
##DATA TYPE= NMR SPECTRUM
##DATA CLASS= NTUPLES
##ORIGIN= UXNMR, Bruker Analytische Messtechnik GmbH
##OWNER= root
$$ XWIN-NMR		Version 3.5
$$ Thu May 15 16:58:10 2025 Russian Standard Time (UT+4h)  Yarkov@DPX200
##.OBSERVE FREQUENCY= 81.013821
##.OBSERVE NUCLEUS= ^31P
##.ACQUISITION MODE= SIMULTANEOUS
##.ACQUISITION SCHEME= undefined
##.AVERAGES= 64
##.DIGITISER RES= 17
##SPECTROMETER/DATA SYSTEM= spect
##.PULSE SEQUENCE= zgpg30
##.SOLVENT NAME= CDCl3
##.SHIFT REFERENCE= (INTERNAL, CDCl3, 0, 198.062)
##AUDIT TRAIL= $$ (NUMBER, WHEN, WHO, WHERE, WHAT)
$$ ##TITLE= Audit trail, XWIN-NMR		Version 3.5
$$ ##JCAMPDX= 5.01
$$ ##ORIGIN= Bruker BioSpin GmbH
$$ ##OWNER= Yarkov
$$ C:/Bruker/XWIN-NMR/data/yarkov2/nmr/P31/2/pdata/1/auditp.txt
$$ ##AUDIT TRAIL=  $$ (NUMBER, WHEN, WHO, WHERE, WHAT)
(   1,<2025-05-15 16:57:10.96 +0400>,<Yarkov>,<DPX200>,
      <created by zg, POWCHK disabled, PULCHK disabled
       configuration hash MD5:
       00 E9 B6 7A A2 85 ED C7 34 08 36 98 17 FE 4E 26
       data hash MD5: 32K
       96 A1 96 97 58 2F D2 7F 44 AB 73 8A ED AF E4 BA>)
(   2,<2025-05-15 16:57:16.70 +0400>,<Yarkov>,<DPX200>,
      <Start of raw data processing
       efp BC_mod = 2 LB = 1.5 FT_mod = 6 PKNL = 1 PHC0 = 1793.24 PHC1 = 76.9595 SI = 64K 
       data hash MD5: 64K
       17 D5 36 77 43 EE 99 73 BA 70 6E 75 BC 99 1E AB>)
(   3,<2025-05-15 16:57:35.54 +0400>,<Yarkov>,<DPX200>,
      <pk PHC0 = -9.599999 PHC1 = 0 
       data hash MD5: 64K
       1B 4E 82 20 E5 9D A3 37 40 8E CF 68 38 FC E4 94>)
(   4,<2025-05-15 16:57:39.50 +0400>,<Yarkov>,<DPX200>,
      <abs ABSG = 5 
       data hash MD5: 64K
       12 5C E6 DE DD 38 6D F2 39 5C 01 89 5A ED E0 E9>)
$$ ##END=
$$ 
$$ hash MD5
$$ 82 6A CC 36 E1 DB CA E9 18 F8 87 FC 71 B3 2E 7B
##$RELAX= 
##$RELAX= 
##$RELAX= 
##$RELAX= 
##$RELAX= 
##$RELAX= 
##$RELAX= 
##$RELAX= 
$$ Bruker specific parameters
$$ --------------------------
##$DU= <C:/Bruker/XWIN-NMR>
##$EXPNO= 2
##$NAME= <P31>
##$PROCNO= 1
##$TYPE= <nmr>
##$USER= <yarkov2>
##$AMP= (0..31)
100 100 100 100 100 100 100 100 100 100 100 100 100 100 100 100 100 100 
100 100 100 100 100 100 100 100 100 100 100 100 100 100 
##$AQSEQ= 0
##$AQ_mod= 1
##$AUNM= <au_zg>
##$AUTOPOS= <>
##$BF1= 81.014009
##$BF2= 200.13
##$BF3= 200.13
##$BF4= 200.13
##$BF5= 200.13
##$BF6= 200.13
##$BF7= 200.13
##$BF8= 200.13
##$BYTORDA= 1
##$CFDGTYP= 0
##$CFRGTYP= 5
##$CHEMSTR= <none>
##$CNST= (0..31)
1 1 145 1 1 1 1 1 1 1 1 1 1 1 1 1 1 1 1 1 1 1 1 1 1 1 1 1 1 1 1 1 
##$CPDPRG= <waltz16>
##$CPDPRG1= <>
##$CPDPRG2= <waltz16>
##$CPDPRG3= <>
##$CPDPRG4= <mlev>
##$CPDPRG5= <mlev>
##$CPDPRG6= <mlev>
##$CPDPRG7= <mlev>
##$CPDPRG8= <mlev>
##$CPDPRGB= <>
##$CPDPRGT= <>
##$D= (0..31)
0 1 0 0 0 0 0 0 0 0.06 0 0.03 2e-05 3e-06 0 0 0.0002 0 0 0 0 0 0 0 0 0 
0 0 0 0 0 0 
##$DATE= 1747313830
##$DBL= (0..7)
120 120 120 11 120 120 24 19 
##$DBP= (0..7)
150 150 150 150 150 150 150 150 
##$DBP07= 0
$$ [...]
##$SUBNAM3= <"">
##$SUBNAM4= <"">
##$SUBNAM5= <"">
##$SUBNAM6= <"">
##$SUBNAM7= <"">
##$SUBNAM8= <"">
##$SUBNAM9= <"">
##$SW= 400.765351723535
##$SWIBOX= (0..15)
0 1 3 0 0 0 0 0 0 0 0 0 0 0 0 0 
##$SW_h= 32467.5324675325
##$TD= 32768
##$TD0= 1
##$TE= 0
##$TE2= 300
##$TE3= 300
##$TEG= 300
##$TL= (0..7)
0 120 53 12 22 120 120 120 
##$TP= (0..7)
150 150 150 150 150 150 150 150 
##$TP07= 0
##$TPNAME0= <>
##$TPNAME1= <>
##$TPNAME2= <>
##$TPNAME3= <>
##$TPNAME4= <>
##$TPNAME5= <>
##$TPNAME6= <>
##$TPNAME7= <>
##$TPOAL= (0..7)
0.5 0.5 0.5 0.5 0.5 0.5 0.5 0.5 
##$TPOFFS= (0..7)
0 0 0 0 0 0 0 0 
##$TUNHIN= 0
##$TUNHOUT= 0
##$TUNXOUT= 0
##$USERA1= <user>
##$USERA2= <user>
##$USERA3= <user>
##$USERA4= <user>
##$USERA5= <user>
##$V9= 5
##$VALIST= <valist>
##$VCLIST= <CCCCCCCCCCCCCCC>
##$VD= 0
##$VDLIST= <DDDDDDDDDDDDDDD>
##$VPLIST= <PPPPPPPPPPPPPPP>
##$VTLIST= <TTTTTTTTTTTTTTT>
##$WBST= 1024
##$WBSW= 4
##$XGAIN= (0..3)
0 0 0 0 
##$XL= 0
##$YL= 0
##$YMAX_a= 4301
##$YMIN_a= -15663
##$ZGOPTNS= <>
##$ZL1= 120
##$ZL2= 120
##$ZL3= 120
##$ZL4= 120
##$ABSF1= 198.0616
##$ABSF2= -202.7028
##$ABSG= 5
##$ABSL= 3
##$ALPHA= 0
##$AQORDER= 0
##$ASSFAC= 0
##$ASSFACI= 0
##$ASSFACX= 0
##$ASSWID= 0
##$AUNMP= <proc_1d>
##$AZFE= 0.1
##$AZFW= 0.5
##$BCFW= 0
##$BC_mod= 2
##$BYTORDP= 0
##$COROFFS= 0
##$CY= -3
##$DATMOD= 1
##$DC= 0
##$DFILT= <>
##$DTYPP= 0
##$F1P= 0
##$F2P= 0
##$FCOR= 1
##$FTSIZE= 65536
##$FT_mod= 6
##$GAMMA= 0
##$GB= 0
##$INTBC= 1
##$INTSCL= 9.790993e-09
##$ISEN= 30
##$LB= 1.5
##$LEV0= 0
##$LPBIN= 0
##$MAXI= 10000
##$MC2= 0
##$MEAN= 0
##$ME_mod= 0
##$MI= 50
##$NCOEF= 0
##$NC_proc= -8
##$NLEV= 6
##$NOISF1= 182.463
##$NOISF2= 159.3651
##$NSP= 0
##$NTH_PI= 0
##$NZP= 0
##$OFFSET= 198.0616
##$PC= 4
##$PHC0= 1783.64
##$PHC1= 76.9595
##$PH_mod= 1
##$PKNL= yes
##$PPARMOD= 0
##$PSCAL= 0
##$PSIGN= 0
##$REVERSE= no
##$SF= 81.0140089999434
##$SI= 65536
##$SIGF1= 159.3651
##$SIGF2= -187.1042
##$SINO= 113.3802
##$SIOLD= 16384
##$SREGLST= <1H.CDCl3>
##$SSB= 0
##$STSI= 65536
##$STSR= 0
##$SW_p= 32467.5324675325
##$SYMM= 0
##$S_DEV= 0
##$TDeff= 32768
##$TDoff= 0
##$TI= <>
##$TILT= no
##$TM1= 0
##$TM2= 0
##$TOPLEV= 0
##$USERP1= <user>
##$USERP2= <user>
##$USERP3= <user>
##$USERP4= <user>
##$USERP5= <user>
##$WDW= 1
##$XDIM= 65536
##$YMAX_p= 197851885
##$YMIN_p= -370431670
$$ End of Bruker specific parameters
$$ ---------------------------------
##NTUPLES= NMR SPECTRUM
##VAR_NAME=  FREQUENCY,     SPECTRUM/REAL,   SPECTRUM/IMAG
##SYMBOL=    X,             R,               I
##VAR_TYPE=  INDEPENDENT,   DEPENDENT,       DEPENDENT
##VAR_FORM=  AFFN,          ASDF,            ASDF
##VAR_DIM=   65536,         65536,           65536
##UNITS=     HZ,            ARBITRARY UNITS, ARBITRARY UNITS
##FACTOR=    0.49542278885378, 1,            1
##FIRST=     16045.7642231865, 0,            0
##LAST=      -16421.768244346, 0,            0
##MIN=       -16421.768244346, -370431670,   0
##MAX=       16045.7642231865, 197851885,    0
$$ Real data points
##PAGE= N=1
##DATA TABLE= (X++(R..R)), XYDATA
$$ [...]
7498e563188J515601J398134M55567M18335J649133K418479J298010j143795l299092
7489h52816l983429k795692k99942J799752J842763J44499j091639l06147J615161
7480c927490K510069J426148m51018j134017N9762J716822J899139N45258m32563
7471B212110J82868J194784Q55292n67875j484498j489625j463611j549969r01770
7462c012294M96263J489463J512511J125350N58841n61330j637977j166092P61822
7453d33443J835321P07172p67027j53498J821258K141208k84577l102261l419756
7444a655603r35042K166498L443852J950578j359142m237134m506595j650308
7436f782896K523232N006462M030763Q07991j519179j213839J45023q3378j864043
$$ plain form
7498 -5563188 -4047587 -2649453 -2193886 -1775551 -126418 2292061 3590071 2446276 -852816
7489 -852816 -4836245 -7631937 -7931879 -6132127 -4289364 -4144865 -5236504 -5542651 -3927490
7480 -3927490 -1417421 8727 -442291 -1576308 -1516546 200276 2099415 2644673 2212110
7471 2212110 2394978 3589762 4445054 3877179 2392681 903056 -560555 -2110524 -3012294
7462 -3012294 -2516031 -1026568 485943 1611293 2170134 1608804 -29173 -1195265 -433443
7453 -433443 1401878 2109050 1342023 1188525 3009783 5150991 4866414 1764153 -1655603
7444 -1655603 -2590645 -424147 3019705 4970283 3611141 -625993 -5132588 -6782896
7436 -6782896 -4259664 746798 4777561 5585552 4066373 2852534 2997557 2914179 1050136
7427A050136k527929p66031J247428R06799j091043j915608p65284L14549j20299
7418c667282p75311J10863J991613L016201K832113K636330K750111J962030k86997
7409A0569671k567602l233603k535489j923925j919358j804454j072411p4554
7401d561725O51793P54789o0966j485245k040066l41240K807112M682624L472998
7392C880074J14682k832116l366396j272801J626179K502130K57917k687414k939510
7383d717255m78000J556882J565178J260115J916360J953977J42278j596670j149645
7374D53220L31065P27022N62887J144874J151681j028033l116613j627938J977095
7365E75260K601767p88845l474275k019284J380849L255452L520872L513062K816248
$$ plain form
7427 1050136 -1477793 -2243824 -996396 -89597 -1180640 -3096248 -3861532 -3546983 -3667282
7418 -3667282 -4442593 -4331730 -2340117 676084 3508197 6144527 8894638 10856668 10569671
7409 10569671 8002069 4768466 2232977 309052 -1610306 -3414760 -4487171 -4561725
7401 -4561725 -3909932 -3155143 -3216109 -4701354 -6741420 -7082660 -4275548 407076 3880074
7392 3880074 3994756 1162640 -2203756 -3476557 -1850378 651752 909669 -1777745 -4717255
7383 -4717255 -5195255 -3638373 -2073195 -813080 1103280 3057257 3199535 1602865 453220
7374 453220 784285 1511307 2074194 3219068 4370749 3342716 226103 -1401835 575260
7365 575260 3177027 2388182 -1086093 -3105377 -1724528 1530924 5051796 8564858 11381106
7356A1381106Q00108j205296j818973j762040k098128k298398j879717j854335
7348g35673k662153k793207j400796q6300n4165J49589J702759K699497J140610
7339b039839j271028j410019P38770K768277L608433L625560K423388j98880k251015
7330E993647j832405m71114q99128k457022k287761l06634R48055R60792J492466
7321A140896K210790O99633k344604k630545J147366M446070L198308m75752j890691
7312E501471l57836J146576Q96334k66113j308254j777185r71308J086633K444432
7303F394750J358217q39566j314093J58876J032396l9663j460856j488028o59563
7294C142470l80729o58035n17685L00842J257630J987702K277042J516306o05346
$$ plain form
7356 11381106 12181214 10975918 9156945 7394905 5296777 2998379 1118662 -735673
7348 -735673 -3397826 -6191033 -7591829 -7678129 -7732294 -7582705 -5879946 -3180449 -2039839
7339 -2039839 -3310867 -4720886 -3982116 -1213839 2394594 6020154 8443542 8244662 5993647
7330 5993647 4161242 3690128 2791000 333978 -1953783 -2260417 -1312362 -351570 1140896
7321 1140896 3351686 4051319 1706715 -923830 223536 4669606 7867914 7392162 5501471
7312 5501471 5143635 6290211 7186545 6920432 5612178 3834993 2863685 3950318 6394750
7303 6394750 7752967 6913401 5599308 5758184 6790580 6750917 5290061 3802033 3142470
7294 3142470 2761741 2103706 1586021 1886863 3144493 5132195 7409237 8925543 8320197
7285H320197k902792l411925j785581l1507n5012j158900j144369M33858J631033
7276a04998J059537p1694Q2829J184306J408738L78656l77064J1503L81560n45695
7266C407678k053787k327090r51191N37602O70705j66559m50537L79128J329019
7257C74968J485043J318013J656266K160617J986557J320582O89412o80509l532421
7248F778528n760830l994569J064882M111729K076421j405602j242740J842603
7240C470422L015581P61012j547858j151243Q51806K113168J702068k49488k704899
7231F260569l312525q20248J924300P36095l660819n783583k818271J769684L606034
7222b098764K754871J515506L10208j227857j697792J49103K474082K322953l36534
$$ plain form
7285 8320197 5417405 2005480 219899 188392 133380 -1025520 -2169889 -1736031 -104998
7276 -104998 954539 882845 965674 2149980 3558718 3937374 3560310 3571813 3953373 3407678
7266 3407678 1353891 -973199 -1924390 -1386788 -716083 -882642 -1333179 -954051 374968
7257 374968 1860011 3178024 4834290 6994907 8981464 10302046 10991458 10310949 6778528
7248 6778528 1017698 -2976871 -1911989 2199740 4276161 2870559 1627819 3470422
7240 3470422 6486003 7247015 5699157 4547914 5399720 7512888 9214956 8965468 6260569
7231 6260569 2948044 2127796 4052096 4788191 1127372 -4656211 -7474482 -5704798 -2098764
7222 -2098764 656107 2171613 2481821 1253964 -443828 -294725 2179357 4502310 4165776
7213D165776k761033k727638n2548L794967N950029L817295j449088m849330l198494
7204B689936P60603K289395Q74467m50659m16531m88250j177552j063018K02622
7195C221013R36515J48405j100818j609378j375441p28486N7245J25071j161909
7186a487783k643232k395926n20207Q49286M98379n87484j113046j019950q16547
7177i236510p21002p44835o15734K61251J795649K691053K080726R11007L95094
7168c183301J88000k99864k29907Q44257J099683o94950j959183K83760L795107
7159a56398L480689p09416l155046q89587K221515J689869j400400l100389k044582
7150d063745O47830L900053O146368M985135N44303l034553k564626k18511P6608
$$ plain form
7213 4165776 1404743 -1322895 -1375443 2419524 8369553 12186848 10737760 5888430 2689936
7204 2689936 3450539 5739934 6614401 6163742 5747211 5258961 4081409 3018391 3221013
7195 3221013 4157528 4305933 3205115 1595737 220296 -508190 -450945 -325874 -1487783
7186 -1487783 -4131015 -6526941 -7047148 -6197862 -5699483 -6286967 -7400013 -8419963 -9236510
7177 -9236510 -9957512 -10702347 -11318081 -11056830 -9261181 -6570128 -4489402 -3578395 -3183301
7168 -3183301 -2995301 -3295165 -3525072 -2680815 -1581132 -2276082 -4235265 -3951505 -156398
7159 -156398 3324291 2614875 -540171 -1429758 791757 2481626 1081226 -2019163 -4063745
7150 -4063745 -3415915 484138 6630506 11615641 12159944 9125391 6560765 6342254 6418862
7141F418862j532448k131192j269912q50876r94991j64250J154786R04191n30602
7132A003568o42165O14510L79632k225487m339227l651023j318033O55759J993282
7123g529184K690804J868728j43725j063584J21673J355542P41716o02560q90730
7114c451320o86405j211695j567691l86684J216305J251818L49951O36149J820190
7105b029382J613323j13241q71530K39193R73985l13488k105147k410899j669046
7096f686232j131406l94839J221873K399984J517934k13961L0942K483587M244885
7087C472767L357896J206804K4108l9650p7457k51393j71671m41233j885802l589957
7077A604412l594752j746702j00323J32820L41092J992770L766732L150527L29699
$$ plain form
7141 6418862 4886414 2755222 1485310 634434 -360557 -524807 629979 1534170 1003568
7132 1003568 361403 975913 1355545 -869942 -5209169 -8860192 -10178225 -9522466 -7529184
7123 -7529184 -4838380 -2969652 -3113377 -4176961 -4055288 -2699746 -1958030 -2560590 -3451320
7114 -3451320 -4137725 -5349420 -6917111 -7303795 -6087490 -4835672 -4485721 -3849572 -2029382
7105 -2029382 -416059 -529300 -1400830 -1161637 -187652 -501140 -2606287 -5017186 -6686232
7096 -6686232 -7817638 -8212477 -6990604 -4590620 -3072686 -3286647 -3255705 -772118 3472767
7087 3472767 6830663 8037467 8061575 8021925 7944468 7693075 7521404 7080171 5194369 1604412
7077 1604412 -1990340 -3737042 -3837365 -3704545 -3363453 -1370683 2396049 5546576 5876275
7068E876275j670739r78875R38369J804737J398659O39874m85511k184267l263750
7059B074772k598956j488932j967784l043748j621221K396003N165036M356587
7051C271757K324137J721128J206810j124235k784514j37436M650858N254204
7043A4382709K73398m353061l782041n88859J96141j431706j892389m82836P5957
7034B397313j222691j987618l64269K225936L142714J542320j164373k646639
7026A922693j511701J030413J913296k8391k026567j039928J604208J957620o86640
7017C135003k888328k277328m11762N61230R66345J597947J376676n97961k539622
7008a077800k080241J98930J627538J164261J99789M1888M94020Q83291R55337
$$ plain form
7068 5876275 4205536 3226661 4165030 5969767 7368426 8008300 7522789 5338522 2074772
7059 2074772 -524184 -2013116 -3980900 -7024648 -8645869 -6249866 -1084830 3271757
7051 3271757 5595894 7317022 8523832 7399597 4615083 4477647 9128505 14382709
7043 14382709 14656107 10303046 6521005 5932146 6128287 4696581 2804192 2321356 2397313
7034 2397313 1174622 -812996 -1177265 1048671 4191385 5733705 4569332 1922693
7026 1922693 410992 1441405 3354701 3326310 1299743 259815 1864023 3821643 3135003
7017 3135003 246675 -2030653 -2442415 -1881185 -914840 683107 2059783 1461822 -1077800
7008 -1077800 -3158041 -2959111 -1331573 -167312 32477 74365 568385 1451676 2407013
6999B407013O55390J61075P1153O01377Q85861J05222j096545j503450j203234
6990A083862j152502j202249l26122J105555J248102l07399j373027k43306J503919
6981C36833J158220r86411j923237m36135J071243L72057j048223m65497J353377
6972e67773R99931j903483l266388m77308L051654K346687j780035l658829q47029
6963f102573K624876K375555l13728j125360Q22535K248752Q15115j786704k350272
6954b791804k3830L101563M384190L010626L61088j582602k021926j427845k83542
6945B725918J354268L017697L652300K725814P05861j764915m129663n265622
6937C021658m128779j521463M51649J290430K447481L918004L165782o05256l721559
$$ plain form
6999 2407013 3062403 3223478 3294631 3896008 4781869 4887091 3790546 2287096 1083862
6990 1083862 -68640 -1270889 -1597011 -491456 756646 449247 -923780 -1167086 336833
6981 336833 1495053 508642 -1414595 -1850730 -779487 -407430 -1455653 -1921150 -567773
6972 -567773 432158 -1471325 -4737713 -5215021 -2163367 183320 -1596715 -5255544 -6102573
6963 -6102573 -3477697 -1102142 -1415870 -2541230 -1718695 530057 1345172 -441532 -2791804
6954 -2791804 -2815634 285929 4670119 7680745 8041833 6459231 4437305 3009460 2725918
6945 2725918 4080186 7097883 10750183 13475997 14181858 12416943 8287280 3021658
6937 3021658 -1107121 -2628584 -2176935 -886505 1560976 5478980 8644762 8039506 4317947
6928D317947k611757P95402J823578p0906j270462l88283j15548j836662k790365
6919b147056p25334K132227K539924J094046O45686J663493K197635J375425M9977
6910H826023j477519l647187n587070n356400k770760j06183O68674l0117n90849
6901a0071388j89739R92857K422504L339549K997691J474261j77630j036985j219284
6892a468164j344413j480790j094493P745J066891J037294o4221q81839l10731
6883d532721R26862J188554L10067j84560M07692Q15678P7792o28629n4290N92447
6873a081108n31968k333143j775350J423855L779825K642288l86778j901189p97128
6864i60696J428765K974380K831946Q25428j913848l422132l124379k562643k770206
$$ plain form
6928 4317947 1706190 2501592 4325170 4254264 2983802 2595519 2479971 643309 -2147056
6919 -2147056 -2872390 -740163 1799761 2893807 3539493 5202986 7400621 8776046 8826023
6910 8826023 7348504 3701317 -1885753 -7242153 -10012913 -10119096 -9450422 -9480539 -10071388
6901 -10071388 -10261127 -9268270 -6845766 -3506217 -508526 965735 788105 -248880 -1468164
6892 -1468164 -2812577 -4293367 -5387860 -5380115 -4313224 -3275930 -3340151 -4221990 -4532721
6883 -4532721 -3605859 -2417305 -2107238 -2291798 -1884106 -1068428 -990636 -1619265 -1673555 -1081108
6873 -1081108 -1613076 -3946219 -5721569 -4297714 -517889 2124399 1737621 -163568 -960696
6864 -960696 468069 3442449 6274395 7099823 5185975 1763843 -1360536 -3923179 -6693385
6855f693385k446931m49895J541709J341742L5099M53796K493567L237192J777410
6846A290304M81058P26059P92433n84756j777012j410153j055579k193088k982579
6837f713313j212218J403943J404714j018238k356407j125484N35525P42420J63067
6828h175991j27210k21859q380J187314K663282K498232O56252m90015J09954
6819a908421M94132o94501j519103m5330J817848Q55009k180646l042805J81749
6810f042068M350497N186576K188421j380570k425549r80175M83575R653j929128
6801e38768l363960l027001j103805J493318L486841L447081J269680q60524r24029
6792a21167k74262j811186m723245m388273J019831O987071Q111110M602131P21449
$$ plain form
6855 -6693385 -9140316 -9590211 -8048502 -6706760 -6671661 -6217865 -3724298 -487106 1290304
6846 1290304 1771362 2497421 3289854 2705098 928086 -482067 -1537646 -3730734 -6713313
6837 -6713313 -7925531 -6521588 -5116874 -6135112 -8491519 -9617003 -9081478 -8339058 -8175991
6828 -8175991 -8303201 -8525060 -8533440 -7346126 -4682844 -2184612 -1528360 -2018375 -1908421
6819 -1908421 -1414289 -2108790 -3627893 -3673223 -1855375 -1000366 -3181012 -6223817 -6042068
6810 -6042068 -1691571 3495005 5683426 4302856 1877307 897132 1380707 1390360 -538768
6801 -538768 -3902728 -6929729 -8033534 -6540216 -3053375 393706 1663386 802862 -121167
6792 -121167 -395429 -2206615 -6929860 -11318133 -10298302 -3311231 4799879 9402010 10123459
6783A0123459j005140j007843r3666Q89033K10754k410952l783312j171921K761011
6774D511423L030756k92081k325503j025285L07886q62472k585490k745147k560998
6765d546911l044725k043460J696304M882410M095515J284969N61105J394552
6757D279759j94875m407750o572924m090752k95582M99006j195967j609194O54695
6748a2933584L047248K831951N73134q39971p800J185763K66484j963035j990964
6739i830774J441709M914280M575201J386120l02408J222820L153994K541809
6731I102751p5141k484966m023597n212808n640857m354278j904616p7207O17876
6722a4052843J571733L514599M698313L072426k80888j694392N34568L607353
$$ plain form
6783 10123459 9118319 8110476 8016810 8905843 9116597 6705645 2922333 1750412 4511423
6774 4511423 7542179 7250098 4924595 3899310 4207196 3344724 759234 -1985913 -4546911
6765 -4546911 -7591636 -9635096 -7938792 -3056382 1039133 2324102 2885207 4279759
6757 4279759 4084884 -322866 -6895790 -10986542 -11282124 -10783118 -11979085 -13588279 -12933584
6748 -12933584 -9886336 -7054385 -6481251 -7321222 -7329022 -6143259 -5876775 -7839810 -9830774
6739 -9830774 -8389065 -3474785 1100416 2486536 2184128 3406948 6560942 9102751
6731 9102751 9027610 6542644 2519047 -2693761 -8334618 -12688896 -14593512 -14670719 -14052843
6722 -14052843 -12481110 -8966511 -4268198 -1195772 -1476660 -3171052 -2636484 970869
6714I70869L590223M54073k098069j705755j15725l7205j177391j231587K75660
6705a074907J392072R07944M0053J89307O31529j28522j516226j181318J577104
6696H37036M148277L545208K72862k321367k519512k124673l001039l756548k052844
6687f972600J072440K221020Q00110r5656J168881K021383J00551k391912j826220
6678c902003J156833K606886J187526m35889l01725K19151m10933j164281p60308
6669a804743k94016j123906j846117k92380K236986J949750j759837m514332k435896
6660i884491K642019N635084M596224K046609M55971m97048j426701j089170J128020
6651C606517K774348J316630j609059k069971L74616J992501M70170j937498k161689
$$ plain form
6714 970869 4561092 5015165 2917096 1211341 1095616 1058411 -118980 -1350567 -1074907
6705 -1074907 317165 1225109 1265162 1454469 2085998 1957476 441250 -740068 837036
6696 837036 4985313 8530521 8803383 6482016 3962504 1837831 -1163208 -4919756 -6972600
6687 -6972600 -5900160 -3679140 -2879030 -2974686 -1805805 215578 316129 -2075783 -3902003
6678 -3902003 -2745170 -138284 1049242 613353 311628 530779 119846 -1044435 -1804743
6669 -1804743 -2098759 -3222665 -5068782 -5361162 -3124176 -1174426 -2934263 -7448595 -9884491
6660 -9884491 -7242472 -1607388 2988836 5035445 5491416 4994368 3567667 2478497 3606517
6651 3606517 6380865 7697495 6088436 4018465 4393081 6385582 6855752 4918254 2756565
6642B756565n86258L02919l85132j525031j914806j054781P70504J900907L79418
6633F44305k896767l949046o52087L822400M942306K710965P26882M43961j39671
6624E653248k102745l321945j713402J548044L389907K208553q32968l008939
6616A819753k394826J76939J898304J539099J067541K241291L194168J100040
6608A0642309k876037m689395l182933j201054o57005j76754J327374K317798
6600A504303J633825Q05355J279834J835604R04131o56014j211197r13671o50293
6591D531877k65802K09176n72605l038274n025332m481844k227225p6008J770060
6582i175977L213044K599679k99112j945431L42404L220225J564136l063163l719114
$$ plain form
6642 2756565 2170307 2473226 2088094 563063 -1351743 -2406524 -1636020 264887 644305
6633 644305 -2252462 -6201508 -6853595 -3031195 1911111 4622076 5348958 5792919 5653248
6624 5653248 3550503 228558 -1484844 63200 3453107 5661660 4828692 1819753
6616 1819753 -575073 -398134 1500170 3039269 4106810 6348101 9542269 10642309
6608 10642309 7766272 3076877 -106056 -1307110 -1964115 -2140869 -813495 1504303
6600 1504303 3138128 3943483 5223317 7058921 7963052 7307038 6095841 5182170 4531877
6591 4531877 4266075 4475251 3902646 864372 -4160960 -8642804 -10870029 -10946037 -9175977
6582 -9175977 -5962933 -3363254 -3662366 -5607797 -5265393 -2045168 -481032 -3544195 -7263309
6573g263309J614577O559263N245573l8611l149660k243189M1150J727099K704493
6564E197386K371294J08667k382105k639491j265841j150740k768368l355054
6556e884252j463706O58142O91356k35572L18590K186683L135517K432156J564351
6547C403265J526839J407537J85461j527086k339946j845488q52414l51848o76268
6538a069948j262096r75566Q14317L185680M232503L096839R92166j85865J51952
6529H979982J009892R76239p03868l516840n524102m579232p25472L061825L647297
6520B625721J113176j602315k259646j355003n79641n70939p99603q09539p70996
6511e008785j005904j284028o45445J602495M257126M433295P42538m140244n787140
$$ plain form
6573 -7263309 -5648732 910531 6156104 6117493 2967833 724644 765794 2492893 5197386
6564 5197386 7568680 7677347 5295242 2655751 1389910 239170 -2529198 -5884252
6556 -5884252 -7347958 -6689816 -5998460 -6234032 -5915442 -3728759 -593242 1838914 3403265
6547 3403265 4930104 6337641 6523102 4996016 2656070 810582 -41832 -393680 -1069948
6538 -1069948 -2332044 -3307610 -2493293 692387 4924890 8021729 9013895 8828030 8979982
6529 8979982 9989874 10966113 10262245 6745405 1221303 -3357929 -4083401 -1021576 2625721
6520 2625721 3738897 2136582 -123064 -1478067 -2057708 -2628647 -3428250 -4237789 -5008785
6511 -5008785 -6014689 -7298717 -7944162 -6341667 -2084541 2348754 3091292 -1048952 -6836092
6502f836092l025160R94736K964791K703279J592671L927j958129k742981p48536
6493g051494K993622N391787M624146J731282r40533j837474j055540k07645j140410
6484B507741l683384n034490k684794K201128N651988N218473K267211j91809
6476F252064q16767o55199j318221k838437l199767m71634M081781O082338K752386
6467I868544l105845n890933l844616n71999N02846M01746J616927L304980K503945
6458D785595p61228k832174j393370J521341K757699K206847J831065J914463
6450A0030238Q32166j644215l317385k680965j112128o17857r70602q71298p14822
6441a066868j805789l373034l076557p49423J012860Q00166K89257Q70798J102775
$$ plain form
6502 -6836092 -9861252 -8866516 -5901725 -3198446 -1605775 -1601848 -3559977 -6302958 -7051494
6493 -7051494 -4057872 1333915 5958061 7689343 6748810 4911336 3855796 3648151 2507741
6484 2507741 -1175643 -6210133 -8894927 -6693799 -1041811 4176662 6443873 6252064
6476 6252064 5435297 4780098 3461877 623440 -2576327 -3047961 1033820 7116158 9868544
6467 9868544 6762699 871766 -2972850 -3544849 -3042003 -2640257 -1023330 2281650 4785595
6458 4785595 4024367 1192193 -201177 1320164 4077863 6284710 8115775 10030238
6450 10030238 10862404 9218189 5900804 3219839 2107711 1489854 519252 -352046 -1066868
6441 -1066868 -2872657 -6245691 -9322248 -10071671 -9058811 -8258645 -7969388 -7098590 -5995815
6432e995815k84012j305683K76504K657397K341917j65473j028382O62064J511434
6423a330049l37889k053389q21729J715094K432146J457049R06145R23372K42530
6414C133280o74626l65915N94566M81986k15916L58724J472668L68647k698838
6405B454576l777275j019737K250510K444442O87318O7792L74996p62505k837853
6396a17736k607242O29477L437630L016474P87892l61970l06827j046880k969256
6387D61562l953124k335605O83624K338260J513057p1828j75912R81468J091082
6378E32584p70110k499206j841024M36533J926257K017417J667355O22430j987526
6369A04710m340158k940827J816310M664567K317871j709824k099267R31011K871108
$$ plain form
6432 -5995815 -6279827 -7585510 -7309006 -4651609 -2309692 -2475165 -3503547 -2841483 -1330049
6423 -1330049 -1667938 -3721327 -4543056 -2827962 -395816 1061233 1967378 2890750 3133280
6414 3133280 2458654 2092739 2687305 3169291 2953375 3312099 4784767 5153414 2454576
6405 2454576 -1322699 -2342436 -91926 2352516 3039834 3107626 3482622 2720117 -117736
6396 -117736 -2724978 -2095501 1342129 4358603 5146495 4784525 4477698 3430818 461562
6387 461562 -3491562 -5827167 -5143543 -2805283 -1292226 -1364054 -1539966 -558498 532584
6378 532584 -237526 -2736732 -4577756 -4141223 -2214966 -197549 1469806 2092236 104710
6369 104710 -4235448 -7176275 -5359965 -695398 1622473 -87351 -2186618 -1255607 1615501
6360A615501J803067J9614n06570k89940J06502J012229J596101K43029k165369
6351C434164k554754l76716J128663n7380j537401n34646J532122J423989o75194
6342A782847j435284O12741L008361K719134p8456k334711j772777L09888N45125
6333C356868j811370l135954l49761L701814L348432j484478m375244j515694
6325b265387K689404K319854j423589k742668j65228K044193Q72247j553742j854962
6316b079878J07912J848279J393471r22185k636643j331454K243637M202876K259687
6307E085702r80264j637625J03712J192342Q82210J094541K258203K544287J237369
6298A1780477n62903k574836n124580o338629l601695J605449M409736L115028
$$ plain form
6360 1615501 3418568 3438182 2931612 2641672 2748174 3760403 5356504 5599533 3434164
6351 3434164 879410 502694 1631357 1573977 36576 -498070 1034052 2458041 1782847
6342 1782847 347563 960304 3968665 6687799 6609343 4274632 2501855 2811743 3356868
6333 3356868 1545498 -1590456 -1940217 1761597 5110029 3625551 -749693 -2265387
6325 -2265387 424017 2743871 1320282 -1422386 -1587614 456579 1328826 -224916 -2079878
6316 -2079878 -1971966 -123687 1269784 347599 -2289044 -3620498 -1376861 2826015 5085702
6307 5085702 4105438 2467813 2571525 3763867 4646077 5740618 7998821 10543108 11780477
6298 11780477 11217574 8642738 3518158 -2820471 -6422166 -4816717 -406981 2708047
6290B708047J076626Q04812N43639j295899k610737j432619L16312J18838j077089
6281h48070j272904j071296j554917j239513J034545K543580L30808l299769l510929
6272h888465j79463K199572J578546O91016J670779K620589J181742j710915l493306
6263d329905l141388j263616J046753K339713J652543K13011M29503K254764K655860
6254A857238m446l144126l330142q07180J429164J860914J411901Q49632k22295
6245i9340j539135j603186Q9240J867196K156867J703946K018947K541232J445846
6236H581613r00146j733751k3274J513546L65842j709033j372550O98050N12235
6227E932532k797082n071160l227512Q3090O08052j179412j344404J122931K836712
$$ plain form
6290 2708047 3784673 4589485 5133124 3837225 1226488 -206131 110181 229019 -848070
6281 -848070 -2120974 -3192270 -4747187 -5986700 -4952155 -2408575 -2077767 -5377536 -8888465
6272 -8888465 -9067928 -6868356 -5289810 -4598794 -2928015 -307426 874316 -836599 -4329905
6263 -4329905 -7471293 -8734909 -7688156 -5348443 -3695900 -3482889 -3053386 -798622 1857238
6254 1857238 1852792 -1291334 -4621476 -5428656 -3999492 -2138578 -726677 122955 -99340
6245 -99340 -1638475 -3241661 -3152421 -1285225 871642 2575588 4594535 7135767 8581613
6236 8581613 7681467 5947716 5924442 7437988 7803830 6094797 4722247 5420297 5932532
6227 5932532 3135450 -1935710 -5163222 -5080132 -4472080 -5651492 -6995896 -5872965 -3036253
6218c036253J124040k389472m307773l493045j324334P17545K359437L860322
6210f489533M957150M730648K550442q31449l494832l938677k193518N90621K911014
6201a208134L324610J484929p66624q87394R85002J844546J44885j725439j199103
6192A997278K60436m12527k623255k838672k45270J957082J571615L65171N58512
6183E90370J195355J90199j907150k601857j029635J178819K303576K222983J664522
6174C807182R80864Q1600r66769j694839j678745j175587q98642q78052k36614
6165b659602J113372J382686q82960l829076l647287M76181M658020M821294J491503
6156B924131j483391k004364j526712j998807l029928k937319j321184N94255
$$ plain form
6218 -3036253 -1912213 -4301685 -8609458 -12102503 -13426837 -12709292 -10349855 -6489533
6210 -6489533 -1532383 3198265 5748707 4917258 1422426 -2516251 -4709769 -4119148 -1208134
6201 -1208134 2116476 3601405 2834781 1947387 2932389 4776935 4921820 3196381 1997278
6192 1997278 2257714 1845187 -778068 -3616740 -3862010 -1904928 -333313 31858 590370
6183 590370 1785725 1975924 68774 -2533083 -3562718 -2383899 -80323 2142660 3807182
6174 3807182 4788046 4869646 3902877 2208038 529293 -646294 -1544936 -2422988 -2659602
6165 -2659602 -1546230 -163544 -1046504 -4875580 -8522867 -8046686 -3388666 1432628 2924131
6156 2924131 1440740 -563624 -2090336 -4089143 -7119071 -10056390 -11377574 -10783319
6148a0783319J602764J382328K4926k008416l322720k388384L42063K307397J909584
6139a0933777O17731O05012J478127J484394J021748J949367L552716K728355
6131B503673q25711l069568j232082K015840K524955K95594j746316k445573k577444
6122d556632j957082k6882J595245P20068j639262k344154p74746O88538P07354
6113g587553M50295R40050J798838K719087L532177L088942R28288n81705P02450
6104E990869K165945n55338o046382p835128l799762N49348N55135j005395N27740
6095i452968L938865M642560K107780j9867K58251J504286K088576J755646M71930
6086G295059j397674k293978j335395k36989r44746k272129j545306J097101K779912
$$ plain form
6148 -10783319 -9180555 -7798227 -7773301 -9781717 -13104437 -15492821 -15150758 -12843361 -10933777
6139 -10933777 -10316046 -9711034 -8232907 -6748513 -5726765 -3777398 -224682 2503673
6131 2503673 1677962 -1391606 -2623688 -607848 1917107 2212701 466385 -1979188 -4556632
6122 -4556632 -6513714 -6540596 -4945351 -4225283 -5864545 -8208699 -8983445 -8294907 -7587553
6113 -7587553 -7137258 -6197208 -4398370 -1679283 1852894 4941836 5870124 5288419 5990869
6104 5990869 8156814 7601476 1555094 -6280034 -10079796 -9530448 -8975313 -9980708 -9452968
6095 -9452968 -5514103 -871543 1236237 1216370 1474621 2978907 5067483 6823129 7295059
6086 7295059 5897385 3603407 2268012 2031023 1086277 -1185852 -2731158 -1634057 1145855
6077A145855J979095J00003r17417m92541R35692K298306K192903M23114j177989
6068F487021r30674M16457J078051Q12889L46172n24086k058562k971165k153960
6059E02143j038790j632123l053799k846036j033422J59446J78392M74720J124405
6050g165064O07181o59245j44868K365927L528195J354234j422485j098067J887108
6041g47084L849194K668068k82441k386721k444244j259624m32462n32760n08471
6032b076545N89452J847526J790626R91648J355110K698049K389884p23533m112499
6023D749718m651424k423517r0822L80660q66868k436984k719933q53378K228036
6014f684512M210436L670459J436258p58410k086646k503164j908045n00470P19404
$$ plain form
6077 1145855 3124950 3224953 2307536 1814995 2750687 5048993 7241896 7665010 6487021
6068 6487021 5556347 5972804 7050855 7863744 8209916 7685830 5627268 2656103 502143
6059 502143 -536647 -2168770 -5222569 -8068605 -9102027 -8942581 -8764189 -8289469 -7165064
6050 -7165064 -6557883 -7217128 -7361996 -4996069 -1467874 -113640 -1536125 -2634192 -747084
6041 -747084 3102110 5770178 5487737 3101016 656772 -602852 -1035314 -1568074 -2076545
6032 -2076545 -1487093 360433 2151059 3142707 4497817 7195866 9585750 8862217 4749718
6023 4749718 98294 -2325223 -2416045 -2035385 -2902253 -5339237 -8059170 -8912548 -6684512
6014 -6684512 -2474076 1196383 2632641 1874231 -212415 -2715579 -4623624 -5124094 -4404690
6005d404690Q54922J98860k75193j11670N12595J365206K161516K366929J693505
5996D361980O49918R1504K58980N39737J59977r49644j917633j706876l02096
5987A185847J152904J650580J311904P47125J07888o00457r97557r65452j074187
5978B518595j431118j047630L57031R90934o68729k933277k639541L79439K945369
5969a528927K840404J105840m39964j571467k561495k848349k133509j223258
5961h360725o09858L42730J774202K456095J744818R04488J098515J417551M62380
5952A230196j243281k114783j959682j828850j868921j042795R36107K756784
5944e135225L037389J922546P13312K57078J61833k19214l76477Q69367L135770
$$ plain form
6005 -4404690 -3549768 -3350908 -3626101 -3737771 -3225176 -1859970 301546 2668475 4361980
5996 4361980 5011898 5103402 5362382 5902119 6062096 5112452 3194819 1487943 1185847
5987 1185847 2338751 3989331 5301235 6048360 6156248 5555791 4558234 3592782 2518595
5978 2518595 1087477 39847 396878 1387812 719083 -2214194 -4853735 -4474296 -1528927
5969 -1528927 1311477 2417317 1977353 405886 -2155609 -5003958 -7137467 -8360725
5961 -8360725 -8970583 -8627853 -6853651 -4397556 -2652738 -1748250 -649735 767816 1230196
5952 1230196 -13085 -2127868 -4087550 -5916400 -7785321 -8828116 -7892009 -5135225
5944 -5135225 -2097836 -175290 538022 795100 956933 737719 361242 1230609 4366379
5935D366379L973638J825494j467747k828325j929647r49939p85053j17594J462448
5926C549654K094001M71324k029119l195755k392851m04763J477776J763353J37059
5917A470679j078587P32048M131996M555983N95667l825069n070071m182088l518150
5908f187592k560918k17466J807115J716148J238238K531751L643914J581205
5900C552395j741758j729626J415500K716285K20773k356592k037653q34545j395476
5891b190697k442418j513340O36847J462220N95980l42083o23820o27502m5118
5882e089931J719243L536244L018046l59543l776100l704478L5840L591340L151077
5873B121738n90560l318825k540232j65289J221043K093031L701975M368758J662691
$$ plain form
5935 4366379 8340017 10165511 8697764 5869439 3939792 2989853 2204800 2087206 3549654
5926 3549654 5643655 6114979 4085860 890105 -1502746 -1907509 -429733 1333620 1470679
5917 1470679 392092 1124140 5256136 9812119 10407786 6582717 1512646 -2669442 -6187592
5908 -6187592 -8748510 -8965976 -7158861 -5442713 -4204475 -1672724 1971190 3552395
5900 3552395 1810637 81011 1496511 4212796 4433569 2076977 39324 -795221 -2190697
5891 -2190697 -4633115 -6146455 -5509608 -4047388 -3451408 -3793491 -4417311 -5044813 -5089931
5882 -5089931 -3370688 165556 3183602 2824059 -952041 -4656519 -4620679 -1029339 2121738
5873 2121738 1531178 -1787647 -4327879 -4493168 -3272125 -1179094 2522881 6891639 8554330
5864H554330k830016m772735k912251j00307J448353K159762K160553N30945j552415
5855B686219j139802J417120J788006j750190m896910l260692J653524N340321
5847A837596O042034M458325Q86585l500671n180062k355772J417633J820038
5839E425706J13226M35180K464009K103477j200530l400121k548163j329129j669427
5830C94228j652497K80813K274298K465534J857568J557517N81909j186353j264364
5821E308653J308139L208365J529352j422157j708491J10435N79257n47149m24387
5812G942017J241074J364991j108194l153632k447791p49407o08909j483552j386487
5803c89890l80858l595l70577r0654J328410K628170K321093K01309k353050l085936
$$ plain form
5864 8554330 5724314 951579 -1960672 -2060979 -612626 1547136 3707689 4238634 2686219
5855 2686219 1546417 2963537 4751543 3001353 -1895557 -5156249 -3502725 1837596
5847 1837596 7879630 12337955 13224540 9723869 4543807 2188035 3605668 5425706
5839 5425706 5538932 5974112 8438121 10541598 9341068 5940947 3392784 2063655 394228
5830 394228 -1258269 -977456 1296842 3762376 5619944 7177461 7759370 6573017 5308653
5821 5308653 6616792 9825157 11354509 9932352 8223861 8334296 8913553 8366404 7942017
5812 7942017 9183091 10548082 9439888 6286256 3838465 3089058 2480149 996597 -389890
5803 -389890 -770748 -774343 -1144920 -1235574 92836 2721006 5042099 5243408 2890358 -195578
5793a95578p10252L187018N022076L012902p15270k843093k671686j832035j215226
5784A038856l08807P64168R08493J65627k9633M36333m15590l123118m489245
5775e052916j469982L676537N328297J834565k209091k353959j02735K22307j713718
5766a840695k329979m57887N50439j635146m139265k903521J306144M056129L331368
5757d062413J289487J69330l97913j303269j918820j497440o24542J01985J158284
5748g085311K481940K456887K67307k124870k381061j136377p62061j497381j292237
5739a1073164O02354K388389K615383K127505K132963K186965J473185O82500
5731C136080R32114J603088R92008j032062k548735k103647n05315N70360Q45946
$$ plain form
5793 -195578 -905830 2281188 7303264 10316166 9600896 6757803 4086117 2254082 1038856
5784 1038856 730049 1494217 2402710 2568337 2538704 2975037 2559447 -563671 -5052916
5775 -5052916 -6522898 -2846361 2481936 4316501 2107410 -246549 -349284 -126977 -1840695
5766 -1840695 -4170674 -4628561 -4078122 -5713268 -9852533 -12756054 -11449910 -7393781 -4062413
5757 -4062413 -2772926 -2603596 -3001509 -4304778 -6223598 -7721038 -8345580 -8243595 -7085311
5748 -7085311 -4603371 -2146484 -1879177 -4004047 -6385108 -7521485 -8283546 -9780927 -11073164
5739 -11073164 -10470810 -8082421 -5467038 -3339533 -1206570 980395 2453580 3136080
5731 3136080 4068194 5671282 6663290 5631228 3082493 978846 473531 1043891 1889837
5722A889837J202880J628037R29762j097282k728981k701602k274308l028910
5714f180567l552033j092251L506395N822449L931464J185377Q42249J152309
5706E615392q87170l547226k644300J534033M358664L660411J737523K05386k258046
5697G774667n623793o680232l933108m40145R46904J624640L540218M891139L237864
5688E338154J52550j267219j372418k305510l174638j473800J663008K299318
5680a40555l00908k739507k837440j921237j170768L31176K653400L683891K474867
5671C2919J043632J083300J382769L74126r15274n52908J095220J774561K67471
5662E585816k310729l716593k654060k51634P53328o22153j753565K07504L808577
$$ plain form
5722 1889837 3092717 4720754 5650516 4553234 1824253 -877349 -3151657 -6180567
5714 -6180567 -9732600 -10824851 -7318456 -1496007 2435457 3620834 4463083 5615392
5706 5615392 4728222 1180996 -1463304 70729 4429393 8089804 9827327 10032713 7774667
5697 7774667 2150874 -4529358 -8462466 -8902611 -7955707 -6331067 -2790849 2100290 5338154
5688 5338154 5490704 4223485 2851067 545557 -2629081 -4102881 -2439873 -140555
5680 -140555 -441463 -3180970 -6018410 -7939647 -9110415 -8779239 -6125839 -2441948 32919
5671 32919 1076551 2159851 3542620 3916746 3001472 2448564 3543784 5318345 5585816
5662 5585816 3275087 -441506 -3095566 -3347200 -2593872 -3216025 -4969590 -4762086 -953509
5653i53509M869303K358029m78655j181274p87751n31518M88059K497039L243879
5644I523602J422131q66378j517679j596738k390914k115025Q08861L376628J295915
5635G940403m213311p114118m240981J160456M129027L270149N46449j639219
5627a61145j918537k47534K068442L365685K971494J118352j711707m190675m064600
5618b770225q28622K211542J169491l143300n737324l682050N83030K914939K163197
5609g119322J04372j279563j010191Q20567K639730K200146o79368k989354j643963
5600h956946K646686N876245N079559J298426j850211j981053j48021N53862j502912
5591A015635m559183n324164k531597J811226M506841L915111Q98114k075898
$$ plain form
5653 -953509 3915794 6273823 5795168 4613894 3826143 3294625 3782684 6279723 9523602
5644 9523602 10945733 10079355 8561676 6964938 4574024 2458999 3267860 6644488 7940403
5635 7940403 3727092 -3387026 -7628007 -6467551 -2338524 931625 1478074 -161145
5627 -161145 -2079682 -2327216 -258774 3106911 6078405 7196757 5485050 1294375 -2770225
5618 -2770225 -3598847 -1387305 -217814 -3361114 -9098438 -12780488 -12197458 -9282519 -7119322
5609 -7119322 -7014950 -8294513 -9304704 -8484137 -5844407 -3644261 -4323629 -7312983 -8956946
5600 -8956946 -6310260 -434015 4645544 5943970 4093759 2112706 1964685 2518547 1015635
5591 1015635 -3543548 -8867712 -11399309 -9588083 -5081242 -1166131 -268017 -2343915
5583b343915k719794o51439K345603M110970M021286K761836Q84537j278656k666473
5574D463955k042657J79582J969559K090821J400869J081363O10670j352318m435667
5565C966177o073128m081949N83142M261155M164889J210899j425801k251922
5557C53462k495994l023754k416646L22560L015230K809223M65339o66915L77754
5548a259741J212432L97925l87872L48153J176834J83629j821644k568236j529936
5539d248456n6453P92875R65435O35585L8419l76925m66455m28107Q5951J625826
5529a432305L194824K666397j8667k054080j629882m95317p05848j021696O59235
5520h37339L100479L390726J646307L77266j22024j677426l655214l006272J81286
$$ plain form
5583 -2343915 -5063709 -5715148 -3369545 741425 4762711 7524547 8409084 7130428 4463955
5574 4463955 2421298 2600880 4570439 6661260 8062129 9143492 9754162 8401844 3966177
5565 3966177 -2106951 -6188900 -5605758 -1344603 2820286 4031185 2605384 353462
5557 353462 -2142532 -5166286 -7582932 -7260372 -4245142 -1435919 -970580 -1637495 -1259741
5548 -1259741 -47309 350616 -37256 310897 1487731 1671360 -150284 -2718520 -4248456
5539 -4248456 -4304909 -3512034 -2546599 -1911014 -1872595 -2249520 -2715975 -3144082 -3058131 -1432305
5529 -1432305 1762519 4428916 4410249 2356169 726287 230970 -474878 -1496574 -837339
5520 -837339 2263140 5653866 7300173 7677439 7555415 5877989 2222775 -783497 -602211
5511f02211J668013m73303k542967j116313J504727J386111n60063o29779J150901
5502b14884J424052l68700j067630O84125K376636K105256J178077P79897k88422
5493F608407k480334l458279j869759l83652j765561m057419l275015M08687K958304
5484g314621K483386J241358J311423J737504J082488j03437r30400j918565l300237
5475e711101l460896j094771K345431M221488L814446K242572L05715j673124
5467I89760k645726j744415k32298l72411k051960k578352n63875J869881K018389
5458e311007K87906o38493N09493K408674L336545K923729J562072m34078k403940
5449B240901l177941k279462p03872K70848N42589P13509P81265L73686j44581
$$ plain form
5511 -602211 1065802 592499 -1950468 -3066781 -1562054 -175943 -736006 -1365785 -214884
5502 -214884 1209168 840468 -227162 456963 2833599 4938855 6116932 6896829 6608407
5493 6608407 4128073 669794 -1199965 -1583617 -3349178 -7406597 -10681612 -10272925 -7314621
5484 -7314621 -4831235 -3589877 -2278454 -540950 541538 438101 -492299 -2410864 -5711101
5475 -5711101 -9171997 -10266768 -7921337 -3699849 114597 2357169 2662884 989760
5467 989760 -1655966 -3400381 -3632679 -4005090 -6057050 -8635402 -9199277 -7329396 -5311007
5458 -5311007 -5023101 -5661594 -5152101 -2743427 593118 3516847 5078919 4644841 2240901
5449 2240901 -937040 -3216502 -3920374 -3649526 -3106937 -2393428 -1612163 -1238477 -1383058
5440a383058j11412Q1833m28431j049650k27251J708596K347659R57196J33306
5431B028788J672695K920222M04541m111196n139674j189730K886052K593867
5423B065565n08550j969954o02525J255746J810470J242882R7172j080725j084801
5414A225280N05561J657534J52886k726877l488658j555855j54314j173635k132597
5405g690675k81841K607674K491536r43059l570966k345033J050780L062964K742340
5396b876280J701416R41285j00919j602813k482245j994223p36542N60362J909759
5387d680200L010930K785628J124315k45429p9097M42707k10722j191183q03373
5378A53576L91459P20444P43922K135905L657520K215562j588450l182122p37818
$$ plain form
5440 -1383058 -1494470 -1412637 -1841068 -2890718 -3117969 -1409373 938286 1895482 2028788
5431 2028788 3701483 6621705 7026246 2915050 -2224624 -3414354 -528302 2065565
5423 2065565 1557015 -412939 -1015464 240282 2050752 3293634 3390806 2310081 1225280
5414 1225280 1730841 3388375 3541261 814384 -2674274 -4230129 -4384443 -5558078 -7690675
5405 -7690675 -7972516 -5364842 -2873306 -3816365 -7387331 -9732364 -8681584 -5618620 -2876280
5396 -2876280 -1174864 -233579 -334498 -1937311 -4419556 -6413779 -7150321 -6589959 -4680200
5387 -4680200 -1669270 1116358 2240673 1995244 1916147 2358854 2148132 956949 153576
5378 153576 545035 1265479 2009401 4145306 7802826 10018388 8429938 5247816 4509998
5369D509998J924800J382415l78879j25314R51758j87678k657626k936399o52487
5360A830588J085668O06878o94454j386794j464893r36719K59664J163364J013304
5351A476606Q33230J381373R13775j853859m069412k119302K253902L764567J269497
5342C850377j045118m64339J064999J487558J645074K084633J197848j350933
5334H470099l093620k762113k380754l366583l978057k734554r71302J69217J796529
5325h851138L988451M118999J296935j049807k45160J289385L09224j727996j401916
5316b273023R80213K542885K570326K101977Q60048j330893k098011M9138J718995
5307E121655r46489n295399n166775k83554L208341K060208n6121M90479J714453
$$ plain form
5369 4509998 6434798 7817213 7438334 7313020 8264778 8077100 5419474 2483075 1830588
5360 1830588 2916256 3523134 2828680 1441886 -23007 -959726 -700062 463302 1476606
5351 1476606 2309836 3691209 4604984 2751125 -1318287 -3437589 -1183687 2580880 3850377
5342 3850377 2805259 2340920 3405919 4893477 6538551 8623184 9821032 8470099
5334 8470099 5376479 2614366 233612 -3132971 -7111028 -9845582 -10816884 -10647667 -8851138
5325 -8851138 -4862687 -743688 553247 -496560 -741720 547665 856889 -871107 -2273023
5316 -2273023 -1292810 1250075 3820401 5922378 6782426 5451533 3353522 3402660 5121655
5307 5121655 4175166 -1120233 -6287008 -6570562 -3362221 -1302013 -1358134 -867655 846798
5298H46798L81494k204372k461570q9142J987822J915551N24328o86571j251392
5289a037054j625165k354157l131830k587778J00640L455752M877514L623716
5281A321638J262868o61362j701736j495645K0975J167162k39956l443208m850587
5272h619851k633163Q74888K555497K231829J527416R33510K2793p37924n59551
5263d404556p4774n44511j508533j026582J373967L420511K684930k20701k130973
5254b431222j126520J109841J525994l65123k165186k022465n50616J068801K682242
5245b274254L693388K363931j292908l947436l037872p58150p00251j958612p73549
5236h685713K592900L626661J007497p82578J403049M128087K814998j052659
$$ plain form
5298 846798 1228292 -976080 -3437650 -3526792 -1538970 376581 900909 214338 -1037054
5289 -1037054 -2662219 -5016376 -8148206 -10735984 -10635344 -7179592 -2302078 1321638
5281 1321638 2584506 1923144 221408 -1274237 -1253262 -86100 -326056 -3769264 -8619851
5272 -8619851 -11253014 -10378126 -7822629 -5590800 -4063384 -3129874 -3107081 -3845005 -4404556
5263 -4404556 -4479330 -5023841 -6532374 -7558956 -6184989 -2764478 -79548 -300249 -2431222
5254 -2431222 -3557742 -2447901 -921907 -1287030 -3452216 -5474681 -6025297 -4956496 -2274254
5245 -2274254 1419134 3783065 2490157 -1457279 -4495151 -5253301 -5953552 -7912164 -8685713
5236 -8685713 -6092813 -2466152 -1458655 -2241233 -838184 3289903 6104901 5052242
5228E052242k614904j334539j031734k819463l015207N96330M428344L718061
5220B979130p62651l645906j985690J346819J934467n08456k445041j717923k06295
5211e011546m97451j702198o59032L179651O365926N705193K182036o75553j275848
5202G611178j171614k124482l629416l941819k541801o56622L13713R6942o27670
5193f671591r28082q9123J681854K730816J344891j593280k790160q36799J198073
5184e953401j03000k974099k579622J537320M305049K595118l15465j55430K141421
5175a502109K965395J830757Q08747L13396n48119r80017J30284J039052n72782
5166C484604l042969k688752K19028J831193R30475K31798J095805J527414M69167
$$ plain form
5228 5052242 2437338 1102799 71065 -2748398 -5763605 -5167275 -738931 2979130
5220 2979130 2216479 -1429427 -3415117 -2068298 -133831 -642287 -3087328 -4805251 -5011546
5211 -5011546 -5508997 -7211195 -7870227 -4690576 1675350 7380543 9562579 8887026 7611178
5202 7611178 6439564 4315082 685666 -3256153 -5797954 -6454576 -6140863 -6043921 -6671591
5193 -6671591 -7599673 -7688796 -6006942 -3276126 -1931235 -3524515 -6314675 -7151474 -5953401
5184 -5953401 -6056401 -9030500 -11610122 -10072802 -5767753 -3172635 -3488100 -3643530 -1502109
5175 -1502109 1463286 3294043 4102790 4416186 3868067 2888050 3018334 4057386 3484604
5166 3484604 441635 -2247117 -2028089 -196896 733579 965377 2061182 3588596 4057763
5157D057763k78865M3391o10917l010021m387345k538522P55832K543336K434493
5148i90855J676418Q66696L03833M42225O03387n72405k379068k357677l48489
5139b755935P88423k52855j199874l37204P48686N83128N68788J830700K406990
5130B380847M40965k411557l476810k590250p36947K099785N061865N264384J724541
5121G756823k046673k632299j490071j770790k850930k033540K68403J320440
5113c478637P47837L59658K56273r31888k558376k492807p96470N06171Q70268
5104g517971J200483J087159l74175j600248k33000K374463K377986o20731k820346
5095f126380k034735l64170k932k05266n8657p04366k509598l028396n52671K528671
$$ plain form
5157 4057763 3778898 3822289 3211372 201351 -4185994 -6724516 -5968684 -3425348 -990855
5148 -990855 685563 1552259 1856092 2298317 2901704 2329299 -49769 -2407446 -2755935
5139 -2755935 -1967512 -2220367 -3420241 -3757445 -3008759 -2425631 -1856843 -26143 2380847
5130 2380847 2821812 410255 -3066555 -5656805 -6393752 -4293967 767898 6032282 7756823
5121 7756823 5710150 3077851 1587780 -183010 -3033940 -5067480 -4799077 -3478637
5113 -3478637 -2730800 -2371142 -2114869 -3046757 -5605133 -8097940 -8894410 -8388239 -7517971
5104 -7517971 -6317488 -5230329 -5604504 -7204752 -7437752 -5063289 -2685303 -3306034 -6126380
5095 -6126380 -8161115 -8525285 -8528217 -8733483 -8792140 -9496506 -12006104 -15034500 -15587171 -13058500
5085a3058500K882404J209426R00864K423970K472967n97543l493363k213871
5077i473646K219532N086797M515400L409230L850543L068871j944319q211404
5069B521004r606047n247761m55491J119409J530767L147990M088280K180497
5061g21352l89729l77265J237617J275849j80767l07620J544966L001963K272203
5052G355865j35805k777001m161581l175389n86958J049196P34659N08000J759909
5043E70895K543485J095115n98823o897J535110J227111m57095j201775j083890
5034C623236j460830j515206o8970R81436m90329k314913j234719R41657j16806
5025a655444l585449m303303j154460J332261N26265p90026N6896J607701J753427
$$ plain form
5085 -13058500 -10176096 -8966670 -8065806 -5641836 -3168869 -3766412 -7259775 -9473646
5077 -9473646 -7254114 -2167317 2348083 5757313 9607856 12676727 10732408 2521004
5069 2521004 -7085043 -12332804 -12788295 -11668886 -10138119 -6990129 -2901849 -721352
5061 -721352 -1111081 -1488346 -250729 1025120 844353 536733 2081699 5083662 7355865
5052 7355865 7220060 4443059 281478 -2893911 -3480869 -2431673 -1697014 -1189014 570895
5043 570895 3114380 4209495 3610672 3603775 5138885 6365996 5908901 4707126 3623236
5034 3623236 2162406 647200 578230 1559666 1069337 -1245576 -2480295 -1538638 -1655444
5025 -1655444 -5240893 -9544196 -10698656 -9366395 -8840130 -9630156 -9573260 -7965559 -6212132
5016f212132J090110P65368L03284p52144j742513k400874k883457k153445O22070
5007a3363733L257161K768468K94915k23448J697800K562935R77174m30253l5495
4998b494476M55724j4176Q854Q61577N59463j018347q74070K046152M247162K543566
4988F321429j467467m013818l832726k420185j513782j631026j758381k85660
4980a0601616K397488L333632J177371r81226j96110J285782l2094k344913j650003
4971g611689O45604P4488k235665j021545L239854M179735K03205k928060j969096
4962g423169n21673j030853n74090K001238K491104j007609l861777k583828k28017
4953a2738674M9467L19202K371767L256468J047029q81417M3803J057595P9065
$$ plain form
5016 -6212132 -5122022 -4356654 -4053370 -4805514 -6548027 -8948901 -11832358 -13985803 -13363733
5007 -13363733 -10106572 -7338104 -7043189 -7266637 -5568837 -3005902 -2028728 -2458981 -2494476
4998 -2494476 -2038752 -2052928 -2044074 -1182497 -623034 -1641381 -2515451 -469299 3777863 6321429
4988 6321429 4853962 840144 -2992582 -5412767 -6926549 -8557575 -10315956 -10601616
4980 -10601616 -8204128 -4870496 -3693125 -4674351 -4870461 -3584679 -3616773 -5961686 -7611689
4971 -7611689 -6966085 -6891597 -9127262 -10148807 -6908953 -2729218 -2526013 -5454073 -7423169
4962 -7423169 -7944842 -8975695 -9549785 -7548547 -5057443 -6065052 -9926829 -12510657 -12738674
4953 -12738674 -12689207 -12370005 -9998238 -6741770 -5694741 -6576158 -6532355 -5474760 -5395695
4944e395695R2260K717516L726335L32626l105350k319454j98424p34547j683188
4935f567921L20335K572083R28773k802660m373151l877525l298868j592577K081589
4926a6609922M469795L051174N73689r5063p95939k970364l348655o4107K697177
4917a3092215J697002L64911J986819L592924K399294J412595K518541J535763
4909B415634l148343n083094l61258M572609L725772J451903K862916L650030
4901A0086169o61689m650105k961387r86258m187887o550261k076711K349010
4893i639119q02117n006499j987736K009886j663393o726156m181194k47454l191424
4884c1435206n087948K067062O442058k785967j0763792k682911L723527j1528102
$$ plain form
4944 -5395695 -5303435 -2585919 1140416 1473042 -1632308 -3951762 -4150186 -4884733 -6567921
4935 -6567921 -6247586 -3675503 -2746730 -5549390 -9922541 -13800066 -17098934 -18691511 -16609922
4926 -16609922 -12140127 -9088953 -8515264 -8610327 -9406266 -12376630 -15725285 -15789392 -13092215
4917 -13092215 -11395213 -11030302 -9043483 -5450559 -3051265 -1638670 879871 2415634
4909 2415634 -732709 -5815803 -6177061 -1604452 2121320 3573223 6436139 10086169
4901 10086169 9424480 4774375 1812988 826730 -3361157 -9911418 -11988129 -9639119
4893 -9639119 -10441236 -15447735 -17435471 -15425585 -17088978 -23815134 -27996328 -28243782 -31435206
4884 -31435206 -36523154 -34456092 -28014034 -30800001 -41563793 -44246704 -40523177 -52051279
4876e2051279k6952897j5465826p911243n3607520j17493674r6949231K9949577
4869c40482093J47375146J44212030N4773715n634644P70464J6516259L154349
4862B0685226j1166879j280380J0976496M040017n995185j000177O565379J486164
4854B4310661n750812j763486M411117N69121n579644k625429L366077K202641
4846A9140246j622269k25473J659258k341164o056593k512896J769899j428236
4838H382772o546515m569773P33191P47593k133594k52126M518888M822224J415624
4829G118284O88474K656520K227012p58320k113234j178090l57010J67068Q22979
4820I273683l10985l074170k840228J587179L675451o43171m924959k128875L565429
$$ plain form
4876 -52051279 -79004176 -94470002 -102381245 -155988765 -273482439 -370431670 -340482093
4869 -340482093 -193106947 -48894917 5878798 244154 1014618 17530877 20685226
4862 20685226 9518347 8237967 19214463 23254480 17259295 16259118 22824497 24310661
4854 24310661 18559849 16796363 21207480 21776601 16196957 13571528 16937605 19140246
4846 19140246 17517977 17292504 18951762 16610598 10554005 8041109 9811008 8382772
4838 8382772 1836257 -2733516 -2000325 -1252732 -3386326 -3638452 880436 5702660 7118284
4829 7118284 7806758 10463278 12690290 11931970 9818736 8640646 8283636 8450704 9273683
4820 9273683 8962698 5888528 3048300 4635479 8310930 7667759 2742800 613925 4179354
4811D179354L706815q57445k863476j122984m19029j483316n23092K389945K969324
4802E976096N35216j051594k95047L17374m38045j125462j333722j902450j858078
4793a175712M05738L346017L691027J143677j660120k922431k504920n72748J705956
4784A456484K040173L05829m83571R01949J336555j117731k941712o52397L040808
4775C886387L526144J702365J727777L631269L652763O79701k506731l652313
4767A2647362k838803q95539P77193L47311j604087j640581J216741K817516P2185
4758A0899298l658740l779368j702978j692493l334963k951372n29093N34198
4750f215511n92977j703448k022156k280023j488893J452308M031515K978612
$$ plain form
4811 4179354 7886169 7028724 4165248 3042264 2623235 1139919 616827 3006772 5976096
4802 5976096 6511312 5459718 5164671 5482045 5044000 3918538 2584816 682366 -1175712
4793 -1175712 -769974 2576043 6267070 7410747 5750627 2828196 323276 -249472 1456484
4784 1456484 3496657 3802486 3318915 4220864 5557419 4439688 1497976 845579 3886387
4775 3886387 7412531 9114896 10842673 14473942 18126705 18806406 16299675 12647362
4767 12647362 9808559 8913020 9690213 10037524 8433437 6792856 8009597 10827113 10899298
4758 10899298 7240558 3461190 1758212 65719 -3269244 -6220616 -6749709 -6215511
4750 -6215511 -6808488 -8511936 -10534092 -12814115 -14303008 -12850700 -8819185 -5840573
4742e840573n2988n81139J714577L068080K117343J257002J603738J471010K64235
4733E021285l73645J60059N68121K67025k47363j240035k840920l219918j048350
4724b953741J356036J035348p17465n09082J366039J718647M7704j292166j753045
4715a701725k693084l383636j846806N40722L24760j917174j774626J863986M601632
4706e985951K910335j149385l138375j269442K766690N624797M642687M99948
4698D901304k855173k900518j635545j560231j259439J150978L117356J532157
4690D90889q83095N35577L793090K794440k087005l894413m34586K119566o08853
4681A825610m527499m098596k45395K620568K927632J761930R2369q59391K16260
$$ plain form
4742 -5840573 -5893561 -6474700 -4760123 -1692043 425300 1682302 3286040 4757050 5021285
4733 5021285 4647640 4807699 5375820 5642845 5395482 4155447 1314527 -1905391 -2953741
4724 -2953741 -1597705 -562357 -1279822 -1788904 -422865 1295782 1343486 51320 -1701725
4715 -1701725 -4394809 -7778445 -9625251 -9084529 -8759769 -10676943 -12451569 -10587583 -5985951
4706 -5985951 -3075616 -4225001 -7363376 -8632818 -5866128 -241331 4401356 4901304
4698 4901304 2046131 -854387 -2489932 -4050163 -5309602 -4158624 -1041268 490889
4690 490889 -392206 143371 3936461 6730901 4643896 749483 314897 2434463 1825610
4681 1825610 -2701889 -6800485 -7045880 -4425312 -1497680 264250 356619 -502772 -286512
4672b86512J949969J125155k009934l246531r88711J150477N45630l20507J114920
4663i66044K685821J298821j871373l447501k471474k27438J969469K622771N76838
4654A69890k343495k384233O50333K611033J554991P35574K504797L880540J794966
4645I174396j390828j818427j62631N57419K95602P97566J518487R24765j10693
4636I785656j25635m19916k759232n379531n065991j989861Q54303J839943J425102
4627a835162J87395r44382j30555K704416M240068J813670k446743m474294l608896
4618d494483k111410j053381P2718J059641J440484K030378L269275L487194J469849
4609E170265r91866j772166j500336j158061O87609M583907O862990M200728o14108
$$ plain form
4672 -286512 1663457 2788612 778678 -2467853 -3456564 -2306087 -1760457 -2080964 -966044
4663 -966044 1719777 3018598 1147225 -2300276 -4771750 -4999188 -3029719 -406948 169890
4654 169890 -2173605 -4557838 -3907505 -1296472 258519 994093 3498890 7379430 9174396
4645 9174396 7783568 5965141 5802510 6359929 6655531 7453097 8971584 9896349 9785656
4636 9785656 9660021 9240105 6480873 1101342 -3964649 -5954510 -5100207 -3260264 -1835162
4627 -1835162 -1647767 -2592149 -2722704 -18288 4221780 6035450 3588707 -885587 -4494483
4618 -4494483 -6605893 -7659274 -7586556 -6526915 -5086431 -3056053 213222 3700416 5170265
4609 5170265 4178399 2406233 905897 -252164 435445 5019352 11882342 16083070 15468962
4600A5468962k402357j358184j706704l824040l737630m91348J970721J453888
4592E373308O99321J988740L164788J587231j480322l104931k781729j938110
4584C508296j162278N537J512050K396015J641740o37741k386367j095847K487529
4575F268934L784831k0956n378754o665691l795483j427554j370989p93234J571332
4566g827564K755427J059152m50414J095112L566660L424513J348437N88550J479004
4557G038877J398350m19100j498183q1051K037136J834114j039597l863826m073167
4548A333553k047048k61836m5290j80803R00750K676609L326717K177903J42086
4539H022641j681289k641827k396764j367452p18117p86230m90639N34399P25942
$$ plain form
4600 15468962 13066605 11708421 10001717 6177677 2440047 1948699 3919420 5373308
4592 5373308 6072629 8061369 11226157 12813388 11333066 8228135 5446406 3508296
4584 3508296 2346018 2351555 3863605 6259620 7901360 7263619 4877252 3781405 6268934
4575 6268934 10053765 10032809 4654055 -2011636 -5807119 -7234673 -8605662 -9398896 -7827564
4566 -7827564 -5072137 -4012985 -4463399 -3368287 198373 3622886 4971323 5559873 7038877
4557 7038877 8437227 8018127 6519944 6438893 8476029 10310143 9270546 5406720 1333553
4548 1333553 -713495 -975331 -1020621 -1201424 -300674 2375935 5702652 7880555 8022641
4539 8022641 6341352 3699525 1302761 -64691 -782808 -1569038 -2059677 -1525278 -799336
4530g99336p26780j685262n1885K482391K677560O42651q06849q67825j141548
4521b76883j699072p67383J368600K109636R60804L98627J244745J017219j443712
4512B912581l284882j777630J744313M234086M702307L666473J338557j454587
4504A2081218k686420j620143j75896j59324r62717j400109j614146j687502q17908
4495I57053M82741M9919k168206k890468l78798K411126K358631R02187Q08308
4486B532493J036456q39238l151632k060394J849025L688500J241499k270519
4478B026190l088727j178489J174712K118138R10494j589437k715229p57006K000184
4469a099170J807573r55797k048216L17700L035897L111340J534742L89029n61635
$$ plain form
4530 -799336 -1526116 -3211378 -3263263 -780872 1896688 2539339 1732490 864665 -276883
4521 -276883 -1975955 -2743338 -1374738 734898 1695702 2094329 3339074 4356293 2912581
4512 2912581 -372301 -2149931 -405618 3828468 8530775 12197248 13535805 12081218
4504 12081218 9394798 7774655 7598759 7439435 6476718 5076609 3462463 1774961 957053
4495 957053 1439794 1489713 -678493 -3568961 -3947759 -1536633 821998 1724185 2532493
4486 2532493 3568949 2729711 -421921 -2482315 -633290 3055210 4296709 2026190
4478 2026190 -1062537 -2241026 -1066314 1051824 1962318 372881 -2342348 -3099354 -1099170
4469 -1099170 708403 -247394 -2295610 -1977910 1057987 4169327 5704069 6093098 5531463
4460E531463j933309k199611j43906K057071J274424k055915m459725l839574
4452e769082j197186J476699K959547K762445J219548l13280n73716L36787J411060
4443B312822J791802Q53439j454985l538009l170590q10891J85827j582657k925574
4434h338816r01834K157226K215078J60586J35766K280517K592898K11808q80601
4425c67372J087676K439557M48133k039754j738231j63298J91210P04969K961949
4416C524839L977232O65068l756701l850642m61864J087444j47445m51968N92038
4407A178001p58202m483567n295322j261011K634944K523242J240112K322042
4399a899761L940941L115044J264375R81070J215816K14682l91127R09061J361644
$$ plain form
4460 5531463 3598154 1398543 1254637 3311708 4586132 2530217 -1929508 -5769082
4452 -5769082 -6966268 -5489569 -2530022 232423 1451971 1138691 564975 901762 2312822
4443 2312822 4104624 4958063 3503078 -34931 -3205521 -4016412 -3830585 -5413242 -8338816
4434 -8338816 -9240650 -7083424 -4868346 -4707760 -4571994 -2291477 301421 513229 -367372
4425 -367372 720304 3159861 3607994 1568240 -169991 -333289 -142079 562890 3524839
4416 3524839 7502071 8167139 4410438 559796 97932 1185376 1037931 585963 1178001
4407 1178001 419799 -4063768 -9359090 -10620101 -7985157 -5461915 -4221803 -1899761
4399 -1899761 2041180 5156224 6420599 7401669 8617485 8832167 8441040 9350101 10711745
4390A0711745j614798m804001l420164J214076L522269J606524j596352l572454
4382B046845l839455j869321J613171K754816p44287m444651k365456L654362
4374c193976O006394K392332j674407k005233p82851q44244j110736l32614j19815
4365a665150j230323j229963J140936L074110K169968N49722J449837M141400
4357H400537M929083J673252m187222q579098p437718q53685N417010N741532
4349E103691J728689l70842R83717J279858j427723k959730n08131K331485J655221
4340G816235p89352j786987k106829l310067l405275p18809J529257p2313k724610
4331e568750j362592L012882M649281J714627j668010j996393m16994L88447k48829
$$ plain form
4390 10711745 9096947 4292946 872782 2086858 5609127 7215651 5619299 2046845
4382 2046845 -1792610 -3661931 -2048760 706056 -38231 -4482882 -6848338 -3193976
4374 -3193976 2812418 5204750 3530343 1525110 742259 -101985 -1212721 -1545335 -1665150
4365 -1665150 -2895473 -4125436 -2984500 89610 2259578 2809300 4259137 8400537
4357 8400537 13329620 15002872 10815650 2236552 -5201166 -6054851 -637841 5103691
4349 5103691 6832380 6461538 7445255 8725113 7297390 4337660 3829529 6161014 7816235
4340 7816235 7026883 5239896 3133067 -177000 -3582275 -4301084 -2771827 -2844140 -5568750
4331 -5568750 -6931342 -3918460 730821 2445448 777438 -1218955 -1635949 -1247502 -1496331
4322a496331j367463j882395j236726Q2N56072M42192J082691K391048K093184
4313E82354l12186j749779k02631J678702O59097k008471l016942k146382j331783
4304g848021p30276M84891J273706M45195n10095R5125Q09709p7283o89603J053442
4294e693210K632153P03555k316724j402032K522939L560253K75185k273821r28423
4285b920125J256692J126377M14548J637177L242631K327233n44274k360196j915427
4276B264636o31168J1476J38118P45304J985607K435234P64191j797630k442451
4267C473317r40811k69621j653366k213068k4521K081635J403623M42087K255975
4258D555250L973885R73524m691835o666327l898415j199157p73035r3109J584871
$$ plain form
4322 -1496331 -2863794 -4746189 -5982915 -5982833 -5426761 -4984569 -3901878 -1510830 582354
4313 582354 270168 -1479611 -1682242 -3540 655557 -1352914 -4369856 -6516238 -7848021
4304 -7848021 -8578297 -8093406 -6819700 -6374505 -6884600 -6789475 -5979766 -6057049 -6746652 -5693210
4294 -5693210 -3061057 -2357502 -4674226 -6076258 -3553319 6934 282119 -1991702 -2920125
4285 -2920125 -1663433 -537056 -122508 1514669 4757300 7084533 6540259 4180063 2264636
4276 2264636 1633468 1644944 1783062 2528366 4513973 6949207 7713398 5915768 3473317
4267 3473317 2532506 2262885 609519 -1603549 -1628070 453565 1857188 2299275 4555250
4258 4555250 8529135 9502659 4810824 -1855503 -5753918 -6953075 -7726110 -7819219 -6234348
4249f234348J604821r5419m1972K088100K218329o49718j945993Q39840L840581
4240A624221L188385M80689j287036k347975l404493k837461k37939J322319M1286
4231c458004j268553J17963K385531K775926K177739K548372K826145J152931
4223I258050j237102j870029r52508m71163r45629j557125k071498k577621k553727
4214d978352j622757p5546J846647L544053L200397n5328l448872l285965j84291
4205e060014J957879J779358J108217L93705j505398l212557k052983N22926N81378
4196e487489j118009j11685L243993L607208J24183j715117M34981K306376J364494
4187B648935N89747J235706J55933k525610j781304K648876L947504k99122l638998
$$ plain form
4249 -6234348 -4629527 -4724946 -4766918 -2678818 -460489 -1110207 -3056200 -2216360 1624221
4240 1624221 4812606 5293295 4006259 1658284 -1746209 -4583670 -4821609 -3499290 -3458004
4231 -3458004 -4726557 -4608594 -2223063 552863 2730602 5278974 8105119 9258050
4223 9258050 8020948 6150919 5198411 4727248 3781619 2224494 152996 -2424625 -4978352
4214 -4978352 -6601109 -6676655 -4830008 -1285955 1914442 1859114 -1589758 -4875723 -5060014
4205 -5060014 -3102135 -1322777 -214560 179145 -1326253 -4538810 -6591793 -6068867 -5487489
4196 -5487489 -6605498 -6717183 -3473190 134018 258201 -1456916 -1021935 1284441 2648935
4187 2648935 3238682 4474388 4630321 2104711 323407 2972283 6919787 6620665 2981667
4178B981667k323434j390125l849686m322022K7048K829444K04527j620674J512019
4169e951236L102730j227199m025715L05798L964679k1518l979025K27810N112122
4160b491554J295573m246981j123591M439118J759056k982760R96920O213477
4152C859258M97561p044723j480510P068859K131900J674248L5645344Q1530117
4144A23882054P3969831k541938p7365819q1109721l1788764L396585J380720
4137I822948p029220j578789L387713k595500o790287r68529L761937J48952k345412
4128d186187K430081N689878J497552k206810M95848K683683j390407n582352
4120e68714l809114m11636n30223j120725R80480K081923l13160j720334P18898
$$ plain form
4178 2981667 658233 -731892 -4581578 -8903600 -8876552 -6047108 -5842581 -7463255 -5951236
4169 -5951236 -2848506 -4075705 -8101420 -7795622 -3830943 -3852461 -7831486 -7603676 -2491554
4160 -2491554 -1195981 -5442962 -6566553 -2127435 -368379 -3351139 -2354219 3859258
4152 3859258 4356819 -2687904 -4168414 2900445 5032345 6706593 42351937 123882054
4144 123882054 197851885 195309947 117944128 36834407 5045643 8442228 9822948
4137 9822948 2793728 1214939 4602652 2007152 -4783135 -5751664 -1989727 -1840775 -4186187
4128 -4186187 -1756106 3933772 5431324 3224514 3720362 6404045 5013638 -568714
4120 -568714 -4377828 -4789464 -5319687 -6440412 -5459932 -3378009 -3691169 -5411503 -4692605
4111d692605K647748J314012J076399M184450M957308k66087n591104m899873
4103a269752j352877o36041j457603P9726K457513K223551P97461J314187K667464
4094D823629K356568J433472J528647Q49689k025149m225906l054206n65565N21029
4085A642208J363845L196481L416132K36573k853438k206095J34168M45171n51313
4076D823732m80731n38592k600200m251640k141324K100948M228955L495226J976086
4067F612460J90761k158474l427557k423297j310335j977171k053690J078865
4059e468438M953126N425401L030858J144949J30426j676634l312666k762827
4051A464195j349880j382210j335170J154295L467473J460418k631828k637644
$$ plain form
4111 -4692605 -2044857 -730845 345554 4530004 9487312 9221225 3630121 -1269752
4103 -1269752 -2622629 -3258670 -4716273 -4636547 -2179034 44517 841978 2156165 4823629
4094 4823629 7180197 8613669 10142316 10992005 8966856 4740950 1686744 1121179 1642208
4085 1642208 3006053 6202534 9618666 9855239 7001801 4795706 4929874 5375045 4823732
4076 4823732 4343001 3804409 1204209 -3047431 -5188755 -3087807 1141148 4636374 6612460
4067 6612460 6803221 4644747 1217190 -1206107 -2516442 -4493613 -6547303 -5468438
4059 -5468438 -515312 4910089 7940947 9085896 9216322 7539688 4227022 1464195
4051 1464195 114315 -1267895 -2603065 -1448770 2018703 3479121 847293 -1790351
4043a790351J556165L540837O85903k091679r01551J186779P0427k664940k890663
4034c299073k68062K253755K908557K040809L26978j421881j992290j210171n25547
4025a186925q41066j097988k29397R01915Q69659j22104p07329l44720J59739
4016b598216j56363j135877j347081M55189L344493M524288K447267j263385l920667
4007C49648m529277l296855k83682L380077M713213K189513j353910k102703n47944
3998a481920q3950j182018r35911J573687L526429K873877J046783q6929p76488
3989D473560j440100j081593N85642J837256J489952P22752Q11985J002651K08540
3980H610645r39697j330007j141529r58408n12421L74551Q94739M87892k40896
$$ plain form
4043 -1790351 -234186 3306651 3992554 1900875 999324 2186103 2256530 -408410 -3299073
4034 -3299073 -3567135 -1313380 1595177 3635986 3962964 2541083 548793 -661378 -1186925
4025 -1186925 -2027991 -3125979 -3355376 -2453461 -1583802 -1705906 -2413235 -2757955 -2598216
4016 -2598216 -2754579 -3890456 -5237537 -4782348 -1437855 3086433 5533700 4270315 349648
4007 349648 -4179629 -7476484 -7760166 -4380089 333124 2522637 1168727 -933976 -1481920
3998 -1481920 -1565870 -2747888 -3683799 -2110112 1416317 4290194 5336977 5250048 4473560
3989 4473560 3033460 1951867 2537509 4374765 5864717 6587469 7399454 8402105 8610645
3980 8610645 7670948 6340941 5199412 4241004 3728583 4103134 4997873 5485765 5244869
3971E244869p47805j280485j557073m94749J582600K329351N81040j451319j125168
3962C081261P26313J012918j071506k855686j757249J435737L464809K205943
3954F242540j050866l011383k073887o7470L67058o02402n66902J148640K150990
3945B536318L75738k820973m160228k151481J530314L764862K713789m41334k391914
3936a044909j208401J282049J871503K24972j205163j198505j012019j251071
3928c541544n36382J454151K491285J288258J1200Q84707K333584J375002j504980
3919D255281k924778j519975N13274Q40918l93202j741483k307695j853345n41060
3910e672065P66656R64288J94r28441p72919K54839J094111R94340K12400l14054
$$ plain form
3971 5244869 4497064 3216579 1659506 1164757 2747357 5076708 5657748 4206429 3081261
3962 3081261 3807574 4820492 3748986 893300 -863949 571788 4036597 6242540
3954 6242540 5191674 2180291 106404 38934 405992 -196410 -763312 385328 2536318
3945 2536318 2912056 91083 -4069145 -6220626 -4690312 -925450 1788339 1347005 -1044909
3936 -1044909 -2253310 -971261 900242 1125214 -79949 -1278454 -2290473 -3541544
3928 -3541544 -4077926 -2623775 -132490 1155768 1166968 2051675 4385259 5760261 4255281
3919 4255281 1330503 -189472 323802 1164720 771518 -969965 -3277660 -5131005 -5672065
3910 -5672065 -4905409 -3941121 -3940927 -4869368 -5642287 -5387448 -4293337 -3298997 -3086597 -3400651
3900c400651j16641J23738m21545j284054j291533n53995m14176j073912q99922
3891i332691J081448L485922M426036L744683K281266K63401k143856l759382
3883D6827l407182j451963P22330K101219K263758J380256O93286J498183K834579
3874F681293K128236p71167k625481j616416l92274j653938l355125k033022J093929
3865b543965J859082j10212j247983m69437o23262k586624k925252L43935L884232
3856d419486L869709J408742J0665K51939K66124m08633p88604q90675j133272
3847a833491m29092K005042L870496K274374j352813k466100J5842J932125O8595
3838D084978l074968l070173J67642K820131K713456J371390O26736J14084q39241
$$ plain form
3900 -3400651 -3517292 -3393554 -3815099 -5099153 -6390686 -6944681 -7358857 -8432769 -9332691
3891 -9332691 -8251243 -4765321 -339285 3405398 5686664 5950065 3806209 46827
3883 46827 -3360355 -4812318 -4089988 -1988769 274989 1655245 2348531 3846714 6681293
3874 6681293 8809529 8038362 5412881 3796465 3404191 1750253 -1604872 -3637894 -2543965
3865 -2543965 -684883 -795095 -2043078 -2512515 -3135777 -5722401 -8647653 -8303718 -4419486
3856 -4419486 -549777 858965 869630 1121569 1387693 979060 190456 -700219 -1833491
3847 -1833491 -2262583 -257541 3612955 5887329 4534516 2068416 2084258 4016383 4084978
3838 4084978 1010010 -2060163 -1892521 927610 3641066 5012456 5639192 5753276 4914035
3829D914035j199510n0580J009190k50769k809946l009404K72805L476077L074340
3820E426238N43723L6167K093800K913780K17533l340393m235178k950197k236581
3811a531108k213994n46771K791162M333291J912436j905296l149052j572535
3803a881867j27594j87901m3824J524709K762457J529275j300885k970778k513334
3794c209742j326329m46397O24193K053866K630735J535540k42978j293799j513930
3785a188841j560522j637469j732591j963705j764828n3567K590144L432035J054639
3776b824705j991518k248886j13697J050856P4034o27352R08086L409269M475199
3767B111286L337752O89520k327870m108677l389064j047745M57852K14696k37027
$$ plain form
3829 4914035 3714525 3663945 4673135 4422366 1612420 -1396984 -1124179 2351898 5426238
3820 5426238 5969961 6006128 8099928 11013708 11231241 7890848 3655670 705473 -1531108
3811 -1531108 -3745102 -4291873 -1500711 2832580 4745016 2839720 -309332 -1881867
3803 -1881867 -2009461 -2197362 -2241186 -716477 2045980 3575255 2274370 -696408 -3209742
3794 -3209742 -4536071 -4982468 -4358275 -2304409 326326 1861866 1618888 325089 -1188841
3785 -1188841 -2749363 -4386832 -6119423 -8083128 -9847956 -9901523 -7311379 -3879344 -2824705
3776 -2824705 -4816223 -7065109 -7178806 -6127950 -6053916 -6681268 -5773182 -2363913 2111286
3767 2111286 5449038 6138558 3810688 -297989 -3687053 -4734798 -4276946 -4062250 -4299277
3758d299277K37220O29082m7121q68170o89581l177L05444M68707Q04500Q93364
3748b569009J079108K670709M920879M210952j083908o835255p498413l098020
3740h202957J295173K322781J268769N03160M38645O11024Q87535O80298p41776
3731i37348k422797k389772q02566j15039j214740j798114J4465K533032K796621
3722d336258O38522j303158q67767J615822L952187L797902N51102l578690n140423
3713d670761k937186O60266K487162J872716N39251J43113Q25111J644048J649435
3704B213155P45099j85495k83020K44966O03451N43441J41005r17529k390629
3695G14444k495077P87L025587L204848P96704m02288J117542K196258J81299
$$ plain form
3758 -4299277 -4062057 -3432975 -3480096 -4348266 -5037847 -5041024 -4735580 -4266873 -3462373 -2569009
3748 -2569009 -1489901 1180808 6101687 10312639 9228731 2393476 -5104937 -8202957
3740 -8202957 -6907784 -4585003 -3316234 -2813074 -2374429 -1763405 -875870 -195572 -937348
3731 -937348 -3360145 -5749917 -6552483 -6667522 -7882262 -9680376 -9665911 -7132879 -4336258
3722 -4336258 -3697736 -5000894 -5868661 -4252839 -300652 3497250 4048352 469662 -4670761
3713 -4670761 -7607947 -6947681 -4460519 -2587803 -2048552 -1905439 -1080328 563720 2213155
3704 2213155 2958254 2772759 2489739 2734705 3338156 3881597 4022602 3105073 714444
3695 714444 -1780633 -1779846 1245741 4450589 5247293 4845005 5962547 8158805 8340104
3686H340104k715799k875714n08873J589156K418894K595207J540892j302137
3678I081730l488128j906282J985278L161419j12787l908941m180404j589165
3670i57280O18903Q91141j76690j554118k220711j446708p846K74642p58928j026445
3660f364040N39470K046975J541686R9274j4304J025229J107066l34803j577908
3651a931355j291134r8638Q06677J120728J013700L98451o77752j521202j387497
3642c568022n33603j80041j021302j931596j010796J601214L003347R40135k793461
3633e494125m225113k235651M70573J587349J787175K151368J777908l6306j362262
3624e579084l966K915504M245750K990766R02989n94063j721536k669925k830368
$$ plain form
3686 8340104 5624305 2748591 2239718 3828874 6247768 8842975 10383867 9081730
3678 9081730 5593602 3687320 5672598 8834017 8721230 4812289 631885 -957280
3670 -957280 -338377 552764 376074 -1178044 -3398755 -4845463 -4853309 -4578667 -5337595 -6364040
3660 -6364040 -5824570 -3777595 -2235909 -2136635 -2150939 -1125710 -18644 -353447 -1931355
3651 -1931355 -3222489 -3321127 -2514450 -1393722 -380022 18429 -659323 -2180525 -3568022
3642 -3568022 -4101625 -4281666 -5302968 -7234564 -8245360 -6644146 -3640799 -2700664 -5494125
3633 -5494125 -9719238 -11954889 -11484316 -9896967 -8109792 -5958424 -4180516 -4216822 -5579084
3624 -5579084 -5583050 -2667546 1578204 4568970 5471959 4877896 3156360 486435 -2343933
3615b343933k108300j356040j090907r75485o75524j83806N37173J230944J181627
3606e784251M94300O43587K232912L337190K164749K31078J40776J143071L90088
3597D993500j729987j676830J128224K567515K1775l588447m472941l170377j957990
3588g885558l27850K824077M881373K325224k954488m910438j318457L442059
3580c924058M470454J775839j563677l526749l660460j926272Q24627K605446
3572d924850K215547O39456l46697k1429J289964K710614K809064P17442k085959
3563C003152k825468j019104Q48655J091752R50787J545900J274902j275722l845894
3554b51040l094973L76962K726206K078379L5007j716748k949500k799959J59763
$$ plain form
3615 -2343933 -4452233 -5808273 -6899180 -7874665 -8550189 -8733995 -8196822 -6965878 -5784251
3606 -5784251 -5289951 -4646364 -2413452 923738 3088487 3319565 3460341 4603412 4993500
3597 4993500 3263513 1586683 2714907 5282422 5304197 1715750 -2757191 -5927568 -7885558
3588 -7885558 -8213408 -5389331 -507958 1817266 -1137222 -6047660 -7366117 -3924058
3580 -3924058 546396 2322235 758558 -2768191 -6428651 -8354923 -7530296 -4924850
3572 -4924850 -2709303 -2069847 -2416544 -2437973 -1148009 1562605 4371669 5089111 3003152
3563 3003152 177684 -841420 7235 1098987 2049774 3595674 4870576 3594854 -251040
3554 -251040 -3346013 -2969051 -242845 1835534 1870541 153793 -2795707 -5595666 -5435903
3545e435903M378045N254175J004354l961678m348939p80665J853305J545477
3537d91829R34413K066127L241586K386832M91614m02721m54042q60115j042396
3528E869469K08448J601759M60233k872111m712737l139815p30167m77425j319961
3519e112307l18808K285919L366438J764447k66498p75826l73580K7773R05435
3510A502993K141823J932673l23916k210506j718453o62766j904845m535926m965306
3501a0744229k139403J397212L366664L662447K493012j06979k483419k309875
3493f864570j65130Q82399J30531K97553K426330L484612J286626j705613k395586
3484b622848j654182j496029p40308K180454M549539K655766j615330k853314
$$ plain form
3545 -5435903 -1057858 4196317 5200671 1238993 -3109946 -3890611 -2037306 -491829
3537 -491829 442584 2508711 5750297 8137129 8628743 8226022 7771980 6911865 5869469
3528 5869469 6077917 7679676 8139909 5267798 555061 -2584754 -3314921 -3792346 -5112307
3519 -5112307 -5431115 -3145196 221242 1985689 1719191 943365 569785 597558 1502993
3510 1502993 3644816 5577489 5253573 3043067 1324614 661848 -1242997 -5778923 -10744229
3501 -10744229 -12883632 -11486420 -8119756 -4457309 -1964297 -2071276 -4554695 -6864570
3493 -6864570 -7029700 -6147301 -6016770 -5719217 -3292887 191725 1478351 -227262 -2622848
3484 -2622848 -4277030 -5773059 -6513367 -4332913 216626 2872392 1257062 -1596252
3476a596252l40146J249981k47513j463330P3895J705506N31550j743501k078307
3467c908117r02976l40602j72388J131177L132297M057033L387296J648546q44118
3458G188148l095647l170998r04848J038745Q28228p563J78194Q1741j601967
3449E34033k923003j842128j80044n16186j435499k44573J665762J194014m24039
3440d171663L61444K369916J047922l057460l894589N37390M534488L146569j211690
3431c37673l607612l117187j266033J420917L684866K608820j614194l829018
3423f057114r27310K980751K778329J8288p18087K51576n34005k449707j908530
3414f565809N09682O25269j857152k682733l27242K006785K571211L313832M427612
$$ plain form
3476 -1596252 -1936398 -686417 -933930 -2397260 -2323365 -617859 -86309 -1829810 -3908117
3467 -3908117 -4811093 -5151695 -5324083 -4192906 -1060609 2996424 6383720 8032266 7188148
3458 7188148 4092501 921503 16655 1055400 1883628 1876065 2054259 2136000 534033
3449 534033 -2388970 -4231098 -4411142 -4927328 -6362827 -6607400 -4941638 -3747624 -4171663
3440 -4171663 -3810219 -1440303 -392381 -3449841 -7344430 -6807040 -2272552 874017 -337673
3431 -337673 -3945285 -7062472 -8328505 -6907588 -3222722 -613902 -2228096 -6057114
3423 -6057114 -6984424 -4003673 -1225344 -1207056 -1925143 -1673567 -2207572 -4657279 -6565809
3414 -6565809 -6056127 -5430858 -7288010 -9970743 -10297985 -8291200 -5719989 -2406157 2021455
3405B021455K677618k210465m997588k312557J988882K752826Q87247M52408J602272
3396B862098J315501p72303k024775j475112p86758q66967r60461r44004j419231
3387e072012j589724K5967K643252L675503K400018P07848L597j52463n4669P77598
3377C364915J561729L20292k752905m422148k603548N37221J593941M19195n44618
3368b525926k14729L56641O24215J339803K374000K088451m6972j907344j201886
3359H86253J478033L438768L113457J273731n90310j793056k342009k393886k096032
3350I74949j361078J27625K050659K999025J952176j20858j476424k083754l071394
3341i074l829155k239041J452550L762280K664650O47571P14171J648086N19680
$$ plain form
3405 2021455 4699073 2488608 -2508980 -4821537 -2832655 -79829 807418 1259826 2862098
3396 2862098 4177599 3405296 1380521 -94591 -881349 -1748316 -2708777 -3652781 -5072012
3387 -5072012 -6661736 -6635769 -3992517 -317014 2083004 2790852 2794449 2641986 2587317 3364915
3377 3364915 4926644 5246936 2494031 -1928117 -4531665 -3994444 -2400503 -1981308 -2525926
3368 -2525926 -2740655 -2384014 -1759799 -419996 1954004 4042455 3995483 2088139 886253
3359 886253 2364286 5803054 8916511 10190242 9599932 7806876 5464867 3070981 974949
3350 974949 -386129 -258504 1792155 4791180 6743356 6622498 5146074 3062320 -9074
3341 -9074 -3838229 -6077270 -4624720 -862440 1802210 2449781 3163952 4812038 5331718
3332E331718j811152j814765O18267J539889q79148l470707k987192o10891O02942
3323c481039J73810l48645l93251k63649O09900K756065M728444M394250J933629
3314A0109514k97137q55391o49858j212262k750977m154689m177434k506116q2344
3305f576694J672457K073437J370423K7201j330858j541747M2677K029732K216591
3296a6781P25841j6308Q93341J286587m50831k399210j851789N19393J610856
3287C01099J69951j993682k670606j405148P27252K121711J694518p3904j549300
3278b678109j906507j720103j281811j22560J107229O88696r34375p66678J851912
3269e762306L027565P3629l400510k378681J749902L285311R66713q17197M52485
$$ plain form
3332 5331718 3520566 1705801 2324068 3863957 2984809 -485898 -3473090 -4083981 -3481039
3323 -3481039 -3307229 -3655874 -4049125 -4312774 -3702874 -946809 3781635 8175885 10109514
3314 10109514 9812377 8956986 8307128 7094866 4343889 189200 -3988234 -6494350 -6576694
3305 -6576694 -4904237 -2830800 -1460377 -1433176 -2764034 -4305781 -4263104 -2233372 -16781
3296 -16781 709060 692752 1586093 2872680 2421849 22639 -1829150 -1309757 301099
3287 301099 471050 -1522632 -4193238 -5598386 -4871134 -2749423 -1054905 -1128809 -2678109
3278 -2678109 -4584616 -6304719 -7586530 -7709090 -6601861 -5913165 -6847540 -7614218 -5762306
3269 -5762306 -2734741 -2661112 -6061622 -8440303 -6690401 -3405090 -2438377 -3255574 -2803089
3260b803089K165358J934721J124539J078816L37031j837437l000245j485143
3252b485449M01311J48791p86911K10611K262935K594230J185553M32460R93342
3243D956873R87625q82830l614212n147789l993223m15284K867771K704841l25457
3234b861685j807410M66034K812572J094076k503139k485269J456214M091971
3226B63364K876604J197127J837889K261402m23386l798954l709035r24522M02725
3217a6786m13618k24858J548596J249302k609377n693967l689158J391208M405065
3208d053593M304977L872963L655670J370636k355607l044025O79483L784707
3200H215211J901225j966992k093968J203837K484105l25258l446106l391875
$$ plain form
3260 -2803089 -637731 1296990 2421529 3500345 3837376 1999939 -1000306 -2485449
3252 -2485449 -2084138 -1935347 -2722258 -2511647 -248712 2345518 3531071 3963531 4956873
3243 4956873 5944498 5061668 1447456 -3700333 -7693556 -8108840 -5241069 -2536228 -2861685
3234 -2861685 -4669095 -4203061 -1390489 -296413 -2799552 -5284821 -3828607 263364
3226 263364 3139968 4337095 6174984 8436386 8013000 4214046 505011 -419511 -16786
3217 -16786 -430404 -655262 893334 2142636 -466741 -6160708 -9849866 -8458658 -4053593
3208 -4053593 251384 4124347 7780017 9150653 6795046 3751021 4430504 8215211
3200 8215211 10116436 8149444 6055476 7259313 9743418 9418160 5972054 2580179
3192B580179j040728J235270K484599K134790j70816k353224j213014K409565
3184F066621L549500L00355k784185j475476J527187Q90482l004969m803274k250433
3175a984192J071527J449970k90417j094366p1474J041970O37010p54608j142787
3166a137367L62550K021524J524348n10604j035809Q67439K383427J285561p20087
3157E040982j112160n32680p74899r34751Q39233L125480K637604o29635l248200
3148D410974l297475k131456j053812M31161K310493K924273J325289j184936
3140C734511k644006k101367K28112K734501K825577j51236k888902j727553K037028
3131B046665L502937Q16401k787656l963466k885720j094384R10309K529811K460509
$$ plain form
3192 2580179 1539451 2774721 5259320 7394110 7223294 4870070 3657056 6066621
3184 6066621 9616121 9916476 7132291 5656815 7184002 8074484 5069515 266241 -1984192
3175 -1984192 -912665 537305 246888 -847478 -918952 123018 760028 5420 -1137367
3166 -1137367 -774817 1246707 2771055 2260451 1224642 2092081 4475508 5761069 5040982
3157 5040982 3928822 3396142 2621243 1686492 2525725 5651205 8288809 7659174 4410974
3148 4410974 1113499 -1017957 -2071769 -1640608 669885 3594158 4919447 3734511
3140 3734511 1090505 -1010862 -782750 1951751 4777328 4626092 1737190 9637 2046665
3131 2046665 5549602 6366003 3578347 -385119 -3270839 -4365223 -3454914 -925103 1535406
3122A535406Q38424l50887k37335j19342o21537n13292M96792O85576m99493j062263
3112A52049N821O50736p51219k502619k456317j329921p60539l41573Q25119J670058
3102d838405R64303r8660K46317J338654J377351L60027m92977q53546p71288
3093b768224K81231J735620J302243j498951l300043j334629K080699K891370
3085f10684J310194O00503J244017O83219j599938k987776k014521k04089P84429
3076b794646Q21637J5813j286925j369411Q49718K995010J946673r33869j396774
3067a152774Q24822J430706j284467l588655k489082j06471P50377J108000K555451
3058a952093L134392N80893k959937l651372j669354k49415k68007K94731K023076
$$ plain form
3122 1535406 2373830 2022943 1785608 1666266 1044729 531437 1028229 1713805 1214312 152049
3112 152049 157870 808606 57387 -2445232 -4901549 -6231470 -6992009 -7333582 -6508463 -4838405
3102 -4838405 -3874102 -3972762 -3726445 -2387791 -1010440 -650413 -1143390 -1996936 -2768224
3093 -2768224 -2486993 -751373 550870 -948081 -4248124 -5582753 -3502054 -610684
3085 -610684 699510 1300013 2544030 3227249 1627311 -1360465 -3374986 -3579075 -2794646
3076 -2794646 -1973009 -1957196 -3244121 -4613532 -3763814 -768804 1177869 244000 -1152774
3067 -1152774 -327952 1102754 -181713 -3770368 -6259450 -6365921 -5615544 -4507544 -1952093
3058 -1952093 1182299 1763192 -1196745 -4848117 -6517471 -6766886 -7034893 -6740162 -4717086
3049d717086K942366K032460Q71716J065883K113014K408047J032296j534044
3041F214652l529607l331169j681931j216100k525176k715051k0606K471645J167823
3032e165520j775192j097079L313839N883803L703840L21221o38286o79563k078521
3023A788542k700733J18311L441185K071896k965868m840392n47952M714570M871437
3014E950996Q21005k025549j441458m1148l42875j664037k266963j910617j167196
3005d087842J8108J711651K951994K688698J350383L18212p5912r29149k820205
2996A125938m402744l792387j066381J504283J969596Q25217R2352O52338J333210
2987a758578P84603n72415j163238m19300N83144P31043L28079N02863J660903
$$ plain form
3049 -4717086 -1774720 257740 1129456 2195339 4308353 6716400 7748696 6214652
3041 6214652 2685045 -646124 -2328055 -3544155 -6069331 -8784382 -8804988 -6333343 -5165520
3032 -5165520 -6940712 -8037791 -4723952 1159851 4863691 5184912 4546626 3867063 1788542
3023 1788542 -912191 -793880 2647305 4719201 1753333 -3087059 -3635011 1079559 5950996
3014 5950996 6772001 4746452 3304994 3263846 2920971 1256934 -1010029 -2920646 -4087842
3005 -4087842 -4069734 -2358083 593911 3282609 4632992 4951204 4875292 3946143 1125938
2996 1125938 -3276806 -7069193 -8135574 -6631291 -4661695 -3836478 -3744126 -3091788 -1758578
2987 -1758578 -973975 -1546390 -2709628 -3128928 -2545784 -1814741 -1486662 -983799 677104
2978F77104L038768L527380K532194L58853j708594k059251l44687J615530J467676
2969I104973q41472k773912k300558l88776N66487N6666k74588M65617R22217
2960D536654m55940l130035n185977n439672l883751r75130K188948L715113K690550
2951e939240R22578J100092L073004L898460K150116N3166K3803J038581N59336
2942F879896j242326j801954l01778J132746Q03990k84404n33286k66926o75854
2933C710104j506375j556339r57155j207326k638509l256263j172034K403371
2925f180526M044146K425405L93466J250726L828255L702211m43327m525036m613647
2916a18327k087611p04472q24976j35091J337305J251578k75775l43639J585478
$$ plain form
2978 677104 3715872 7243252 9775446 10134299 8425705 6366454 6021767 7637297 9104973
2969 9104973 8263501 5489589 3189031 2800255 3366742 3423408 3148820 3614437 4536654
2960 4536654 4080714 950679 -4235298 -9674970 -13558721 -14533851 -12344903 -8629790 -5939240
2951 -5939240 -5016662 -3916570 -843566 3054894 5205010 5258176 5281979 6320560 6879896
2942 6879896 5637570 3835616 3533838 4666584 5470574 5186170 4652884 4385958 3710104
2933 3710104 2203729 647390 -309765 -1517091 -4155600 -7411863 -8583897 -6180526
2925 -6180526 -2136380 289025 682491 1933217 5761472 9463683 9020356 4495320 -118327
2916 -118327 -2205938 -2910410 -3735386 -3870477 -2533172 -1281594 -1557369 -1901008 -315530
2907c15530K406438O18084j122809o08633N19042L49266N6039P62350M98887k124533
2897A038601m227931k780013L0811N5307k063025k260962J2176J364548O32881
2888h197607M08224J906560L044834K686598K464607K945199K031694r35597l068043
2879C286469k068453M65394J851937J724218P88909r91632k843182k438437Q05770
2870E80993L766254L345489M80527j683393j957993j372493q61356q41704j784752
2861c28428l205319l228492r48478J876866K993659K257471P86835p64013j555631
2852b115530k23332K704937L922955J406033k148830k684934m58133O05339j290902
2843b82397l572748l184419m85464J557846R62014j071355j443025J063597L734643
$$ plain form
2907 -315530 2090908 2708992 1586183 977550 1496592 1845858 1901897 2664247 3163134 1038601
2897 1038601 -3189330 -5969343 -5938532 -5883225 -7946250 -10207212 -10195036 -8830488 -8197607
2888 -8197607 -7789383 -5882823 -2837989 -151391 2313216 5258415 7290109 6354512 3286469
2879 3286469 1218016 1683410 3535347 5259565 6048474 5056842 2213660 -224777 580993
2870 580993 4347247 7692736 8173263 6489870 4531877 3159384 2298028 1456324 -328428
2861 -328428 -3533747 -6762239 -7710717 -5833851 -2840192 -582721 204114 -559899 -2115530
2852 -2115530 -2338862 366075 4289030 5695063 3546233 861299 403166 1008505 -282397
2843 -282397 -3855145 -7039564 -7525028 -5967182 -5005168 -6076523 -7519548 -6455951 -2721308
2834b721308L148809Q2823j474287m45570j12890k057410k918648j50882L002054
2825c647309K575232O59256J823709M974821M732484J33000l912380m157344k604994
2816E76475j605488m83025J228216J657391n3785j769344j709534p56971J14139
2807b801926J498024L050662K663928J01414j638845o71950R69346R45992P5669
2798D192314j24344m60639j936182l100948k291287l63307J307977L157491N033588
2789E414663M164780q25403n929764n935988j530949J700371Q50584j507776k097410
2780e696892r44344J14121J53059n03836p82274O32108L585225N472966L983135
2771F013268N03998j506079j249813r74719j646506j454264M69971J909085R55428
$$ plain form
2834 -2721308 427501 510324 -963963 -1409533 -1522423 -3579833 -6498481 -6649363 -3647309
2825 -3647309 -1072077 -412821 1410888 6385709 11118193 11251193 7338813 3181469 576475
2816 576475 -1029013 -1512038 -283822 1373569 1319784 -449560 -2159094 -2916065 -2801926
2807 -2801926 -1303902 1746760 4410688 4512102 2873257 2201307 3170653 4116645 4192314
2798 4192314 4067970 3607331 1671149 -1429799 -3721086 -4084393 -2776416 381075 5414663
2789 5414663 9579443 8754040 2824276 -3111712 -4642661 -2942290 -2091706 -3599482 -5696892
2780 -5696892 -6641236 -6527115 -6374056 -6877892 -7660166 -7028058 -3442833 2030133 6013268
2771 6013268 6517266 5011187 3761374 2786655 1140149 -314115 155856 2064941 3020369
2762C020369p30566k93835J976866K828052K18131m124712o378444m271902P41384
2753g014657M707101M941240K503237L07139o45243j592180k819166k502760K82202
2744a833087L405093M187919K736778J013458l51577k170673m067032m087433
2736a166554j513903J665149K984794K015961j41313k622391m781606n327626
2728h887489l282880J41317K122587J274067p81743j377072L91864L189663M940724
2719b268962M330230J683879j037126j927891j344495j347421k375109k150046
2711f436941P42729L905135L970286J242039j008036j081477L932J257858K448636
2702E044161K368859k0502k414130j087809K982920M118637j501m364446l598126
$$ plain form
2762 3020369 2289803 1995968 3972834 6800886 7019017 2894305 -3484139 -7756041 -7014657
2753 -7014657 -2307556 2633684 5136921 5444060 4798817 3206637 387471 -2115289 -1833087
2744 -1833087 1572006 5759925 8496703 9510161 9158584 6987911 2920879 -1166554
2736 -1166554 -2680457 -1015308 1969486 3985447 3844134 1221743 -3559863 -8887489
2728 -8887489 -12170369 -12029052 -9906465 -8632398 -9414141 -10791213 -10399349 -7209686 -2268962
2719 -2268962 2061268 3745147 2708021 780130 -564365 -1911786 -4286895 -6436941
2711 -6436941 -5694212 -1789077 2181209 3423248 2415212 1333735 1337667 2595525 5044161
2702 5044161 7413020 7392518 4978388 3890579 6873499 10992136 10990635 6626189 3028063
2693C028063P09693L231125K335508K05846j940502m105765m685912k222410Q68254
2684b576100R13431j144820j079852J619128K984790J323369k75322L91961J152750
2675C309335j40415j812828j699852q52880r27547p24262J414375L895145L863751
2666F324822J543944l69800p43594p63511j204960j331160m96237Q26263J690999
2657E476766J492369N12445Q1215J142216K283657R57705k543132m520780k756995
2648B125466K28023Q86307l53261m51768J285088K626328K188006R53167r040
2639I478316r66464k254335l296497l290390j847561Q12598L307040L476520P73237
2630F192464k411256l350091k227068j170435r32054o18400r6817k27415p41210
$$ plain form
2693 3028063 3737756 6968881 9304389 9510235 7569733 3463968 -1221944 -3444354 -2576100
2684 -2576100 -1662669 -2807489 -3887341 -2268213 716577 2039946 1764624 2156585 3309335
2675 3309335 3168920 1356092 -343760 -1196640 -2124187 -2848449 -1434074 2461071 6324822
2666 6324822 7868766 7498966 6755372 5991861 4786901 3455741 2959504 3785767 5476766
2657 5476766 6969135 7481580 7562795 8705011 10988668 11946373 9403241 4882461 2125466
2648 2125466 2353489 3239796 2886535 2434767 3719855 6346183 8534189 9487356 9478316
2639 9478316 8511852 6257517 2961020 -329370 -2176931 -1364333 1942707 5419227 6192464
2630 6192464 3781208 431117 -1795951 -2966386 -3898440 -4516840 -4613657 -4841072 -5582282
2621e582282k10188J451209K372219J200659j197926k854659k395378K65790L636858
2612c313698N273571M057896J533983k90069j556952l113298l629303j146131
2604b184001K862776M303959J874480j334868k470189k215593k286013k495011
2596c944460k043117j329395o59126P41227K653051K978278R48550q77657k12503
2587a745152J266075O21503j454716j717375M32332K175340J770172P03017N45946
2578B597142L30689j432245l863623m573468k682407L23101K515727L299405L084733
2569d00946K006749p8983k254931k474283p1349K485750K262171o2320j199792
2560B12066m34809o12956k845942l851663j165930K206742K112831j73098k33550
$$ plain form
2621 -5582282 -5792470 -4341261 -1969042 -768383 -1966309 -4820968 -7216346 -6950556 -3313698
2612 -3313698 1959873 6017769 7551752 7261683 5704731 2591433 -1037870 -2184001
2604 -2184001 678775 4982734 6857214 5522346 3052157 836564 -1449449 -3944460
2596 -3944460 -5987577 -7316972 -7976098 -7234871 -4581820 -1603542 -654992 -1532649 -1745152
2587 -1745152 -479077 142426 -1312290 -3029665 -2597333 -421993 1348179 2051196 2597142
2578 2597142 2927831 1495586 -2368037 -6941505 -9623912 -9300811 -6785084 -3485679 -400946
2569 -400946 1605803 1526820 -728111 -3202394 -3273743 -787993 1474178 1411858 212066
2560 212066 -222743 -835699 -3681641 -7533304 -8699234 -6492492 -4379661 -4552759 -4786309
2551d786309K083274K679007L73060j274740l19460M50754j156395k781615j806241
2542f538665J35895L45694k85021M50104J556951O95452j097854p97478J332151
2533d202771K031700M88102n73764K13739P38491m96961j579656n52156J064067
2524b869209O64827j135518j242624J375548M066831L804027Q46943j650343j426855
2515B433627J45095j45447k788059m231343j410723L581992N570309K656630j918871
2506C893210m418261m427395l256427j356821Q40813J724863N28827p45806L21827
2497f895170L109327M787968L927100J434177j361696l524436l939573k158788
2489d621091K37205J115651O74769R07248K137006K375769P47309p01676O2471
$$ plain form
2551 -4786309 -2703035 -24028 349032 -925708 -1245168 -794414 -1950809 -4732424 -6538665
2542 -6538665 -6402770 -6057076 -6342097 -5891993 -4335042 -3639590 -4737444 -5534922 -4202771
2533 -4202771 -2171071 -1682969 -2256733 -2042994 -1304503 -1801464 -3381120 -3933276 -2869209
2524 -2869209 -2204382 -3339900 -4582524 -3206976 859855 4663882 5510825 3860482 2433627
2515 2433627 2578722 2433275 -354784 -4586127 -5996850 -2414858 3155451 5812081 3893210
2506 3893210 -525051 -4952446 -8208873 -9565694 -8724881 -7000018 -6471191 -7216997 -6895170
2497 -6895170 -3785843 1002125 4929225 6363402 5001706 1477270 -2462303 -4621091
2489 -4621091 -4383886 -3268235 -2593466 -1686218 450788 2826557 3573866 2872190 2934661
2480B934661J982468K397061O34136j449041k133640j739896j706366k494353
2472a574970k837824j244655J757802L557872K384385l15791j663219j049310
2464i85710l21459l78878J57080K094020L605896K570327l89635k736146k967590
2455F47905j492248M73709J590395Q90797j093928k510335k553040k457053k883695
2446i387493k081846J149781M227248L591790K3810k208719j476712n47047j517583
2437h226771k600691j684099M1446N13779M69260J745111L453891K968049J98717
2428c121308j825268q50890K018343L885608K986906J80775j595302o0920L249962
2419D867906L883232L0679m430850m768377j664605M85588K57275M0072O35601
$$ plain form
2480 2934661 4917129 7314190 7948326 6499285 4365645 2625749 919383 -1574970
2472 -1574970 -4412794 -5657449 -3899647 -341775 2042610 1726819 63600 -985710
2464 -985710 -1307169 -1686047 -1528967 565053 4170949 6741276 6351641 3615495 647905
2455 647905 -844343 -370634 1219761 2110558 1016630 -1493705 -4046745 -6503798 -9387493
2446 -9387493 -11469339 -10319558 -6092310 -2500520 -2476710 -4685429 -6162141 -6709188 -8226771
2437 -8226771 -10827462 -12511561 -12470115 -11956336 -11487076 -9741965 -6288074 -3320025 -3121308
2428 -3121308 -4946576 -5797466 -3779123 106485 3093391 3274166 1678864 1617944 4867906
2419 4867906 8751138 8781817 4350967 -417410 -2082015 -1596427 -1339152 -1299080 -663479
2410f63479p4668k069385j768878J941674M721769L156360K43125L11045J778224
2401G575787K68290l216806l358549O66567L470412J694289j349127j453181N20111
2392D817793J319062M42253n75496j411386k326376k225185l95597J220376L79896
2383A245340j799586k168526Q9938K711868L480856K142621k62275k176640k214336
2374A049260o71839L98148K7576n6513J587647L211195K449943K85005o67608
2365G612814o80546k117091m616530m958487k093609J247750K712191K794915
2357i8593K278166N62455k035597l339735k375062q81771l17631J28755J113484
2348d965529J476374P57674O78622K086177L008979J967882O27438O36127M59146
$$ plain form
2410 -663479 -738147 -2807532 -4576410 -2634736 2087033 5243393 5486518 5797563 7575787
2401 7575787 7844077 4627271 1268722 1935289 5405701 7099990 5750863 4297682 4817793
2392 4817793 6136855 6579108 6003612 4592226 2265850 40665 -354932 865444 1245340
2383 1245340 -554246 -2722772 -2632834 79034 3559890 5702511 5440236 3263596 1049260
2374 1049260 377421 775569 803145 746632 2334279 5545474 7995417 8280422 7612814
2365 7612814 6932268 4815177 198647 -4759840 -6853449 -5605699 -2893508 -98593
2357 -98593 2179573 2742028 706431 -2633304 -5008366 -5890137 -6207768 -6079013 -4965529
2348 -4965529 -3489155 -2731481 -2052859 33318 3042297 5010179 5637617 6273744 6732890
2339F732890j548861l287651j857733J268527J950448n77021l044932l157159
2331c521492j814700l97993R08778J738591J332108K26887j32356L03234L98841
2322i58102K31697R14417K113191K221296J051160n3429p34667j716473k477919
2313E91171j604587M56908J799096K229703L003345L423590J398387k149577l469306
2304E678730j703871l37522j292426j862694o205J522669j49388k744532k448784
2295c344023j57509L86109j104779j587659j22756J230302J567909K005945K282732
2286A156271N40042k775656m418073k901773m81642O29430J111063K121060K740079
2277b279199J821361L36908k33121l84891j437791k953938l309548k272175j158897
$$ plain form
2339 6732890 5184029 1896378 38645 1307172 3257620 2680599 -364333 -3521492
2331 -3521492 -5336192 -5734185 -4825407 -3086816 -1754708 -1527821 -1660177 -1356943 -958102
2322 -958102 -726405 188012 2301203 4522499 5573659 5520230 4785563 3069090 591171
2313 591171 -1013416 -556508 1242588 3472291 6475636 9899226 11297613 9148036 5678730
2304 5678730 3974859 3637337 2344911 482217 476012 1998681 1849293 -895239 -3344023
2295 -3344023 -3501532 -3115423 -4220202 -5807861 -5930617 -4700315 -3132406 -1126461 1156271
2286 1156271 1696313 -1079343 -5497416 -8399189 -8880831 -8251401 -7140338 -5019278 -2279199
2277 -2279199 -457838 -120930 -354051 -738942 -2176733 -5130671 -8440219 -10712394 -11871291
2268a1871291n55291M60055K426940M102815L836419J869244L50607P98248K144589
2259C562335K043591n9825k173279k359448j042305j7379j03350p46739j188814
2250b085213r32909L01268J966580K644411J708658K91943n34282j385695k725947
$$ plain form
2268 -11871291 -12426582 -11966527 -9539587 -5436772 -1600353 268891 619498 1417746 3562335
2259 3562335 5605926 5546101 3372822 1013374 -28931 -46310 -149660 -896399 -2085213
2250 -2085213 -3018122 -2716854 -750274 1894137 3602795 3894738 3360456 1974761 -751186
$$ [...]
##END NTUPLES=NMR SPECTRUM
##END=
