##TITLE=31P_DE-80H_X3
 64 sc D2O
 26.2.2025
##JCAMPDX= 6.0         $$ Bruker NMR JCAMP-DX V2.0
##DATA TYPE= NMR SPECTRUM
##DATA CLASS= NTUPLES
##ORIGIN= UXNMR, Bruker Analytische Messtechnik GmbH
##OWNER= root
$$ XWIN-NMR		Version 3.5
$$ Thu May 15 15:02:15 2025 Russian Standard Time (UT+4h)  Yarkov@DPX200
##.OBSERVE FREQUENCY= 81.013821
##.OBSERVE NUCLEUS= ^31P
##.ACQUISITION MODE= SIMULTANEOUS
##.ACQUISITION SCHEME= undefined
##.AVERAGES= 64
##.DIGITISER RES= 17
##SPECTROMETER/DATA SYSTEM= spect
##.PULSE SEQUENCE= zgpg30
##.SOLVENT NAME= CDCl3
##.SHIFT REFERENCE= (INTERNAL, CDCl3, 0, 198.062)
##AUDIT TRAIL= $$ (NUMBER, WHEN, WHO, WHERE, WHAT)
$$ ##TITLE= Audit trail, XWIN-NMR		Version 3.5
$$ ##JCAMPDX= 5.01
$$ ##ORIGIN= Bruker BioSpin GmbH
$$ ##OWNER= Yarkov
$$ C:/Bruker/XWIN-NMR/data/yarkov2/nmr/P31/2/pdata/1/auditp.txt
$$ ##AUDIT TRAIL=  $$ (NUMBER, WHEN, WHO, WHERE, WHAT)
(   1,<2025-05-15 15:01:11.17 +0400>,<Yarkov>,<DPX200>,
      <created by zg, POWCHK disabled, PULCHK disabled
       configuration hash MD5:
       00 E9 B6 7A A2 85 ED C7 34 08 36 98 17 FE 4E 26
       data hash MD5: 32K
       43 1A 07 F9 AF 41 42 91 22 12 83 06 E1 93 F0 A3>)
(   2,<2025-05-15 15:01:17.85 +0400>,<Yarkov>,<DPX200>,
      <Start of raw data processing
       efp BC_mod = 2 LB = 1.5 FT_mod = 6 PKNL = 1 PHC0 = 1749.863 PHC1 = 109.5595 SI = 64K 
       data hash MD5: 64K
       2E AC 81 4C 71 06 2A 78 40 F2 2F 4E 2B CF 78 87>)
(   3,<2025-05-15 15:01:47.03 +0400>,<Yarkov>,<DPX200>,
      <pk PHC0 = 43.37745 PHC1 = -32.6 
       data hash MD5: 64K
       2D 45 35 52 A2 8D 8D 30 DB BB 83 D1 7D 23 0A 34>)
(   4,<2025-05-15 15:01:50.79 +0400>,<Yarkov>,<DPX200>,
      <abs ABSG = 5 
       data hash MD5: 64K
       18 B7 E0 D8 2E 5D C2 54 31 C8 BE 72 30 90 D7 B3>)
$$ ##END=
$$ 
$$ hash MD5
$$ 91 98 BF 5B A5 C6 01 9B 0C 8D 04 98 13 35 69 08
##$RELAX= 
##$RELAX= 
##$RELAX= 
##$RELAX= 
##$RELAX= 
##$RELAX= 
##$RELAX= 
##$RELAX= 
$$ Bruker specific parameters
$$ --------------------------
##$DU= <C:/Bruker/XWIN-NMR>
##$EXPNO= 2
##$NAME= <P31>
##$PROCNO= 1
##$TYPE= <nmr>
##$USER= <yarkov2>
##$AMP= (0..31)
100 100 100 100 100 100 100 100 100 100 100 100 100 100 100 100 100 100 
100 100 100 100 100 100 100 100 100 100 100 100 100 100 
##$AQSEQ= 0
##$AQ_mod= 1
##$AUNM= <au_zg>
##$AUTOPOS= <>
##$BF1= 81.014009
##$BF2= 200.13
##$BF3= 200.13
##$BF4= 200.13
##$BF5= 200.13
##$BF6= 200.13
##$BF7= 200.13
##$BF8= 200.13
##$BYTORDA= 1
##$CFDGTYP= 0
##$CFRGTYP= 5
##$CHEMSTR= <none>
##$CNST= (0..31)
1 1 145 1 1 1 1 1 1 1 1 1 1 1 1 1 1 1 1 1 1 1 1 1 1 1 1 1 1 1 1 1 
##$CPDPRG= <waltz16>
##$CPDPRG1= <>
##$CPDPRG2= <waltz16>
##$CPDPRG3= <>
##$CPDPRG4= <mlev>
##$CPDPRG5= <mlev>
##$CPDPRG6= <mlev>
##$CPDPRG7= <mlev>
##$CPDPRG8= <mlev>
##$CPDPRGB= <>
##$CPDPRGT= <>
##$D= (0..31)
0 1 0 0 0 0 0 0 0 0.06 0 0.03 2e-05 3e-06 0 0 0.0002 0 0 0 0 0 0 0 0 0 
0 0 0 0 0 0 
##$DATE= 1747306870
##$DBL= (0..7)
120 120 120 11 120 120 24 19 
##$DBP= (0..7)
150 150 150 150 150 150 150 150 
##$DBP07= 0
$$ [...]
##$SUBNAM3= <"">
##$SUBNAM4= <"">
##$SUBNAM5= <"">
##$SUBNAM6= <"">
##$SUBNAM7= <"">
##$SUBNAM8= <"">
##$SUBNAM9= <"">
##$SW= 400.765351723535
##$SWIBOX= (0..15)
0 1 3 0 0 0 0 0 0 0 0 0 0 0 0 0 
##$SW_h= 32467.5324675325
##$TD= 32768
##$TD0= 1
##$TE= 0
##$TE2= 300
##$TE3= 300
##$TEG= 300
##$TL= (0..7)
0 120 53 12 22 120 120 120 
##$TP= (0..7)
150 150 150 150 150 150 150 150 
##$TP07= 0
##$TPNAME0= <>
##$TPNAME1= <>
##$TPNAME2= <>
##$TPNAME3= <>
##$TPNAME4= <>
##$TPNAME5= <>
##$TPNAME6= <>
##$TPNAME7= <>
##$TPOAL= (0..7)
0.5 0.5 0.5 0.5 0.5 0.5 0.5 0.5 
##$TPOFFS= (0..7)
0 0 0 0 0 0 0 0 
##$TUNHIN= 0
##$TUNHOUT= 0
##$TUNXOUT= 0
##$USERA1= <user>
##$USERA2= <user>
##$USERA3= <user>
##$USERA4= <user>
##$USERA5= <user>
##$V9= 5
##$VALIST= <valist>
##$VCLIST= <CCCCCCCCCCCCCCC>
##$VD= 0
##$VDLIST= <DDDDDDDDDDDDDDD>
##$VPLIST= <PPPPPPPPPPPPPPP>
##$VTLIST= <TTTTTTTTTTTTTTT>
##$WBST= 1024
##$WBSW= 4
##$XGAIN= (0..3)
0 0 0 0 
##$XL= 0
##$YL= 0
##$YMAX_a= 18117
##$YMIN_a= -7311
##$ZGOPTNS= <>
##$ZL1= 120
##$ZL2= 120
##$ZL3= 120
##$ZL4= 120
##$ABSF1= 198.0616
##$ABSF2= -202.7028
##$ABSG= 5
##$ABSL= 3
##$ALPHA= 0
##$AQORDER= 0
##$ASSFAC= 0
##$ASSFACI= 0
##$ASSFACX= 0
##$ASSWID= 0
##$AUNMP= <proc_1d>
##$AZFE= 0.1
##$AZFW= 0.5
##$BCFW= 0
##$BC_mod= 2
##$BYTORDP= 0
##$COROFFS= 0
##$CY= -3
##$DATMOD= 1
##$DC= 0
##$DFILT= <>
##$DTYPP= 0
##$F1P= 0
##$F2P= 0
##$FCOR= 1
##$FTSIZE= 65536
##$FT_mod= 6
##$GAMMA= 0
##$GB= 0
##$INTBC= 1
##$INTSCL= 9.790993e-09
##$ISEN= 30
##$LB= 1.5
##$LEV0= 0
##$LPBIN= 0
##$MAXI= 10000
##$MC2= 0
##$MEAN= 0
##$ME_mod= 0
##$MI= 50
##$NCOEF= 0
##$NC_proc= -8
##$NLEV= 6
##$NOISF1= 182.463
##$NOISF2= 159.3651
##$NSP= 0
##$NTH_PI= 0
##$NZP= 0
##$OFFSET= 198.0616
##$PC= 4
##$PHC0= 1793.24
##$PHC1= 76.9595
##$PH_mod= 1
##$PKNL= yes
##$PPARMOD= 0
##$PSCAL= 0
##$PSIGN= 0
##$REVERSE= no
##$SF= 81.0140089999434
##$SI= 65536
##$SIGF1= 159.3651
##$SIGF2= -187.1042
##$SINO= 113.3802
##$SIOLD= 16384
##$SREGLST= <1H.CDCl3>
##$SSB= 0
##$STSI= 65536
##$STSR= 0
##$SW_p= 32467.5324675325
##$SYMM= 0
##$S_DEV= 0
##$TDeff= 32768
##$TDoff= 0
##$TI= <>
##$TILT= no
##$TM1= 0
##$TM2= 0
##$TOPLEV= 0
##$USERP1= <user>
##$USERP2= <user>
##$USERP3= <user>
##$USERP4= <user>
##$USERP5= <user>
##$WDW= 1
##$XDIM= 65536
##$YMAX_p= 284063184
##$YMIN_p= -58625212
$$ End of Bruker specific parameters
$$ ---------------------------------
##NTUPLES= NMR SPECTRUM
##VAR_NAME=  FREQUENCY,     SPECTRUM/REAL,   SPECTRUM/IMAG
##SYMBOL=    X,             R,               I
##VAR_TYPE=  INDEPENDENT,   DEPENDENT,       DEPENDENT
##VAR_FORM=  AFFN,          ASDF,            ASDF
##VAR_DIM=   65536,         65536,           65536
##UNITS=     HZ,            ARBITRARY UNITS, ARBITRARY UNITS
##FACTOR=    0.49542278885378, 1,            1
##FIRST=     16045.7642231865, 0,            0
##LAST=      -16421.768244346, 0,            0
##MIN=       -16421.768244346, -58625212,    0
##MAX=       16045.7642231865, 284063184,    0
$$ Real data points
##PAGE= N=1
##DATA TABLE= (X++(R..R)), XYDATA
$$ [...]
##PAGE= N=2
##DATA TABLE= (X++(I..I)), XYDATA
6753C309192n13482j594275N91220L602661M428077K491353p80853l251228l289613
6744D993052j432748j91061q07915j495357n12597P86402K83034j207190j353496
6735i37876j17223Q07435J284463K345445L296945K449403K86810j208602j950212
6726F256588l162413l824457j611897K306585L510295N90010k532831k319357
6718g87477l13037J67182q29813r58316J26457O27120l8218l81525O46458K181695
6708D40526K861741K579655K293405K432363J980868k32634l208024m037601j658162
6699C452137J013144P30437j452704k039300p69739p07223k551743l148723r82748
6690f456462J030655N22150m44534M61382J310335m80501k825258j939699J138723
$$ y = [3309192, 2795710, 1201435, 1792655, 5395316, 9823393, 12314746, 11533893, 8282665, 4993052, 3560304, 3369243, 2561328, 1065971, 553374, 1339776, 1622810, 415620, -937876, -1055099, -247664, 1036799, 3382244, 6679189, 9128592, 9415402, 8206800, 6256588, 3094175, -730282, -2342179, -35594, 3474701, 4064711, 1531880, -787477, -1100514, -933332, -1763145, -2721461, -2595004, -1967884, -2006102, -2387627, -1741169, 440526, 3302267, 5881922, 8175327, 10607690, 12588558, 12355924, 9147900, 5110299, 3452137, 4465281, 5195718, 3743014, 1703714, 933975, 226752, -2324991, -5473714, -6456462, -5425807, -4903657, -5348191, -4886809, -3576474, -4056975, -6882233, -8821932, -7683209]
6681g683209J942642l04910j875760q46132O48847J282116K832351N683475O305630
6672G985050K259860l268444n173337k782818L76018J740530J744094J442041
6664D322994Q82908J7117o82781r18913q58271p11215o73679q84593r13827j35903
6654e56163P88462J71530j849549k313354P95849M963167N718182K271203j773109
6645H216218l125696j835362M40442K489682L101591J127123k466038m405516
6637C542444k660465R64482L051469K272355j81564k448342k958544j071755J563820
6628B073900J747766j169410l409244j579795K008958K350522o36755j884911
6620d98969P53379K905045N73987l414310l707864l77152K006614J737814J448228
$$ y = [-7683209, -5740567, -6045477, -7921237, -8767369, -8118522, -6836406, -4004055, 1679420, 7985050, 10244910, 6976466, 1803129, -979689, -603671, 1136859, 2880953, 4322994, 5205902, 5223019, 4540238, 3621325, 2763054, 2051839, 1378160, 493567, -420260, -556163, 232299, 403829, -1445720, -3759074, -2963225, 1999942, 7718124, 9989327, 8216218, 5090522, 3255160, 3695602, 6185284, 9286875, 10413998, 7947960, 3542444, 881979, 1846461, 4897930, 7170285, 6988721, 4540379, 1581835, 510080, 2073900, 3821666, 2652256, -756988, -2336783, -327825, 2022697, 1385942, -498969, 254410, 3159455, 3733442, 319132, -3388732, -3765884, -1759270, -21456, 1426772]
6611A426772K338792J959575q39476l099810k361434o16474o50344j277276Q9704
6602c029971K164591J480490j402926j975627J284687M245386L179119O776j109198
6593D843327K58224J392887J224889R87767Q58404m26687k317163k170562N91298
6584E242384K815523J826935q50910j958671r54912K65712Q23049J378547J760644
6575A0348301P78268j313293k479884j777623p04306q12904j547834j480280m61867
6566E48578M61891L72955r50432k747424l122816p39095K620272L169336J91114
6557a95621k137602k81021L163632K825241j534488m455099k568722R74737J699028
6548b509915J40745L2855K187263L679108K595900M22817q72050j623004l033028
$$ y = [1426772, 3765564, 5725139, 4885663, 1785853, -575581, -1192055, -1842399, -3119675, -3029971, -865380, 615110, -787816, -2763443, -1478756, 2766630, 5945749, 5952525, 4843327, 5101551, 6494438, 7719327, 8707094, 9565498, 9138811, 6821648, 4651086, 5242384, 8057907, 9884842, 9033932, 7075261, 6120349, 6386061, 7209110, 8587657, 10348301, 11126569, 9813276, 7333392, 5555769, 4851463, 4038559, 2490725, 1010445, 548578, 1010469, 1383424, 432992, -2314432, -5437248, -6176343, -3556071, -386735, -195621, -2333223, -2614244, 549388, 3374629, 1840141, -2614958, -5183680, -4208943, -2509915, -2369170, -2336315, -149052, 3530056, 6125956, 6548773, 5676723, 4053719, 1020691]
6539A020691m557127m371991j974254R35256K273672J637478L85464L6425Q07754
6530c806632J642426J502314N09317k44430L2180Q86014J110516K16186q69311
6521I78580r41092j64238J54797m25094o97926K89471J504005J282146k19027
6512A761622j386534j585130j494053j089248O27663L308277M699392L559529
6504H401518J471927M55433L66279K10157L49020J209678J148070j559290n122641
6495F930151n633221k361460J067012J604384L57445q5976M20092L95447j25161
6486B568713K26827J351083J341679o88776l035288l355996j340240J176028K293260
6477E37290J737170O01422j42560m71593o27373l26043N61636J031740J5392j547827
$$ y = [1020691, -3536436, -7908427, -9882681, -8947425, -6673753, -5036275, -4650811, -4614386, -3806632, -2164206, -661892, -152575, -397005, -364825, 521189, 1631705, 1847891, 978580, 37488, -126750, 28047, -397047, -1094973, -805502, 698503, 1980649, 1761622, 375088, -1210042, -2704095, -3793343, -3165680, 142597, 4841989, 8401518, 9873445, 10328878, 10695157, 10905314, 11254334, 12464012, 13612082, 12052792, 6930151, 1296930, -1064530, 2482, 1606866, 1964311, 1878335, 2298427, 2693874, 2568713, 2795540, 4146623, 5488302, 4799526, 1764238, -1591758, -2931998, -1755970, 537290, 2274460, 2875882, 2733322, 2261729, 1634356, 1308313, 1869949, 2901689, 2917081, 1369254]
6467A369254j355388R13667K595551J606983n39286j083738j38709o8613j385882
6458A913839k056854j148553l92027j040566j621989n26987J139262J429649P88922
6449a515304R20686J384228K13535k191978k773870k48869K715064L201176J859807
6440C564475J177299J572327J541739P51666M25451P83960N21110o62844j155845
6431H519338r3096Q37980k83687k670780l808812k730918p88122N29028J020588
6422E31519R67710L29376o96622j302994r76904k47314l685m53467j139242j564535
6412d556158j374334l60958J082229J791505R10777p93906j446849k55569J420322
6403c582941J793284R45835M37880P67293N43453j210156l095310k914781o14740
$$ y = [1369254, 13866, 927533, 3523084, 5130067, 4590781, 3507043, 3368334, 3299721, 1913839, -143015, -1291568, -1683595, -2724161, -4346150, -4873137, -3733875, -2304226, -1515304, -594618, 789610, 1003145, -1188833, -3962703, -4211572, -1496508, 1704668, 3564475, 4741774, 6314101, 7855840, 8607506, 9032957, 9816917, 10338027, 9675183, 8519338, 8426242, 9264222, 8980535, 6309755, 2500943, -229975, -1018097, -489069, 531519, 1499229, 1828605, 1131983, -171011, -1147915, -1395229, -1398914, -1852381, -2991623, -4556158, -5930492, -6291450, -5209221, -3417716, -2506939, -3300845, -4747694, -5003263, -3582941, -1789657, -843822, -405942, 361351, 904804, -305352, -3400662, -6315443, -6930183]
6394f930183J689902K374359J636241L47411p73212p25739J055882K914144K030304
6385C619109j447095l485352j412728J846535J659176j517984k840254k96417
6377c875010K663109K606370N82448p05648j002103j238477p97175Q33787J596268
6368F63569m07460k918868k105474J264385K318296o38257l383814k064108J364433
6359e907298K696662J672700J084184J431847N17442j977996l401795k430567
6351f314821j097639r51518j77812K906784N709336M183691r16450m094834k045923
6342b799186K326009M140680K461591Q7633q21622n03269J29306M75007l37498
6333E158651k726504m983042m350490n56028L316388M267024K334001n03632k737068
$$ y = [-6930183, -5240281, -2865922, -1229681, -882270, -1655482, -2381221, -1325339, 1588805, 3619109, 2172014, -1313338, -2726066, -879531, 779645, -738339, -3578593, -3875010, -1211901, 1394469, 1976917, 1271269, 269166, -969311, -1766486, -932699, 663569, 256109, -2662759, -4768233, -3503848, -1185552, -1823809, -5207623, -7271731, -5907298, -3210636, -1537936, -453752, 978095, 1495537, -482459, -3884254, -6314821, -7412460, -8363978, -8541790, -5635006, 74330, 4258021, 3341571, -753263, -2799186, -473177, 3667503, 6129094, 6216727, 5395105, 4891836, 5021142, 5496149, 5158651, 2432147, -2550895, -6901385, -7457413, -4141025, 125999, 2460000, 1956368, -780700]
6324g80700l654074k817805o12849J687172L380890M701712N015600K650260k008693
6315G561513n377955m865032k358952r61342k08778J943805M071862K932751l27516
6306B410356q59789K148522L660689P73656k497925j729722R61272Q31297j904204
6297C794152l335022k547038j930160j959832p53733J406180J901076N46109J41637
6288b736631J465801J894650J86462j367729j135651o63943j074579o37722J578084
6279b491258L021830J666450j50659O57426K670510K071095j303702l682790k697711
6270b38809O9147J834569J485994k77475j742756j325931N38019J335198j77890
6261A500066j829676j239044L82530M09838n60615K07362K503894L076391R01590
$$ y = [-780700, -4434774, -7252579, -7865428, -6178256, -2797366, 1904346, 6919946, 9570206, 7561513, 2183558, -2681474, -5040426, -6001768, -6210546, -4266741, -194879, 2737872, 2410356, 1550567, 3699089, 7359778, 8133434, 5635509, 3905787, 4867059, 5698356, 3794152, 459130, -2087908, -4018068, -5977900, -6731633, -5325453, -3424377, -2878268, -2736631, -1270830, 623820, 810282, -557447, -1693098, -2357041, -3431620, -4069342, -2491258, 530572, 2197022, 2046363, 2703789, 5374299, 7445394, 6141692, 2458902, -238809, -169662, 1664907, 3150901, 2873426, 1130670, -195261, 342758, 1677956, 1500066, -329610, -1568654, -1186124, -776286, -1336901, -1129539, 1374355, 4450746, 5352336]
6252E352336j217289j323885j127995k533799m238552l845385j345268J375221
6244h904616L018504L390591K725005J708179J114169P13621k37013j173884o66774
6235A687782J031146J993571J551705Q30747Q9656j392726k222131L49860N013792
6226H933402O119076J623017k894120k156263O92205p48321n605620o876457k271084
6217c184165K611433K925234O86590Q7314J277504J647149J30042k380072m663131
6208h62102n287592l180694L35346K153226J343968K62837N39511P41570l32979
6199d286909j008844K47461J729934J138331p69866j878724k068872j995494n51948
6190i444931K917573N431544L483604j248311l299985o65409L015954L991102
$$ y = [5352336, 4135047, 2811162, 1683167, -850632, -5089184, -8934569, -10279837, -8904616, -5886112, -2495521, 229484, 1937663, 3051832, 3765453, 3528440, 2354556, 1687782, 2718928, 4712499, 6264204, 7094951, 7184607, 5791881, 3569750, 3919610, 8933402, 15052478, 16675495, 13781375, 11625112, 12317317, 11568996, 5963376, -913081, -3184165, -572732, 2352502, 3039092, 3126406, 4403910, 6051059, 6181101, 3801029, -862102, -6149694, -9330388, -8995042, -6841816, -5497848, -5235011, -4695500, -3953930, -4286909, -5295753, -5048292, -3318358, -2180027, -2949893, -4828617, -6897489, -8892983, -9444931, -6527358, -1095814, 2387790, 1139479, -2160506, -2825915, 190039, 4181141]
6182D181141K506614M06691j815626l688496l381734j45306L612908M854337L363551
6173I894080J058966q27199k079171k172791p89055P76267O40976j138778k474883
6164B888412j845792P8914J543634J519830K42227j274952j943343j318055P6571
6155c2554J262642J624220J093347j67328j801130l031452k905196j149677J186460
6146c920668K262385J105482j148494k226597j264487K65753O92810K60950J8237
6137c954629l76208j766255k923730j473682K117865M100680K318424p26171j498171
6128d181877j37226P70477M83504K92328L80968l50744j530322j443678k41699
6119e958269m6492j131997j016352J312945L210595K454010R19389J456930L107115
$$ y = [4181141, 6687755, 7094446, 5278820, 1590324, -1791410, -1936716, 1676192, 6530529, 9894080, 10953046, 10125847, 8046676, 5873885, 5084830, 5861097, 6502073, 5363295, 2888412, 1042620, 1121534, 2665168, 4184998, 4427225, 3152273, 1208930, -109125, -32554, 1230088, 2854308, 3947655, 3780327, 1979197, -1052255, -3957451, -5107128, -3920668, -1658283, -552801, -1701295, -3927892, -5192379, -4926626, -4233816, -3972866, -3954629, -4330837, -6097092, -9020822, -10494504, -8376639, -4275959, -1957535, -2683706, -4181877, -4319103, -3548626, -3065122, -2772794, -2391826, -2742570, -4272892, -5716570, -5958269, -6004761, -7136758, -8153110, -6840165, -3629570, -1175560, -256171, 1200759, 4307874]
6110D307874K733953K58147j317643q44976m20808j260047j590682j67766J044941
6101B742993j3897j853814j607752M53381J488612O71813K30306J450657K370887
6092E933186Q78548j839532k878998j604176o8822J91659j57377q7656L9969m16161
6082i360p79346o8818R84224O76079p92650r68569J359324L772734L068564k19563
6072G022619k275227j141115P94131N53297j122493j315934L15441J047672m89421
6063C388970k026467j106675J138693J737774L67515l14643J149067K783651K147031
6054I264916j21003j357707o97979J2871p41895j842414j264796P65444J723522
6045E740959k5459l013008m280776k737391j07391J457453J798135K098767K442884
$$ y = [4307874, 7041827, 7299974, 5982331, 5137355, 4716547, 3456500, 1865818, 1698052, 2742993, 2729096, 875282, -732470, -279089, 1209523, 1881336, 2111642, 3562299, 5933186, 6811734, 4972202, 2093204, 489028, 420206, 611865, 454488, 366832, 406801, -9360, -788706, -857524, 126700, 802779, 10129, -958440, 400884, 4173618, 7242182, 7022619, 4747392, 3606277, 4400408, 4953705, 3831212, 2515278, 2830719, 3878391, 3388970, 1362503, 255828, 1394521, 3132295, 3499810, 3185167, 4334234, 7117885, 9264916, 9143913, 7786206, 7088227, 7101098, 6359203, 4516789, 3251993, 4017437, 5740959, 5715500, 2702492, -1578284, -4315675, -4423066, -2965613, -1167478, 931289, 3374173]
6036C374173J451726j215276l386473k837768n41941M64791m89663p35448J212159
6027b703720K584654M04076l013351k412765K487691N563305K587658k626246
6019B871302l658274m47222J584134K01340r61633Q50785K997717K237757K00332
6010E876238L62585K063438J757818r51828k809706k292945j389221j311977n17527
6001G86875J318635J239536k109869m616069j766270M113304O176110K344006
5993G486258k153477k532666n74527n81583k580888l244112j778838p64776j292218
5984h016827j129334J101236L055334K079311o29897j773816o40735N90494P73990
5975d590244J261112K909123M051498K852204J00534j914596k313067j902842
$$ y = [3374173, 4825899, 3610623, 224150, -2613618, -3155559, -2690768, -3180431, -3915879, -2703720, -119066, 285010, -2728341, -5141106, -2653415, 2909890, 5497548, 2871302, -786972, -1234194, 349940, 551280, -410353, 440432, 3438149, 5675906, 5876238, 6238823, 8302261, 10060079, 9108251, 6298545, 4005600, 2616379, 1304402, 786875, 2105510, 3345046, 1235177, -3380892, -5147162, -1033858, 5142252, 7486258, 5332781, 2800115, 2225588, 1644005, -936883, -4180995, -5959833, -6724609, -8016827, -9146161, -8044925, -4989591, -2910280, -3540177, -5313993, -5954728, -5364234, -4590244, -3329132, -420009, 3631489, 6483693, 6584227, 4669631, 2356564, 453722]
5967D53722j350241p56700o12750j341580j896787o61618J837087K914004J294577
5958a20286r10880j054526N91260J807152J751111J315608Q05413m01813j772262
5949B010777j506639O50005K380638J770695j95968j450923j790433k308725k896288
5940c336861k370807p63771N18918R58251J540543K663101L086054J827840j70943
5931C952325j269828j105394m57428M1759J37736l66206j107779r08112Q43469
5922b39458K877246L255630J775018P8984o01052o55932q37346j035774j036436
5913C580880j503366l027215m574793m203050j662579P37888P52871q07663q74495
5904a1581522J929679N258408N716523K778400j016411l238323l555658k718335
$$ y = [453722, -896519, -1653219, -2265969, -3607549, -5504336, -6165954, -4328867, -1414863, -120286, -1031166, -2085692, -1494432, 312720, 2063831, 3379439, 4184852, 3783039, 2010777, 504138, 1154143, 3534781, 5305476, 5109508, 3658585, 1868152, -440573, -3336861, -5707668, -6471439, -5952521, -4994270, -3453727, -790626, 2295428, 4123268, 3952325, 2682497, 1577103, 1119675, 1161434, 1299170, 932964, -174815, -1082927, -239458, 2637788, 5893418, 7668436, 7747420, 7146368, 6490436, 5653090, 4617316, 3580880, 2077514, -949701, -5524494, -9727544, -11390123, -10652235, -9899364, -10707027, -11581522, -9651843, -4393435, 1323088, 4101488, 3085077, -153246, -3708904, -6427239]
5896f427239j255756K36374R32839Q72715J226011K545086L651136L226650J641140
5887F648956J53615p80749j201799o60340Q30928J674951M81156j461929j591611
5878D093178K13078J563641J367401J221763K221512K785184J178844j611101
5870A3033500l273303l187319k420027j710943j056866n77675l55171J5561N57441
5861A025198M10509n83186q80393N10200J794351O16694k027521k620847k1459
5852a776454K889216L208709J554235M16512O66179J214254J067537K21346r11041
5843H550493j722084j466527j66985Q65360M63961o51306o82630O19444J253496
5834G063222n24799l676688n205413l464395p577K192151K002823J002549J101880
$$ y = [-6427239, -7682995, -7446621, -6513782, -5641067, -4415056, -1869970, 1781166, 5007816, 6648956, 6802571, 6021822, 4820023, 4159683, 4990611, 6665562, 7146718, 5684789, 4093178, 4306256, 5869897, 7237298, 8459061, 10680573, 13465757, 14644601, 13033500, 9760197, 6572878, 4152851, 2441908, 1385042, 807367, 452196, 467757, 1025198, 1435707, 852521, -27872, 482328, 2276679, 2893373, 865852, -1754995, -1776454, 1112762, 4321471, 5875706, 6292218, 6958397, 8172651, 9240188, 9461534, 8550493, 6828409, 5361882, 5194897, 6060257, 6524218, 5872912, 5190282, 5809726, 7063222, 6538423, 2861735, -2343678, -5808073, -5815650, -3623499, -1620676, -618127, 483753]
5825D83753K141915K514047J570589K44958p09328j746743l119764l595547j943764
5816d159884P60640J903961O71010q05671m25100R93416J199662R1317j70156
5807E9195J324774K695048K147872N31358n13672j298636k722895l386128j190261
5798b353345K338848K821104p74151l890556k461796J404003K698760N74588j405064
5789a047609j253747r88681k489980m167985l367288r2697L245046M608792L707077
5780a847072J565401k74466q03716m72190n42797j353168k057836k071529j488887
5771i346260K181K892360N965926O464060L348979q81690k888946k074852m91267
5762B990491j73677j575640l670906m575972l015705j17632J364037N84786r4401
$$ y = [483753, 2625668, 5139715, 6710304, 6955262, 6245934, 4499191, 1379427, -2216120, -4159884, -3399244, -1495283, -824273, -1629944, -2055044, -1061628, 138034, 229351, 59195, 1383969, 4079017, 6226889, 6758247, 6244575, 4945939, 2223044, -1163084, -2353345, -14497, 2806607, 2032456, -1858100, -4319896, -2915893, -217133, 357455, -1047609, -2301356, -3290037, -5780017, -9948002, -13315290, -13407987, -10162941, -5554149, -1847072, -281671, -556137, -1359853, -1832043, -2374840, -3728008, -5785844, -7857373, -9346260, -9344079, -6451719, -485793, 5978267, 9327246, 8445556, 5556610, 3481758, 2990491, 2816814, 1241174, -2429732, -7005704, -10021409, -10139041, -8775004, -8190218, -8284619]
5753h284619J273627K983865K243663k88142j286212L87760K414026K739488J894932
5744D078388R63842k07085j579339j921581q80349l35573j791314l640514l115455
5735h428980k95295J976056K088720J485778J891317K574414J793386q8148p67854
5726B229394P06033K433129K225810M86261p73225j020762j469445k309315j910175
5717E97705J99896J603138J83860k385851k851761j231240m56443j237500p82280
5708f360476K132513M188125K231996j490634k261325K18544J641560k37958k462830
5699b400485j600720J464044L507359L525167K869324K217120J061621k66373
5691A0377057n56062P2298o0050j629850l125460k910623j188279P12078J758257
$$ y = [-8284619, -7010992, -4027127, -1783464, -2071606, -3357818, -2970058, -556032, 2183456, 4078388, 5042230, 4835145, 3255806, 1334225, 453876, 118303, -1673011, -5313525, -8428980, -8724275, -6748219, -4659499, -3173721, -1282404, 1292010, 3085396, 2997248, 2229394, 2935427, 5368556, 7594366, 8080627, 7307402, 6286640, 4817195, 2507880, 597705, 797601, 2400739, 2584599, 198748, -2653013, -3884253, -4340696, -5578196, -6360476, -4227963, -39838, 2192158, 701524, -1559801, -1341257, 300303, 62345, -2400485, -4001205, -2537161, 970198, 4495365, 7364689, 9581809, 10643430, 10377057, 9820995, 9893293, 9833243, 8203393, 5077933, 2167310, 979031, 1691109, 3449366]
5682C449366J313950p49571l077602l362863j184964Q73597N11254j019008r23634
5673d169475P40413J305523p5743j178466n82735Q4159o35035j116996O01640
5664e026715K974829K786900p206k234800k130991j113227n07620N89022K865251
5655a804557M641385M134231K277759J227072J122660M35145j159468k464274
5647H409953l088346l788481m158812k341873J730341M693037L332756j019463
5639C769112l665247k086379J344062K641106Q02216j825264k854292k175879
5631d050565j031070J0756J395036L321317M939109N059220L379379P77489j463961
5622A2336710k519860k274054j130754K32157J106385J006454j64818k020196
$$ y = [3449366, 4763316, 4013745, 936143, -2426720, -3611684, -2738087, -2226833, -3245841, -4169475, -3429062, -2123539, -2199282, -3377748, -3960483, -3876324, -4511359, -5628355, -5026715, -2051886, 735014, 727808, -1506992, -3637983, -4751210, -5258830, -4669808, -1804557, 2836828, 6971059, 9248818, 10475890, 11598550, 12033695, 10874227, 8409953, 5321607, 1533126, -2625686, -4967559, -3237218, 1455819, 4788575, 3769112, 103865, -1982514, -638452, 2002654, 2804870, 979606, -1874686, -4050565, -5081635, -5070879, -3675843, -354526, 4584583, 9643803, 13023182, 13800671, 12336710, 9816850, 7542796, 6412042, 6644199, 7750584, 8757038, 8592220, 6572024]
5614F572024l653503m017937k842789j124019j63099j14354j61409j13144o18670
5605f236900j284554j11306L645557P079243O312642J477387l145248m360060
5597C376761l254907k275733j450661N00524K889810L424859J428807j312810
5589C326650k832020k525750o79285J826784L361910K793677J088940K45052O55636
5580G261594J143366J427489K316980L131154J570440k566056n856954n374099
5572C053914k580039r46796j084296q76085K78649M16349j313008k546640p98397
5563f396349K846669M790865L166349k42931k278780j707856K5238Q26893K31177
5554A261275m49356n579J060001J092313o89740l113401m184634l137750j088591
$$ y = [6572024, 2918521, -1099416, -3942205, -5066224, -5229323, -5343677, -5505086, -5618230, -6236900, -7521454, -7632760, -3987203, 3092040, 9404682, 10882069, 7736821, 3376761, 121854, -2153879, -3604540, -3104016, -214206, 3210653, 4639460, 3326650, 494630, -2031120, -2710405, -883621, 2478289, 5271966, 6360906, 6605958, 7261594, 8404960, 9832449, 12149429, 15280583, 16851023, 14284967, 8428013, 3053914, 473875, -472921, -1557217, -2433302, -2154653, -1738304, -3051312, -5597952, -6396349, -3549680, 1241185, 4407534, 4164603, 1885823, 177967, 203205, 1030098, 1261275, 811919, 806340, 1866341, 2958654, 2268914, -844487, -5029121, -8166871, -9255462]
5545i255462L65962Q05217Q87111R87825Q19455M36509N06065J043425R69185
5536b434708j95891j247768j081118m81914n82482o11986O37806J904476Q21251
5527c272334j915003k787002m70572K361302L282557L124135L138298K251308
5519E712689l08796k170178p86853K299556L229583Q90728k469081m729545n285412
5510c617309l859242r06724J299221Q85943o53199n19968Q42439N30137j674527
5501g673229k660703j045139Q72958J382176J878572L247870L285341N51727k021429
5492b181856q50599K728192M139771J980257n92169p86586N07276R37168j59667
5483E721787j786594k799767k479327q02367J141214K009414J940030K251503
$$ y = [-9255462, -8889500, -8084283, -7197172, -6209347, -5389892, -4953383, -4447318, -3403893, -2434708, -2630599, -3878367, -4959485, -5441399, -6023881, -6635867, -5998061, -4093585, -3272334, -5187337, -7974339, -8444911, -6083609, -2801052, 323083, 3461381, 5712689, 5403893, 3233715, 2446862, 4746418, 7976001, 8866729, 6397648, 1668103, -3617309, -7476551, -8383275, -7084054, -6198111, -6851310, -7371278, -6528839, -5998702, -7673229, -10333932, -11379071, -10506113, -9123937, -7245365, -3997495, -712154, -160427, -2181856, -3032455, -304263, 3835508, 5815765, 5223596, 4437010, 4944286, 5881454, 5721787, 3935193, 1135426, -1343901, -2146268, -1005054, 1004360, 2944390, 5195893]
5475E195893K952857K160646q13421l284014k163332J539746L550674J847819
5467A0986868j009378j965868j502626j712242k320631j450680O32849J652905
5459C311197J053105N64024P16933n6036j971325k779188j602755p47348j626237
5450c137630j970599J54996K401198J674218o34068q96978Q60766J514292L42957
5441C09152k96845M31273O79992l15287j004150o32543k87713l09322K13250R44566
5431b67627M37249r20705j309108r57979j617688k423341n77143L152777M289728
5422a93837J487667j095408l50425J335041Q67995n28968l92180N21552M37507
5413B088944J89848J054530J571275N1610k003248k284196j311553o23340K95042
$$ y = [5195893, 8148750, 10309396, 9495975, 6211961, 4048629, 5588375, 9139049, 10986868, 9977490, 8011622, 6508996, 4796754, 2476123, 1025443, 1658292, 3311197, 4364302, 4928326, 5645259, 5589223, 3617898, 838710, -764045, -1511393, -3137630, -5108229, -4953233, -2552035, -877817, -1511885, -2408863, -1548097, -33805, 309152, 12307, 443580, 1123572, 808285, -195865, -828408, -1116121, -1425443, -1212193, -267627, 169622, -751083, -2060191, -3018170, -4635858, -7059199, -7636342, -4483565, -193837, 1293830, 198422, -152003, 1183038, 2051033, 1522065, 1129885, 1651437, 2088944, 2278792, 3333322, 4904597, 4956207, 2952959, 668763, -642790, -1266130, -971088]
5404i71088K035279K658219O12028j919965k126359q77352m07790j21697J294586
5395A75861K003306q2990k516101j498114J536617J768926j354564l537271k476117
5386e980447k78696J110565K092721K560586J414699l80257m50783O89436J54520
5377I32344j983032k271274L54112K730442K554938J199332K76637m79552o72641
5368B641306J116832L586087K944792j117610l898029k481952r6813q80092l847201
5359b032680n162830l551824n15927K422830M105196L579407J755711J015827
5351A615710J526889P49814j739028k502992K76489L210221K712016L32363m07906
5342E773576L90342L22266q92180k054245l339584m814756m346821r15042K141505
$$ y = [-971088, 1064191, 3722410, 4334438, 2414473, 288114, -589238, -997028, -1118725, 175861, 2179167, 2096177, -419924, -1918038, -381421, 1387505, 32941, -3504330, -5980447, -6259143, -5148578, -3055857, -495271, 919428, 539171, 88388, 777824, 932344, -1050688, -3321962, -2967850, -237408, 2317530, 3516862, 3793499, 3313947, 2641306, 3758138, 7344225, 10289017, 9171407, 5273378, 2791426, 2694613, 1814521, -2032680, -7195510, -10747334, -11263261, -8840431, -4735235, -1155828, 599883, 1615710, 3142599, 3892413, 2153385, -349607, -73118, 3137103, 5849119, 6181482, 5773576, 6163918, 6486184, 5594004, 3539759, 200175, -4614581, -8961402, -9876444, -7734939]
5333g734939J422852r20706m23952K512606L643620J948438M45841M08691N5039
5324A357490q06051o7525J895167J746103j113171l047631k137277j062815j773958
5315e009668j741935J241583M299102L475784q5878k019270j087508K83332Q38114
5306A93656J827172L381594L188958Q5049l491227m300188k239411l5903L41064
5297a049236l17601k9557J752531L631747M053585K895498J109798m92344j481854
5288A0072567j424735k68365J050664J347911N44508n22090j439966k321779k759452
5279D279263k134098j165728j563330l426208m403222k541697J013752L347029
5271f594239L152858J674270O72301N63160N28989l22429k002825l433247l303422
$$ y = [-7734939, -6312087, -7232793, -7656745, -5144139, -1500519, 447919, 893760, 1302451, 1357490, 551439, 483914, 2379081, 4125184, 3012013, -35618, -2172895, -3235710, -5009668, -6751603, -5510020, -1210918, 2264866, 2178988, 159718, -927790, -644458, 193656, 2020828, 5402422, 8591380, 8676429, 5185202, 885014, -1354397, -1390300, -1049236, -1366837, -1396394, 356137, 3987884, 8041469, 10936967, 12046765, 11554421, 10072567, 8647832, 8379467, 9430131, 10778042, 11322550, 10800460, 9360494, 7038715, 4279263, 2145165, 979437, -583893, -4010101, -8413323, -10955020, -9941268, -6594239, -3441381, -1767111, -1094810, -531650, -2661, -325090, -2327915, -5761162, -9064584]
5262i064584j465413P80994K071606K246091J971425J765195J895710K475495
5254B676519K850195J709050r69821k767743j395092J726948K552053k85040l310044
5245B787025k796808J89468J515011k15832k179942j693374M46439J863156J859456
5236A774599J402396J195148J213917J358151J335683N02399j185511k663390
5228D933392l034532k591249j786375l11831J676296K680196J834339O98526J135172
5219E233934K211140J469739j107106k804391j982546l3616Q71572J77108j268073
5210B767761k158119j282577J184682K949239K057989m3136l08010J092771Q76080
5201G136680j732713l004335k55325L646801M107307J010203j907929k499615
$$ y = [-9064584, -10529997, -9749003, -7677397, -5431306, -3459881, -1694686, 201024, 2676519, 5526714, 7235764, 6265943, 3498200, 2103108, 3830056, 6382109, 6097069, 2787025, -9783, 179685, 1694696, 1478864, -701078, -2394452, -1948013, -84857, 1774599, 3176995, 4372143, 5586060, 6944211, 8279894, 8782293, 7596782, 4933392, 1898860, -692389, -2478764, -2790595, -1114299, 1565897, 3400236, 4098762, 5233934, 7445074, 8914813, 7807707, 5003316, 3020770, 2987154, 3858726, 4035834, 2767761, 609642, -672935, 511747, 3460986, 5518975, 5475839, 5167829, 6260600, 7136680, 5403967, 2399632, 2144307, 5791108, 9898415, 10908618, 9000689, 6501074]
5193F501074j914199j492594r97612k35342M722n28565p49235J02956J098843
5184A790048R18701n2577j2364J716250L335488K681223K42665j435083j503984
5175G680367j835447l223872l152528J14789L392130K282448k106214m366782
5167a215109k445827K54163P43803j11526r22476j843313j783677J566121O613563
5158H55722P658107K992357j419751l20156L084779K573212j501198l688656k115355
5149H119061K7668L88898l39098j386544k455570j963782R28271L289459J756646
5140H365009j908654l126905j533904o82743j220075n5061L101674M124013J211243
5131H274597j708026p99635K352276L732941K055160j258563m391891n370219
$$ y = [6501074, 4586875, 3094281, 2096669, 1861327, 1866049, 1337484, 588249, 691205, 1790048, 2708749, 2656172, 2643808, 4360058, 7695546, 10376769, 10619434, 9184351, 7680367, 5844920, 2621048, -531480, -416691, 2975439, 5257887, 3151673, -1215109, -3660936, -3406773, -2662970, -2774496, -3696972, -5540285, -7323962, -5757841, 855722, 8513829, 11506186, 10086435, 9766279, 12851058, 15424270, 13923072, 10234416, 8119061, 8146729, 8535627, 8196529, 6809985, 4354415, 2390633, 3318904, 6608363, 8365009, 6456355, 3329450, 1795546, 1112803, -107272, -162333, 2939341, 7063354, 8274597, 6566571, 5766936, 8119212, 11852153, 13907313, 12648750, 8256859, 2886640]
5123B886640k700505J976264M141499J593678k321705k772827N32634L340518
5115F676196K260782j387244l395014j847117K42452j294092n478783o389735
5107a0612555j199012N073999N999417K320779j46939O86969J575743L22811j482457
5098B538755k335939k611555j966488M59670K681489J415058k162947k969941
5090d951898M97790L946963L935135J999883N12678p92566k086396j808297l5288
5081A218004P20358M5018N39028K428372K382599o7696o21049K228545L627412
5072A2500591M26206k971257j877340R15769N84849j259936l72650J685762M10043
5063A0042037k866794k742355R26428K851039J201601l50125j782n16335l044407
$$ y = [2886640, 186135, 2162399, 6303898, 7897576, 5575871, 2803044, 3335678, 6676196, 8936978, 7549734, 4154720, 2307603, 2550055, 1255963, -4222820, -10612555, -11811567, -6737568, -738151, 1582628, 1435689, 2122658, 3698401, 4021212, 2538755, 202816, -2408739, -4375227, -3915557, -1234068, 180990, -1981957, -4951898, -4454108, -507145, 3427990, 5427873, 5940551, 5147985, 3061589, 1253292, 1218004, 1938362, 1983380, 2522408, 4950780, 7333379, 7265683, 6644634, 8873179, 12500591, 12926797, 9955540, 8078200, 8993969, 9578818, 8318882, 7946232, 9631994, 10042037, 7175243, 4432888, 5359316, 8210355, 9411956, 9061831, 9060049, 8543714, 5499307]
5054E499307m288282k180152N55413J085849O14981J196331J839369O82043j351182
5045C653677j726441K23585K764883L674512J815181j852292m282903l061567
5037A208635L28082J818496L5882j808261m78313K764068M023023J974510q43747
5028I022375j712664q44383j26058n2080N46684J920647K384161Q64477j003249
5019A0999910j039640K46541P04869O3203j64605J53552k69889r80338K4512K285772
5009A2023887K549774l32716l463438m283453l629995k858796j439987N80844
5001h53880J288959M65682R14397L499814M508125J333784k619592k721510M2492
4992E858271J278749k6969j285248j196575o75310o2197Q00366P29921j119757
$$ y = [5499307, 1211025, -969127, -413714, 672135, 1287116, 2483447, 4322816, 5004859, 3653677, 1927236, 2150821, 4915704, 8590216, 10405397, 8553105, 4270202, 1208635, 1536717, 3355213, 3391095, 1582834, 1104521, 3868589, 7891612, 9866122, 9022375, 7309711, 6465328, 6339270, 6287190, 6833874, 8754521, 11138682, 12003159, 10999910, 9960270, 10206811, 10911680, 10974883, 10810278, 10963830, 10693941, 9713603, 9738115, 12023887, 14573661, 14240945, 10777507, 6494054, 2864059, 5263, -1434724, -853880, 435079, 900761, 1815158, 5314972, 9823097, 11156881, 8537289, 5815779, 5858271, 7137020, 7110051, 5824803, 4628228, 3952918, 3890721, 4691087, 5421008, 4301251]
4983D301251k789847j931913M44833J695343J678269K030167K621324J993148
4975A0042575L39685q52158j194057j057326k15750J016137J112665j37784p62298
4966H291689k46828r42315l459160m401752j761475J390350K089437K021971K861796
4957E843713J973067k067158m557984j573319K662160K280991m73492J78834K924558
4948G191370K178670j101184r39692K592739L342662k5995k213045j062668n22626
4939I440231k451073l424444j511252Q14993K040042L324476L900597J459743
4931A3593313k070463k009510J075498J880457m85738j323028P81105J678273
4923A3119907k61885j452536l22011O5604j450556j948708n23535K17190O7808
$$ y = [4301251, 1511404, -420509, 24324, 1719667, 3397936, 5428103, 8049427, 10042575, 10382260, 9530102, 8336045, 7278719, 7062969, 8079106, 9191771, 9053987, 8291689, 8044861, 7102546, 3643386, -758366, -2519841, -1129491, 959946, 2981917, 5843713, 7816780, 5749622, 1191638, -381681, 2280479, 4561470, 4087978, 4266812, 7191370, 9370040, 8268856, 7329164, 9921903, 13264565, 13238570, 11025525, 9962857, 9440231, 6989158, 3564714, 2053462, 2868455, 4908497, 8232973, 12133570, 13593313, 11522850, 9513340, 10588838, 12469295, 11983557, 10660529, 11441634, 13119907, 12858022, 11405486, 11083475, 11149079, 9698523, 7749815, 7226280, 7443470, 7511278]
4914G511278J694791M213763L574563J81680j374293o10252j128891k316615j50963
4905A1595061L556838K726931j616538k123267J907368L541715J193993N45495
4897B1327596K236861P04564k968036j179259M848759N063757j011090k311598
4889B6711554L331175M652226j738478m488220J214366N402076M102674O574562
4881D5761935J2916063R365429k631357j393011J5452300K0050026N988162J1670962
4873A17180509N3444326P2606001P734459j00291132j43043807q4815065l748258
4866h0932967K1311465L219681l595148R082635J2064474M14484m095613L040008
4858c9490981N090040j451947k550091M801733P800502K164308k006195O7358
$$ y = [7511278, 9206069, 13419832, 16994395, 17176075, 15801782, 15191530, 14062639, 11746024, 11595061, 15151899, 17878830, 16262292, 14139025, 16046393, 19588108, 20782101, 21327596, 23564457, 24269021, 21300985, 20121726, 24970485, 30034242, 29023152, 26711554, 30042729, 34694955, 32956477, 28468257, 29682623, 35084699, 39187373, 45761935, 58677998, 68043427, 65412070, 64019059, 79471359, 99521385, 105509547, 117180509, 170624835, 243230836, 250965295, 150674163, 7630356, -77184709, -80932967, -59621502, -56401821, -59996969, -50914334, -38849860, -38435376, -42530989, -39490981, -34400941, -35852888, -38402979, -33601246, -25800744, -23636436, -25642631, -25575273]
4850b5575273J922322Q95312J903239M904605L780385r91466k001353J796887
4842a3365342L592354J050465j107639j029221j565618k254048K20237L652731
4834a0806081K441866j911049k162835K564675N397774K983279o42795k181364
4826d316530k890373l484408k661416j344884j746628k352030l22029K114512
4818a7003786P50081k344512j426270K884534M272465J165648j540547j317819
4810a4560206o07757j67618K221954N429597N003549R16575j755739j128816n96253
4801e244714j543747j148391J025378J354461r01927j739670K82024J362457m57200
4792g011329j787750k28462J632051J436504P95945Q96648k91690l225093m215472
$$ y = [-25575273, -23652951, -22757639, -20854400, -15949795, -12169410, -13160876, -15162229, -13365342, -9772988, -8722523, -9830162, -10859383, -12425001, -14679049, -14458812, -10806081, -8364215, -10275264, -12438099, -9873424, -4475650, -1492371, -2135166, -4316530, -7206903, -10691311, -13352727, -14697611, -16444239, -18796269, -19118298, -17003786, -16253705, -18598217, -20024487, -17139953, -12867488, -11701840, -13242387, -14560206, -15167963, -15335581, -13113627, -7684030, -2680481, -1763906, -3519645, -4648461, -5244714, -6788461, -7936852, -6911474, -5557013, -6458940, -8198610, -7916586, -6554129, -7011329, -8799079, -9027541, -7395490, -5958986, -5163041, -4266393, -4558083, -7783176, -11998648]
4783a1998648j186802K346105K554580P29717J09828Q07826J286453J819899L051052
4774d79990L469583J523579j378483k524867j366595M54084J414336J175475K83078
4765B570200n02154j199707k515094l876541l155489j64920J739589L55603j518339
4756h266852o47389R25232l10392k290651m31474L875944M898651K117972P08170
4747E79211K161071K192233o75551k255179p51181j33540k355225l414944r60550
4738e613655J050643l40133j632230L54118K371054J011184m94895J978690N558670
4729D243446M784106K87019l215627m406540m653525k883722K076591O262399
4721B494147M615514q44485l343136j232620O69130m54800j755414m86294J845689
$$ y = [-11998648, -13185450, -10839345, -8284765, -7555048, -7445220, -6637394, -5350941, -3531042, -479990, 2989593, 4513172, 3134689, 609822, -756773, -302689, 1111647, 2287122, 2570200, 2068046, 868339, -1646755, -5523296, -8678785, -8843705, -7104116, -6748513, -8266852, -8914241, -7989009, -8299401, -10590052, -11021526, -7145582, -2246931, -128959, 579211, 2740282, 4932515, 4256964, 2001785, 1250604, 1117064, -1238161, -4653105, -5613655, -4563012, -4903145, -6535375, -6181257, -3810203, -2799019, -3293914, -1315224, 4243446, 9027552, 9314571, 6098944, 1692404, -2961121, -5844843, -3768252, 2494147, 7109661, 6265176, 2922040, 1689420, 2358550, 1903750, 148336, -337958, 1507731]
4712A507731K646458J501494r17683l717375m736961k036389K694220N157035
4704B098530L493828k60414l636717n550868m934718j376071K459649K875972
4696d830809M93257j33603K631337M864948L088601p48314k842160k964837l129728
4687c571308l214132j716464K61475l03022l392329m891409j794119L666089O691528
4678h263691N439442K243895R5457k52052L08103Q69804P86544k73511j410566
4669d56575p71932J832964L597085J893801j808719l437471j625191Q25028J157015
4660A206005p5767q89357p84327m04550m9438O0929m78676j015945O1865K624069
4650B54808L910081K098054p86099j609691n51558l81689j967527k996704j424462
$$ y = [1507731, 4154189, 5655683, 4738000, 1020625, -3716336, -5752725, -3058505, 2098530, 5592358, 5331944, 1695227, -3855641, -8790359, -10166430, -7706781, -4830809, -4337552, -4471155, -1839818, 3025130, 6113731, 5365417, 2523257, -441580, -3571308, -6785440, -8501904, -8240429, -8543451, -11935780, -16827189, -18621308, -14955219, -8263691, -2824249, -580354, -484897, -736949, -428846, 440958, 1227502, 953991, -456575, -1228507, 604457, 4201542, 6095343, 4286624, 849153, -776038, 48990, 1206005, 1130238, 240881, -543446, -947996, -997434, -936505, -1415181, -2431126, -2369261, 254808, 4164889, 6262943, 5476844, 3867153, 3315595, 2933906, 966379, -2030325, -3454787]
4641c454787J716223L660161L021532R63945l27984l2331O04119J88669o81113
4632E658434l02231J339089K298129J472387q4397j205755k065202k686199j997027
4623B427228K13380K079308J976583O73198k80406q09649j323363j006367P56025
4614D705937K294854J304270j775160l956325l350972j227394k30367j359314
4606c594471k886834k190983J063119M047271M118878K300300J380297J191838
4598E429415r23679m585601n299097q42440M688280N932785K731966j188199l503827
4589B439603m149461l022274l65710J812594J830656Q95029J027562J767673J566438
4580C802110R00693J026233J096564k85731j946410j854381p60530p62042j414771
$$ y = [-3454787, -1738564, 1921597, 4943129, 5907074, 5579090, 5546759, 6150878, 6339547, 5658434, 5356203, 6695292, 8993421, 10465808, 10381411, 9175656, 7110454, 4424255, 2427228, 2640608, 4719916, 6696499, 7369697, 7089291, 6279642, 4956279, 3949912, 4705937, 7000791, 8305061, 6529901, 2573576, -777396, -2004790, -2235157, -3594471, -6481305, -8672288, -7609169, -3561898, 556980, 2857280, 4237577, 5429415, 4505736, -79865, -5378962, -6221402, -1533122, 4399663, 7131629, 5943430, 2439603, -1709858, -4732132, -5097842, -3285248, -1454592, -559563, 467999, 2235672, 3802110, 4702803, 5729036, 6825600, 6539869, 4593459, 2739078, 1978548, 1216506, -198265]
4571a98265q44264L57685J53902r29261p64872J93778j53047j152875m66215R79867
4561b823567J58800j947450j001052K995725M414872N37202l912693l783551n37419
4552e899133J260255P57910K02796K32753l07666j470681k287604k533465k086966
4543a2131801r6020L021536M530163K724932k74710j409607p73555m18508n96431
4534e424001J23336J957805L524722L691268K071566j196111m457384m886475
4526d595274j970949Q82745O71326p98046K39335L455208M725365K178777j403657
4517C384830k658632j284703J013224K696418K663669N84065j976846k545061
4509A876964q07828R13359J075621R48971J984085K949614J701998j241764l175790
$$ y = [-198265, -1042529, -684844, -530942, -1460203, -2225075, -2031297, -2184344, -3337219, -3803434, -2823567, -2664767, -4612217, -5613269, -2617544, 1797328, 2334530, -1578163, -5361714, -5899133, -4638878, -3880968, -3678172, -3445419, -3753085, -5223766, -7511370, -10044835, -12131801, -12227821, -9206285, -4676122, -1951190, -2225900, -3635507, -4409062, -4827570, -5424001, -5300665, -3342860, 181862, 3873130, 5944696, 4748585, 291201, -4595274, -6566223, -5683478, -5012152, -5810198, -5570863, -2115655, 2609710, 4788487, 3384830, 726198, -558505, 454719, 3151137, 5814806, 6398871, 4422025, 1876964, 1069136, 1982495, 3058116, 4007087, 5991172, 8940786, 10642784, 9401020, 6225230]
4500F225230l020575k440300k647586k259268J16874K705971K408194n64416k546524
4491b022400j581156r2135o84405j672789K13681M059058N423287K773443l79191
4482F037393q03165K36386j06237j790106k700557k105556r41215J39560R47027
4473a086470J006660M39156M69980J282276P75211k254959n031897l876993K50316
4464h026720K506060O63285k193567k370739k26557J449904J608261J349407J252191
4455c988475M81785j306519k624700j556379J729137M495311M072004R88704j364183
4446I26685o98353J513658K316740J193921M5765j11641j89619n89244m8820J953650
4436F312742L431463K199394r49268k940905j994301O68720K541716K302305N54204
$$ y = [6225230, 3204655, 764355, -1883231, -4142499, -4025625, -1319654, 1088540, 524124, -2022400, -3603556, -3695691, -4380096, -6052885, -5839204, -1780146, 3643141, 6416584, 6037393, 5234228, 5470614, 5364377, 3574271, 873714, -1231842, -2173057, -2033497, -1086470, -79810, 359346, 829326, 2111602, 2886813, 631854, -4400043, -8277036, -8026720, -5520660, -4857375, -7050942, -9421681, -9648238, -8198334, -6590073, -5240666, -3988475, -3506690, -4813209, -7437909, -8994288, -7265151, -2769840, 1302164, 2290868, 926685, 228332, 1741990, 4058730, 5252651, 5298416, 5186775, 4997156, 4407912, 4359092, 6312742, 9744205, 11943599, 10994331, 8053426, 6059125, 6727845, 9269561, 11571866, 12126070]
4427A2126070j122717j625892j123107m54794J41210J122164K298885K375178
4419A3736997O55836j505674k141654j209110m34868p34187j221435j059643p46718
4410E339544p66693l87413R14834J971726J523969N11553P73522J849321J429132
4401A3159495p44444j938214m59751J655354J703766K01144m56544J58486M75398
4392A3754690o3065n21770p17382j479275k601820k824056k067222j485121j073012
4383I21967L39540K276568K502164O50764p58243l34005j15416j861592l589929
4374C1818k560034J61058J210551q6415j262500o92059P78683J946701K338265
4365A866068J245854j605987m147884l445614R9984K473434J120762j788145k532873
$$ y = [12126070, 11003353, 9377461, 8254354, 7799560, 7940770, 9062934, 11361819, 13736997, 14392833, 12887159, 10745505, 9536395, 9101527, 8367340, 7145905, 6086262, 5339544, 4572851, 4185438, 5100272, 7071998, 8595967, 9107520, 9881042, 11730363, 13159495, 12415051, 10476837, 10017086, 11672440, 13376206, 13577350, 13120806, 13279292, 13754690, 13691625, 13169855, 12452473, 10973198, 8371378, 5547322, 3480100, 1994979, 921967, 1261507, 3538075, 6040239, 6691003, 5932760, 5598755, 5483339, 3621747, 31818, -2528216, -2367158, -1156607, -1243022, -2505522, -3197581, -2418898, -472197, 1866068, 3111922, 1505935, -2641949, -6087563, -5987579, -3514145, -2393383, -4181528, -6714401]
4356f714401m66355K118341L256396K609682N05555k294466m102184l329675m21799
4347h838906K255608K871974J874023R84821R87359J072474L67011n22664k40897
4338H10803J116932J690248M91402p12654L18465K679204K975157j31864l945877
4329E291816n152888l573476j281927N95751K447369M288648N167425M486821
4321A2269539K645056K84805k048407l501027l322536k007028j113852j460250
4313A746300k056209j294062J036734L164705K803897n16632m443890n715066
4305e274223l571373n87199O17721N41010J318658K963779L303919J601078k72192
4296F41178j019787j791708l340895l635031p97645L117858M299965K496663J089088
$$ y = [-6714401, -7180756, -5062415, -1806019, 803663, 1309218, -985248, -5087432, -8417107, -8838906, -6583298, -3711324, -1837301, -852480, 134879, 1207353, 1574364, 1051700, 810803, 1927735, 3617983, 4109385, 3396731, 3715196, 6394400, 9369557, 9237693, 5291816, 138928, -3434548, -4716475, -4120724, -1673355, 2615293, 7782718, 12269539, 14914595, 15199400, 13150993, 9649966, 6327430, 4320402, 3206550, 1746300, -309909, -1603971, -567237, 2597468, 5401365, 4884733, 440843, -5274223, -8845596, -9432795, -8815074, -8274064, -6955406, -3991627, -687708, 913370, 641178, -378609, -2170317, -5511212, -9146243, -9943888, -6826030, -2526065, -29402, 1059686]
4287A059686J770687K326688P47178j364849j510719l20449k92541j594070j821780
4278a000169L4073J724626P95482j924514l223345j481040J422787K547889J490769
4269C86558N39074J270896K357984J707292l04208j412307p92475J33487K27229
4260D113530o2030l47594j207950k609951l299035k714464j709695n17162J747209
4251f607142M336848M334258R33117k316586k284135q86027j507109k951464j440064
4242h388304K544204M481875K948641J463855K125577K320565m4793k493460k297447
4233B660713j175227j871036k874537r46964K784225L875965J278743j285912
4225B445970j133885O4361N0899l10170P72191K524524K833981J578064L62275
$$ y = [1059686, 2830373, 5157061, 5904239, 4539390, 3028671, 2708222, 2415681, 821611, -1000169, -966096, 758530, 1554012, -370502, -3593847, -5074887, -3652100, -1104211, 386558, 925632, 2196528, 4554512, 6261804, 5957596, 4545289, 3752814, 3886301, 4113530, 4051500, 3703906, 2495956, -113995, -3413030, -6127494, -7837189, -8354351, -6607142, -2270294, 2063964, 2997081, 680495, -1603640, -2489667, -3996776, -6948240, -8388304, -5844100, -1362225, 1586416, 3050271, 5175848, 7496413, 7451620, 4958160, 2660713, 1485486, -385550, -3260087, -4207051, -1422826, 2453139, 3731882, 2445970, 1312085, 1376446, 1427345, 1117175, 1889366, 4413890, 7247871, 8825935, 9188210]
4216I188210k54938r83650j623574j014351O05990J398123P73683L80758J133089
4207I603340J325386m93515k559038k296588n30035l89872k441360l879738k798383
4198d459803m32645J461321K784502L703514L460482J673425r78263l770120n647338
4189b204925m400260O08466N228269M472701L7260j381570J700263L314881L11479
4180G686564k203877J02663L229950K175553l51269M34101K428756J148044j442506
4171A3207979r98378M08982j444916l575591m59371M982831N417465J644515L62741
4162A9546257J720547P22765j030184K081913O818876M841507j371290j622798
4154C1707593L254387K946328j469638J840402J1363384J1708992L148307O029874
$$ y = [9188210, 8933272, 7949622, 6326048, 5311697, 5917687, 7315810, 8089493, 8470251, 9603340, 10928726, 10435211, 7876173, 5579585, 5049550, 4659678, 2218318, -1661420, -4459803, -4892448, -3431127, -646625, 3056889, 6517371, 8190796, 7212533, 3442413, -2204925, -6605185, -5996719, -768450, 3704251, 3741511, 2359941, 4060204, 7375085, 7686564, 5482687, 5585350, 8815300, 10990853, 10639584, 11073685, 13502441, 14650485, 13207979, 12209601, 12618583, 11173667, 7598076, 7138705, 12121536, 17539001, 19183516, 19546257, 21266804, 21989569, 20959385, 23041298, 29860174, 34701681, 33330391, 31707593, 34961980, 37908308, 36438670, 38279072, 49642456, 61351448, 64499755, 70529629]
4146G0529629K4901020L5772961K5850003J6807106K3286778J6887779l0797270
4139A83238006q8927463r6999377m8205325J328970J0524499j958928l009110
4132d4008728N436275N181465j096882R3039N530691L981452p85763J524913O618791
4123a7524747L836118k944034k340188L361019L064725k190962j624490N070920
4115a1291639P451087L016502O987J432185J155128k907407n098626l443432k813387
4106a2492602m518281l555761J369679M805802L872566J914765R87449q91799
4098h508182l263711k345243J332495K325058m76252j589266J566725M165047
4090f793329K039864k037694l389813j588438J142868L240834L453735J247195
$$ y = [70529629, 95430649, 131203610, 157053613, 173860719, 197147497, 214035276, 183238006, 94310543, -2688834, -50894159, -49565189, -39040690, -40999618, -44008728, -38572453, -33390988, -34487870, -34394831, -28864140, -24882688, -25668451, -24143538, -17524747, -13688629, -16632663, -18972851, -15611832, -12547107, -14738069, -16362559, -11291639, -3840552, -824050, -817063, 615122, 1770250, -1137157, -6235783, -9679215, -12492602, -17010883, -20566644, -19196965, -14391163, -10518597, -8603832, -7616383, -8508182, -11771893, -14117136, -12784641, -10459583, -10935835, -12525101, -10958376, -6793329, -4753465, -6791159, -10180972, -11769410, -10626542, -7385708, -3931973, -2684778]
4082b684778j048158m01928J964740J980256p65606k602035j977808j055350r18703
4073g509370m26301j52273k071979m794669m452205r35042J889864K370229K089592
4064a3992154R68194k348672n176801k946734K548491M419457J539804L59820
4056a4628595L668545N708033K181869k530077l026494j112295r43726j641160
4048a2323900n25751R91134N93021K35464K378148M286403J933464k735103m085785
4039i252905j020635K089498K082963L76923l20619N23468J368701M20017k318260
4030f050849m078360j981591K648327N044731L099574j39000j325050q54500l01973
4021c938691O10638K003035K018480j52052k099760j679225j74924L33365Q8442
$$ y = [-2684778, -3732936, -4134864, -2170124, -189868, -955474, -3557509, -5535317, -6590667, -7509370, -7935671, -8087944, -10159923, -14954592, -19406797, -20341839, -18451975, -16081746, -13992154, -13023960, -15372632, -20549433, -23496167, -20947676, -16528219, -14988415, -14628595, -10960050, -5252017, -3070148, -5600225, -8626719, -9739014, -10682740, -12323900, -12849651, -11858517, -11265496, -11030032, -8651884, -4365481, -2432017, -5167120, -9252905, -10273540, -8184042, -6101079, -5724156, -6044775, -5521307, -4152606, -3732589, -6050849, -10129209, -12110800, -9462473, -4417742, -1318168, -1457168, -2782218, -3636718, -3938691, -3328053, -1325018, 693462, 541410, -1558350, -3237575, -3412499, -3079134, -2990692]
4012b990692j60693j191532k998417l304464j001437J658158K704217L192568
4004d092292L820230K463834j595942m548751l197184k49054j36814k030830j660889
3995a1227692J584750L972801L096505M24957j477165j446526L3610J094541J48330
3986c795889j330902m2163L575027M537489O57125l293302k475953Q05540J495446
3977A32418p9624j24342J147396K09152k839365l990099j698559J543906L707257
3968a991860M593370L301181p02350m332990l797563p04449j93548k850416l858391
3959a0537016r26830K360476K632554J188783L33889l22543j479733j762914k83933
3950h797267J277755J330464O76005M47165J63855n30661n13234P63318J790349
$$ y = [-2990692, -3151385, -4342917, -7341334, -10645798, -11647235, -9989077, -7284860, -4092292, -272062, 2191772, 595830, -3952921, -7150105, -7399159, -7535973, -9566803, -11227692, -9642942, -5670141, -2573636, -2148679, -3625844, -5072370, -5038760, -3944219, -3795889, -5126791, -5168954, -1593927, 2943562, 3600687, 307385, -2168568, -1363028, 132418, 52794, -71548, 1075848, 1285000, -1554365, -5544464, -7243023, -5699117, -1991860, 2601510, 5902691, 5200341, 867351, -2930212, -3634661, -3828209, -6678625, -10537016, -11463846, -9103370, -6470816, -5282033, -4948144, -5270687, -6750420, -8513334, -8797267, -7519512, -6189048, -5513043, -5065878, -4902023, -5432684, -5945918, -5182600, -3392251]
3941c392251J077174p94429k185122k131552o50378J242394J876277R27744M65928
3932c564215J901685L040464J247133j583971j328809J628494K737041O41410
3924D719232r74830j54716L6388k577613m927075l692698p83679J0037j095879
3915i440833j189187L08085J578619J851504J646829P91616q73634j836051o74564
3906g837616J338305J794147N02909q69542j541865j729807r72072J127441L029233
3897e158867K656078N93876l75811P72125J816295M92169k237554l221228j000511
3888e663428K224735L001565Q21995j139119k71763J728928J336651j363320k632950
3879a956706p69921J383983J015627n50702o12503M25127K85337r41309j026268
$$ y = [-3392251, -2315077, -3109506, -5294628, -7426180, -8076558, -6834164, -4957887, -4030143, -3564215, -1662530, 1377934, 2625067, 1041096, -287713, 1340781, 4077822, 4719232, 3744402, 3589686, 3626074, 1048461, -3878614, -7571312, -8354991, -8344954, -9440833, -10630020, -10321935, -8743316, -6891812, -5244983, -4453367, -5327001, -7163052, -7837616, -6499311, -4705164, -4202255, -5071797, -6613662, -8343469, -9315541, -8188100, -5158867, -2502789, -1908913, -2284724, -1512599, 303696, 795865, -1441689, -4662917, -5663428, -3438693, -437128, 384867, -754252, -1026015, 702913, 2039564, 676244, -1956706, -2726627, -1342644, -327017, -877719, -1490222, -1065095, -779758, -1721067, -2747335]
3870b747335L77054R72968m40288j929764j306182N44488P92360j338845l183742
3861h259286j902910J663519L805239K711237O60490L47222R13695q009j680931
3852a749734j106244J718510L078068J026885j764473k291070j348385j182310
3844c618753j510926n94034J358092K438185J768672M782j936797l021412k223243
3835g335434k47151K66458j747898l464597j770729J939803L421943J589220r3895
3826g442280J279781M083624M606973J970252r98631j469792P1125Q93399j05791
3817B888660j074579m83367n0555k174922n379859n454859j371440L120652M713244
3808e267025M172826L346048J911916n23275k051797j181129L02622J66224n49614
$$ y = [-2747335, -2370281, -1397313, -1837601, -3767365, -5073547, -4529059, -3736699, -5075544, -8259286, -10162196, -8498677, -4693438, -1982201, -1321711, -974489, -60794, -68803, -1749734, -2855978, -1137468, 1940600, 2967485, 1203012, -1088058, -2436443, -3618753, -5129679, -5723713, -4365621, -1927436, -158764, -153982, -2090779, -5112191, -7335434, -7582585, -7316127, -9064025, -12528622, -14299351, -12359548, -8937605, -7348385, -7442280, -6162499, -2078875, 2528098, 4498350, 3499719, 2029927, 2101052, 2994451, 2888660, 1814081, 1330714, 1280159, -894763, -6274622, -11729481, -13100921, -9980269, -5267025, -1094199, 2251849, 4163765, 3640490, 1588693, 407564, 710186, 876410, 326796]
3799C26796K81349J800393J670842K08059m70007k69102n87097r35585K20839
3790B246487J907398J676559j63592j108862r88650j896665l493642k791153M19366
3781d192754K184945K02112k623440k533324J75766K689140L451921K353616l57692
3772A350290l167007l544500j299123M00241m85570j591060J0549K761518K771748
3763b792914j65403k234470j121426J239350K023702J163827N66277J218626K151300
3754B048869J727452m11299k503773k274850J18428J787985Q85527n53013M89876
3745A315202L113067L256344m25821m252283m338359j467143P48779R08521O02574
3736e39119R52129J034444Q7241r21185r24660m31689m14403o54532m43734q8231
$$ y = [326796, 608145, 2408538, 4079380, 4287439, 3817432, 3548330, 2961233, 2025648, 2246487, 4153885, 5830444, 5666852, 4557990, 3569340, 1672675, -1820967, -4612120, -4192754, -2007809, -1805697, -4429137, -6962461, -6786695, -4097555, -645634, 1707982, 1350290, -1816717, -5361217, -6660340, -6260099, -6745669, -8336729, -8326180, -5564662, -2792914, -2958317, -5192787, -6314213, -5074863, -3051161, -1887334, -1321057, -102431, 2048869, 3776321, 3365022, 861249, -1413601, -1295173, 492812, 1378339, 825326, 1315202, 4428269, 7684613, 7258792, 3006509, -1331850, -2798993, -2050214, -1141693, -539119, 413010, 1447454, 1534695, 613510, -311150, -742839, -1157242, -1811774, -2255508, -2343739]
3726b343739l31981p67298k04762J508732L177176L649868K584768K20358k414586
3717E078536l538060k416289p75486o26424j077672L02001L078783M041034K377928
3708F444351J231988K296831K433349j235920n791469o192080k666867R7776L43657
3699c038384R86123L562983N154872L174502m55630k304296j943131j118201n76902
3690C441936j62603m48263j795907k788291j792859N61220K293088K766323K675286
3681D749930K061055M88240j091008r82368L39042J25858k717199n267440l859522
3672f153412J040438N063465N110075K648452J086973J249913J086624o92930
3664A0439598k756827l452229l174456l104858k786853q08750K379140M070378
$$ y = [-2343739, -2675720, -3443018, -3647780, -2139048, 1038128, 4687996, 7272764, 7493122, 5078536, 1540476, -875813, -1651299, -2277723, -3355395, -3053394, 25389, 4066423, 6444351, 7676339, 9973170, 12406519, 11170599, 5379130, -812950, -3479817, -3382041, -3038384, -2052261, 1510722, 6665594, 9840096, 9384466, 7080170, 5137039, 4018838, 3441936, 3279333, 2831070, 1035163, -1753128, -3545987, -2984767, -691679, 2074644, 4749930, 6810985, 7299225, 6208217, 5225849, 5564891, 5690749, 2973550, -2293890, -6153412, -5112974, -49509, 5060566, 7709018, 8795991, 10045904, 11132528, 10439598, 7682771, 4230542, 1056086, -2048772, -4835625, -5644375, -3265235, 805143]
3656H05143K288984j736056m644165m180270j184944J450985J749881M49505l83065
3647e384002l9148N19983O63488P13120M78313p00890j861780q98662J626168
3638d883410K002602j117053l560278j226727L475854M854096K092634l49448
3630A288270O9339J112511N45201o31608r33641o90753l00720N77532J060953
3621B097084m08437k591746k136120J076106L028379J464065j233869k662761
3613a367299l519626l951418j679081K912141M581588O43441l527436j740957
3605g648647L529016M889878R69532k776266l022779j811506p96526J371732M530575
3596g64991N390530K698108k39309m38523Q19042R37877k33697j540361k568806
$$ y = [805143, 3094127, 1358071, -3286094, -7466364, -8651308, -7200323, -5450442, -5000937, -5384002, -5423150, -4903167, -4239679, -3526559, -3048246, -3749136, -5610916, -6509578, -4883410, -2880808, -3997861, -7558139, -8784866, -5309012, -454916, 1637718, 1288270, 1357609, 2470120, 3015321, 2383713, 1450072, 759319, 458599, 1036131, 2097084, 1688647, -903099, -3039219, -1963113, 1065266, 2529331, 1295462, -1367299, -4886925, -8838343, -10517424, -7605283, -3023695, -2380254, -5907690, -7648647, -4119631, 770247, 1739779, -1036487, -4059266, -5870772, -6667298, -5295566, -764991, 4625539, 7323647, 7084338, 6645815, 7464857, 8402734, 8169037, 6628676, 4059870]
3587D059870k674753o41232K732563M169171K118640p13449j115079K75304N59070
3578H770105r97577k406887k009352k53983J198650J086994k96155j130269q5616
3569C875910J666646J908779P51753L81988J212899J085248p51544j875983o60305
3560G595391Q36926L42222p83442j72089J079136J43745k459522l323359j547171
3551A711837r9351j077095k722979k585049j201536o95324j258068j188852J24155
3542h992262J222227R17012J94480P63203K342057K798773J286967j80289M39613
3533G91781J832082Q94286k418086m296831k135644J757899L223718J471683q17644
3524C03244j614722j469710j563459j903464j824397q63267J155952L742880N277945
$$ y = [4059870, 1385117, 743885, 3476448, 7645619, 9764259, 9050810, 7935731, 8211035, 8770105, 7772528, 5365641, 3356289, 3102306, 4300956, 5387950, 5091795, 3961526, 3875910, 5542556, 7451335, 8203088, 8585076, 9797975, 10883223, 10131679, 8255696, 7595391, 8432317, 8774539, 7991097, 7819008, 8898144, 9041889, 6582367, 3259008, 1711837, 1612486, 535391, -2187588, -4772637, -5974173, -6669497, -7927565, -9116417, -8992262, -7770035, -6853023, -6658543, -5895340, -3553283, -754510, 532457, 352168, 791781, 2623863, 3518149, 1100063, -3196768, -5332412, -3574513, -350795, 1120888, 303244, -1311478, -2781188, -4344647, -6248111, -8072508, -8935775, -7779823, -4036943, 1241002]
3515A241002M161120Q75498j999763k346451n83916J055429R34370m72304j339289
3506A525696q17761l13450j588563l698178l518469j17965L273520L348291J172260
3497g34619K11772J139794J648735R43432Q75361J984742J888701p13150l325229
3488C919539l244254j594962j100341j537656n55282J837792K881122J306337
3480A912295q58373j416024n94911L70736J143535J591319J020043m85491j434382
3471A248747j080409p84463j606601k033812l80347J702206J128896j429297j611563
3462d846643K312563O115053M710000j301761o518251p083307l945450m44714
3454a1002510J102670M75361q25251o48538J743353M498975N151534L533715J402844
$$ y = [1241002, 5402122, 6277620, 4277857, 1931406, 1347490, 2402919, 3337289, 2864985, 1525696, 707935, 394485, -1194078, -4892256, -8410725, -8528690, -5255170, -1906879, -734619, -522847, 616947, 2265682, 3209114, 4084475, 6069217, 7957918, 7244768, 3919539, 675285, -919677, -2020018, -3557674, -4112956, -2275164, 605958, 1912295, 1053922, -362102, -957013, -586277, 557258, 2148577, 3168620, 2683129, 1248747, 168338, -616125, -2222726, -4256538, -4636885, -2934679, -1805783, -3235080, -4846643, -2534080, 3580973, 8290973, 6989212, 470961, -6612346, -10557796, -11002510, -9899840, -9424479, -10249730, -10898268, -9154915, -4655940, 495594, 4029309, 5432153]
3445E432153l48333k152738l611699l286671j238732M10503L93677j58474o7782
3436d628096J0950o50901j158814o57948K1081O4723L55756J614750K549209J955658
3426e23632J008419J071006R39385q22176k385834j105156J604937J903002l74335
3417A315616j592270n13665M9934j161499j415818P42846K323683J015870n29777
3408B34920P53529K999895K867861J353745J255820J264262j678547n523482n012200
3399a484197m74900J736515r54020l377205j262778J942595J234335j686004j852395
3390f178054M28217P27177j221931q18366L297514O244255M153051j42032j671432
3381D818399k36549P29738m224n60226N600K94616n38808j337335j248315j257446
$$ y = [5432153, 5083820, 2931082, -680617, -3967288, -5206020, -4795517, -4401840, -4560314, -4628096, -4617146, -5268047, -6426861, -7084809, -7063728, -6999005, -6643249, -5028499, -2479290, -523632, 484787, 1555793, 2495178, 1673002, -712832, -1817988, -213051, 1689951, 1315616, -276654, -790319, -740385, -1901884, -3317702, -2574856, -251173, 764697, 234920, 988449, 3988344, 6856205, 8209950, 9465770, 10730032, 9051485, 3528003, -1484197, -1959097, -222582, -1176602, -4553807, -5816585, -3873990, -2639655, -4325659, -6178054, -5749837, -5022660, -6244591, -7062957, -3765443, 2478812, 6631863, 6489831, 4818399, 4581850, 5311588, 5307364, 4747138, 4752738, 5047354, 4508546, 3171211, 1922896, 665450]
3371F65450k199931k941344k060810k31388P03666M20317K62871R29998J661252
3362b789919J935846K333529K985231K660358O40213j612218k238417j756715
3354B157908k223492l807241m181766j859866J565491L486314L353032K586903
3346A077283K288779K172603J386942l78662k371117l140771k084655o43427p23686
3337b416711j762966j218094J329439K863912J315196j025523q89841J117186
3329f87402K132449J904981K184835K173693p50074n412948o758664l031463J239139
3320g005454J801380L10585L92076J725273J961920J588355K283436K511656k17478
3311E351749l841707l753486j35789J948224M64629q33735P87588K553420J334484
$$ y = [665450, -1534481, -4475825, -6536635, -6768023, -6064357, -5644040, -5381169, -4451171, -2789919, -854073, 1479456, 4464687, 7125045, 7765258, 6153040, 3914623, 2157908, -65584, -3872825, -8054591, -9914457, -8348966, -4862652, -1509620, 1077283, 3366062, 5538665, 6925607, 6546945, 4175828, 1035057, -1049598, -1693025, -2416711, -4179677, -5397771, -4068332, -1204420, 110776, -914747, -1804588, -687402, 1445047, 3350028, 5534863, 7708556, 6958482, 1545534, -5213130, -8244593, -7005454, -5204074, -4893489, -4501413, -2776140, -814220, 774135, 3057571, 5569227, 5351749, 1510042, -2243444, -2379233, -431009, 33620, -800115, -12527, 2540893, 3875377]
3302C875377j065778j495658q69203j668723k523434j66001M276313N759815K415446
3293H538154j819932k672495m68456J644457J768388L5225k598538m637367m512313
3284d722877k267411J12314J082989J236965J636325J692508K62065j890793k560523
3275e418438j108027N01330K71623j247942j895920q79669L71693M98797J36035
3266h770518N70681J342990Q74754o42891j062309K88582J115943k55576j685040
3257h223384j83508L057332L813104R41295j912197j616589M24725J268748R68168
3248a462306J681491L722191M974356L726440L11794l563225n673895m321867
3240f05021l88950K251286M75906l981299o034117l068774K305143N515196M495289
$$ y = [3875377, 2809599, 1313941, 444738, -1223985, -3747419, -3913420, 362893, 6122708, 8538154, 6718222, 4045727, 3577271, 5221728, 6990116, 7025341, 4426803, -210564, -4722877, -6990288, -6877974, -5794985, -4558020, -2921695, -1229187, -967122, -2857915, -5418438, -6526465, -6025135, -5753512, -7001454, -8897374, -9777043, -9405350, -8906553, -8770518, -8199837, -6856847, -5982093, -6624984, -7687293, -7398711, -6282768, -6538344, -8223384, -8406892, -5349560, -1536456, -595161, -2507358, -4123947, -3699222, -2430474, -1462306, 219185, 3941376, 8915732, 12642172, 12953966, 9390741, 3716846, -605021, -993971, 1257315, 1733221, -2248078, -8282195, -11350969, -9045826, -3530630, 964659]
3231I64659O34475l100872m281066k477674N13986K430588K705157K280990J683542
3222A353785O88854j84356K76128J809264K240088L04789k297247k892957j091849
3213B06499J059209J672630P87897k40044l80681J39568L91667J79543L86063
3204D202351J357036J778618M41445j563857k193542j499391j108129r89422L33089
3195G58198K099825J357607k057585m119921k352598L16401K77521j208062p78153
3186e706767J206359J828130Q98749O53670J212260P50203m60483o24140n17835
3177g59854k219600l981457j822039L192243N099927K061713o89880N03680K069347
3168C454080P2420k738991j983953N95270L99169k071083k696553j133169m86024
$$ y = [964659, 1599134, -1501738, -5782804, -8260478, -7746492, -5315904, -2610747, -329757, 1353785, 2042639, 1858283, 2134411, 3943675, 6183763, 6488552, 4191305, 1298348, 206499, 1265708, 2938338, 3726235, 3486191, 3105510, 3245078, 3636745, 3816288, 4202351, 5559387, 7338005, 7779450, 6215593, 4022051, 2522660, 1414531, 425109, 758198, 2858023, 4215630, 2158045, -1961876, -4314474, -3998073, -3720552, -4928614, -5706767, -4500408, -2672278, -1773529, -1119859, 92401, 842604, 382121, -242019, -759854, -2979454, -6960911, -8782950, -5590707, -490780, 1570933, 881053, 1384733, 3454080, 3526500, 787509, -1196444, -601174, -202005, -2273088, -4969641, -6102810, -6588834]
3159f588834p74609R40987M050426M176014L89063k860436k531298q14746l89595
3150d403028m15693N04137J406887J499506K068417L354585K881277l03784k806181
3141C786123j515673J468573J974130r4648j274087k3391J686379J803948L75153
3132H186507j605202l221870l520694k208191m78478K24690J6453K4203O24093
3123a958489J333421J674640J074126r91214l508457l997137j720484N91544K58480
3114g243570j449334j345322Q64445K644019K830409K693220K856624K210213
3106D060704M25357j114736j646712j918365k078772j191116K49618M5491j950387
3097e118918k483500L91354L442347K183553k504976n050413k520189J808720
$$ y = [-6588834, -7363443, -6422456, -2372030, 1803984, 2193047, -667389, -3198687, -4013433, -4403028, -4818721, -4314584, -2907697, -1408191, 660226, 4014811, 6896088, 6592304, 3786123, 2270450, 3739023, 5713153, 5618505, 4344418, 4321027, 6007406, 7811354, 8186507, 6581305, 3359435, -161259, -2369450, -2847928, -2623238, -2606785, -2582582, -1958489, -625068, 1049572, 2123698, 1132484, -2375973, -6373110, -8093594, -7502050, -7243570, -8692904, -10038226, -9173781, -6529762, -3699353, -1006133, 1850491, 4060704, 4486061, 3371325, 1724613, -193752, -2272524, -3463640, -3214022, -3168531, -5118918, -7602418, -7211064, -3768717, -1585164, -4090140, -9140553, -11660742, -9852022]
3089i852022L283819J780491P57758J820569K781518J336436j364088k141592
3081a597111N7539K876410L413305J238062j765946l540013l201792j175761J027000
3072b668307J701615O55935l28797K55381J382822Q61850j240137k336332r85705
3063b701675R24056Q48870q71739j789879r23197L47990Q88862J331983K236652
3054B91923K443177Q46746j162234j062612J057851K201578O80510j270839p78073
3045C248027J145914Q64033k340558m710561l069677O92280K111792K8751k188084
3036d218083j274288J860611L522284J792945j355464k577754j065749Q54401
3028b461097J038251K62681O02348J925410J917468l18481k682111k941683j532733
$$ y = [-9852022, -6568203, -4787712, -4029954, -2209385, 572133, 1908569, 544481, -1597111, -1539572, 1336838, 4750143, 5988205, 4222259, 682246, -2519546, -3695307, -2668307, -966692, -310757, -639554, -384173, 998649, 1860499, 620362, -1715970, -2701675, -1777619, -928749, -1800488, -3590367, -4513564, -4165574, -3276712, -1944729, 291923, 2735100, 3581846, 2419612, 1357000, 2414851, 4616429, 5296939, 4026100, 3248027, 4393941, 5257974, 2917416, -1793145, -4862822, -4170542, -2058750, -2029999, -4218083, -5492371, -3631760, -109476, 1683469, 328005, -2249749, -3315498, -2461097, -1422846, -1160165, -557817, 1367593, 3285061, 2966580, 284469, -2657214, -4189947]
3019d189947l14113P1871J13915k21081j307361k489862k457238r88264O97526
3010a1084554J332924P54114r2652O0378J475453K714370K229507P14207K87846
3001a608407J088892R74738n13987p21434J697515L739695K342767o54208j447062
2992D898509l39303o42873k571700k927120q73362N97143j50155r54822j5850
2983b979533J310851J571455J589310J867936R09044j669343l355110k502712
2975c258102j099580j189999j201995J113709M264911M857382K426833n47265
2967E365894k304676k793065k139364p61609K5598j03092O58294K992793L882940
2958D823713P02674l613226l726919L46604L135352J738826n29239K9215K094954
$$ y = [-4189947, -4504060, -4432189, -4318274, -4539355, -5846716, -8336578, -10793816, -11782080, -11084554, -9751630, -8997516, -9090168, -9029790, -7554337, -4839967, -2610460, -1896253, -1608407, -519515, 455223, -58764, -780198, 917317, 4657012, 6999779, 6345571, 4898509, 4559206, 3916333, 1344633, -1582487, -2455849, -1858706, -2008861, -2963683, -2979533, -1668682, -97227, 1492083, 3360019, 4269063, 2599720, -755390, -3258102, -4357682, -5547681, -6749676, -5635967, -1371056, 3486326, 5913159, 5365894, 3061218, 268153, -1871211, -2632820, -2607222, -2710314, -2052020, 940773, 4823713, 5526387, 1913161, -1813758, -1467154, 1668198, 3407024, 2877785, 2907000, 5001954]
2949E001954K268498L97586j022069r92048p24433j023055j293916j019146n66552
2940A026819m21284o15662r61895j226765j118320m62528O41972J788820K120793
2931G71950O57374k379123m832055m411025j410034J377582J710912M8002j438674
2922i905091j114852Q78729K758969K561495L98290j098343J45299K577290K818990
2913B0776K97869k164685k626589k299388k581734k404699l75341K428376M010965
2904e694450M356825M453402L587226L98955l727093n186091k699212Q65719K193345
2895a451374J309277M86234P54067J082122M29491q56437j717134j507710l36027
2886a807491J033427J553144Q49786p2558J47027J179948Q80464j946052n298515
$$ y = [5001954, 7270452, 7668038, 6645969, 5653921, 4929488, 3906433, 2612517, 1593371, 1026819, 605535, -10127, -972022, -2198787, -3317107, -3779635, -3137663, -1348843, 771950, 1429324, -949799, -5781854, -10192879, -11602913, -10225331, -8514419, -8466417, -9905091, -11019943, -10141214, -7382245, -4820750, -4422460, -5520803, -5375504, -2798214, 20776, 318645, -1846040, -4472629, -6772017, -9353751, -11758450, -12133791, -9705415, -5694450, -1337625, 3115777, 6703003, 7101958, 3374865, -1811226, -4510438, -3644719, -1451374, -142097, 344137, 1098204, 2180326, 2609817, 1753380, 36246, -1471464, -1807491, -774064, 779080, 1628866, 1556308, 1703335, 2883283, 3763747, 1817695, -3480820]
2877c480820n819811k823639Q67703K455761K144275J780135J891866J601315
2869a383215P14793J26259J93723J91335l87043j089753j233231m48946J334631
2860a981447L304209L498300Q75063k348699k571599L47956K354122N89280k586398
2851A480787k992108m05413J666916J158191m59240j303992j607937k154527k294808
2842f912131j057701Q80599J722810O15721j577320l117008k576703K9687K752457
2833i239589L230542J458430R3439J014746K605250K036272m23704j503005M98182
2824b29437L290196L672288J384602j436837l352800m387863m399702k758818
2816h218371L5678J995497J720901O1542r10464j47811J483292K193381R87353
$$ y = [-3480820, -9300631, -12124270, -11256567, -8800806, -6656531, -4876396, -2984530, -1383215, -668422, -542163, -348440, -157105, -544148, -1633901, -2867132, -3316078, -1981447, 1322762, 4821062, 5696125, 3347426, 775827, 1123783, 3477905, 4067185, 1480787, -1511321, -1916734, -249818, 908373, 449133, -854859, -2462796, -4617323, -6912131, -7969832, -7089233, -5366423, -4750702, -6328022, -9445030, -12021733, -11992046, -9239589, -6009047, -4550617, -4457178, -3442432, -837182, 1199090, 775386, -727619, -229437, 3060759, 6733047, 8117649, 6680812, 3328012, -1059851, -5459553, -8218371, -8182693, -6187196, -4466295, -4404753, -5315217, -5463028, -3979736, -1786355, -799002]
2807g99002j283939k618109j933073j47970J267789K156597L063125L421392K032669
2798E159479p11467k812522l146248k343749r85477J055278K858474K353244o84307
2789G42705l470242l591401j781587J74267K113952L909923L519154j03727l685603
2780b172559l065222O50336K270014l2184k461587j753673L50462Q01812J10370
2771e302231O35498K225336K737442J842243J333870J783517J423493q96487l336444
2762B446237k954881M47443L464092K696841j124508l790052k763929k20756L44302
2753a455211r44685j114055Q01868K591915K575001J534021L60047j326327l095829
2744g3255l005259n44805K025702K838278K654708K409147J134934j484712l002626
$$ y = [-799002, -2082941, -4701050, -6634123, -6782093, -5514304, -3357707, -294582, 3126810, 5159479, 4448012, 1635490, -1510758, -3854507, -4839984, -3784706, -926232, 1427012, 742705, -2727537, -6318938, -8100525, -7926258, -5812306, -1902383, 1616771, 1513044, -2172559, -5237781, -4587445, -2317431, -2349615, -4811202, -6564875, -6214413, -5412601, -5302231, -4666733, -2441397, 296045, 2138288, 3472158, 5255675, 6679168, 5782681, 2446237, -508644, -61201, 3402891, 6099732, 4975224, 1185172, -1578757, -1799513, -1455211, -2399896, -3513951, -2712083, -120168, 2454833, 3988854, 4348901, 3022574, -73255, -3078514, -3623319, -1597617, 1240661, 3895369, 6304516, 7439450, 5954738, 2952112]
2735B952112j487458R97751J245634k38496m52608J031999J630020J43431j543754
2726D278631j613239p02085n04901j673725l438189m114390k295605J211050L430510
2717e421943K779918J492091K388261M370846L923211M69403k855591l787281
2709C358915l292411k908655k515455j633239o68461O6158Q24378J383673J158759
2700d226338M99036J48127k96248j216964r04170K216198N497834M194100j451607
2691D459968n282374l295673J036051K168116M9685j120975M56709K487521K617591
2682C576619R82378j129850k744850l186923k253797n61316J103587K342256K594509
2673G22613J233600j020858k225804j684465p19990j24801J006797K599378K346203
$$ y = [2952112, 1464654, 2462405, 3708039, 3469543, 3016935, 4048934, 5678954, 5822385, 4278631, 2665392, 1963307, 1458406, -215319, -3653508, -7767898, -10063503, -8852453, -5421943, -2642025, -1149934, 1238327, 5609173, 9532384, 10001787, 7146196, 3358915, 66504, -2842151, -5357606, -6990845, -7659306, -7593148, -6768770, -5385097, -4226338, -3727302, -3579175, -3875423, -5092387, -5996557, -3780359, 1717475, 5911575, 4459968, -822406, -4118079, -3082028, -913912, -864227, -1985202, -1528493, 959028, 3576619, 4558997, 3429147, 684297, -2502626, -4756423, -5317739, -4214152, -1871896, 722613, 1956213, 935355, -1290449, -2974914, -3694904, -3819705, -2812908, -213530, 2132673]
2664B132673o55733l353730k620263J58066J366052M68089k10080K30974O54624
2655a829328P65289J145494R85029p06848k044622k72476L162735L660898K88037
2646E154208k566306j767188K41037j10298k083619k522226q36980Q26357J092726
2637b572289O23439N86210J446841K630221K623045O41715j432003r16853J245676
2628D876002R31141k782004n075236k115286K658601L028780j071217l746066
2620c295285j751377J674252K381417O97268n78769n49694k19127O3548Q04148
2611g73619J729867J744012M61965j198158k009272j597304o73131k28803m45890
2602b990333o74407o54443r86249j752056j658384J86643K400903K846681J575057
$$ y = [2132673, 1476940, -1876790, -4497053, -4338987, -2972935, -2504846, -2714926, -2483952, -1829328, -1064039, 81455, 1066484, 359636, -1684986, -1957462, 1205273, 4866171, 5154208, 2587902, 820714, 1061751, 951453, -1132166, -3654392, -4491372, -3665015, -2572289, -1948850, -1362640, 84201, 2714422, 5337467, 5979182, 4547179, 3630326, 4876002, 5807143, 3025139, -2050097, -4165383, -1506782, 1521998, 450781, -3295285, -5046662, -3372410, -990993, -293725, -872494, -1422188, -1641315, -1577767, -773619, 956248, 2700260, 3162225, 1964067, -45205, -1642509, -2315640, -2544443, -2990333, -3664740, -4319183, -5305432, -7057488, -8715872, -8529229, -6128326, -3281645, -1706588]
2593a706588M96836L54620J9159j005397j406742j41165J878641K988595K503482
2584C981441P36242j456043k663708j808485L29579J640554J238230K93386j1372
2575B279824J19902J89097K36441n2105j285797k557973j623053J785421M537994
2566C629751L690598K42807k262551j913271J49209J526212O17144k107802l975554
2557d03457k583866Q07526K275356O23368q20662M76501K153691J046224j398363
2548B176318j675563j18886K20505p76081o26242M11603m82456k906896k858119
2539f635817P05473L799042L581457J968116J119454N6656j616233j336034J623956
2530C266070L339481J314284o66195J363804M195973K127471l504679o068751
$$ y = [-1706588, -1209752, -855132, -835973, -1841370, -3248112, -3389277, -1510636, 1477959, 3981441, 4717683, 3261640, 597932, -1210553, -880974, 759580, 1997810, 2291196, 2279824, 2399726, 2588823, 2825264, 2773159, 1487362, -1070611, -2693664, -908243, 3629751, 7320349, 7563156, 5300605, 3387334, 3536543, 5062755, 5679899, 3572097, -403457, -2987323, -2179797, 95559, 718927, -101735, 374766, 2528457, 3574681, 2176318, 500755, 381869, 602374, -173707, -799949, -388346, -870802, -3777698, -6635817, -5930344, -2131302, 1450155, 3418271, 4537725, 4594381, 2978148, 1642114, 3266070, 6605551, 7919835, 7253640, 8617444, 12813417, 14940888, 11436209, 5367458]
2522E367458l842937j757537k621642l106976l02102L275329L992793K230001
2514C234387M01434p43899j174884P2624K806977M356752K991648O45189j77001
2505A2413227j67142j331586l216809l882375l272594k770304k378287j126428
2497e732298M12817P90279M91636J335624L040162L088242O16921j881023j768073
2488C94287M86019K247916J711233p78077l259155l392998l59521L656268M935520
2479E641492K216515j534423k395867J8349K501020K395499M40067q65650n73305
2470G843697k608o10095k166132l225485k806422j357886l89970j134829l085430
2461f935160m003584k289882O14295J550265r0817j111343J070377M298509M345148
$$ y = [5367458, 1524521, -233016, -2854658, -5961634, -6263736, -2988407, 1004386, 3234387, 3635821, 2891922, 1717038, 1789662, 4596639, 8953391, 11945039, 12590228, 12413227, 12246085, 10914499, 7697690, 3815315, 542721, -2227583, -4605870, -5732298, -5319481, -4529202, -4037566, -2701942, 338220, 3426462, 4043383, 2162360, 394287, 880306, 3128222, 4839455, 4061378, 802223, -2590775, -2950296, 705972, 5641492, 7858007, 6323584, 3927717, 3946066, 6447086, 8842585, 9282652, 8417002, 7843697, 7841089, 7230994, 5064862, 1839377, -967045, -2324931, -2714901, -3849730, -6935160, -10938744, -13228626, -12614331, -11064066, -11154883, -12266226, -11195849, -6897340, -2552192]
2452b552192Q86830k060743j825784k61309j83502j282076j487554m90120M22004
2443h834446R33836J784796K638532J920435r02355m147227n374706l495997K95635
2434a5181497L153012K815323R3219j570783l8495K795219L515915J705403J53073
2425b559611P38936K030971J575637q24622l033105l056174q89900J747478L039230
2416a231160K503770J008385m25044j367688j521898m54901J525233K972498K746966
2407E756161J444316N53836O18814J029830J092467L83529j323238l382272m177227
2398A996216l027399j598060j834687k991767k650202n20913R95872M88943l88995
2389i530992M27787K417354L478413K762697J172476j89425q93027j005190r43394
$$ y = [-2552192, -1665362, -3726105, -5551889, -5813198, -5996700, -7278776, -8766330, -9256450, -8834446, -7900610, -6115814, -3477282, -1556847, -2459202, -6606429, -11981135, -15477132, -15181497, -12028485, -9213162, -9119943, -10690726, -10729221, -7934002, -4418087, -2712684, -2559611, -1820675, 210296, 1785933, 961311, -2071794, -5127968, -6017868, -4270390, -1231160, 1272610, 2280995, 1855951, 488263, -1033635, -1488536, 36697, 3009195, 5756161, 7200477, 7754313, 8373127, 9402957, 10495424, 10878953, 9555715, 6173443, 1996216, -1031183, -2629243, -4463930, -7455697, -10105899, -10626812, -9630940, -9141997, -9530992, -9103205, -6685851, -3207438, -444741, 727735, 538310, -354717, -1359907, -2303301]
2380b303301j124994j241930n47590O66926R18329l05621j294409l08397J758414
2371c782573K479758J309526J78693M60970R77200m1806k062620k672897p73423
2362c927172J744099K052560l22154k933166l186561j094107J173199K027431
2354d465871J892285J852067J885415J208102j23184r71770o59522K15k55922
2345C61815j415285k181553j761337r92749j145464j953060j707833M61500L118987
2336g214979L950570K422492M33776J92398J714259K742831J411933j154303j784593
2327B714384N61226K651614Q38730l397384m508858m22306L803409K315820l464159
2318A092476o468627l071642K873323N576099L799542M89770j533080j537392
$$ y = [-2303301, -3428295, -4670225, -5217815, -4550889, -3632560, -3938181, -5232590, -5540987, -3782573, -1302815, 6711, 185404, 646374, 1623574, 1581768, -480852, -3153749, -3927172, -2183073, -130513, -452667, -3385833, -6572394, -7666501, -6493302, -4465871, -2573586, -721519, 1163896, 2371998, 2248814, 1277044, 617522, 617737, 361815, -1053470, -3235023, -4996360, -5989109, -7134573, -9087633, -10795466, -10333966, -7214979, -3264409, -841917, -408141, -215743, 1498516, 4241347, 5653280, 4498977, 2714384, 3275610, 5927224, 6765954, 3368570, -1140288, -1562594, 2240815, 4556635, 1092476, -5376151, -8447793, -5574470, 1629, 3801171, 4290941, 2757861, 1220469]
2310A220469j87409J024463M82064j716817l147841j697873J598072L643909K909903
2301D128940P72902n96706n22021R8943P7430r47021k145837k211894q48442N84239
2291a609467M32469j301384k869523k678713r20049P62813J008899N3402o87135
2282g808688l03885O40316J099373J000616R80111J079475Q89399Q59612J900093
2273C36422L306893K865801J11976k140912j319031R83746R32612j976058l832833
2264g31384j643258K405019L768308J412524j356112j735689p93890r77787k114524
2255a766793k013515l03095R31443P83189J177398L244492M248170R99284m671963
2246B628610p153570m049519R82710L326655K653295J521171J136858Q76457N56477
$$ y = [1220469, 1033060, 2057523, 2539587, 822770, -2325071, -4022944, -2424872, 1219037, 4128940, 4901842, 4305136, 3783115, 3882058, 3959488, 3012467, 866630, -1345264, -2193706, -1609467, -1176998, -2478382, -5347905, -8026618, -8946667, -8183854, -7174955, -7121553, -7808688, -8112573, -7472257, -6372884, -5372268, -4392157, -3312682, -2423283, -1563671, 336422, 3643315, 6509116, 6621092, 4480180, 3161149, 4144895, 5077507, 3101449, -731384, -2374642, 30377, 3798685, 5211209, 3855097, 2119408, 1325518, 347731, -1766793, -3780308, -4083403, -3151960, -2368771, -1191373, 2053119, 6301289, 7300573, 2628610, -4524960, -8574479, -7591769, -4265114, -1611819, -90648, 1046210, 1922667, 2479144]
2237B479144O48194P88200J44745r79049j564036j567903j604191j325956M8346
2228b932506J739213J888711L37764q68065l52958P86715Q97511J21168l13297
2219A304256j83067l15584r32489j191585n05926N70742J147259J103035Q86288
2210A882929N75753j13200r13175j025167m94430n86945j824902k541480r76591
2201f017208J708765K574758J087070j85561L19218R07687q1906j199476l93550
2192a280203J264794J163593o88473j965180j854283j667419j792597r67818J001465
2183f786121K415858K266511J426422O81339j83258p39174J34583J678569J181166
2174B075895k026275m795698m187410j247761J185042K411959L112601K454605
$$ y = [2479144, 3127338, 3915538, 4060283, 3081234, 1517198, -50705, -1654896, -2980852, -2932506, -1193293, 695418, 1033182, 165117, -187841, 598874, 1496385, 1617553, 1304256, 1121189, 805605, -126884, -1318469, -1824395, -1253653, -106394, 996641, 1882929, 2458682, 2345482, 1432307, 407140, -87290, -674235, -2499137, -5040617, -6017208, -4308443, -1733685, -646615, -832176, -512958, 394729, 312823, -886653, -1280203, -15409, 1148184, 459711, -1505469, -3359752, -5027171, -6819768, -7787586, -6786121, -4370263, -2103752, -677330, 4009, -179249, -918423, -783840, 894729, 2075895, 49620, -4746078, -8933488, -10181249, -8996207, -6584248, -3471647, -1017042]
2166a017042o82398m303502m635024j353248J499226R97898p45867l2143K783641
2157g488459L659797O07979l301360l740558n30750K505727K791693K034289K996912
2148d64730M940724M568626J020310k693989l875266l351016l137730l058154
2140f051225j916331n28750p27423j833944j056109K137867M665961M069042J998976
2131G58064J662775L163134L614293J546078r62957j248772L03202R14949p25544
2122I025222k587300j800514J639384M515488L739298n22456n170856p040949
2114A797317n225987j288030K081656K878816J104925j404270k678376k239918
2106d973867j051471j40239M25611J291692K736613L854949L135384M05667k117386
$$ y = [-1017042, -1699440, -6002942, -10637966, -11991214, -10491988, -9494090, -10239957, -10272100, -7488459, -3828662, -3220683, -6522043, -10262601, -10793351, -8287624, -5495931, -3461642, -464730, 4475994, 9044620, 10064930, 7370941, 3495675, 144659, -2993071, -6051225, -7967556, -8496306, -9223729, -11057673, -12113782, -9975915, -5309954, -1240912, 758064, 2420839, 5583973, 9198266, 10744344, 9781387, 8532615, 8835817, 9750766, 9025222, 6437922, 4637408, 6276792, 10792280, 14531578, 14009122, 8838266, 1797317, -3428670, -4716700, -2635044, 243772, 1348697, -55573, -2733949, -4973867, -6025338, -6165577, -5739966, -4448274, -1711661, 2143288, 5278672, 5684339, 3566953]
2097C566953j948107K78979J106358j111163l465182k217868J845130M280133
2089B335233K941744L63038m24170J99098K28730m22322m17889K47448L80353
2080E431263q5918j61615m4829j015416k733022k896193o42657J588576J185356
2071F25545r15361j530426K88610K036410J315577r51934j847962k40087J878172
2062F58544J933258q4412j696613j087167O73563J252509L13240k24691O60234
2053B398465J268822l72266l282822m310069j905384K140876M769245M480950
2045E187817K108346k93501j200362r25403j069798k160283k570697r12299J384430
2036d51750J774630L90247k97567L39957R7940j968797l368575j912090Q62811
$$ y = [3566953, 1618846, 1897825, 3004183, 1893020, -1572162, -3790030, -1944900, 2335233, 5276977, 5640015, 5215845, 5414943, 5643673, 5221351, 4803462, 5050910, 5431263, 5345345, 5183730, 5138901, 4123485, 1390463, -1505730, -2148387, -559811, 625545, -289816, -1820242, -1531632, 504778, 1820355, 868421, -979541, -1219628, 658544, 2591802, 2507390, 810777, -276390, 397173, 1649682, 1962922, 1738231, 2398465, 3667287, 3295021, 12199, -4297870, -6203254, -4062378, 706867, 5187817, 7296163, 7002662, 5802300, 4876897, 3807099, 1646816, -923881, -1836180, -451750, 1322880, 1713127, 1415560, 1755517, 1853457, -115340, -3483915, -5396005, -4533194]
2027d533194K366786K885671L871454M075595J208980l153609m379209j204660
2019A137814K085666J364048k194909m470274l738212j585376M2732N72996L07461
2010f478054l9627M12550J707191K577580J900644K28665r34294r01719p6005
2001a603069R79247J849086K109316J736525J322435J136652M63483j228050k888253
1992C877372k798537q61133R88944R09017r12784k618329k535970n81877J771792
1983b761505K754954J800942k325j016580o76806J6370l07438j700683k660983
1974d554054j911150j25038R41468R55427J267348K200919J927195m32979k282080
1965b012944p09468K707160L372438n961l703205m316368k718866j308031l34316
$$ y = [-4533194, -2166408, 719263, 4590717, 8666312, 9875292, 6721683, 2342474, 1137814, 3223480, 4587528, 2392619, -2077655, -5815867, -7401243, -7358511, -6785515, -6478054, -6517681, -6105131, -4397940, -1820360, 80284, 308949, -625345, -1527064, -1603069, -623822, 1225264, 3334580, 5071105, 6393540, 7530192, 7993675, 6765625, 3877372, 1078835, 217702, 1206646, 2115663, 1202879, -1415450, -3951420, -4533297, -2761505, -6551, 1794391, 1792066, 775486, 98680, 115050, -192388, -1893071, -4554054, -6465204, -6590242, -5648774, -4693347, -3425999, -1225080, 702115, 269136, -2012944, -2722412, -15252, 3357186, 3351225, -351980, -4668348, -7387214, -8695245, -9029561]
1956i029561Q33576J343604N51158K04866J913090L697519K267855j844048m509105
1947d571046l377597l09977J833702K275774J599884L11479q13327o84819O64932
1938c070995J708661J223482l90835j877461k264414j243056M43069J138962K00882
1929d131705n12871J076226L692834L869769J068890j136518k49116J423031L58682
1920E459222k841357m403479k659375K86655J974008K327015K520327K861254
1912E524270K685273J529046j75208j296475r64818K97024Q34039j23416j296508
1903G013227j164229l07478n07839j777846k078018m13288J454688J393770k49413
1894C363574j523324j784326k100991k893668k857035r57321J616891K644769
$$ y = [-9029561, -8195985, -6852381, -6301223, -6096357, -4183267, -485748, 1782107, -61941, -4571046, -7948643, -8258620, -6424918, -4149144, -2549260, -2237781, -3051108, -3735927, -3070995, -1362334, -138852, -529687, -2407148, -4671562, -5914618, -5471549, -4332587, -4131705, -4644576, -3568350, 124484, 3994253, 5063143, 3926625, 3677509, 5100540, 5459222, 2617865, -1785614, -4444989, -4158334, -2184326, 142689, 2663016, 5524270, 8209543, 9738589, 9563381, 8266906, 7302088, 7599112, 8433151, 8309735, 7013227, 5848998, 5541520, 5033681, 3255835, 1177817, 764529, 2219217, 3612987, 3363574, 1840250, 55924, -2045067, -4938735, -7795770, -8753091, -7136200, -4491431]
1886d491431J627914K87209K34195J083200J367641O47078j73548m66499q52926
1877g37167k046712l295151k873217k82615K754594M105421L681194L202468L405107
1868G913922K608603q75632n444530o941374l376516K151820M514667K300598
1860B851558p35117m02975K769489M317038J563107k909628m430455j921156J228962
1851B330823J848518O13710J06053R20833J465053P63811m56086j254714j365425
1842D972576o63223O49786J382034N77812o37206m04617O24234j17553k679778
1833C704065l576781p18093L177135M246954K497055O20653m91983k010035l819000
1824C629970m114698k446853n66265K29091M73432P13623K61072j257506k441043
$$ y = [-4491431, -2863517, -2576308, -2342113, -1258913, 108728, 755806, 582258, 115759, -737167, -2783879, -6079030, -8952247, -9234862, -6480268, -2374847, 1306347, 4508815, 7913922, 10522525, 9646893, 4202363, -2739011, -6115527, -3963707, 550960, 2851558, 2116441, 1713466, 4482955, 8799993, 10363100, 7453472, 3023017, 1101861, 2330823, 4179341, 4793051, 4899104, 5819937, 7284990, 8048801, 7592715, 6338001, 4972576, 4309353, 4959139, 6341173, 6918985, 6281779, 5877162, 6501396, 6383843, 3704065, 127284, -590809, 2586326, 6833280, 9330335, 9950988, 9459005, 7448970, 3629970, -484728, -2931581, -3497846, -3268755, -2795323, -2081700, -1820628, -3078134, -5519177]
1815e519177j411724J737978M426528L838423K5836l574574l781196j575371n11739
1806f345016j247524p17385K100247L344586J19541m060792l862607N8855K567273
1797h042822J897196P98471M95400q31085l022298k991043k81194J587004J322818
1788i067553K310326O065970Q163913M623145j525312m420341l240521j599675
1780A309952j380563j576222j739158k325897k403204p22208J427269J622262
1772e787769K4457j135358r82511j29794J454130L519825L683294L01567l552099
1763b604258l187605P28749K642784J20981l009385k903618p98799N06055J481870
1754g023226L707655N480845L734806n32709k570616j46889L376585L503561J05773
$$ y = [-5519177, -6930901, -5192923, -766395, 3072028, 3097864, -476710, -4257906, -5833277, -6345016, -7592540, -8309925, -6209678, -2865092, -2745551, -6806343, -10668950, -10610095, -8042822, -6145626, -5347155, -4851755, -5682840, -8705138, -11696181, -11977375, -10390371, -9067553, -6757227, -691257, 7472656, 12095801, 10570489, 6150148, 2909627, 1309952, -70611, -1646833, -3385991, -5711888, -8115092, -8837300, -7410031, -5787769, -5763312, -6898670, -7881181, -8010975, -6556845, -3037020, 646274, 947841, -2604258, -5791863, -5063114, -2420330, -2299349, -5308734, -8212352, -9011151, -8505096, -7023226, -3315571, 2165274, 5900080, 5367371, 2796755, 2649866, 6026451, 9530012, 9635785]
1745I635785l285453m415550m174422l621486j817734J782486M721961M067066
1737B892653Q29482j141841p24034o31894k139182k487486J82433K743840J410624
1728I34595k229020l427539j089173J536545K105165J249736j34152j749370k075592
1719d878805L42934L346864K853067r68015l099384p78010K509877K347775m22589
1710A253714j581786N20533L501379M131559J132849l930405p165679n392182
1702g530018j11292L324803K002457j118576j835801l96379J85376m55738j9705
1693e954873J698256J858028q11593l496509l070767l86953J247790Q58787P79976
1684g277858K626877M370952L066837m78282k150091q3218K570630K018202r45362
$$ y = [9635785, 6350332, 1934782, -2239640, -5861126, -7678860, -5896374, -1174413, 2892653, 3722135, 2580294, 1856260, 1224366, -914816, -3402302, -3219869, -476029, 934595, -1294425, -4721964, -5811137, -4274592, -2169427, -919691, -1053843, -2803213, -4878805, -4535871, -1189007, 1664060, 696045, -2403339, -3181349, -671472, 1676303, 1253714, -328072, 192461, 3693840, 7825399, 8958248, 5027843, -2137836, -7530018, -7641310, -4316507, -2314050, -3432626, -5268427, -5664806, -5479430, -5935168, -5954873, -4256617, -2398589, -3210182, -6706691, -9777458, -10164411, -8916621, -8057834, -7277858, -4650981, -280029, 2786808, 2308526, 158435, 75217, 2645847, 4664049, 3718687]
1675C718687k515004j396983K61082R30083J374988J967292J550994l3599j129555
1666D727985j121937j426914k389268k056713K78247K140849J603488L45984N70386
1657B672107J326005P03928n54158q05028q84117k196181l073914j071760K134803
1648a748315K506642N8163r25904J338515L499870K620005L16437q41008j488072
1639E336333l022262l876794k001028O63755L08185k569150l146778O83757M806705
1630b817277M446024N95871j986465j614890r32345j533094j240548J530973L878848
1621C27097K109831k283192m029247j275231K104548K171338k43028j887631j571246
1612d576761j43633J853648L877598M123707J450060j949559k451515K65618K606993
$$ y = [3718687, 1203683, -193300, 67782, 997865, 2372853, 4340145, 5891139, 5857540, 4727985, 3606048, 2179134, -210134, -2266847, -1988600, 152249, 1755737, 2101721, 2672107, 3998112, 4702040, 4147882, 3342854, 2458737, 262556, -2811358, -3883118, -1748315, 758327, 816490, -109414, 1229101, 4728971, 7348976, 7665413, 6824405, 5336333, 2314071, -1562723, -3563751, -2899996, -2591811, -5160961, -8307739, -7623982, -2817277, 1628747, 2224618, 238153, -1376737, -2309082, -3842176, -5082724, -3551751, 327097, 2436928, 153736, -3875511, -5150742, -3046194, -874856, -1117884, -3005515, -4576761, -4720394, -2866746, 1010852, 5134559, 6584619, 4635060, 2183545, 2449163, 5056156]
1603E056156J690955j249055k944357k171716n10877L69745Q02616J905117K970543
1594E919127J633091k504405n769469m103853J468894N521637M754330J281165
1586H200517j398578k659750l181772k206922N17190K201174J17069l803969n033159
1577g248200k677770k41674j38357q58810l31197R73363J652343J780846K210674
1568d878782K980994L541001L390900J923201r53480l477548l006008O12923L926206
1559D059407L429123l74821l491422k871074L09225K086427M26138k124321j589175
1550a40493J897201L818628J362244k588160l429219p98139J921978K442692J132772
1541E619504q91322k200059q41552K866419M481392M31844n847080p387333l212473
$$ y = [5056156, 6747111, 5498056, 2553699, 381983, -128894, 240851, 1043467, 2948584, 5919127, 7552218, 5047813, -721656, -4825509, -3356615, 2165022, 6919352, 8200517, 6801939, 4142189, 960417, -1246505, -729315, 1471859, 1588928, -2215041, -7248200, -9925970, -10167644, -10306001, -11164811, -11496008, -10522645, -8870302, -7089456, -4878782, -1897788, 1643213, 5034113, 6957314, 6003834, 2526286, -479722, 133201, 4059407, 7488530, 7113709, 3622287, 751213, 1060438, 3146865, 3573003, 1448682, -140493, 1756708, 5575336, 6937580, 4349420, 920201, 122062, 2044040, 4486732, 5619504, 4728182, 2528123, 1686571, 4552990, 9034382, 9466226, 3619146, -3768187, -6980660]
1532f980660O92104O40551j22358J802920L983658K739426l58570j050024J071258
1523B418305K748830K225774N68368j092585k424983k683845j313658P16677K101414
1514C264297K806089K883328J320984j827655l911358k879923o02035k98817j907113
1505a152203k787584j954143o30486O04245K167694L356211K746614O73551j073897
$$ y = [-6980660, -6288556, -5648005, -5770363, -3967443, 16215, 2755641, 2397071, 1347047, 2418305, 5167135, 7392909, 7961277, 6868692, 4443709, 1759864, 446206, 1162883, 3264297, 6070386, 8953714, 10274698, 8447043, 4535685, 1655762, 1053727, 754910, -1152203, -3939787, -5893930, -6524416, -5920171, -3752477, -396266, 2350348, 3023899, 1950002]
$$ [...]
##END NTUPLES=NMR SPECTRUM
##END=
