##TITLE=31P_DE-80H_X3
 64 sc D2O
 26.2.2025
##JCAMPDX= 6.0         $$ Bruker NMR JCAMP-DX V2.0
##DATA TYPE= NMR SPECTRUM
##DATA CLASS= NTUPLES
##ORIGIN= UXNMR, Bruker Analytische Messtechnik GmbH
##OWNER= root
$$ XWIN-NMR		Version 3.5
$$ Thu May 15 14:54:27 2025 Russian Standard Time (UT+4h)  Yarkov@DPX200
##.OBSERVE FREQUENCY= 81.013821
##.OBSERVE NUCLEUS= ^31P
##.ACQUISITION MODE= SIMULTANEOUS
##.ACQUISITION SCHEME= undefined
##.AVERAGES= 64
##.DIGITISER RES= 17
##SPECTROMETER/DATA SYSTEM= spect
##.PULSE SEQUENCE= zgpg30
##.SOLVENT NAME= CDCl3
##.SHIFT REFERENCE= (INTERNAL, CDCl3, 0, 198.062)
##AUDIT TRAIL= $$ (NUMBER, WHEN, WHO, WHERE, WHAT)
$$ ##TITLE= Audit trail, XWIN-NMR		Version 3.5
$$ ##JCAMPDX= 5.01
$$ ##ORIGIN= Bruker BioSpin GmbH
$$ ##OWNER= Yarkov
$$ C:/Bruker/XWIN-NMR/data/yarkov2/nmr/P31/2/pdata/1/auditp.txt
$$ ##AUDIT TRAIL=  $$ (NUMBER, WHEN, WHO, WHERE, WHAT)
(   1,<2025-05-15 14:53:12.89 +0400>,<Yarkov>,<DPX200>,
      <created by zg, POWCHK disabled, PULCHK disabled
       configuration hash MD5:
       00 E9 B6 7A A2 85 ED C7 34 08 36 98 17 FE 4E 26
       data hash MD5: 32K
       A7 E7 0F 2E 3D D8 00 23 52 A8 8E 8E 10 36 36 FC>)
(   2,<2025-05-15 14:53:19.28 +0400>,<Yarkov>,<DPX200>,
      <Start of raw data processing
       efp BC_mod = 2 LB = 1.5 FT_mod = 6 PKNL = 1 PHC0 = 1763.063 PHC1 = 109.5595 SI = 64K 
       data hash MD5: 64K
       C3 DE 4F 04 33 43 92 38 92 BE 5E EE FD E5 58 C7>)
(   3,<2025-05-15 14:53:54.87 +0400>,<Yarkov>,<DPX200>,
      <abs ABSG = 5 
       data hash MD5: 64K
       BF 44 1D 5D FB 9C E9 34 C0 19 6D 79 DC 6C 71 38>)
(   4,<2025-05-15 14:54:05.53 +0400>,<Yarkov>,<DPX200>,
      <pk PHC0 = -13.2 PHC1 = 0 
       data hash MD5: 64K
       C9 1C 0E A5 35 04 C7 CC 25 9B 0D 8E DF 7F 8F 25>)
$$ ##END=
$$ 
$$ hash MD5
$$ 66 F7 80 06 BC 5F 45 44 76 6C E5 03 C2 A1 91 BB
##$RELAX= 
##$RELAX= 
##$RELAX= 
##$RELAX= 
##$RELAX= 
##$RELAX= 
##$RELAX= 
##$RELAX= 
$$ Bruker specific parameters
$$ --------------------------
##$DU= <C:/Bruker/XWIN-NMR>
##$EXPNO= 2
##$NAME= <P31>
##$PROCNO= 1
##$TYPE= <nmr>
##$USER= <yarkov2>
##$AMP= (0..31)
100 100 100 100 100 100 100 100 100 100 100 100 100 100 100 100 100 100 
100 100 100 100 100 100 100 100 100 100 100 100 100 100 
##$AQSEQ= 0
##$AQ_mod= 1
##$AUNM= <au_zg>
##$AUTOPOS= <>
##$BF1= 81.014009
##$BF2= 200.13
##$BF3= 200.13
##$BF4= 200.13
##$BF5= 200.13
##$BF6= 200.13
##$BF7= 200.13
##$BF8= 200.13
##$BYTORDA= 1
##$CFDGTYP= 0
##$CFRGTYP= 5
##$CHEMSTR= <none>
##$CNST= (0..31)
1 1 145 1 1 1 1 1 1 1 1 1 1 1 1 1 1 1 1 1 1 1 1 1 1 1 1 1 1 1 1 1 
##$CPDPRG= <waltz16>
##$CPDPRG1= <>
##$CPDPRG2= <waltz16>
##$CPDPRG3= <>
##$CPDPRG4= <mlev>
##$CPDPRG5= <mlev>
##$CPDPRG6= <mlev>
##$CPDPRG7= <mlev>
##$CPDPRG8= <mlev>
##$CPDPRGB= <>
##$CPDPRGT= <>
##$D= (0..31)
0 1 0 0 0 0 0 0 0 0.06 0 0.03 2e-05 3e-06 0 0 0.0002 0 0 0 0 0 0 0 0 0 
0 0 0 0 0 0 
##$DATE= 1747306392
##$DBL= (0..7)
120 120 120 11 120 120 24 19 
##$DBP= (0..7)
150 150 150 150 150 150 150 150 
##$DBP07= 0
$$ [...]
##$SUBNAM3= <"">
##$SUBNAM4= <"">
##$SUBNAM5= <"">
##$SUBNAM6= <"">
##$SUBNAM7= <"">
##$SUBNAM8= <"">
##$SUBNAM9= <"">
##$SW= 400.765351723535
##$SWIBOX= (0..15)
0 1 3 0 0 0 0 0 0 0 0 0 0 0 0 0 
##$SW_h= 32467.5324675325
##$TD= 32768
##$TD0= 1
##$TE= 0
##$TE2= 300
##$TE3= 300
##$TEG= 300
##$TL= (0..7)
0 120 53 12 22 120 120 120 
##$TP= (0..7)
150 150 150 150 150 150 150 150 
##$TP07= 0
##$TPNAME0= <>
##$TPNAME1= <>
##$TPNAME2= <>
##$TPNAME3= <>
##$TPNAME4= <>
##$TPNAME5= <>
##$TPNAME6= <>
##$TPNAME7= <>
##$TPOAL= (0..7)
0.5 0.5 0.5 0.5 0.5 0.5 0.5 0.5 
##$TPOFFS= (0..7)
0 0 0 0 0 0 0 0 
##$TUNHIN= 0
##$TUNHOUT= 0
##$TUNXOUT= 0
##$USERA1= <user>
##$USERA2= <user>
##$USERA3= <user>
##$USERA4= <user>
##$USERA5= <user>
##$V9= 5
##$VALIST= <valist>
##$VCLIST= <CCCCCCCCCCCCCCC>
##$VD= 0
##$VDLIST= <DDDDDDDDDDDDDDD>
##$VPLIST= <PPPPPPPPPPPPPPP>
##$VTLIST= <TTTTTTTTTTTTTTT>
##$WBST= 1024
##$WBSW= 4
##$XGAIN= (0..3)
0 0 0 0 
##$XL= 0
##$YL= 0
##$YMAX_a= 8639
##$YMIN_a= -21862
##$ZGOPTNS= <>
##$ZL1= 120
##$ZL2= 120
##$ZL3= 120
##$ZL4= 120
##$ABSF1= 198.0616
##$ABSF2= -202.7028
##$ABSG= 5
##$ABSL= 3
##$ALPHA= 0
##$AQORDER= 0
##$ASSFAC= 0
##$ASSFACI= 0
##$ASSFACX= 0
##$ASSWID= 0
##$AUNMP= <proc_1d>
##$AZFE= 0.1
##$AZFW= 0.5
##$BCFW= 0
##$BC_mod= 2
##$BYTORDP= 0
##$COROFFS= 0
##$CY= -3
##$DATMOD= 1
##$DC= 0
##$DFILT= <>
##$DTYPP= 0
##$F1P= 0
##$F2P= 0
##$FCOR= 1
##$FTSIZE= 65536
##$FT_mod= 6
##$GAMMA= 0
##$GB= 0
##$INTBC= 1
##$INTSCL= 9.790993e-09
##$ISEN= 30
##$LB= 1.5
##$LEV0= 0
##$LPBIN= 0
##$MAXI= 10000
##$MC2= 0
##$MEAN= 0
##$ME_mod= 0
##$MI= 50
##$NCOEF= 0
##$NC_proc= -8
##$NLEV= 6
##$NOISF1= 182.463
##$NOISF2= 159.3651
##$NSP= 0
##$NTH_PI= 0
##$NZP= 0
##$OFFSET= 198.0616
##$PC= 4
##$PHC0= 1749.863
##$PHC1= 109.5595
##$PH_mod= 1
##$PKNL= yes
##$PPARMOD= 0
##$PSCAL= 0
##$PSIGN= 0
##$REVERSE= no
##$SF= 81.0140089999434
##$SI= 65536
##$SIGF1= 159.3651
##$SIGF2= -187.1042
##$SINO= 113.3802
##$SIOLD= 16384
##$SREGLST= <1H.CDCl3>
##$SSB= 0
##$STSI= 65536
##$STSR= 0
##$SW_p= 32467.5324675325
##$SYMM= 0
##$S_DEV= 0
##$TDeff= 32768
##$TDoff= 0
##$TI= <>
##$TILT= no
##$TM1= 0
##$TM2= 0
##$TOPLEV= 0
##$USERP1= <user>
##$USERP2= <user>
##$USERP3= <user>
##$USERP4= <user>
##$USERP5= <user>
##$WDW= 1
##$XDIM= 65536
##$YMAX_p= 107429704
##$YMIN_p= -345362831
$$ End of Bruker specific parameters
$$ ---------------------------------
##NTUPLES= NMR SPECTRUM
##VAR_NAME=  FREQUENCY,     SPECTRUM/REAL,   SPECTRUM/IMAG
##SYMBOL=    X,             R,               I
##VAR_TYPE=  INDEPENDENT,   DEPENDENT,       DEPENDENT
##VAR_FORM=  AFFN,          ASDF,            ASDF
##VAR_DIM=   65536,         65536,           65536
##UNITS=     HZ,            ARBITRARY UNITS, ARBITRARY UNITS
##FACTOR=    0.49542278885378, 1,            1
##FIRST=     16045.7642231865, 0,            0
##LAST=      -16421.768244346, 0,            0
##MIN=       -16421.768244346, -345362831,   0
##MAX=       16045.7642231865, 107429704,    0
$$ Real data points
##PAGE= N=1
##DATA TABLE= (X++(R..R)), XYDATA
$$ [...]
7495A023049j301330k80578M67691J8335j129252j129600J187544M346162N126441
7486H328462J894290l296691o266542m518087K75909L670541K885707k00212j420215
7477A353162L40024J886340N45305j874894j952631J39926J180367k9628j342805
7468B45166j289988j215745k172034k522165o90978J775036K310194J189630Q56886
7459a513998K082479L107686K456309N89804j314157k425563j928566N09558L340303
7450D903855L861911J321025j894352l096376k288303j296359r41462n68203J20630
7441A22366M81329M08823Q81841K174304K582930L09342l611158n623523l498990
7432e772736R00741L528759K500259l09632j943912j603929o77587l25283j63498
$$ y = [1023049, -278281, -558859, -91168, -72833, -1202085, -2331685, -1144141, 3202021, 8328462, 10222752, 6926061, 659519, -3858568, -3582659, 87882, 2973589, 2773377, 1353162, 1693186, 3579526, 4124831, 2249937, 297306, 437232, 1617599, 1587971, 245166, -1044822, -2260567, -4432601, -6954766, -7645744, -5870708, -3560514, -2370884, -1513998, 568481, 3676167, 6132476, 6722280, 5408123, 2982560, 1053994, 1563552, 4903855, 8765766, 10086791, 8192439, 5096063, 2807760, 1511401, 569939, 1736, 122366, 603695, 1012518, 1894359, 4068663, 6651593, 6960935, 3349777, -2273746, -5772736, -4871995, -1343236, 1157023, 847391, -1096521, -2700450, -3378037, -3703320, -3866818]
7423c866818N60926J407592J153013l09398j252954l8140K389928L024735N55374
7414C624258k347947k077378R23895K400080J73222k562160j749181J567844K763595
7405B716228L98116j962093j257673R96658J826313J239587J035215J123208J53507
7396F269066j099969k47724K672633M510985L162561J36443k000433k699102k702927
7387H001533k066115n68814J056775J865887J884900J399064P1005j940465l109416
7378F594354k458264j413771j836404k929130k355714r5609J340751Q11157J21663
7369b220967Q17892J729869J220804K7500o3050Q08096Q84037m73056k036371
7360F94754k469597j520191K79423J912281K180383R27285k79403J08654J427891
$$ y = [-3866818, -3305892, -1898300, -745287, -1054685, -2307639, -2345779, 44149, 3068884, 3624258, 1276311, -801067, 122828, 2522908, 2696130, 133970, -1615211, -47367, 2716228, 3114344, 1152251, -105422, 891236, 2717549, 3957136, 4992351, 6115559, 6269066, 5169097, 4921373, 7594006, 12104991, 15267552, 15403995, 13403562, 10704460, 8001533, 5935418, 5366604, 6423379, 8289266, 10174166, 11573230, 11644235, 9703770, 6594354, 4136090, 2722319, 885915, -2043215, -4398929, -4494538, -3153787, -2342630, -2220967, -1403075, 326794, 1547598, 1575098, 1512048, 2320144, 3204181, 2731125, 694754, -1774843, -3295034, -3015611, -1103330, 1077053, 2004338, 1724935, 1833589, 3261480]
7351C261480J644284K32218j197482j201579o1812J116794J494418M88561j806052
7342C970830l791833l557109j538189l91806j366257k531186j857826k54803L37612
7333a0980567L20589J380717K975594K747705L72222j732909j948608j122147
7325g987404k9630J995413M473551M608581J187112k343324j737779K093536M052995
7316F313051J564683k564631m383741l236565r87726R02980J968129J896213P83756
7307B256149m05341p31019k45827M10154O99274J74191j204139k344829j810469
7298c201856J71757J738602J900628J485266J037242j57171j878151k155637m54589
7289a513909O27483o79210j887028j39917K310682R53702l380595m800924j029931
$$ y = [3261480, 4905764, 5137982, 3940500, 2738921, 2677109, 3793903, 5288321, 5776882, 3970830, 178997, -3378112, -4916301, -5308107, -6674364, -9205550, -11063376, -11318179, -10980567, -10659978, -9279261, -6303667, -3555962, -3183740, -4916649, -6865257, -7987404, -8017034, -6021621, -1548070, 3060511, 4247623, 1904299, 166520, 2260056, 6313051, 7877734, 5313103, 929362, -2307203, -3294929, -2391949, -423820, 1472393, 2256149, 1850808, 1119789, 873962, 1284116, 1983390, 2157581, 953442, -1391387, -3201856, -3030099, -1291497, 609131, 2094397, 3131639, 2974468, 1096317, -1059320, -1513909, -886426, -1565636, -3452664, -3592581, -1281899, -328197, -3708792, -8509716, -9539647]
7280i539647L048803K614350n19035j609801L4469J485123J396567R37320O85767
7271a466084J31114k58708L86031R62877m01073k746524k818812K91084L650252
7262b269843M378031K731187M68398j585599l087339l221037j804941j29194O44404
7253c875933R38207J517247J856302J059796l51103r24653k07789Q57632J212595
7244B082301N17799r54668k342792k268392J14689L799752O184726N188776J282756
7235A3604947k694432m077295k903983j525494j488398j704121o01282R34559
7227d55499O86514j133943j675001K87820K180544J305870j162007k065074r36684
7218b967460j22728n47559j93251K341191N051948M994417K257007l70873j224888
$$ y = [-9539647, -6490844, -3876494, -4395529, -6005330, -5970861, -4485738, -3089171, -2151851, -1466084, -1334970, -1593678, -1207647, -244770, -645843, -3392367, -6211179, -5920095, -2269843, 2108188, 4839375, 5307773, 3722174, 634835, -2586202, -4391143, -4520337, -3875933, -2937726, -1420479, 435823, 1495619, 1144516, 219863, 12074, 869706, 2082301, 2600100, 1645432, -697360, -2965752, -2851063, 948689, 7133415, 12322191, 13604947, 10910515, 6833220, 3929237, 2403743, 915345, -788776, -1390058, -455499, 231015, -902928, -2577929, -2290109, -109565, 1196305, 34298, -2030776, -2967460, -3090188, -3637747, -3830998, -1489807, 3562141, 8556558, 10813565, 10442692, 9217804]
7209I217804j450509k553488l820553l384201j206875N05313K58918n32213N48857
7200b416947L299548M670860K596554j155476k977903j617260Q15898J820369
7192E035643J174390K23082l67162j029149j827057j851414o70451L83818m79611
7183E92089k858783l938818j717639K238358M395564L357691J092671m4108j8301
7174C098724j07963n63986p20732o97204j277980k101297j498034J277947M619991
7165B029466O001043M323526N70947l194953n129242m655731k869646j477502
7157d402092r31685j73131J395423K624640K263786J110686J039753K108503K265311
7148G301194K97684k429356l948391m089910l780840l019079j110536J525481
$$ y = [9217804, 7767295, 5213807, 1393254, -1990947, -3197822, -2692509, -2433591, -2965804, -2416947, 882601, 5553461, 8150015, 6994539, 4016636, 2399376, 3215274, 5035643, 6210033, 6433115, 6065953, 5036804, 3209747, 1358333, 687882, 1071700, 592089, -2266694, -6205512, -7923151, -5684793, -1289229, 2068462, 3161133, 3117025, 3098724, 2990761, 2426775, 1706043, 1008839, -269141, -2370438, -3868472, -2590525, 2029466, 8030509, 12354035, 12924982, 9730029, 4600787, -54944, -2924590, -4402092, -5333777, -5506908, -4111485, -1486845, 776941, 1887627, 2927380, 5035883, 7301194, 7598878, 5169522, 1221131, -2868779, -6649619, -9668698, -10779234, -9253753]
7140i253753L314300L340722K119485N98034n97608j080850r91284j182843j923688
7131e657485j809346L21489K697429K209889j008680l269035k491912p99772l21264
7122a0128687M49668L200773N363695L237784j761093m324723k548689R5651N55213
7113e860408o9808J50943O24208K28145k66436M6969L75952J49402N32484K008274
7103b080275K705148J378155j50069m4580K29222j341805l167165k209129R61945
7094c718553K953023K665456J931586J404962k61622k793143l634636j896564
7086c349491L08455J478557K411787L098731J508499k439897m926539l111246
7078e021144M24611J179299j044347k533519j175970J492562L255236L440204
$$ y = [-9253753, -5939453, -2598731, -479246, 118788, -478820, -1559670, -2550954, -3733797, -5657485, -7466831, -7145342, -4447913, -2238024, -3246704, -6515739, -9007651, -9807423, -10128687, -9679019, -6478246, -1114551, 2123233, 362140, -3962583, -6511272, -6415621, -5860408, -5930216, -5779273, -5155065, -4926920, -5193356, -5146387, -4770435, -4621033, -4088549, -2080275, 624873, 2003028, 1852959, 1808379, 2037601, 695796, -2471369, -4680498, -3718553, -765530, 1899926, 3831512, 5236474, 4974852, 2181709, -1452927, -3349491, -3041036, -1562479, 849308, 3948039, 5456538, 3016641, -1909898, -5021144, -4596533, -3417234, -4461581, -6995100, -8171070, -6678508, -3423272, 16932]
7070A6932K257364L43833q65763l64552O94090L46904j113982j465833q8121J026637
7060G87509L29854j302185k419996k782034k215825J75902L881095N720595L137473
7051E312388j889512m450159k289085J924014M103805K956991K41171j727767
7043D181846j936199r43264j99722p12884j918572k295273j290897J09529R98395
7034d007041J638009K290027K187281R16990j80407K86493J265904N31572j649776
7025C279052k430317n69566J548143J373957k75043r43296k49898L26786L33633
7016B393451N33255O65424m02238k123344k350018o76215N02711n92193k491280
7007d540447k667429q98416J102565K276811K748476K479041J125074q75024k325472
$$ y = [16932, 2274296, 2618129, 1752366, 1387814, 2081904, 2428808, 1314826, -151007, -239128, 787509, 1117363, -184822, -2604818, -5386852, -7602677, -7426775, -3545680, 2174915, 5312388, 3422876, -1027283, -3316368, -1392354, 2711451, 5668442, 5909613, 4181846, 2245647, 1302383, 1102661, 389777, -1528795, -3824068, -5114965, -5005436, -4007041, -2369032, -79005, 2108276, 3025266, 2844859, 3131352, 4397256, 4928828, 3279052, 848735, 279169, 1827312, 3201269, 2926226, 1982930, 1733032, 2059818, 2393451, 2926706, 3592130, 3189892, 1066548, -1283470, -1959685, -1456974, -2049167, -4540447, -7207876, -8106292, -7003727, -4726916, -1978440, 500601, 1625675, 750651, -1574821]
6998a574821k391171r57708J636254M248927M952159K901496O4922m45170J862537
6989A0297425L984183K931104p53152l719863l609546j449482k66449j655666
6981E758554m064717m766086l235204j563314j245928j041087O63890K605811
6973f888081K085974o27264k010944k30755K058962J567116q86802j888793n83048
6964g403635N56631M3488m35767P70294K262638J772608l9546l18883J762238
6955a029934L654209K814296j31966k486453k667949j299653K02552R93211R37139
6946I85452L78703k8887J20018L79418j55672j627534k920181k692478q38668
6937f399829J254327J999914J208258K49199L39481Q46137N6666k149435l468570
$$ y = [-1574821, -3965992, -4923700, -3287446, 961481, 5913640, 8815136, 8880058, 8434888, 10297425, 14281608, 17212712, 16459560, 12739697, 9130151, 7680669, 7414220, 5758554, 1693837, -3072249, -6307453, -7870767, -9116695, -10157782, -9493892, -6888081, -4802107, -5429371, -7440315, -7671070, -5612108, -4044992, -4931794, -6820587, -7403635, -6847004, -6803516, -7239283, -6468989, -4206351, -2433743, -2473289, -2792172, -1029934, 2624275, 5438571, 5306605, 2820152, 152203, -1147450, -944898, 48313, 985452, 1364155, 1335268, 1455286, 1834704, 1679032, 51498, -2868683, -5561161, -6399829, -5145502, -3145588, -1937330, -1688131, -1348650, -502513, -445847, -2595282, -6063852]
6928f063852j984354R72080K284897J153145k3737P35160K257850K224106N04214
6919B059509j114746j678911j709709j445801m24914Q87188R20162o38803j763152
6910d909177o34624J704176K639278J350680n37859j424169j378322j174015j010682
6901e374714p19165k45448N95388J961530L071606K450378j20204k755339l502229
6892d638197k479790j038664K91447J622934K281096J457819J7406l50278J82205
6883b654022j07568j178341p82450J604256L064041J470586q02428k15896K405841
6874B804019L011317M23287k156742k149072q82441o58764j244309j144880m58325
6865b455910l96617j082884j592743j454876p07814P51419K474003K926386J307762
$$ y = [-6063852, -8048206, -7076126, -4791229, -3638084, -3661821, -2926661, -668811, 1555295, 2059509, 944763, -734148, -2443857, -3889658, -4314572, -3427384, -2507222, -3146025, -4909177, -5543801, -3839625, -1200347, 150333, -387526, -1811695, -3190017, -4364032, -5374714, -6093879, -6339327, -5743939, -3782409, -710803, 1739575, 1619371, -1135968, -4638197, -7117987, -8156651, -7865204, -6242270, -3961174, -2503355, -2485949, -2836227, -2654022, -2761590, -3939931, -4722381, -3118125, -54084, 1416502, 614074, 398178, 2804019, 5815336, 6238623, 4081881, 1932809, 1050368, 391604, -852705, -1997585, -2455910, -2852527, -3935411, -5528154, -6983030, -7690844, -6939425, -4465422, -1539036, -231274]
6856b31274o38270m65477J436797K060679R613k268895j721542R65210K038049
6847A184890k99283l175890k479995J805466N320409M556385P45539k400740l286253
6838A970528k947906k083621k73891J763805J930376j22140j863610j461137n87711
6829c675307j651717l679015l448226j64257L365802M344433K867804Q00446o49565
6820a889602j484858k043561k382604k275574j508400j71837J461024L185930
6812g109482M391142L636491K13558l613819l990779k89979L403238L383017R99510
6803A022897j29810K64048l36650k146674k611401j129531k33550j056018j371749
6794g728438J46274J214980q3628j622136o11869J597383J610017n06753j440498
$$ y = [-231274, -869544, -1335021, 101776, 2162455, 2172068, -96827, -1818369, -853159, 1184890, 885607, -2290283, -4770278, -2964812, 2355597, 6911982, 7657521, 5256781, 1970528, -977378, -3060999, -3334890, -1571085, 359291, 237151, -1626459, -3087596, -3675307, -5327024, -9006039, -12454265, -12618522, -9252720, -4908287, -2040483, -1240037, -1889602, -3374460, -5418021, -7800625, -10076199, -11584599, -11756436, -10295412, -7109482, -2718340, 918151, 1131709, -2482110, -6472889, -6762868, -3359630, 23387, 1022897, 893087, 1157135, 820485, -1326189, -3937590, -5067121, -5300671, -6356689, -7728438, -7582164, -6367184, -6450812, -8072948, -8684817, -7087434, -5477417, -5984170, -7424668]
6785g424668J02353J752732J398248j58393j189571j277001o11785Q87881K587680
6776c932524K885649J246759o24749q13679L95216J115234K55537j517972k760917
6767c751446k538460j136586O1824j08972j085318j068399N67919K239363K201685
6758d618390P94548k96406l16427J44215M86856N55951M8672j082072j660336
6749e943389l34555K014248K582614L09508k236299k036895M53670K344897K472670
6740c73531K272341K563002J962218m58276k897207k910900p30987J141593J135613
6731A703866l6111r35809r28501j05468J129647K054886J966271Q45739o35208
6722E059312j707073j796783o73023J081121K135385J665699K18281j222240k337619
$$ y = [-7424668, -7322315, -5569583, -4171335, -4329728, -5519299, -6796300, -7408085, -6520204, -3932524, -1046875, 199884, -424865, -1238544, -843328, 271906, 527443, -990529, -3751446, -6289906, -7426492, -7364668, -7473640, -8558958, -9627357, -9059438, -6820075, -4618390, -3823842, -4120248, -4436675, -4292460, -3805604, -3249653, -3200981, -4283053, -5943389, -6277944, -4263696, -1681082, -1371574, -3607873, -5644768, -5191098, -2846201, -373531, 1898810, 4461812, 6424030, 5965754, 3068547, 157647, -573340, 568253, 1703866, 1667755, 731946, -196555, -302023, 827624, 2882510, 4848781, 5694520, 5059312, 3352239, 1555456, 882433, 1963554, 4098939, 5764638, 5982919, 4760679, 2423060]
6713B423060k881842k023626K77975K060304J390126p97208j837665j051831j51002
6704b591709m0437K17140R01402R00155L44652J063871K991376L132175K34479
6695G153104k459771k031100o95955j947065m103929k703183J613566L215884
6687a958449K27946k295840k16296L426067L511997N31989j173034m49089J46372
6678A751663k53013K83584J946916J940654q39798l395571k864779n33803N18072
6669a446075k97809j437847k255749l133645l513177k342866k70241Q17409N90013
6660a3289987P25662K226994L968144M461352L647160K311130R85279J17559J87993
6651E341286Q53439R08556j39568j284881j478251r69311m71886R257N75643O29573
$$ y = [2423060, -458782, -2482408, -2204433, -144129, 1245997, 448789, -1388876, -2440707, -2591709, -2632146, -2415006, -1513604, -613449, -268797, 795074, 3786450, 6918625, 7153104, 4693333, 2662233, 1966278, 19213, -4084716, -6787899, -5174333, -1958449, -1730503, -4026343, -4242639, -816572, 2695425, 3227414, 2054380, 1605291, 1751663, 1498650, 1782234, 3729150, 5669804, 4830006, 1434435, -1430344, -1964147, -1446075, -1743884, -3181731, -5437480, -8571125, -12084302, -14427168, -14697409, -13880000, -13289987, -12564325, -10337331, -6369187, -1907835, 1739325, 4050455, 5035734, 5153293, 5341286, 6194725, 7103281, 6963713, 5678832, 4200581, 3231270, 2759384, 2768641, 3344284, 3973857]
6641C973857j43502p95229m45703Q9981m66506j498177j171169N72768J550992
6632A667312L42593j831664k997971k856166k287939j487140M1972J974344K930179
6623d504480K099368M60601j39249R23275K238090J961033N5801j672479j849119
6614d27159r38487M0537J055309K256824K662519J299718q32760j745008j270189
6605B101304j061201j662115j597214M395J770053K111189J368227P77927N60244
6596D372809K36699j60931l58907n19082p08876n06218Q8152L03474j25598n22146
6586B099376q03180j812636l059708k186536J380812M184366K951997k17431k95554
6577B241506L369474N800512L278475j728295m278113l197788j344636j067924
$$ y = [3973857, 3830355, 3035126, 2589423, 2679404, 2212898, 714721, -456448, 116320, 1667312, 2009905, 178241, -2819730, -5675896, -7963835, -9450975, -9409003, -7434659, -4504480, -2405112, -1944511, -2083760, -1160485, 1077605, 3038638, 3094439, 1421960, -427159, -1365646, -1325109, -269800, 1987024, 4649543, 5949261, 5116501, 3371493, 2101304, 1040103, -622012, -2219226, -2214831, -444778, 1666411, 3034638, 3812565, 4372809, 4609508, 4448577, 4089670, 3570588, 2861712, 2355494, 2443646, 2747120, 2621522, 2099376, 1296196, -516440, -3576148, -5762684, -4381872, -197506, 2754491, 2537060, 2241506, 5610980, 11411492, 14689967, 12961672, 8683559, 5485771, 4141135, 3073211]
6569C073211j792144j751561k62502J951654L524697L250810R33385k156287m044689
6560B726574l711802k108890j347415k451658l853686k888270O67162L490596
6552i477389K453606j124665k784017n28450K883089L972305K888803K180526
6544D63808K686598K855491J737403N07077M38632Q02889k24571l067159n839639
6535C60529n969922k751600J555729L513686J944550o85302j063098J030110K641543
6526E76225J528947j208663k915363k515792q86958Q36248J963240J949262R20228
6517B47374J62898O44587J379600R09034J5377O99277K413683K150510q04962
6508G817378l168208k488255q47836j105047k012781o96050J854419K110501J3705
$$ y = [3073211, 1281067, -470494, -732996, 1218658, 4743355, 7994165, 8927550, 6771263, 2726574, -985228, -3094118, -4441533, -6893191, -10746877, -13635147, -12967985, -9477389, -7023783, -8148448, -10932465, -11460915, -8577826, -4605521, -1716718, 463808, 3150406, 6005897, 7743300, 8250377, 8689009, 9491898, 9267327, 6200168, 360529, -5609393, -8360993, -6805264, -3291578, -1347028, -2032330, -3095428, -2065318, 576225, 2105172, 896509, -2018854, -4534646, -5421604, -4585356, -2622116, -672854, 247374, 410272, 1054859, 2434459, 3343493, 3358870, 4058147, 6471830, 8622340, 7817378, 4649170, 2160915, 1313079, 208032, -1804749, -2500799, -646380, 1464121, 1477826]
6499A477826r35304K90322P73168p71259j514139L99506K373796J675595k02197
6490C567314n46320Q6004l21231j289307j118974k97763l41873p81653m64543
6481a508346l24191j546792k462352q87093J641330J819916j09238j013433k48796
6472d638995j04698r60656m89535J630165K510640Q71645p86916m49146M43180
6463a974316Q0792q32313j279813k086859l603880l739869p99651L489316N930635
6454d815958N433963L042525N3272k207393k334965m45318J243980Q53785j039783
6445b15892k543504k457580o10342K151667L797099K903748J078151J212918K889304
6436H205569K591527n67099k913360j771592N96898R99128j50521j168760k600204
$$ y = [1477826, 542522, 832844, 1606012, 834753, -679386, -279880, 2093916, 3769511, 3567314, 3020994, 3106998, 2785767, 1496460, 377486, 79723, -262150, -1043803, -1508346, -1832537, -3379329, -5841681, -6728774, -5087444, -3267528, -3376766, -4390199, -4638995, -4743693, -5704349, -6193884, -4563719, -2053079, -1181434, -1968350, -2417496, -1974316, -1893524, -2725837, -4005650, -6092509, -9696389, -13436258, -14235909, -10746593, -4815958, 618005, 3660530, 3713802, 1506409, -828556, -1273874, -29894, 823891, -215892, -2759396, -5216976, -5827318, -3675651, 121448, 3025196, 4103347, 5316265, 8205569, 10797096, 10229997, 7316637, 5545045, 6141943, 7141071, 6990550, 5821790, 3221586]
6427C221586m735913m650020j86370N115224N707149J554281k246642k539810
6419A239485o96856J248049K771759L150094J556545o49642j105413k12204m98209
6410F803608k124401k525669q61428P62224J123083J386815J976424J507373o2986
6401G985043p16971o1429j89956j421903j030491J673705K893725J2982l700262
6392E444443l783446j244640k85295j315825j027455J319936K550186J091961
6384B749865m65799J17945J239062O54116o31401m25584O17230J12006j819617
6375B147823k533757j101997L18372P2944o94985o87475q49966j933711j873383
6366g136135J191962M648625M091525K6072k328367p09798J111645j33223j976414
$$ y = [3221586, -1514327, -6164347, -6350717, -1235493, 4471656, 6025937, 3779295, 1239485, 542629, 1790678, 4562437, 7712531, 9269076, 8619434, 7514021, 7301817, 6803608, 4679207, 2153538, 1292110, 2054334, 3177417, 4564232, 6540656, 8048029, 7985043, 7268072, 7206643, 7016687, 5594784, 4564293, 6237998, 9131723, 9144705, 5444443, 1660997, 416357, 131062, -1184763, -2212218, -892282, 1657904, 2749865, 2284066, 2402011, 3641073, 4295189, 3663788, 3238204, 3855434, 3967440, 2147823, -385934, -1487931, -1169559, -1096615, -1791600, -2479075, -3329041, -5262752, -7136135, -5944173, -1295548, 2795977, 2822049, 493682, -216116, 895529, 762306, -1214108]
6357a214108q68136J613174J688537n6694j02899J491910J382985o45834r89886
6348B299049J311058K547497N03043j903597j582901o3971l81274k097667k523145
6339a891908r48708R96554J822172J056665q84746k242994j230382Q35062K82879
6330b205406l146367m346224K73144O526748P130347J288786m497753m875062
6322c851787j093392K376119L278418K359586J099000K40642m06378j428280k566092
6313G836k376522j83310K244770K506740O46288j202098j827098j752661j312434
6304c248489p0811J535047J927220M88391j417342k090332j140090P02745K276598
6295a037063K375719O73239j550503k648695k477797j844829n47123K111908M909788
$$ y = [-1214108, -2082244, -469070, 1219467, 1162773, 1059874, 2551784, 3934769, 3288935, 2299049, 3610107, 6157604, 6660647, 4757050, 3174149, 3110178, 2728904, 631237, -1891908, -2840616, -1844062, -21890, 1034775, 150029, -2092965, -3323347, -2488285, -2205406, -5351773, -9697997, -9424853, -2898105, 4232242, 5521028, 1023275, -3851787, -4945179, -2569060, 709358, 3068944, 4167944, 4408586, 4002208, 2573928, 7836, -2368686, -2551996, -307226, 2199514, 2845802, 1643704, -183394, -1936055, -3248489, -3319300, -1784253, 142967, 631358, -785984, -2876316, -4016406, -3313661, -1037063, 1338656, 2011895, 461392, -2187303, -4665100, -6509929, -7057052, -4945144, -35356]
6286c5356N200551K598135j871l09448M18128l5065j148858r86418p9179r56556
6276D664063l654948m647687j689265K441032L280874O38816j377624j59155K260361
6267A756467K762903J364002m4244j176323k725836l370485r53768L154702M445625
6258E213043J370638k034537j702716R61723J919976P43606M72501K169411L292673
6249A2406318J798513j149826l392363m304665m163137k997526j228147O2787
6241b968046N26745R91347J736289J702412M00633p07758q8598J475002J816556
6232D884582L59061j170446j142163j26801K109j339588k535784j808121L51898
6223b525253J714287J268382M24484O53197J183726L42307j643095k748582j762465
$$ y = [-35356, 5165195, 7763330, 7761459, 7452011, 7870139, 7835074, 6686216, 5699798, 5620619, 4664063, 1009115, -3638572, -5327837, -2886805, 394069, 1032885, -344739, -503894, 1756467, 4519370, 5883372, 5839128, 4662805, 1936969, -1433516, -2387284, 767418, 5213043, 6583681, 4549144, 2846428, 3808151, 5728127, 6471733, 6944234, 9113645, 12406318, 14204831, 13055005, 9662642, 5357977, 1194840, -1802686, -3030833, -2968046, -2441301, -1449954, 286335, 1988747, 2389380, 1681622, 1593024, 3068026, 4884582, 5243643, 4073197, 2931034, 2804233, 2806342, 1466754, -1069030, -2877151, -2525253, -810966, 457416, 881900, 1535097, 2718823, 3061130, 1418035, -1330547, -3093012]
6214c093012N85710K874592M015723L256730P23168j917060k715957j634801l93158
6205A701935j37847m47322n60649k40698N49247J447637J316045l87916k114914
6196A125518k020759j007610j459725k828191j641634K935788O689427N647880
6188G440694J340450j771796k170368j733619j746386j622908j043964m89277
6180a797174K19634J393646J710797k97055k963638k750928N14784K760317J462042
6171B52425o14739J59879K493043K129018j489708m097280k510227J305364L294306
6162I22081K237303l0140j736949k448748j947918p247K421997L370288J965088
6153D745755m45557j887048j884023j441300j348364j185470r5637J753129K846699
$$ y = [-3093012, -2507302, 367290, 4383013, 7639743, 8362911, 6445851, 3729894, 2095093, 1701935, 1564088, 1116766, 556117, 315419, 864666, 2312303, 3628348, 3240432, 1125518, -895241, -1902851, -3362576, -6190767, -7832401, -4896613, 1792814, 7440694, 8781144, 7009348, 4838980, 3105361, 1358975, -263933, -1307897, -1797174, -1577540, -183894, 1526903, 1229848, -1733790, -4484718, -3969934, -1209617, 252425, -362314, -202435, 2290608, 4419626, 2929918, -1167362, -3677589, -2372225, 922081, 3159384, 3129244, 1392295, -1056453, -3004371, -3011618, -589621, 2780667, 4745755, 4300198, 2413150, 529127, -912173, -2260537, -3446007, -3541644, -1788515, 1058184]
6144A058184J917634j59165r92741K23993J391545N78941p77199n4789J878054
6135E064457J446652j733216l422829j008342K281892K313906K12801l32866L42716
6126E165171j069674m213262m908001k162316j09623j182490k116623L97370M063175
6117f136273M631330K292080M84232L13503K03747k9495J149424L329950L765830
6108A0004328J432831j171799j284010Q34826K597078J878588j170788m130664
6100H990390m307207j716940N22142l6564j994027k360995q11462O81162J503672
6091D70171K638205L515089K051794j488335l833060l168835j528865j203207
6083b547043j393374m80877O45791J29878j437450j728613m2728K245138L988012
$$ y = [1058184, 2975818, 2816653, 1823912, 2047905, 3439450, 4018391, 3241192, 3186403, 5064457, 6511109, 4777893, 1355064, 346722, 2628614, 4942520, 5155321, 4822455, 5165171, 4095497, -117765, -5025766, -7188082, -7297705, -8480195, -10596818, -10199448, -6136273, -1504943, 787137, 1271369, 1584872, 1788619, 1759124, 2908548, 6238498, 10004328, 11437159, 10265360, 8981350, 9816176, 12413254, 14291842, 13121054, 8990390, 4683183, 2966243, 3488385, 3451821, 1457794, -903201, -1714663, -1033501, 470171, 3108376, 6623465, 8675259, 7186924, 3353864, 185029, -1343836, -2547043, -3940417, -4421294, -3775503, -3645625, -5083075, -6811688, -6854416, -4609278, -621266]
6074f21266M905421M378223J853504j481224l379460l201447k300941j573853
6066a421043m14915J349466K300953J376422k47766n62565O24293J629943J156587
6057E791375m29109j945508k561056k017593n75099Q66304J206176K66979q10946
6048b08477p95080J78476Q67846N68053j26433l50697j04893J12931L13259R16860
6038A371845J782550K053099J165058m00251j524788j393003j40153J079121R18137
6029D911615o37557j797554r88526O55491J99757l029636n673265m146841N08220
6020i998296L531106K336641m43147q09659J340853K698719J541014j25740N1604
6011A23095J317794J268578m76983j987934j951942r73052R9863J194422J870295
$$ y = [-621266, 4284155, 8662378, 10515882, 9034658, 5655198, 2453751, 152810, -1421043, -1835958, -486492, 1814461, 3190883, 2943117, 2380552, 3004845, 4634788, 5791375, 5362266, 3416758, 855702, -1161891, -1736990, -870686, 335490, 602469, -208477, -1003557, -825081, 42765, 610818, 484385, 133688, 28795, 141726, 454985, 1371845, 3154395, 5207494, 6372552, 5972301, 4447513, 3054510, 2914357, 3993478, 4911615, 4274058, 2476504, 1487978, 2143469, 2343226, -686410, -6359675, -10506516, -9998296, -6467190, -4130549, -4573696, -5383355, -4042502, -1343783, 197231, 71491, 123095, 1440889, 2709467, 2232484, 244550, -1707392, -2680444, -2580581, -1386159, 484136]
6002D84136J152728m23224m96452J757025L619574K402288l09432q13783J040001
5993H412861J751567o1585j518734n42912M41171j399474m175315l840594m71422
5984a404437J852057J131867k94869k07788K76222m47961j229746j51630J990692
5975A514407K673854J231530p26378k002847k861437l448038l097000j679772
5967h395681k06752N02572O79827O66620K00870o47340p29319R67054L648588
5958c313561N073043L705769L06994k548603k557049K37510L223282L541247R84894
5949H653526j761952k082727j90778J488616J250704k73508j294895r19441K44712
5940E114257J096621J173697O98863j54963j468234k820664l014766j437718O21003
$$ y = [484136, 1636864, 1213640, 717188, 2474213, 6093787, 8496075, 8186643, 7372860, 8412861, 10164428, 10102843, 8584109, 8041197, 8482368, 7082894, 2907579, -933015, -1404437, 447620, 1579487, 1284618, 1076830, 1353052, 905091, -324655, -476285, 1514407, 4188261, 5419791, 4693413, 2690566, -170871, -3618909, -6715909, -8395681, -8602433, -8099861, -7420034, -6753414, -6552544, -7199884, -7929203, -6962149, -3313561, 1759482, 5465251, 5772245, 3223642, 666593, 904103, 4127385, 7668632, 8653526, 6891574, 4808847, 4618069, 6106685, 7357389, 7083881, 5788986, 4869545, 5114257, 6210878, 7384575, 8083438, 7928475, 6460241, 3639577, 624811, -812907, -191904]
5931a91904J225869M02971K6848P17875P40869q03464j682118K53475K963701
5922C654122K539973p43651k339613k36871J788050q0089l749601m346719j385943
5913d900342J028352N24632q43287o91125L42596O72601M94551P22210J174907
5904a474905J435589J829292K080160Q32480j740189k786082n99126K068693J449231
5895C095143j647220l043410j418145M73135R79315J747827L355510K925384j050479
5886E417060m819160m055470k75217J504414K12235n55815J019843K319838J042346
5877A810074j318515k499103k717818k820104k006658J20088J579281P90947n44400
5868g606208j54176Q67131m474k060965k195317L0306J661768R47985n20663q27796
$$ y = [-191904, 1033965, 1436936, 1463784, 2181659, 2922528, 2119064, 436946, 690421, 3654122, 6194095, 5450444, 3110831, 2873960, 4662010, 4581921, 832320, -3514399, -4900342, -3871990, -3347358, -4190645, -4881770, -4539174, -3866573, -3372022, -2649812, -1474905, -39316, 1789976, 3870136, 4702616, 2962427, 176345, -422781, 1645912, 3095143, 1447923, -1595487, -3013632, -2540497, -1561182, 186645, 3542155, 6467539, 5417060, 597900, -3457570, -3732787, -2228373, -2016138, -2571953, -1552110, 767728, 1810074, 491559, -2007544, -4725362, -7545466, -9552124, -9432036, -7852755, -7061808, -7606208, -7760384, -6893253, -6897727, -8958692, -11154009, -11123703, -9461935, -8513950, -9034613, -9862409]
5858i862409O7028J812772M315182N910126M069677m48843l160303j693158O94508
5849A704580Q8115k152217j927494R02272K461798J006566q76348q38833p9290
5840B89149n87576j671451j221456R84042K985071L035658J166574j263588k822328
5831H94095k946938j948199k07137J990159L448723K242424j582458m596762l624220
5822f330313k35788J198464j13029m27880K107732L863164J178352l532688m823446
5813g115432j772172J392036J721819P53580P12126J062083N41338L3370J111153
5804a560099L090412L667368J980254n98296k557056l761534m586548m475025
5796h800524k202896K194683O167926O407984K646568j158562r82979K220131
$$ y = [-9862409, -9795381, -7982609, -3667427, 2242699, 6312376, 5863533, 2703230, 1010072, 1704580, 1792695, -359522, -2287016, -1384744, 1077054, 2083620, 1207272, 368439, 289149, -298427, -1969878, -3191334, -2207292, 777779, 3813437, 4980011, 3716423, 894095, -2052843, -4001042, -4208179, -2218020, 1230703, 3473127, 1890669, -2706093, -6330313, -6566101, -5367637, -5480666, -5908546, -3800814, 62350, 1240702, -2291986, -7115432, -8887604, -7495568, -5773749, -5020169, -4308043, -3245960, -2704622, -2671252, -1560099, 1530313, 5197681, 7177935, 6579639, 4022583, 261049, -4325499, -8800524, -11003420, -8808737, -2640811, 3767173, 6413741, 5255179, 4272200, 6492331]
5788F492331L543369M90354l763201m538023j318242K279547K931062L93418l139651
5779C370964m841020l193581K85934J974763K66967k217689k273507o04534o0427
5770g292130m94809R17879M184436N350651K311825j665449k444958l63388J365028
5761A869085J321196K58576j311583k891200k677339L48746L700821L778983P17747
5752E115032j922434k141331j331371r89069n38902P62235K200953K893040K785002
5743F833155J680100p71425l406755l911682j779647Q83026K296381K822748L001307
5734G647208K020050l45694k165075j634838K24229Q20827p99343l224436m453371
5725a910443l482916q84800J485589K130112J597604J492358J830714J143226
$$ y = [6492331, 10035700, 10526054, 6762853, 2224830, 906588, 3186135, 6117197, 6510615, 3370964, -1470056, -4663637, -4377703, -2402940, -2135973, -4353662, -6627169, -7231703, -7292130, -7786939, -6869060, -2684624, 2666027, 4977852, 3312403, 867445, 504057, 1869085, 3190281, 3448857, 2137274, -753926, -3431265, -3082519, 618302, 4397285, 5115032, 3192598, 1051267, -280104, -1269173, -1808075, -1045840, 1155113, 4048153, 6833155, 8513255, 7741830, 4335075, 423393, -1356254, -473228, 1823153, 4645901, 7647208, 9667258, 9321564, 7156489, 5521651, 5745880, 6566707, 5767364, 2542928, -1910443, -5393359, -6278159, -4792570, -2662458, -1064854, 427504, 2258218, 3401444]
5717C401444o35835j676622j248680p09638o12097L46114K087161J959982j026540
5708A885289l671224l079285j119321j091303k169466j089724K050020L837100
5700d447914K918800J527455J496322J987677J593567J20515j900943l318277
5692b2798k382244R27466L310758J755100j866631k983482o59601J743144K021993
5683A843705J414638J115236M30174o93036r08461l19653o95771j871782j539589
5674a224539K59153M30970j723270k539269J05535K936317K516629P36272J173599
5665B671397K873870K197020r74546l320178l436005k993920k874955j947625
5657g804942P565J422284J640823J838669K544027K549773J151984l96620n94754
$$ y = [3401444, 2765609, 1088987, -159693, -869331, -1481428, -1135314, 951847, 2911829, 1885289, -1785935, -4865220, -5984541, -7075844, -9245310, -10335034, -8285014, -4447914, -1529114, -1659, 1494663, 3482340, 5075907, 5196422, 3295479, -22798, -2405042, -1477576, 1833182, 3588282, 1721651, -1261831, -1921432, -178288, 1843705, 3258343, 4373579, 4803753, 4110717, 3202256, 2882603, 2186832, 315050, -1224539, -965386, -534416, -2257686, -4796955, -4691420, -1755103, 761526, 1497798, 2671397, 5545267, 7742287, 6767741, 3447563, 11558, -2982362, -5857317, -7804942, -7797377, -6375093, -4734270, -2895601, -351574, 2198199, 3350183, 2953563, 2358809]
5648B358809M80019J738338K374352K041950O93093j122423k307425k041919n30404
5639C684390J017916J213744k24065j942375k327396j346749j57476Q39769K055417
5630B813175K921698K140357J88856o77885J40240M45395j178681k969468k869180
5621I54507j574344o80080O3426J238091J519266j86462j951551j244767J018729
5612h43185J920933J114050P37592J329537J128101n56238k272654k950989k840838
5603c233691j850897L33996K339867K181426O55139P22649K773391L505188Q85336
5594H312404k456295k737562m2889K174021J480062j317284l656368l636019j350146
5585c230076J288558K249250J261867k82403j163414j299830r83457j93934J020775
$$ y = [2358809, 2838828, 4577166, 6951518, 8993468, 9686561, 8564138, 6256713, 4214794, 3684390, 4702306, 5916050, 5691985, 3749610, 1422214, 75465, -82011, 757758, 2813175, 5734873, 7875230, 8064086, 7386201, 7526441, 7971836, 6793155, 3823687, 954507, -619837, -1299917, -1236491, 1600, 1520866, 1334404, -617147, -1861914, -843185, 1077748, 2191798, 2929390, 4258927, 5387028, 4830790, 2558136, -392853, -3233691, -5084588, -4750592, -2410725, -229299, 425840, 1148489, 3921880, 7427068, 8312404, 5856109, 3118547, 3075658, 5249679, 6729741, 5412457, 1756089, -1879930, -3230076, -1941518, 307732, 1569599, 1287196, 123782, -1176048, -2159505, -2353439, -1332664]
5576a332664K146009K411274J209746j269254l544885l916523k622243j691888
5568h610428j845785j303286R05378K548539J481880n38971m17454J335239J792287
5559d652601P91628Q52340K181714K112585R2551j020163J18682J117553K53389
5550A847678o85136j18323L03493r24156j893342n23118J469869J231426m70737
5541B37654o15678J099220J948681L80414k191904l607989k878260k69587K642847
5532c254602L547374J834466j73836j94080P34557O2274k061621l060444k114683
5523d680595j245073j748543k095087m90424K344066M277353M403224L299112
5515D064033J492365r71779l561486m902438l896268r98570J954246L334868L009261
$$ y = [-1332664, 813345, 3224619, 4434365, 3165111, -379774, -4296297, -6918540, -8610428, -10456213, -11759499, -10854121, -8305582, -6823702, -7362673, -7780127, -6444888, -4652601, -3860973, -3008633, -826919, 1285666, 1378217, 358054, 476736, 1594289, 1847678, 1162542, 1044219, 1347712, 423556, -1469786, -1992904, -523035, 708391, 237654, -378024, 721196, 2669877, 3050291, 858387, -2749602, -5627862, -5897449, -3254602, 292772, 2127238, 1953402, 1759322, 2493879, 2556153, 494532, -2565912, -4680595, -5925668, -7674211, -9769298, -10259722, -7915656, -3638303, 764921, 4064033, 5556398, 4584619, 1023133, -3879305, -7775573, -8774143, -6819897, -3485029, -475768]
5506d75768J954337J035494O19107Q32338J210875M65090j997909m381833m034342
5497d772611j040426J521157J632308P07582P15280R50134l00358k350362k871288
5488e808584j390415L29586J180053J703848K079931J377325m78754j903748j847344
5479d758102j278367j312141j174652M24917K743497L626881K514369J134930
5471A921332Q89993J096870N86946l72051r83388j566417k600936k990125j448776
5462e466552P54624R84991o67310j320391n6537M77708j174103k342488p82683
5453i592741J028420J952j748393r0893L691926M250562P29172j737528j20741
5444c588264K358702K247057R94261J021563R21771j532106m584006m652620j482313
$$ y = [-475768, 1478569, 2514063, 3133170, 3965508, 5176383, 5641473, 3643564, -738269, -4772611, -5813037, -4291880, -2659572, -1951990, -1236710, -286576, -586934, -2937296, -5808584, -7198999, -6869413, -5689360, -3985512, -1905581, -528256, -1007010, -2910758, -4758102, -6036469, -7348610, -8523262, -8098345, -5354848, -1727967, 786402, 1921332, 2811325, 3908195, 4495141, 4123090, 3139702, 1573285, -1027651, -4017776, -5466552, -4711928, -3726937, -4394247, -5714638, -5771175, -5293467, -6467570, -8810058, -9592741, -8564321, -8562369, -10310762, -10401655, -6709729, -2459167, -1729995, -3467523, -3588264, -1229562, 1017495, 2011756, 3033319, 3955090, 2422984, -2161022, -6813642, -8295955]
5435h295955K088827M005505L930749J944018r58503k490209j749729q72960j640204
5426d038461k139752L35763M452810O045227L546061m66336k830025k762255j586933
5417E56099j182225k282854l322082k071350Q20951K017866L94320j012237J16505
5408e965007J588117N82734j560271j902020p41667r1932L92065J795402K376169
5399c526410L00427j808411k43216L065655K820584j089505l153892q66341J894055
5390b607054J460588q29172k304065k745781k335003o5889L311414M462993K139039
5381D87070m97875n46835O52093N38745n69910r24145m47005n1397O7327l69278
5371a661210j932614l312842j746712K473151M962727L128184Q0934k05774J227551
$$ y = [-8295955, -6207128, -2201623, 1729126, 3673144, 2714641, 224432, -1525297, -2398257, -4038461, -6178213, -5842450, -1389640, 4655587, 8201648, 7735312, 4905287, 2143032, 556099, -626126, -2908980, -6231062, -8302412, -7481461, -5463595, -5069275, -6081512, -5965007, -4376890, -3794156, -5354427, -7256447, -7998114, -8090046, -7697981, -5902579, -3526410, -3225983, -5034394, -5277610, -2211955, 608629, -480876, -3634768, -4501109, -2607054, -1146466, -1975638, -4279703, -7025484, -9360487, -9426376, -6114962, -1651969, 487070, -10805, -557640, 94453, 633198, 63288, -860857, -1307862, -1359259, -1291932, -1661210, -3593824, -6906666, -8653378, -6180227, -1217500, 1910684, 1991618, 1785844, 3013395]
5362C013395Q24820j467601k720388k104123j402358j087539K94724K688917L729335
5353A769182K048000r62081l216221l901438l096145j233378O00842J225729O57837
5344f107673l4115j82217l4036l0997l14218o00882k5520K082664M577805M864405
5334D195216K124067r04742r69521J584488L374839K222731p29169k926364k951662
5325E019883j105388J299827K849676K917662J923735O08469o04973j390159j412749
5316A0105983q98443o16882q58031j116843j084119j025826q94819k61688M47431
5307C796763N4815j360076k042364j045190L68241Q55320Q87946J087369L43514
5298B946338k262651m735346l886978K62184L893101L762787P88795j461395j022206
$$ y = [3013395, 3838215, 2370614, -349774, -2453897, -3856255, -4943794, -4649070, -1960153, 1769182, 3817182, 2855101, -361120, -4262558, -7358703, -8592081, -7991239, -6765510, -6107673, -6141788, -6324005, -6358041, -6389038, -6703256, -7304138, -7329658, -5246994, -669189, 4195216, 6319283, 5414541, 4445020, 6029508, 9404347, 11627078, 10897909, 7971545, 5019883, 3914495, 5214322, 8063998, 10981660, 12905395, 13513864, 12908891, 11518732, 10105983, 9207540, 8590658, 7732627, 6615784, 5531665, 4505839, 3611020, 3349332, 3796763, 3851578, 2491502, 449138, -596052, -227811, 627509, 1515455, 2602824, 2946338, 683687, -4051659, -7938637, -7676453, -3783352, -20565, 768230, -693165, -1715371]
5289a715371O30231R27217m22672j376061q21639k64181j054801j587644K91252
5280e393669L061299L003455p9056k182476j093535M93262l39617k205237k163576
5271f899150l69104J016005J610860K455546L188633K478182M74515j495737k823940
5262c64190l246370j895582J052626L143109K452934L49442q84387j485481k475453
5253c353352k416237L43957L547172L460730Q44516N110J843451K537861J12460
5244F925668k281429j624962L80127O25720o13639j156161q84772j191870j866523
5235a687841j343071N89698K482382L193460K538327N69947k150428l950726l288950
5226c047202o95011J487693J414509n74242k328429j857408M59669J772147Q8735
$$ y = [-1715371, -1085140, -157923, -580595, -1956656, -2778295, -3042476, -4097277, -5684921, -5393669, -2332370, 671085, 592029, -1590447, -2683982, -2190720, -2530337, -4735574, -6899150, -7268254, -6252249, -4641389, -2185843, 1002790, 3480972, 3955487, 2459750, -364190, -3610560, -5506142, -4453516, -1310407, 1142527, 1491969, 607582, -877899, -3353352, -5769589, -5425632, -1878460, 1582270, 2426786, 2431896, 4275347, 6813208, 6925668, 4644239, 3019277, 3399404, 4025124, 3411485, 2255324, 1370552, 178682, -1687841, -3030912, -2441214, 41168, 3234628, 5772955, 6342902, 4192474, 241748, -3047202, -3742213, -2254520, -840011, -1414253, -3742682, -5600090, -5140421, -3368274, -3279539]
5217c279539k377688j251884L922775Q043655O666371J800950j129726o72068
5209A1722846k68775k132139l986868l218533j144019p33775j998796k350858
5201d110917o52686J622753K928821K954809J443146j755460m880419n009246
5193g459199j835352J364987J941539J047619R19298J108839l6733j741298j714313
5184f404613N3685J363608J343895J094894R52798j826j517193j986305j023013
5175f124070K31244J347244K452232K201460n88360l384237k250278J750781L140171
5166a223813K27651k287150r54021J459032J709709J553786L224191M178049J613343
5157I500777j607469j282922R40308O57055j585607j994941r39056j857029l965983
$$ y = [-3279539, -5657227, -6909111, -2986336, 5057319, 11723690, 13524640, 12394914, 11722846, 11454071, 9321932, 5335064, 2116531, 972512, 238737, -1760059, -4110917, -4763603, -3140850, -212029, 2742780, 4185926, 2430466, -2449953, -7459199, -9294551, -7929564, -5988025, -4940406, -4021108, -2912269, -2949002, -4690300, -6404613, -6350928, -4987320, -3643425, -2548531, -1595733, -1597559, -3114752, -5101057, -6124070, -5892826, -4545582, -2093350, 108110, -480250, -3864487, -6114765, -4363984, -1223813, -996162, -3283312, -4237333, -2778301, -1068592, 485194, 3709385, 7887434, 9500777, 7893308, 6610386, 7550694, 8207749, 6622142, 4627201, 3688145, 1831116, -2134867]
5148b134867l107171M26873J938129N70445M56691K577157K681171o29065k794750
5139a5387j264490J38432j351428j995855J539193N392729M470456P93092m17835
5130G288907L77731j150932m585652m948048j107435K332357K249488O36498j97445
5121H95469j013488k242243j637558J760950M567815L195288r86310l651363l310428
5112b421868k087268j410635j71022K221076L660212K021250j369695k919008
5104b476958j182093J442029J738893o53587l091843k821197L05495L602458M092106
5095I55303J783190r5630Q10746K500140J390689j881348k795237J05795K445406
5086E219054O20850k333214j380423K467390L546082L8694l763193m003948j721675
$$ y = [-2134867, -5242038, -4815165, -2877036, -2306591, -1849900, 727257, 3408428, 2779363, -15387, -1279877, -1141445, -2492873, -4488728, -2949535, 2443194, 6913650, 7706742, 7288907, 7666638, 6515706, 1930054, -3017994, -4125429, -1793072, 456416, 1092914, 895469, -118019, -2360262, -3997820, -2236870, 2330945, 5526233, 4539923, 888560, -2421868, -4509136, -5919771, -6090793, -3869717, -209505, 1811745, 442050, -2476958, -3659051, -2217022, -478129, -1131716, -4223559, -7044756, -6739261, -3136803, 955303, 2738493, 2642863, 3453609, 5953749, 7344438, 5463090, 2667853, 2773648, 5219054, 5839904, 3506690, 2126267, 4593657, 8139739, 8178433, 4415240, 411292, -1310383]
5077a310383L01104J312009J537367M98088j534397k571203j311039Q93780J804761
5068c79913Q80716p26891j612739j044191M39203J193398L24365r80536j260679
5059c167267r68841r76502k67868K014719L473933J263444k546494k819248J071654
5050b922470M044085K849483L44231J72939J218627K61831k751047n041901m721556
5041f545778j976280J808780M431856M038313J266728j253827k133996j983638
5033b347842r48341J415842L421858K203875j456038l091473r10109J682098J742401
5024A712271Q45709J105774J392854O28368P87527K820224L283108m57635m684996
5015G433204m010629M51883K723638O95847j756415j324996N74612J110942o082
$$ y = [-1310383, -1009279, 302730, 1840097, 2338185, 803788, -1767415, -3078454, -2184674, -379913, 500803, -226088, -1838827, -2883018, -2443815, -1250417, -926052, -1906588, -3167267, -4136108, -5112610, -5380478, -3365759, 108174, 1371618, -1174876, -3994124, -2922470, 1121615, 3971098, 4315329, 4488268, 5706895, 5968726, 3217679, -1824222, -6545778, -8522058, -6713278, -2281422, 1756891, 3023619, 1769792, -364204, -2347842, -3296183, -1880341, 1541517, 3745392, 2289354, -802119, -1712228, -30130, 1712271, 2557980, 3663754, 5056608, 5684976, 6472503, 9292727, 12575835, 12118200, 7433204, 3422575, 3874458, 6598096, 7293943, 5537528, 4212532, 4787144, 5898086, 5892004]
5006E892004j334331k166083k645212k508265r76532J902669M166502L283599
4998E614351m02845k842721j095858K120870J988981j030908j790811J347778
4990C908837M008028K917765L86879p02945j390894k953887l397933j464512m3791
4981A267547j474712l109259j792694P07883J226080Q76908K336554M172471K979012
4972G189790p27812l369779l496334k166950m8659K050854J951703o77203k240625
4963a535015l67267J598541k24664l419877k951432N69232K066671Q5740j924803
4954f102874j752151o88233J41322J211919K341854K628305K376390K240856J508789
4945C906177j44296j057480m66972m42700j983938k403976j07720J713553L29580
$$ y = [5892004, 4557673, 2391590, -253622, -2761887, -3738419, -1835750, 2330752, 5614351, 5211506, 2368785, 1272927, 3393797, 5382778, 4351870, 2561059, 3908837, 7916865, 10834630, 11221509, 10518564, 9127670, 6173783, 2775850, 1311338, 1267547, -207165, -3316424, -5109118, -4401235, -3175155, -2298247, 38307, 4210778, 7189790, 6461978, 3092199, -404135, -2571085, -2619744, -568890, 1382813, 705610, -1535015, -1902282, -303741, -528405, -3948282, -6899714, -6330482, -4263811, -4178071, -6102874, -7855025, -8543258, -8401936, -7190017, -4848163, -2219858, 156532, 2397388, 3906177, 3761881, 2704401, 2237429, 1794729, -189209, -2593185, -2700905, -987352, -657772]
4936f57772j488658m57991J215644K94767j000939Q37507L491633K461684j151159
4927C544716k961776k534050k042352q99275J843598L196604J016949p12093J632190
4918B084511L941786J236290k926186k704978p28084k602962n373779k664225
4910i737627K667587L055671O6812J035042M612176L118355k492118l781044N5160
4901a399986J866257N17510J293264L176623K71467m654586l184317K646850L037681
4892C570763j429839j327011K604395P40025n212926l793416L642673L980305
4884B774969k667048l080990K214233n74256q548572m258096P489493K367834
4876d282433j5370187j3279294L069466k0837061r5241274j35154827o4267221
$$ y = [-657772, -2146430, -2604421, -1388777, -1094010, -2094949, -1257442, 2234191, 4695875, 3544716, 582940, -1951110, -3993462, -4892737, -3049139, 147465, 1164414, 452321, 2084511, 6026297, 7262587, 4336401, 1631423, 903339, -1699623, -7073402, -9737627, -7070040, -4014369, -3947557, -2912515, 1699661, 4818016, 2325898, -1455146, -1399986, 466271, 983781, 2277045, 5453668, 5725135, 1070549, -2113768, 533082, 3570763, 2140924, 813913, 3418308, 4158333, -1054593, -4848009, -1205336, 2774969, 107921, -2973069, -758836, -1333092, -9881664, -14139760, -6650267, -4282433, -19652620, -32931914, -29862448, -50699509, -145940783, -281095610, -345362831]
4869c45362831O4834870J26329155Q2299322J5280534k85427J6295868J5863202
4862b4745307O56768k61993R909588Q321378k616793l759685L864307M618421
4854d013316j142164j199455K992532P12298n350392l988556K800703L957701
4846e230649J73549R89971N314517L603362l251123m763038P40932M298336K291822
4837D167679J69847N14496J40637j053181J47572J995330j04339l842300k614832
4828d79091K678852M302963n1747m723982n611660l951088j049809K839945M929434
4819a116183K574154j200212j595723J09915n32906k625968j916618P24497Q80941
4810d698103q70135j12128K745202K920642j65548k256520j776883j031443o12172
$$ y = [-345362831, -280527961, -154198806, -71899484, -56618950, -56904377, -40608509, -24745307, -24088539, -24350532, -14440944, -6119566, -8736359, -12496044, -8631737, -4013316, -5155480, -6354935, -3362403, -2650105, -8000497, -11989053, -9188350, -5230649, -5057100, -4067129, 1247388, 4850750, 1599627, -3163411, -2422479, 1875857, 4167679, 4337526, 4852022, 4992659, 3939478, 4087050, 6082380, 5978041, 2135741, -479091, 2199761, 6502724, 6450977, 1726995, -3884665, -7835753, -8885562, -6045617, -1116183, 1457971, 257759, -1337964, -1228049, -1760955, -4386923, -6303541, -5579044, -4698103, -5568238, -5680366, -2935164, -14522, -180070, -2436590, -4213473, -5244916, -5857088]
4801e857088O00838R54557j491401l396249m95937L941768L178510j605916k902292
4792g073210M65243J792133j341243k959934M57215L709037J657268k656574l325878
4783i275943O6560L552575M501588K992221L57327j398769j080091j74905q36124
4774a295561k198637j864699l00085J84404m5865J032958K440733J570316n23802
4765a000238o11504O30392r1409j869805o74625K687028K753414j453755m436284
4756d066786l011207l72325O77464J862642M138221M666162K362049O86769J504870
4747H447859J600869j177356l658694l131996k267365l778210m725582j250435
4739i940910M395771O593848L932731j64938k580470k650069q37681J419133J742526
$$ y = [-5857088, -5256250, -4301693, -5793094, -9189343, -9685280, -5743512, -2565002, -4170918, -7073210, -6607967, -4815834, -6157077, -9117011, -8659796, -4950759, -3293491, -5950065, -9275943, -9209383, -5656808, -1155220, 1837001, 2194328, 795559, -284532, -459437, -1295561, -3494198, -5358897, -5658982, -5474578, -5520443, -4487485, -2046752, -476436, -1000238, -1611742, -981350, -1072759, -2942564, -3617189, -930161, 1823253, 369498, -4066786, -7077993, -7450318, -6772854, -4910212, -771991, 3894171, 6256220, 6942989, 8447859, 10048728, 8871372, 5212678, 2080682, -186683, -3964893, -8690475, -9940910, -5545139, 1048709, 4981440, 4816502, 2236032, -414037, -1251718, 167415, 1909941]
4730A909941o43460l390071l821366j955974M55880K111014K397065J550382J224716
4721a61873K471231L041284J03411m234796m636259o11892K225114P03212j473219
4712b573787m53305J927159K530063K128952K091825M85021l693233o406994m005575
4703g969874M60640J675925O2528j58480J358254J249242r33625j958556n70122
4694f784068R25110Q56069l4439r28374j475169m49910K548285M706870L095983
4685B460357m70357j661671j74934L32350j283095j985249r6167K047958K423520
4676A592712K214949K490377J730608p82431k225113r1447L144467K617177k198857
4667H492442o206899m787638O20695M319242L084450m43927j751588l92834J81510
$$ y = [1909941, 1266481, -2123590, -5944956, -7900930, -7445050, -5334036, -2936971, -1386589, -161873, 2309358, 5350642, 5454053, 1219257, -3417002, -4028894, -1803780, -1100568, -2573787, -3027092, -1099933, 1430130, 3559082, 5650907, 6135928, 2442695, -3964299, -7969874, -7509234, -5833309, -5770781, -5929261, -4571007, -3321765, -4255390, -6213946, -6784068, -5858958, -5002889, -5037328, -5965702, -7440871, -7890781, -5342496, -635626, 2460357, 1990000, 328329, 153395, 485745, -797350, -2782599, -2878766, -830808, 1592712, 3807661, 6298038, 8028646, 7246215, 5021102, 4929655, 8074122, 10691299, 8492442, 2285543, -2502095, -1881400, 2437842, 5522292, 5078365, 3326777, 2933943, 3115453]
4658C115453j692762l446960k612486n97390J19092L1203Q45341J670516N40900
4649b027093j535079j814347l96192K22954k36246L37081K001660K380233J268110
4640B01081J257023K624409K122940j208068l507218k161771k16438j090494k709476
4631d688012j513026P79802j5872k847040k648048J174305L647821K474767J322083
4622b313220K717311L388046L54472l162684k816712n76398j412914m656942m837600
4613a3316641p28727K509422J392124j087023j053474M06548L19856o61135K31340
4604a1987710K736501L701182J805874p07917j069134J080418L681633M081832
4596C322679J375726k311776l808666k615092j056934l95851N58379J947389J383717
$$ y = [3115453, 1422691, -2024269, -4636755, -5234145, -5115053, -5083850, -4238509, -2567993, -2027093, -3562172, -5376519, -5772711, -5549757, -5786003, -5448922, -3447262, -1067029, 201081, 1458104, 4082513, 6205453, 4997385, 1490167, -671604, -888042, -1978536, -4688012, -6201038, -5421236, -5437108, -8284148, -10932196, -9757891, -6110070, -3635303, -2313220, 404091, 3792137, 4146609, 983925, -1832787, -2409185, -3822099, -8479041, -13316641, -14045368, -11535946, -10143822, -11230845, -12284319, -11877771, -11557915, -12219050, -11987710, -9251209, -5550027, -3744153, -4452070, -5521204, -4440786, -759153, 3322679, 4698405, 2386629, -1422037, -4037129, -5094063, -5489914, -4931535, -2984146, -1600429]
4587a600429j778547l959825k274891R21818K002893J837745L262082N131090
4579C541936M048259O39122j212257p57231q38038k198468k507343j211728l17764
4570h13512m9641J163900K120728r6056l836721l806567L13864K510366j07013
4561b600652k894125j779949M86624J75461j106433n59967M69435K00185P63544
4552f845877L758001N895795M354017K053104K005169J155914l414197o749256
4544B212670k821811M229462M994899o84597l745301m74857K652702O15253k797251
4535D181169k927457j765516k686285l818246j982512J252973K529919K286653
4527b929302K702339K870342O91907k382665k991082j168383n5028p69447j122678
$$ y = [-1600429, -3378976, -7338801, -9613692, -8691874, -6688981, -4851236, -1589154, 3541936, 7590195, 8229317, 7017060, 6259829, 5421791, 3223323, 715980, -495748, -813512, -863153, 300747, 2421475, 2325419, -1511302, -5317869, -5004005, -2493639, -2600652, -5494777, -7274726, -6788102, -6612641, -7719074, -8279041, -7809606, -7609421, -6845877, -3087876, 2807919, 7161936, 9215040, 11220209, 12376123, 8961926, 2212670, -609141, 3620321, 8615220, 7930623, 4185322, 3710465, 6363167, 6978420, 4181169, 1253712, -511804, -3198089, -7016335, -8998847, -7745874, -5215955, -2929302, -226963, 2643379, 3335286, 952621, -2038461, -3206844, -3261872, -4031319, -5153997]
4518e153997L28486J908856J480465l83614j142413L49859K164555J582247j030155
4509A04289j994729Q15955M284922L670642q06588m190123l731439j995931j827627
4500e670629j896102J05806K625462K233479p40133k087051M92098M139217M471354
4491C673501R35354k783898l225120q88159Q51197j25696k589977l902226k776369
4482a0831393K94069L846524N652595L709358j162585m822468l953941k5692K710625
4473d582908K302093J77252j739364k423474j156786J520687K856365R76023j625862
4464c695974j187826J224816J098246j838782k443320J611481N450446M027233
4456D246320n36208k680327j477807m13962q83278p11681J041511K054386O05399
$$ y = [-5153997, -4825511, -2916655, -1436190, -1819804, -2962217, -2612358, -447803, 1134444, 104289, -1890440, -1074485, 3210437, 6881079, 6074491, 1884368, -1847071, -3843002, -5670629, -7566731, -7460925, -4835463, -2601984, -3342117, -5429168, -4937070, -797853, 3673501, 4608855, 1824957, -1400163, -2288322, -1437125, -1562821, -4152798, -8055024, -10831393, -10537324, -6690800, -1038205, 2671153, 1508568, -3313900, -7267841, -7293533, -4582908, -2280815, -2103563, -3842927, -6266401, -7423187, -5902500, -3046135, -2070112, -3695974, -4883800, -3658984, -2560738, -4399520, -6842840, -5231359, 219087, 4246320, 3710112, 1029785, -448022, -861984, -1745262, -2456943, -1415432, 638954, 1244353]
4447A244353j527348j623179K73819J741405J285966k7335l17239N58603R98558
4438B607603J77605o52504l21597J5405j316270l206679k823160j0003K107139
4429c422461J620679K96384L07857R86268N69964p82304j631466j429393l77699
4420c862171J467686L323044L350574J020719j434486j769977p81650o24204j116872
4411d27337j91851K247472L389234J196962k568238m181897k262452P38170J586066
4402d73871J97104m60612J450288L915500L699873O47816k361094l117998j860955
4393A636051J89260J942307K264558Q43652p82627j025918p00348j389436k065605
4384I11894n00966K288159K792488N12812j297543j177769j417870k983747k991697
$$ y = [1244353, -282995, -1906174, -1632355, 109050, 1395016, 1367681, 1050442, 1609045, 2607603, 2785208, 2132704, 1811107, 1826512, 510242, -2696437, -5519597, -5529600, -3422461, -1801782, -1505398, -1197541, -211273, 358691, -423613, -2055079, -3484472, -3862171, -2394485, 928559, 4279133, 5299852, 3865366, 2095389, 1313739, 689535, -427337, -619188, 1628284, 5017518, 6214480, 3646242, -535655, -2798107, -2059937, -473871, -276767, -737379, 712909, 4628409, 8328282, 8976098, 6615004, 3497006, 1636051, 1825311, 3767618, 6032176, 6875828, 6093201, 5067283, 4366935, 2977499, 911894, 410928, 2699087, 5491575, 6004387, 4706844, 3529075, 2111205, -872542, -3864239]
4375c864239K24387L526715L570689J666097Q30235R47096K40470r90495j539897
4366D611058k033162l223067l534925j496333J205227K092787J493521R47237
4358F2343J65525j366695j974679l51601J496876J257869J97465N50435J271955
4349A309493L01517j141593q94895m64550k439582m910548l782918K51213K474825
4340i297038J597989J040983K384431K846932O36504j736077j425047P64567K006344
4331a180412P93739k085680m056497k611210J269905K963594K99810k378955m26953
4322g412659L184123K040079l008969m423640L77998N128381M375625N38593j534757
4313g35226j370927q53425j91862N87977Q2721j419279r73946K064395L842236
$$ y = [-3864239, -3639852, -113137, 3457552, 5123649, 5953884, 6900980, 7141450, 6150955, 4611058, 2577896, -645171, -4180096, -5676429, -4471202, -2378415, -884894, 62343, 227868, -1138827, -3113506, -3465107, -1968231, -710362, -512897, 37538, 1309493, 1611010, 469417, -425478, -890028, -3329610, -8240158, -12023076, -11771863, -9297038, -7699049, -6658066, -4273635, -1426703, -790199, -2526276, -3951323, -3186756, -1180412, -386673, -2472353, -6528850, -9140060, -7870155, -4906561, -4606751, -6985706, -7412659, -4228536, -2188457, -5197426, -9621066, -9243068, -4114687, 260938, 799531, -735226, -2106153, -2959578, -3151440, -2563463, -2480742, -3900021, -4873967, -2809572, 1032664]
4304A032664J673830j720944k628610j463133m42789L22692J155573O05739j562318
4295c027296k252128M90570L657886L496397R23582q49577j544216k793177m060439
4286e958398l582478j880761p42407K3934J564657K965789K405819L99855p78985
4277e582975j24527J585240L061572K819158J24390k994758l249402j018903m12967
4268e793172k595671l268057L47316M494179M752690K649311J736268J142532
4260C465396j397629l618748k157553P52666O01965j439307p60179J951116J533753
4251a068520k478489m783027k957201l38968Q06556K311529M539512M225480N35556
4242G92428k325135j617147l21003j650351l572773k408739J304866L969468L760608
$$ y = [1032664, 2706494, 985550, -1643060, -3106193, -3548982, -3226290, -2070717, -1464978, -3027296, -5279424, -4788854, -1130968, 2365429, 3289011, 2439434, 895218, -1897959, -5958398, -9540876, -11421637, -12164044, -12140110, -10575453, -7609664, -5203845, -4803990, -5582975, -5707502, -4122262, -1060690, 1758468, 1882858, -1111900, -4361302, -5380205, -5793172, -8388843, -11656900, -11309584, -6815405, -2062715, 586596, 2322864, 3465396, 2067767, -1550981, -3708534, -2955868, -2353903, -3793210, -4553389, -2602273, -1068520, -3547009, -8330036, -11287237, -11626205, -10819649, -8508120, -3968608, 256872, 792428, -1532707, -3149854, -3470857, -5121208, -8693981, -11102720, -9797854, -5828386, -2067778]
4233b067778J663330o01195j781906j703518j663050k600481k861164l38361L342059
4224h612064M235086J852831l67441q57555j787685l992740m625914k004829J171664
4215a4988647J921621J044186Q33411J618565K540960L100684K446137m4929k411746
4206c939758j697670J097648J591701j168350k894922r27847J713883J708355
4198d516960M00127K83010N86753j74389q00355l564P46987J74354j20466J020594
4188b403909J512688k98044k296863k113668r60583r10503j343269r84992m23709
4179a0222852O298J472949L431201L100322M64769p75639M13612N55152j150622
4170b704810m42873L495841M598503N9781l769090j921603O60984j245352l121639
$$ y = [-2067778, -404448, -1005643, -2787549, -4491067, -6154117, -8754598, -11615762, -11954123, -8612064, -4376978, -2524147, -2891588, -3749143, -5536828, -9529568, -14155482, -16160311, -14988647, -13067026, -12022840, -11189429, -9570864, -7029904, -3929220, -1483083, -1528012, -3939758, -5637428, -4539780, -2948079, -4116429, -7011351, -7939198, -6225315, -4516960, -4116833, -3833823, -3247070, -3421459, -4221814, -4225378, -3478391, -3304037, -3424503, -2403909, -891221, -1189265, -3486128, -5599796, -6560379, -7470882, -8814151, -9799143, -10222852, -10216554, -8743605, -5312404, -2212082, -1747313, -2522952, -2109340, -1554188, -2704810, -3147683, 348158, 4946661, 5006442, 1237352, -684251, -23267, -1268619, -4390258]
4161d390258L15495L862448P14453m193880k235363L256154K936419j682478j846180
4152c263190J741280J310571j786526J90696M624565K411206l083326j176443
4144I68833K987569m768519j5173466l8326L9132481N7875836K6445296k3953515
4136H3476189m1035804j9848796O08931j780833j0156592o691188J022217Q34198
4128F428322k813146j700051Q01957l46813q34922K918346M635620m30436n310274
4119C348603k553941L201877L556350l61346k238866j786009k562156l703912
4111c099400k145936Q17858K152279K506431L198803K207725j141444k450177
4103B046139O74295K941755m48779m961948l708096J096440K136213p51837j265826
$$ y = [-4390258, -4074763, -212315, 502138, -3691742, -5927105, -2670951, 265468, -1417010, -3263190, -1521910, -211339, -1997865, -1807169, 2817396, 5228602, 2145276, 968833, 3956402, -812117, -15985583, -16023909, 23108572, 80984408, 107429704, 83476189, 42440385, 22591589, 23200520, 21419687, 11263095, 4571907, 5594124, 6428322, 3615176, 1915125, 2717082, 2370269, 1535347, 4453693, 9089313, 8658877, 3348603, 794662, 3996539, 7552889, 7191543, 4952677, 3166668, 604512, -3099400, -5245336, -4427478, -2275199, 231232, 3430035, 5637760, 4496316, 2046139, 2720434, 5662189, 5213410, 251462, -3456634, -2360194, -223981, -975818, -2241644]
4094b241644K145295M473155L208058J282053N23686o60646k162837j347038J261577
4085F481659J463216j671471l750559k030526M61407K82587j183235q54983Q29492
4076B7587J032064q91905k565495j755792J135832L534942L190940N22707j762094
4067B468786j814478n39229L37419O33286Q94898Q14428J04314n25372p98089
4058A575963j469329j990761j52221L803244N728852L254080j52094n57931J45197
4049A0185000j837513m853373m441153j499476j006331l129214k728616J457428
4041g853248M105601J888236j549566k170341j496781k297084l105809j368375
4033a3847367J515241K579140K135432K349368L035076K467003Q04122m64500
$$ y = [-2241644, -96349, 4376806, 7584864, 8866917, 9390603, 8729957, 6567120, 5220082, 6481659, 7944875, 6273404, 2522845, 492319, 953726, 1236313, 53078, -801905, 27587, 1059651, 167746, -2397749, -4153541, -3017709, 517233, 3708173, 4230880, 2468786, 654308, 115079, 452498, 1085784, 1980682, 2795110, 2899424, 2374052, 1575963, 106634, -1884127, -2036348, 1766896, 7495748, 10749828, 10597734, 10039803, 10185000, 8347487, 3494114, -947039, -2446515, -3452846, -6582060, -9310676, -7853248, -3747647, -1859411, -3408977, -5579318, -7076099, -9373183, -12478992, -13847367, -12332126, -9752986, -7617554, -5268186, -2233110, 233893, 1038015, 573515]
4025E73515j130452j580226j000806J000228K478037J694586K13203M67275J446655
4016D162015J93743k966947m240709j827009J473098K253611Q47713J33789J345788
4007A375092K747451K239807P8418j562535j339280k29147O2560o00130j006668
3998A765568o06173l9862J65337J99229L13421O64744J519744K391363J650976
3989H024347j174280l431306k251500Q20601J217196k129586m888471l261418
3981g074417J110276L998044L823398J856492p45186l479876n162013m374225
3973a0047507j174890K682444M913382L993852N61284k352447k211753j93590
3965c829225O11072N3820Q14907L052414L209044j84632l452662l068663n50276
$$ y = [573515, -556937, -2137163, -3137969, -2137741, 340296, 2034882, 2248085, 2715360, 4162015, 4355758, 1388811, -2851898, -4678907, -3205809, -952198, -104485, 29304, 1375092, 4122543, 6362350, 6440768, 4878233, 3538953, 3309806, 3372366, 2772236, 1765568, 1159395, 1119533, 1284870, 1484099, 1797520, 2462264, 3982008, 6373371, 8024347, 6850067, 3418761, 1167261, 1987862, 3205058, 1075472, -3812999, -7074417, -5964141, -1966097, 1857301, 3713793, 2968607, -511269, -5673282, -10047507, -11222397, -8539953, -3626571, 367281, 928565, -1423882, -3635635, -3829225, -3218153, -3164333, -2349426, 702988, 3912032, 3727400, 274738, -2793925, -3344201]
3956c344201Q37787R99769J304998J038162o32459j777635p93876R0936j368646
3947c645165k641295m12116K852544K230809j121834j340460K376586M238770
3939B537839J455395j284955K15159K975851K158783j310369k992569j894775
3931A860359p57444j112571j944509k321531k144074r17488J510065L525589L421801
3922A120197J927919R13544L24323j092135k503661j404139K175325M509966K678944
3913H650283j478122l638259k396332n75869j073887l083296l617915j860694
3905i074091o5404J12486J00992J753222L811498L479254Q97033p65595k5453
3896B23942R17658J21061p58486P04612L305496L510591O25062k095296j988019
$$ y = [-3344201, -2506414, -1506645, -201647, 836515, 204056, -1573579, -2367455, -2276519, -3645165, -6286460, -6698576, -3846032, -1615223, -2737057, -4077517, -1700931, 2537839, 3993234, 2708279, 2923438, 5899289, 8058072, 6747703, 3755134, 1860359, 1102915, -9656, -1954165, -4275696, -6419770, -7337258, -5827193, -2301604, 1120197, 3048116, 3961660, 4285983, 3193848, 690187, -713952, 1461373, 5971339, 8650283, 7172161, 3533902, 1137570, 561701, -512186, -3595482, -7213397, -9074091, -9139495, -9027009, -8926017, -7172795, -3361297, 117957, 1014990, 249395, 223942, 1141600, 1262661, 504175, 1208787, 4514283, 8024874, 8649936, 6554640, 4566621]
3887D566621m05653l84921k399005m090705l649739j771316j9863J284600K531215
3878d338766L102983J839190p13364k082334p93205J530591K186295Q98934q3725
3869A546599P02688J980190J671139j73698j429324p31973O79245N85783j135853
3860C694796k180686r74247J029578J424254K48467o02784p84923j715957l195230
3851c056732k823541k9902K145026J274306q27445j033294O59684K257362L327542
3842A893006M288290L843926Q58347k245178j923116R94889K158876J57180j789318
3833H236902j206912M12868R88961R03832J002069N81899p24041j574371j198850
3824G422357q24298j246451j208777J80167J560595J516613O91080J96132j08397
$$ y = [4566621, 4160968, 3776047, 1377042, -2713663, -6363402, -8134718, -8154581, -6869981, -4338766, -1235783, 603407, -109957, -2192291, -2985496, -1454905, 731390, 1630324, 1546599, 2249287, 4229477, 5900616, 5726918, 4297594, 3565621, 4244866, 4830649, 3694796, 1514110, 539863, 1569441, 2993695, 3242162, 2639378, 1854455, 138498, -3056732, -5880273, -5910175, -3765149, -2490843, -3318288, -4351582, -3691898, -1434536, 1893006, 6181296, 10025222, 10883569, 8638391, 6715275, 7710164, 9869040, 10026220, 8236902, 7029990, 7442858, 8431819, 9335651, 10337720, 10919619, 10195578, 8621207, 7422357, 6598059, 5351608, 4142831, 4322998, 5883593, 7400206, 8091286, 8287418, 8179021]
3815H179021l78794j3428N18224m48550k535311k795058l85093J357673J56225
3806C654909j137292O43983L017259J506927k551308l367841L58055L198973R50247
3797F273912l686757n564243l810599j431407m67206k86932L75946J882422L809774
3788b905090N203895M990290L082446P70951o43050j148719j380384j297258m35041
3779F238040P87075J078703j4221j146085p64445N83915P60559p37904j549649
3770E235988J46617K302268J564869j353554k135755O23244K813656P48618l291957
3761F653994m520594k499509q29748j122377j323962j44251O80081k42311j373437
3752d722114q49741M77975N72519o25017j469362j247732p56742m96434J00390
$$ y = [8179021, 7800227, 7786799, 8305023, 7856473, 5321162, 2526104, 2141011, 3498684, 3654909, 2517617, 3161600, 6178859, 7685786, 5134478, 1766637, 2124692, 5323665, 6273912, 2587155, -2977088, -6787687, -8219094, -8686300, -8973232, -8597286, -6714864, -2905090, 2298805, 7289095, 10371541, 11142492, 10499442, 9350723, 7970339, 6673081, 6238040, 7025115, 8103818, 8089597, 6943512, 6179067, 6762982, 7523541, 6785637, 5235988, 5382605, 7684873, 9249742, 7896188, 5760433, 6383677, 9197333, 9945951, 6653994, 2133400, -366109, -1195857, -2318234, -3642196, -3786447, -3106366, -3348677, -4722114, -5571855, -5093880, -4521361, -5146378, -6615740, -7863472, -8620214, -9116648, -9016258]
3743i016258J262702J910642J038908m20803l76637J397310K226356j72301m100813
3734f250894n548190l416508p64851j28794j66644J292903L190343K991536J086584
3725g714515K51334J124132J315980n10007k344465j772088O16262K099957J247391
3716e686019n10186n76270J702783L797103K818975k16560r82833J981338M198336
3707F526667J279918l996790m954835o16419K972647J815633p45634k95022J588361
3698C574526O06181k789595l955682j117491K403497L296542K107424R59972J60383
3689E245757j233257k985270l558205k105499L47996J855117J529844M97212M88870
3680H2565J427432J335997p28744k797128k428402k47605Q46745j77973j244312
$$ y = [-9016258, -7753556, -5842914, -4804006, -5224809, -5601446, -4204136, -1977780, -2150081, -6250894, -11799084, -15215592, -15980443, -16109237, -16275881, -14982978, -11792635, -8801099, -7714515, -7463181, -6339049, -5023069, -5533076, -7877541, -9649629, -9033367, -6933410, -5686019, -6196205, -6772475, -5069692, -1272589, 1546386, 1329826, 346993, 2328331, 6526667, 7806585, 3809795, -1145040, -1761459, 1211188, 3026821, 2281187, 1986165, 3574526, 4180707, 1391112, -2564570, -3682061, -1278564, 2017978, 4125402, 5085374, 5245757, 4012500, 1027230, -2530975, -4636474, -4288478, -2433361, -903517, -406305, 82565, 1509997, 2845994, 2117250, -679878, -3108280, -3355885, -2509140, -2687113, -3931425]
3671c931425n55659Q40003J126401O68400J014863J979659J917345O40295j72276
3662C527606J36051N6874j292741k176619p89026J582623K154169P19793k42538
3653C676192M87409J209473K65950j393432j823723q11978K70912L48296o64852
3644A564247k142090k832092j625872Q32370K240157J303815n68359j145558l2447
3635b405829J422925J869372P25296j633032l498077k937699l51680J487685J090198
3626d230841K16422P58194J724345J436120O57549P68136O79143r92217k152960
3617a136109J75706M126860M467994L49548k904976j329965K313298L067523N19832
3608I649711j848109j870935l50280J258681K244649K253284J398266N05443O9393
$$ y = [-3931425, -4487084, -3647081, -2520680, -1852280, -837417, 1142242, 3059587, 3699882, 3527606, 3663657, 3720531, 2427790, 251171, -537855, 1044768, 3198937, 3918730, 3676192, 4163601, 5373074, 5639024, 4245592, 2421869, 1609891, 1880803, 2229099, 1564247, -577843, -3409935, -5035807, -4203437, -1963280, -659465, -1227824, -2373382, -2405829, -982904, 886468, 1611764, -21268, -3519345, -6457044, -6808724, -5321039, -4230841, -4014419, -3256225, -1531880, -95760, 561789, 1329925, 2009068, 1016851, -1136109, -960403, 3166457, 7634451, 7983999, 5079023, 3749058, 6062356, 9129879, 9649711, 7801602, 5930667, 5580387, 6839068, 9083717, 11337001, 12735267, 13240710, 13310103]
3599A3310103n43237j961790l605806m444184m185156l012778j096953Q64400
3591d675401J616000P40797p27117j742835k333122k576860j686862Q01390L685270
3582f898740M996841L972314J624696k94964p55932l92092q88620k734823m069682
3573e441002l000901n60322M65356n34574j370260n87385O55816R97426J029430
3564h346416J850509L084482L564296K861608J296258n45335j787265j817584
3556A60553j078740k52526R14379K341874K033596j476819n464435n245332n47031
3547h614481L789999M325751K643353J235611k74050k605727m081610l219618
3539f800772j311639R1590J497098K847101J832385j995983m523172k375316J571868
$$ y = [13310103, 12766866, 10805076, 7199270, 2755086, -1430070, -4442848, -5539801, -4675401, -3059401, -2318604, -3045721, -4788556, -7121678, -9698538, -11385400, -10584010, -6898740, -1901899, 2070415, 3695111, 3400147, 2644215, 2252123, 1363503, -1371320, -5441002, -8441903, -9002225, -8536869, -9071443, -10441703, -11029088, -10373272, -9375846, -8346416, -6495907, -3411425, 152871, 3014479, 4310737, 3765402, 1978137, 160553, -918187, -1170713, -256334, 2085540, 4119136, 2642317, -2822118, -8067450, -8614481, -4824482, -498731, 2144622, 3380233, 3106183, 500456, -3581154, -6800772, -8112411, -8020821, -6523723, -3676622, -1844237, -3840220, -8363392, -10738708, -9166840]
3530i166840K227213j29568q82014J453820L490174K648929M90195l52599M69344
3521B48654J552450J646038O26152k99211J34108J040503J94280j963655k050367
3512A128952O07038J733624j206521l955708j869743K031841J592143k223217
3504b161591k731771J542472M690692K965266l50460j508184j599999k658132
3496a811707l632388l123663j859193p6955L301091O743411O122851J374008j716003
3487E321452J95759K636092N06324l684310m099239q63778Q55777o90217k135347
3478a957487j324925l1861K93759R72742K803367L730204J752836j907371m242085
3469H9179l938269k257585j060160q24450o55947O4609O31811K04986n73845n22528
$$ y = [-9166840, -6939627, -7069195, -7951209, -6497389, -3007215, -358286, 131909, -220690, 248654, 1801104, 3447142, 4073294, 3774083, 3908191, 4948694, 5142974, 3179319, 1128952, 1735990, 3469614, 2263093, -1692615, -3562358, -1530517, 61626, -2161591, -4893362, -3350890, 1339802, 4305068, 3954608, 2446424, 846425, -1811707, -5444095, -8567758, -10426951, -10503906, -7202815, -459404, 5663447, 7037455, 5321452, 5517211, 8153303, 8659627, 4975317, 876078, 12300, 868077, 177860, -1957487, -3282412, -3314273, -3020514, -2047772, 755595, 4485799, 6238635, 4331264, 89179, -3849090, -6106675, -7166835, -7991285, -8647232, -8582623, -7950812, -7745826, -8319671, -8842199]
3459h842199q5982o01990j485588o46817J830532L192438K146680O36798K17040
3450c639088k00164j158651o61044J845695K705092r09027n553008n448855n26964
3441a3546014L747788L991303K189985J293561J437703J472614J148200N73607
3433B308747l15920r37613m99043L81007K81501o76026j002003l92099o0587m36023
3423a348059o27188l41662k12665l2992J127214K773635L238022K418278J855712
3414H850295J621298j08654l347589m993809l055894O8627P46644j043303k279073
3405c541458j274663P44071J996829K078558J440431M62794n39418j244640j572633
3396a450129j635731j491128j193571q07213j46712R80461J972153J592168m31070
$$ y = [-8842199, -8928181, -9530171, -11015759, -11662576, -9832044, -6639606, -4492926, -3856128, -3639088, -3839252, -4997903, -5658947, -3813252, -1108160, -2017187, -7570195, -13019050, -13546014, -9798226, -5806923, -3616938, -2323377, -885674, 586940, 1735140, 2308747, 1992827, 1055214, 556171, 937178, 1218679, 542653, -459350, -851449, -912036, -1348059, -1975247, -2316909, -2529574, -2562566, -1435352, 1338283, 4576305, 6994583, 8850295, 10471593, 10362939, 7015350, 2021541, -1034353, -965726, -219082, -1262385, -3541458, -4816121, -4072050, -2075221, 3337, 1443768, 1906562, 1367144, 122504, -1450129, -3085860, -4576988, -5770559, -6577772, -6724484, -5744023, -3771870, -2179702, -2610772]
3387b610772k517974k733140r17397J292607K350146K096252J322642O98046K85350
3378g34240k30451r99775j592295j190666N49369K750233L635497J976560j492159
3369B672073m221446l920110p84584K589701L749421K552816O58492n01617o21648
3360B173098N0824J110661J811485J466800L78995l67255m42023q62730k352888
3351B966967l692174k849789J65614K702256K393148k8891j784709j490662l37172
3342a955412J30593j9930Q7944O19737J191143J554238J255045k89031k346185
3333B28142k846391j262265p5123j330186l118243k247292O16836J921330R43543
3324g169649N82144J923350K188846k82926k812458k485703k91541J373106K314454
$$ y = [-2610772, -5128746, -7861886, -8779283, -7486676, -5136530, -3040278, -1717636, -1019590, -734240, -964691, -1964466, -3556761, -4747427, -4198058, -1447825, 2187672, 4164232, 2672073, -1549373, -5469483, -6254067, -3664366, 85055, 2637871, 3296363, 2794746, 2173098, 2223922, 3334583, 5146068, 6612868, 6991863, 6624608, 6182585, 5319855, 2966967, -725207, -3574996, -3409382, -707126, 1686022, 1657131, -127578, -1618240, -1955412, -1824819, -1844749, -1756805, -1137068, 54075, 1608313, 2863358, 2574327, 228142, -2618249, -3880514, -3955637, -5285823, -8404066, -10651358, -10034522, -8113192, -7169649, -6587505, -4664155, -2475309, -2758235, -5570693, -8056396, -8347937, -6974831, -4660377]
3315d660377K840284J513954j809703l378422k90379M056235M009856R3472j692239
3306F82681R82597L449901J343281l056673m315415r52898L459372M864071K544367
3297I001284q58236k142753q23177L91258q09170l036863l259017j398421l02379
3288c237474j237758k249627j544788J41413J450161K259898K571440J775387
3280g1348K97815p2518J023250J193848j448359m929277n193804r84394M281651
3271e903136N814970K453767j901944k608355j7833J015996j700475l976004j521467
3262h344481K847349L119281l39370j238056K285153M326259O90653m213106m126395
3253d992713r9755K090641P09761q99785m37203R90161K051761K655325K228855
$$ y = [-4660377, -1820093, -306139, -2115842, -5494264, -5784643, -1728408, 2281448, 2374920, 682681, 1665278, 5115179, 6458460, 3401787, -913628, -1866526, 1592846, 6456917, 9001284, 8143048, 6000295, 5177118, 5568376, 4759206, 1722343, -1536674, -2935095, -3237474, -4475232, -6724859, -8269647, -8128234, -6678073, -4418175, -1846735, -71348, 226467, 153949, 1177199, 2371047, 922688, -4006589, -9200393, -10184787, -5903136, -88166, 2365601, 463657, -2144698, -2162531, -1146535, -2847010, -6823014, -8344481, -5497132, -2377851, -2717221, -3955277, -1670124, 2656135, 3346788, -866318, -4992713, -5092468, -3001827, -2292066, -3191851, -3629054, -2638893, -587132, 2068193, 4297048]
3244D297048n0905k989831l999347k316901L33032K145334K560040J725266M60644
3235B164380J15629P62110N33341j406560k702099j087785J590638J741101n58422
3226A152333j943431j092566j8193J21974P48271K344234K549669l59154m307169
3217h04032n598991l041152J215726L900155L096395k99376l120676k986107r01381
3208h539439L38010n0664l68307N55122K026094L135032L504952K359291o49774
3199B310317l423940l010750J00682K070097J039291n61048l66085M10025p9862
3190a511273p76057L3466J197067O33739q81773j202276q47725j950445l791919
3181i097196l286198k28148J729158N92304q29232O07882L375639L507882M07937
$$ y = [4297048, 4246143, 1256312, -2743035, -5059936, -4726904, -2581570, -21530, 1703736, 2164380, 2280009, 3042119, 3575460, 2168900, -533199, -1620984, -30346, 1710755, 1152333, -791098, -1883664, -1901857, -1779883, -1031612, 1312622, 3862291, 3503137, -804032, -6403023, -9444175, -8228449, -4328294, -1231899, -1531275, -4651951, -7638058, -8539439, -8201429, -8252093, -8620400, -8065278, -6039184, -2904152, 600800, 2960091, 2310317, -1113623, -4124373, -4023691, -1953594, -914303, -1475351, -1841436, -1431411, -1511273, -2287330, -2253864, -1056797, -423058, -1304831, -2507107, -3354832, -5305277, -9097196, -12383394, -12611542, -10882384, -10290080, -11119312, -10511430, -7135791, -3627909, -3219972]
3172c219972k368026j792491J364881M045877M003503J238919k186621l541939
3164b455869j956641K53539K21551j385080r59093K577804N342290L587971p27263
3155D499209k562425r41573L26730p17323j041118J916300N226366M378206J20962
3146A1205334k505890j314321N92438n473k031094k307495p6547K328334K379872
3137H265158j17240k934238l539914j787583j51521m48223j188181Q7282K574408
3128G59948K878075m8581l353837m306176l191104j213016J590920M538233N084711
3119B739173K093032j477428j955286J26657J201515j19570j862492k319401j921921
3110c495721j237941J63428K006442K738695J819558Q21831J052343J531496O48681
$$ y = [-3219972, -5587998, -7380489, -6015608, -1969731, 2033772, 3272691, 1086070, -2455869, -4412510, -4158971, -3937420, -5322500, -6281593, -3703789, 1638501, 5226472, 4499209, 1936784, 995211, 1321941, 604618, -436500, 1479800, 6706166, 11084372, 11205334, 8699444, 7385123, 7977561, 7972088, 5940994, 3633499, 3556952, 5885286, 8265158, 8147918, 5213680, 1673766, -113817, -265338, -713561, -1901742, -1814460, 759948, 3638023, 3589442, 235605, -4070571, -7261675, -8474691, -6883771, -2345538, 2739173, 4832205, 3354777, 1399491, 1526148, 2727663, 2608093, 745601, -1573800, -3495721, -4733662, -4570234, -2563792, 174903, 1994461, 2816292, 3868635, 5400131, 6048812]
3101F048812j312924k720777k920477k606663k202012j245468L55106J474707
3093e129696R27253p61314j475113Q9994K477723K925155J042389k58106J318833
3084A157118L727264K922286j314622m484476l224581L25415J894030R56085M50336
3075B408855J459453J560080p24509k774295j327051K568937M581474K616804
3067A0369748r43691k755405k237839r57259J3469O20664O67392j60403j225477
3058C391199j278418j46490R08131Q81310K78911K16247Q65892J336401P98167
3049G251350o32369j957887k146268j210622m18684q92316j985712j852815J06648
3040c738675K289518K987678K550072K423501K689614K007840j5310j866307k149223
$$ y = [6048812, 4735888, 2015111, -905366, -3512029, -5714041, -6959509, -6604403, -5129696, -4202443, -4963757, -6438870, -6348876, -3871153, -945998, 96391, -161715, 1157118, 4884382, 7806668, 6492046, 2007570, -1217011, -891596, 1002434, 1958519, 2408855, 3868308, 5428388, 4703879, 1929584, 602533, 3171470, 7752944, 10369748, 9426057, 6670652, 4432813, 3475554, 3489023, 4109687, 4777079, 4616676, 3391199, 2112781, 1966291, 2874422, 3755732, 4034643, 4250890, 5116782, 6453183, 7251350, 6618981, 4661094, 2514826, 1304204, 885520, -6796, -1992508, -3845323, -3738675, -1449157, 1538521, 4088593, 6512094, 9201708, 11209548, 11194238, 9327931, 7178708]
3031G178708j504859j554652k506058k877422j574643O12365J890529J374879
3023A038847j53183j103906n01920J161463K282811J624284l16627j682928j270380
3014A078461J85690J113926J003231M61525j70311j033157j611323r11094O30095
3005G47043R27528q71415k583551j788574M60367R25197j051703k523617j312199
2996g070924Q77306J160014l83193j176164R4378K071844K864897K024117K86768
2987G49043j345821j935727j039886O28901J520352O68879j378559l110006l327714
2978h570538k074058o54335n07986j577658k049670l45172K786628M867690M358578
2969c766521K051825j82461j219387j044238j73267O54187O84367k30458j251526
$$ y = [7178708, 5673849, 4119197, 1613139, -1264283, -2838926, -2226561, -336032, 1038847, 885664, -218242, -720162, 441301, 2724112, 4348396, 4031769, 2348841, 1078461, 1264151, 2378077, 3381308, 3842833, 3672522, 2639365, 1028042, 116948, 747043, 1674571, 803156, -1780395, -3568969, -3108602, -2183405, -3235108, -5758725, -7070924, -6193618, -5033604, -5416797, -6592961, -6498583, -4426739, -1561842, 462275, 749043, -596778, -2532505, -3572391, -2943490, -1423138, -754259, -2132818, -5242824, -8570538, -10644596, -11298931, -11806917, -13384575, -15434245, -15779417, -12992789, -8125099, -3766521, -1714696, -1897157, -3116544, -4160782, -4334049, -3679862, -2995495, -3225953, -4477479]
2960d477479j225286J70175K098524L350972L332400K331778J011360k37021j397536
2951D957887k385614k727996j923036j92498J257332J057113q59103k678864k331653
2942e826432j21046J114413m25364k483236j290591K778813M669333J236988l862314
2933d209436m574371m89689K863206J737698j343076k129301n31318O34823P03828
2924g337636J546724L423293L802769J284527j752889k139593j74697R92585k27547
2915e82464j894879j401202J060177K976758K844822J631490P55539M9434j201185
2906D238490k235352j666155j30280L4573j604731k408625n78150J626235R43227
2897a780768j771471k478928R2160K525844J720860q79499j791354j86020J993991
$$ y = [-4477479, -5702765, -5532590, -3434066, -83094, 3249306, 5581084, 6592444, 6355423, 4957887, 2572273, -155723, -2078759, -2271257, -1013925, 43188, -815915, -3494779, -5826432, -5947478, -4833065, -5258429, -7741665, -9032256, -6253443, -1584110, -347122, -4209436, -8783807, -9273496, -6410290, -4672592, -6015668, -8144969, -8676287, -8041464, -7337636, -5790912, -2367619, 1435150, 2719677, 966788, -1172805, -1347502, -354917, -582464, -2477343, -3878545, -2818368, 158390, 3003212, 4634702, 5390241, 5439675, 4238490, 2003138, 336983, 206703, 241276, -1363455, -3772080, -4350230, -2723995, -1780768, -3552239, -6031167, -5939007, -3413163, -1692303, -2571802, -4363156, -4549176, -2555185]
2888b555185L117093K791561Q08396k263372l897505j751098K689703N004052
2880C943645L146838k04480j574336q81327j68032K9877P06812J647176J206001
2871G852174r09722k632397k148548k15785J067225Q71755m8190j051634k283938
2862E00940l570831l853283k498224n50706K80869k49555p45306k42739N62847
2853a0365988P37561P74868J693925K962540K734071L80683k304661l012607j438670
2844g838278N75338J111461P3212q91846l16519J321511K218392J679778R42441
2835a124510J022781J095451L22204l8648J510492L586400L304193N53627j888462
2826H343528k641703k989677l249873j502507K304792M388833K040499k042146
$$ y = [-2555185, 561908, 3353469, 4161865, 1898493, -1999012, -3750110, -1060407, 3943645, 7090483, 6886003, 5311667, 4430340, 4262308, 4292185, 4998997, 6646173, 7852174, 6942452, 4310055, 2161507, 1945722, 3012947, 3884702, 3836512, 2784878, 500940, -3069891, -6923174, -9421398, -9972104, -9691235, -9940790, -10686096, -10928835, -10365988, -9628427, -8853559, -7159634, -4197094, -1463023, -1082340, -3387001, -6399608, -7838278, -7262940, -6151479, -6078267, -6970113, -7286632, -5965121, -3746729, -2066951, -1124510, -101729, 993722, 1315926, 1277278, 2787770, 6374170, 9678363, 10231990, 8343528, 5701825, 2712148, -537725, -2040232, 264560, 4653393, 6693892, 4651746]
2818D651746l352816j544427K68618N04120J29873r4308j17205P85741K758494
2809C989836L552746J182559k360044l393277j836654o03425m10367N59955K016028
2800B697357J312921j460886k778929j311481J87104J44025O65414K646623L162387
2791E264535P56377j163889J3809J199388j077807m038953k838141J120263K051817
2782A287399j129187l504352k040359O42474J505433J411498K320917L761539
2774D255362M209678L491731K112738J89060j632940j998625p57423M36631L03598
2765A0609810o07652j163483r87911k64549M02405j28070k226626m195844m100604
2756b662524k654821k056676k144657n70682K760452M509552K499411j062271
$$ y = [4651746, 1298930, -245497, 23121, 527241, 657114, 562806, 445601, 1231342, 3989836, 7542582, 8725141, 6365097, 2971820, 1135166, 531741, 121374, 681329, 2697357, 4010278, 2549392, -229537, -1541018, -1353914, -1209889, -544475, 2102148, 5264535, 6020912, 4857023, 4870832, 6070220, 4992413, 953460, -1884681, -764418, 1287399, 158212, -3346140, -5386499, -4744025, -3238592, -1827094, 493823, 4255362, 8465040, 11956771, 14069509, 14258569, 12625629, 10627004, 9869581, 10306212, 10609810, 10002158, 8838675, 7850764, 7586215, 7988620, 7860550, 5633924, 1438080, -2662524, -5317345, -7374021, -9518678, -10089360, -7328908, -2819356, -319945, -1382216]
2748a382216k657617j756457l03502M26704N64527K96463m55450j335784j540605
2739h143937m09690J933844L899970L098497o16300l418527j501477L242710M824066
2730B909156J255267k528629j729580J740150K705656J20230k595899l001838
2722a125487j718233J82298K270285L224072J493573j771447l152420j414759
2714b012118O11169p3970k491640l044103k06019L664730N218687L766395J424878
2705F858009J5455j039844k951003m674956l805671m96735J823881R40539r02138
2696d232463k17318K703363M464575L500318J617389N84655j63395j562536k851999
2687C842589k954426k517401k867999l521580k416410J042187M352738M373014
$$ y = [-1382216, -4039833, -5796290, -6099792, -5673088, -5108561, -4812098, -5267548, -6603332, -8143937, -8553627, -6619783, -2719813, 378684, -237616, -3656143, -5157620, -1914910, 2909156, 4164423, 1635794, -93786, 1646364, 4352020, 4472250, 1876351, -1125487, -2843720, -2661422, -391137, 2832935, 4326508, 2555061, -597359, -2012118, -1400949, -1474919, -3966559, -7010662, -7216681, -3551951, 1666736, 5433131, 6858009, 6873464, 5833620, 2882617, -1792339, -5598010, -6094745, -4270864, -3330325, -4232463, -4449781, -1746418, 2718157, 6218475, 7835864, 8420519, 8257124, 6694588, 3842589, 888163, -1629238, -4497237, -8018817, -10435227, -9393040, -5040302, -667288]
2679f67288J172401j729725j553505L89943R31324j43537R3132K777986M912334
2670F183065L640079O34953l50334J047597J680422k94443l306926n158853n269878
2661a194318l674084l57361L338314M818327L191766O11519n60165m60736l37747
2652E375515o9452R93768J786797M93132k342897l801206k361493j08962r283
2643d4081j926847k855529j038304J589624J880599m98668k819850k817748r62705
2634i493509J087695K618101L367708K484068r7031k107514j135874J703210K596660
2625A023514N1520l083646l616298k003683p80965o65007l61426O64422J507904
2616g263665J742316J976576K231020J562608p1276j131180n97789M65835N14201
$$ y = [-667288, 505113, -1224612, -2778117, -2388174, -1456850, -1600387, -1507255, 1270731, 6183065, 9823144, 10458097, 10107763, 11155360, 12835782, 12541339, 9234413, 4075560, -1194318, -4868402, -5225763, -1887449, 2930878, 6122644, 6734163, 6173998, 5713262, 5375515, 5306063, 6299831, 8086628, 8579760, 6236863, 2435657, 74164, -34798, -44081, -1970928, -4826457, -5864761, -4275137, -2394538, -2893206, -5713056, -8530804, -9493509, -8405814, -5787713, -2420005, 64063, -32968, -2140482, -3276356, -1573146, 1023514, 1075034, -2008612, -5624910, -7628593, -8409558, -9074565, -9435991, -8771569, -7263665, -5521349, -3544773, -1313753, 248855, 177579, -953601, -1551390, -1085555, -571354]
2607e71354l05591p83597o55411n46059m12731K97947J043160N53389p98452q70594
2597c049293J013090K449244J222510j148015j314752J103584L032781K292271
2589E601420J03026j364157j796472j960746j889935j330414p73415o20011k84083
2580d314787N61483Q32198l46726j645188r22008J605627L149182J546149k257855
2571a791925n037543m108022L39566N158344O925708N105199J932922p68401k987985
2562D767863m354005l180297N12146L371807K814504R18043J052229K223299Q57404
2553H982993k560433l427596k52966K653129J503617j896152l778605l674332
2545b450345l134120k082595P0401J643165O20585j642752j884387M34444K776803
$$ y = [-571354, -876945, -1660542, -2315953, -2862012, -3274743, -2976796, -1933636, -1380247, -2178699, -3049293, -2036203, 413041, 1635551, 487536, -827216, 276368, 3309149, 5601420, 5704446, 4340289, 2543817, 583071, -1306864, -2637278, -3410693, -4030704, -4314787, -3753304, -2921106, -3267832, -4913020, -5835028, -4229401, -1080219, 465930, -1791925, -6829468, -10937490, -10597924, -5439580, 1486128, 6591327, 8524249, 7755848, 4767863, 413858, -2766439, -2254293, 1117514, 3932018, 4850061, 5902290, 8125589, 8982993, 6422560, 2994964, 2741998, 5395127, 6898744, 5002592, 1223987, -2450345, -5584465, -7667060, -7596659, -5953494, -5332909, -6975661, -8860048, -8425604, -5648801]
2536e648801L412410K955262K223250J242115N60990J072493K020395J382394
2528I220508j045835k844743k138734n5253R44211J10653j091271r13408P61189
2519B947317K139824J297020j322208k883344j634165N58777Q25876m66282o37871
2510H24944M80543n2145l161314n330135l495378J78436J394294k3309l95761
2501i579825J836551L965765L499599J653163P69793P19604J12524o01333J5834
2492B391675J182593M58076k199890l622719j843190Q70269J179664p12527j839613
2483d135662r48172K69456L12242j22263J40031R31776J546678J892077J949408
2474A835571J351150L54173J8744N30125N75504n87053j651925j084711N97661
$$ y = [-5648801, -2236391, 718871, 2942121, 4184236, 4745226, 5817719, 7838114, 9220508, 8174673, 5329930, 3191196, 3135943, 4080154, 4190807, 3099536, 2186128, 2947317, 5087141, 6384161, 5061953, 2178609, 544444, 1103221, 1929097, 1462815, 824944, 1305487, 1253342, -1907972, -7238107, -10733485, -10555049, -9160755, -9184064, -9579825, -7743274, -3777509, -277910, 1375253, 2145046, 2864650, 2977174, 2375841, 2391675, 3574268, 4032344, 1832454, -1790265, -3633455, -2763186, -1583522, -2296049, -4135662, -5083834, -4814378, -4502136, -4624399, -4484368, -3552592, -2005914, -113837, 1835571, 3186721, 3540894, 3559638, 4089763, 4665267, 4078214, 2426289, 1341578, 1939239]
2465A939239J636181J288674J30798j055334j608100j141213m21554r42953k516946
2456b691208k800520o95067J542011J586556O07050Q69025J499370R5680k611381
2447b598484l672209k935736k848151l243099j150388L229603N395635L522103
2439d300726J762610L385933N012828K137113k971270m223208p85106K172771
2431B190945J383858q07187j318474o51244p16890j395307j202098K38543J703338
2422e74516J593540n27826k844013k482106Q46753L618339K942278P96785Q81439
2413D250673K515603J701510k008031m201128k185290J176636K003707M25600
2405C679280r45779p79709P08807K805403L847295K128584j186180k667860j595096
$$ y = [1939239, 3575420, 4864094, 4994892, 3939558, 2331458, 1190245, 768691, -174262, -2691208, -5491728, -6186795, -4644784, -3058228, -2451178, -1582153, -82783, 12897, -2598484, -6270693, -9206429, -12054580, -15297679, -16448067, -13218464, -7822829, -4300726, -2538116, 847817, 5860645, 7997758, 5026488, 803280, 18174, 2190945, 3574803, 2767616, 1449142, 797898, 81008, -1314299, -2516397, -2277854, -574516, 1019024, 491198, -2352815, -4834921, -3988168, -369829, 2572449, 3369234, 4250673, 6766276, 8467786, 6459755, 2258627, 73337, 1249973, 3253680, 3679280, 2733501, 1953792, 2662599, 5468002, 9315297, 11443881, 10257701, 7589841, 5994745]
2396E994745j125721k680414l041990m7512K679412R79928k853865l389857m40003
2387c925277J186941n27209k497306k140162n42442P31401J839378K610197J879332
2378a385147k4239j195908j285947j675096k169858j069947R38261R53631j049981
2369g964231j522605O57435J810057n01185l170945k524168n4707N93453l70633
2360a3047529L6543K334094M272331M580646L680632J753426p70226j900797m44524
2351D94596J361148Q22512o02182O52297M144952N386547K347114j650699k687629
2342A0268656r45095P66667Q57219k40152j551273k396830k471150j884030q58231
2333A545781M59345J407654Q57891j111479k548278k002654n53120M6794m9068
$$ y = [5994745, 4869024, 2188610, -853380, -900892, 1778520, 2758448, -95417, -3485274, -3925277, -2738336, -3265545, -5762851, -7903013, -8445455, -7714054, -5874676, -3264479, -1385147, -1409386, -2605294, -3891241, -5566337, -7736195, -8806142, -7867881, -6914250, -7964231, -9486836, -8829401, -7019344, -7520529, -10691474, -13215642, -13270349, -12676896, -13047529, -13010986, -10676892, -6404561, -1823915, 1856717, 3610143, 2839917, 939120, 494596, 1855744, 2678256, 2076074, 2728371, 6873323, 12259870, 14606984, 12956285, 10268656, 9323561, 10090228, 10947447, 10707295, 9156022, 6759192, 4288042, 2404012, 1545781, 2005126, 3412780, 4270671, 3159192, 610914, -1391740, -1944860, -1898066, -1947134]
2324a947134R2238j820q67586j117599L02584J380332L6624j570867j4289L176044
2314e31473L342542M62101p24327Q89243O05548l500491o127240k966703J948686
2305f602114K421516m68136j162894Q76772J128668j510877k704265M3496L486530
2296d491304L837331J711191k12695j185492j736354j446905K16656K195438K841893
2287A729759J921819N21240l26192k71214K04899j51378k057764m088947l816723
2278f334501j217117O11635p22552l660582m760053l093878q36899J76480O06257
2269a9231210J885160L817730M860705M034230J726098q28831k100451j033397
2261f869966J522054K727171P99346k069129j989976J112495K945068J029889
$$ y = [-1947134, -1854896, -1856716, -2724302, -3841901, -3539317, -2158985, -2122361, -3693228, -3707517, -531473, 2811069, 3273170, 2548843, 3438086, 4043634, 543143, -5584097, -8550800, -6602114, -4180598, -4648734, -5811628, -4934856, -3806188, -5317065, -8021330, -7977834, -4491304, -653973, 1057218, 844523, -340969, -2077323, -3524228, -3307572, -1112134, 1729759, 3651578, 4172818, 3846626, 3575412, 3780311, 3628933, 1571169, -2517778, -6334501, -7551618, -6939983, -7662535, -11323117, -16083170, -19177048, -20013947, -19837467, -19231210, -17346050, -13528320, -8667615, -4633385, -2907287, -3736118, -5836569, -6869966, -5347912, -2620741, -1821395, -3890524, -5880500, -4768005, -1822937, -793048]
2253g93048j508714q62375J423722J195722j210210j416807J656269L862448K401781
2244D748788j83256o35412L59655P73241R76969J687914J113899k150372n491856
$$ y = [-793048, -2301762, -3164137, -1740415, -544693, -1754903, -3171710, -1515441, 2347007, 4748788, 4565532, 3930120, 4289775, 5063016, 6039985, 7727899, 8841798, 6691426, 1199570]
$$ [...]
##END NTUPLES=NMR SPECTRUM
##END=
