##TITLE=31P_DE-80H_X3
 64 sc D2O
 26.2.2025
##JCAMPDX= 6.0         $$ Bruker NMR JCAMP-DX V2.0
##DATA TYPE= NMR FID
##DATA CLASS= NTUPLES
##ORIGIN= UXNMR, Bruker Analytische Messtechnik GmbH
##OWNER= root
$$ XWIN-NMR		Version 3.5
$$ Thu May 15 14:44:16 2025 Russian Standard Time (UT+4h)  Yarkov@DPX200
##.OBSERVE FREQUENCY= 81.013821
##.OBSERVE NUCLEUS= ^31P
##.DELAY= (6, 6)
##.ACQUISITION MODE= SIMULTANEOUS
##.ACQUISITION SCHEME= undefined
##.AVERAGES= 64
##.DIGITISER RES= 17
##SPECTROMETER/DATA SYSTEM= spect
##.PULSE SEQUENCE= zgpg30
##.SOLVENT NAME= CDCl3
##.SHIFT REFERENCE= (INTERNAL, CDCl3, 0, 243.863)
##AUDIT TRAIL= $$ (NUMBER, WHEN, WHO, WHERE, WHAT)
$$ ##TITLE= Audit trail, XWIN-NMR		Version 3.5
$$ ##JCAMPDX= 5.01
$$ ##ORIGIN= Bruker BioSpin GmbH
$$ ##OWNER= Yarkov
$$ C:/Bruker/XWIN-NMR/data/yarkov2/nmr/P31/2/audita.txt
$$ ##AUDIT TRAIL=  $$ (NUMBER, WHEN, WHO, WHERE, WHAT)
(   1,<2025-05-15 14:40:41.68 +0400>,<Yarkov>,<DPX200>,
      <created by zg, POWCHK disabled, PULCHK disabled
       configuration hash MD5:
       00 E9 B6 7A A2 85 ED C7 34 08 36 98 17 FE 4E 26
       data hash MD5: 32K
       CD 85 B3 A7 C1 38 2A A8 88 1A 01 DA 94 AF 47 60>)
$$ ##END=
$$ 
$$ hash MD5
$$ 09 9C 76 32 3C 28 88 38 43 68 2E 43 98 AA AE 7F
##$RELAX= 
##$RELAX= 
##$RELAX= 
##$RELAX= 
##$RELAX= 
##$RELAX= 
##$RELAX= 
##$RELAX= 
$$ Bruker specific parameters
$$ --------------------------
##$DU= <C:/Bruker/XWIN-NMR>
##$EXPNO= 2
##$NAME= <P31>
##$PROCNO= 1
##$TYPE= <nmr>
##$USER= <yarkov2>
##$AMP= (0..31)
100 100 100 100 100 100 100 100 100 100 100 100 100 100 100 100 100 100 
100 100 100 100 100 100 100 100 100 100 100 100 100 100 
##$AQSEQ= 0
##$AQ_mod= 1
##$AUNM= <au_zg>
##$AUTOPOS= <>
##$BF1= 81.014009
##$BF2= 200.13
##$BF3= 200.13
##$BF4= 200.13
##$BF5= 200.13
##$BF6= 200.13
##$BF7= 200.13
##$BF8= 200.13
##$BYTORDA= 1
##$CFDGTYP= 0
##$CFRGTYP= 5
##$CHEMSTR= <none>
##$CNST= (0..31)
1 1 145 1 1 1 1 1 1 1 1 1 1 1 1 1 1 1 1 1 1 1 1 1 1 1 1 1 1 1 1 1 
##$CPDPRG= <waltz16>
##$CPDPRG1= <>
##$CPDPRG2= <waltz16>
##$CPDPRG3= <>
##$CPDPRG4= <mlev>
##$CPDPRG5= <mlev>
##$CPDPRG6= <mlev>
##$CPDPRG7= <mlev>
##$CPDPRG8= <mlev>
##$CPDPRGB= <>
##$CPDPRGT= <>
##$D= (0..31)
0 1 0 0 0 0 0 0 0 0.06 0 0.03 2e-05 3e-06 0 0 0.0002 0 0 0 0 0 0 0 0 0 
0 0 0 0 0 0 
##$DATE= 1747305641
##$DBL= (0..7)
120 120 120 11 120 120 24 19 
##$DBP= (0..7)
150 150 150 150 150 150 150 150 
##$DBP07= 0
##$DBPNAM0= <>
##$DBPNAM1= <>
##$DBPNAM2= <>
##$DBPNAM3= <>
##$DBPNAM4= <>
##$DBPNAM5= <>
##$DBPNAM6= <>
##$DBPNAM7= <>
##$DBPOAL= (0..7)
0.5 0.5 0.5 0.5 0.5 0.5 0.5 0.5 
##$DBPOFFS= (0..7)
0 0 0 0 0 0 0 0 
##$DE= 6
##$DECBNUC= <off>
##$DECIM= 4
##$DECNUC= <off>
##$DECSTAT= 4
##$DIGMOD= 1
##$DIGTYP= 9
##$DL= (0..7)
0 0 52 120 120 21 21 25 
##$DP= (0..7)
150 150 150 150 150 150 150 150 
##$DP07= 0
##$DPNAME0= <>
##$DPNAME1= <>
##$DPNAME2= <>
##$DPNAME3= <>
##$DPNAME4= <>
##$DPNAME5= <>
##$DPNAME6= <>
##$DPNAME7= <>
##$DPOAL= (0..7)
0.5 0.5 0.5 0.5 0.5 0.5 0.5 0.5 
##$DPOFFS= (0..7)
0 0 0 0 0 0 0 0 
$$ [...]
##$SUBNAM1= <"">
##$SUBNAM2= <"">
##$SUBNAM3= <"">
##$SUBNAM4= <"">
##$SUBNAM5= <"">
##$SUBNAM6= <"">
##$SUBNAM7= <"">
##$SUBNAM8= <"">
##$SUBNAM9= <"">
##$SW= 400.765351723535
##$SWIBOX= (0..15)
0 1 3 0 0 0 0 0 0 0 0 0 0 0 0 0 
##$SW_h= 32467.5324675325
##$TD= 32768
##$TD0= 1
##$TE= 0
##$TE2= 300
##$TE3= 300
##$TEG= 300
##$TL= (0..7)
0 120 53 12 22 120 120 120 
##$TP= (0..7)
150 150 150 150 150 150 150 150 
##$TP07= 0
##$TPNAME0= <>
##$TPNAME1= <>
##$TPNAME2= <>
##$TPNAME3= <>
##$TPNAME4= <>
##$TPNAME5= <>
##$TPNAME6= <>
##$TPNAME7= <>
##$TPOAL= (0..7)
0.5 0.5 0.5 0.5 0.5 0.5 0.5 0.5 
##$TPOFFS= (0..7)
0 0 0 0 0 0 0 0 
##$TUNHIN= 0
##$TUNHOUT= 0
##$TUNXOUT= 0
##$USERA1= <user>
##$USERA2= <user>
##$USERA3= <user>
##$USERA4= <user>
##$USERA5= <user>
##$V9= 5
##$VALIST= <valist>
##$VCLIST= <CCCCCCCCCCCCCCC>
##$VD= 0
##$VDLIST= <DDDDDDDDDDDDDDD>
##$VPLIST= <PPPPPPPPPPPPPPP>
##$VTLIST= <TTTTTTTTTTTTTTT>
##$WBST= 1024
##$WBSW= 4
##$XGAIN= (0..3)
0 0 0 0 
##$XL= 0
##$YL= 0
##$YMAX_a= 3554
##$YMIN_a= -15465
##$ZGOPTNS= <>
##$ZL1= 120
##$ZL2= 120
##$ZL3= 120
##$ZL4= 120
##$ABSF1= 60
##$ABSF2= -190
##$ABSG= 5
##$ABSL= 3
##$ALPHA= 0
##$AQORDER= 0
##$ASSFAC= 0
##$ASSFACI= 0
##$ASSFACX= 0
##$ASSWID= 0
##$AUNMP= <proc_1d>
##$AZFE= 0.1
##$AZFW= 0.5
##$BCFW= 1
##$BC_mod= 2
##$BYTORDP= 1
##$COROFFS= 0
##$CY= 9.86611175537109
##$DATMOD= 1
##$DC= 1
##$DFILT= <>
##$DTYPP= 0
##$F1P= 182.462994727601
##$F2P= 168.069089081705
##$FCOR= 0.5
##$FTSIZE= 0
##$FT_mod= 0
##$GAMMA= 1
##$GB= 0
##$INTBC= 1
##$INTSCL= 1
##$ISEN= 30
##$LB= 1.5
##$LEV0= 0
##$LPBIN= 0
##$MAXI= 11.51145
##$MC2= 0
##$MEAN= 0
##$ME_mod= 0
##$MI= 1.244541
##$NCOEF= 0
##$NC_proc= 0
##$NLEV= 6
##$NOISF1= 0
##$NOISF2= 0
##$NSP= 1
##$NTH_PI= 0
##$NZP= 1
##$OFFSET= 243.8632
##$PC= 1.4
##$PHC0= 1763.063
##$PHC1= 109.5595
##$PH_mod= 0
##$PKNL= yes
##$PPARMOD= 0
##$PSCAL= 0
##$PSIGN= 0
##$REVERSE= no
##$SF= 81.0140731611343
##$SI= 65536
##$SIGF1= 0
##$SIGF2= 0
##$SINO= 80
##$SIOLD= 65536
##$SREGLST= <31P.CDCl3>
##$SSB= 0
##$STSI= 0
##$STSR= 0
##$SW_p= 25641.0256410257
##$SYMM= 0
##$S_DEV= 0
##$TDeff= 0
##$TDoff= 0
##$TI= <>
##$TILT= no
##$TM1= 0
##$TM2= 0
##$TOPLEV= 0
##$USERP1= <user>
##$USERP2= <user>
##$USERP3= <user>
##$USERP4= <user>
##$USERP5= <user>
##$WDW= 1
##$XDIM= 64
##$YMAX_p= 0
##$YMIN_p= 0
$$ End of Bruker specific parameters
$$ ---------------------------------
##NTUPLES= NMR FID
##VAR_NAME=  TIME,          FID/REAL,        FID/IMAG
##SYMBOL=    X,             R,               I
##VAR_TYPE=  INDEPENDENT,   DEPENDENT,       DEPENDENT
##VAR_FORM=  AFFN,          ASDF,            ASDF
##VAR_DIM=   16384,         16384,           16384
##UNITS=     SECONDS,       ARBITRARY UNITS, ARBITRARY UNITS
##FACTOR=    3.08e-05,      1,               1
##FIRST=     0,             0,               0
##LAST=      0.5045964,     0,               0
##MIN=       0,             -15465,          0
##MAX=       0.5045964,     3554,            0
$$ Real data points
##PAGE= N=1
##DATA TABLE= (X++(R..R)), XYDATA
0@%%%%%%%%%%%%%%%%%%%%%%%%%%%%%%lQj1J6k4K8l0L3l3L4l7M3n3N8o0O7p6Q3
48D3q9R3j05J18j28J46j67J85k01K26k63L09l61M32n33O96r85J677j6558J2470
68b995L034k70K838j279k15k078j323Q80L11J485J010L80k887j470P32Q25K099
85A077N85q46R88l623j01K20J576K570j209k21j521r36l55J399J905m7o52j380
103e71p41l7Q4K682P75q82j231k10o51q91K168p24K363k321l24j426ML966j389
122F44Q74j496Q43k156m84J006J481J005p06m74j746N72k86J27K094k53j27J34
140A052j211n76J272K2L35M15j653m66m90J262J479m2M10j350j703N84j383L435
158A392m93K09j197j671R70j048K528O18J232j895k289Q30p02N70O1J809M66o80
$$ plain form
0 0 0 0 0 0 0 0 0 0 0 0 0 0 0 0 0 0 0 0 0 0 0 0 0 0 0 0 0 0 0 0 -3 5 -6 10 -14 14 -16 17 -16 18 -19 24 -29 29 -31 36 -40 43
48 43 -46 47 -58 60 -68 78 -89 96 -105 121 -142 167 -194 238 -295 401 -584 1093 -15465 -2995
68 -2995 39 -231 2607 1328 1113 -965 -2288 -1408 -1097 388 1398 1778 -1109 -2579 -1847 -1022 1077
85 1077 1662 816 1804 -1819 -1920 -1700 -124 2446 1237 1016 -505 -1441 -1796 -397 1508 1461 809 -571
103 -571 -1312 -1349 -1265 1417 2192 1310 79 -131 -782 -1673 495 -229 2134 -187 -511 -1937 -1933 2033 644
122 644 1518 22 865 -1291 -1775 -769 712 1717 1011 537 -1209 -637 -923 -796 1298 1045 918 1052
140 1052 -159 -735 537 559 894 1309 -344 -810 -1300 -38 1441 1399 1809 459 -1244 -660 -2043 1392
158 1392 899 1108 -89 -1760 -790 -1838 690 1308 2540 645 -1644 -814 -1516 -946 -885 924 1390 710
176G10r64R2q09P28J467J209k087r17j747K379O39k58R0l00J741l259q4J080N3
195b37J767j069j29l17j941J734n77K940n25n41r87j510L85m19K687p90N11k02
213G80p44j626l49L834j910K915l120k09J187k595J683m5K310k221k87M53j586
230a530J650J289N30j862j60K06j028J907r92K237k869K031o81k008L432k904
246g52J288n68K403l309r14Q27K68J909l13p9N5j956j10M21J73l62R30K89l78
265a78K47o12K76J154o07O72l106J865j102J239k95L7J980j692j005J79m09J204
283a53m19J703j379Q97j435K2J48p12K556j261K15P3j574K872j319J6j33p05J71
302d17l55J722j559J274l29K25k60j667k24Q99J697K43j606k31r8O96j013J299
$$ plain form
176 710 -254 -162 -971 -243 1224 2433 346 -571 -2318 61 700 442 532 232 1973 -1286 -1370 -290 -237
195 -237 1530 461 332 15 -1926 -192 -769 2171 1646 1105 118 -1392 -1007 -1426 1261 471 982 780
213 780 36 -1590 -1939 1895 -15 2900 -220 -429 758 -1837 -154 -199 2111 -110 -397 56 -1530
230 -1530 120 1409 1939 77 -83 123 -905 1002 10 2247 -622 1409 728 -1280 2152 -752
246 -752 536 -32 2371 -938 -1852 -1025 -757 1152 839 760 815 -1141 -1251 -830 -657 -1019 -89 200 -178
265 -178 69 -543 -267 887 280 952 -2154 -289 -1391 -152 -447 -410 1570 -122 -1127 -948 -1357 -153
283 -153 -572 1131 -248 649 -786 -764 -616 -1328 1228 -33 182 255 -1319 1553 234 250 117 -588 -417
302 -417 -772 950 -609 665 336 561 301 -1366 -1590 -691 1006 1249 -357 -588 -686 10 -1003 296
320B96J28m74n31l17K343k527J795o87J162p77j361O25l73K106m70k51n08k89
338a10P4j087J892N0r72k13P34l31m63L68j217K047q73q31J146j003K91J705r18
357B89l39o66L84K08R2M69P74l14j854J050k68j636K522r16j38j42R85q59j360
376a719J763n13oO78p53m15J110j49o53O74j187K80J255j066J284j292J670k293
394a332P26R97j141J620k700J823o02j52K463j770m24j24J277j548J44L60L16
411f7J877k230J189k125J463M50j982Q13O19j306N36Q23O06j027O82q82q4r21
429a566J734Pj015J832j675Q16J353p45j772J056P89j051P26j413N52N71r44J245
447E00p01j97Q57N17L13l087J871J090j271l20Q59j72j024J257L9j412J533j169
$$ plain form
320 296 424 -50 -581 -898 1445 -1082 713 26 1188 411 -950 -325 -698 1408 938 687 179 -110
338 -110 -36 -1123 769 819 -153 -366 368 37 -426 -58 -1275 772 -101 -932 214 -789 -498 1207 289
357 289 -50 -716 -332 -124 -32 437 1211 897 -957 93 -175 -1811 711 -205 -343 -485 500 -359 -1719
376 -1719 44 -469 -475 203 -550 -965 145 -4 -657 17 -1170 -890 365 -701 583 -709 961 -1332
394 -1332 -606 391 -750 870 -1830 -7 -609 -761 1702 -68 -492 -616 661 -887 -743 -383 -67
411 -67 1810 -420 769 -1356 107 557 -1425 -612 7 -1299 -763 60 666 -361 321 -561 -645 -1566
429 -1566 168 175 -840 992 -683 133 1486 741 -1031 25 814 -237 489 -924 -372 199 -745 500
447 500 -201 -398 459 976 1289 -1798 73 1163 -108 -428 431 259 -765 492 531 -881 652 -517
465e17J381p21L79j038o97J790j644P03J487j59m42j040N84p20J459p88j46n68
483f97K65Q68K1k57j86N00l34q22R58j149J967k445K372j088j783K016o19J063
501F50k25J564j719j663l12L10K693k730J812n65R7n30Q95N96m28O32j843P5M58
520b33L57%q27J143q97P53N05j911J962q70O1L82j119J113Q79j879m39J246m49
539b23j59R4j391J820M05r02J924j062O10j068j066J462J6J45j439j03Q16o42
557g63Q64o54L03l09N80j792J000K160j785K238o2k169J51o38J048j291J638o17
575i8m76N09l9J559j716L69k32m0k37r50J652k094J262K69J131j515M32l31m77
594a022J504l18J531j566j106J347j852J366m7J757k158J314o38M3K10j410L87
$$ plain form
465 -517 864 143 522 -516 -1213 577 -1067 -364 1123 964 522 -518 66 -654 805 17 -129 -697
483 -697 -432 436 457 200 14 514 180 -642 316 -833 1134 -1311 1061 -27 -1810 206 -413 650
501 650 425 1989 270 -1393 -1705 -1395 1298 -1432 380 -185 -88 -618 277 873 445 1077 -766 -691 -233
520 -233 124 124 -703 440 -457 296 801 -1110 852 -18 43 425 -694 419 1298 -581 -1020 226 -223
539 -223 -382 -288 -1679 141 546 -356 1568 506 1116 48 -1018 444 460 605 -834 -937 -121 -763
557 -763 101 -553 -250 -559 21 -1771 -771 1389 -396 1842 1780 -389 -238 -876 172 -1119 519 -98
575 -98 -574 -65 -104 1455 -261 108 -124 -164 -401 -1351 301 -1793 -531 -262 869 -646 -214 -545 -1022
594 -1022 482 164 1695 129 -977 370 -1482 -116 -163 1594 -564 750 112 155 365 -1045 -658
611f58J137K8Qo46j00O8M91L34q14M57k324K674o56L39o79N39R37k497R31Q89
631D58P00Q38r80l96k344K011LK1Q54j167N63N6j804R97j86N59j72N13n46l92
651d14J321k066J311j242K617j723k5M00q84J569j587K805j871M7M27k121K376
668I40k195K162p99L89j41r74J361j438O85j23J74Q92j788R07J91j06N09l28J070
687A388j971m10O0J145L72q75J539j037m63m25O41K54M08k48j45J122k541J668
705D82j137J310q63L31j98j66J440j089L12L42j377R18j767J015O45k97P72n16
723A57j032J148j74J092j543J537k514L22J920p31j074J282P63L06j355q8q96
740h80Q87l93J462O8j090Q22j275J237k588J865K24j70O16k082J848o79P3K79
$$ plain form
611 -658 479 507 515 -131 -231 -163 328 662 -152 305 -2019 655 -1 338 -341 198 1135 -1362 -431 458
631 458 1158 1996 1016 620 -1724 287 290 311 1165 -2 561 617 -1187 -190 -376 183 11 524 -22 -414
651 -414 907 -1159 152 -1090 1527 -196 -221 179 -705 864 -723 2082 211 258 685 -1436 940
668 940 -1255 907 108 497 356 -618 743 -695 -10 -133 41 933 -855 52 243 137 646 318 1388
687 1388 -583 -993 -933 212 584 -291 1248 211 -252 -677 -36 218 626 378 233 1355 -1186 482
705 482 -655 655 -208 123 -75 -241 1199 110 422 764 -613 305 -1462 -447 198 -99 673 157
723 157 -875 273 99 1191 -352 1185 -1329 -1007 913 182 -892 390 1153 1459 104 16 -880
740 -880 7 -386 1076 1144 54 876 -399 838 -1750 115 339 169 785 -1297 551 -128 -55 224
758B24J66k26j057J147j650J348n9K06O04j226J046j407R72l41K453j756j345
775i01J142j450m03Q51M26Q67L19r93o23J313l82m94N32q48J696j556O70p76J595
794I85p96P7O4l84k15k11L95P09r27l51J486r2p63r5P22j894J930k03j609M96
814f76J194L52l70n06j94j246K244j707P21K31P36m96j410J431j170J448j137
831e55m57J059j71J458j471J136l57j77j333q34K615q98J419q22r7j33M57k45
849E94j411J27J43j27J379k007J273j170J668q25Q36J749k587J948j958L51m26
866d43O04J5j218k7K84K5J267j44J78j939K544m07j671M63J575k14j476K073r63
885E26p25m90M02l04N12O22J7p28K22r90J383K46j673P23J557j407P16O0n98P33
$$ plain form
758 224 390 164 -893 254 -1396 -48 -107 99 703 -523 523 -884 88 -253 2200 444 -901
775 -901 241 -1209 -1612 -761 -335 532 851 -142 -765 548 166 -328 204 -644 1052 -504 166 -610 985
794 985 189 266 330 -54 -269 -480 -85 624 -303 -654 832 740 -23 -118 604 -1290 640 437 -1172 -676
814 -676 518 870 500 -6 -200 -1446 798 -909 -188 43 779 283 -1127 304 -866 582 -555
831 -555 -1012 47 -124 1334 -137 999 642 465 -868 -1702 913 15 1434 612 515 382 839 594
849 594 -817 -690 -547 -674 705 -1302 -29 -1199 469 -356 480 2229 -358 1590 -368 -17 -443
866 -443 161 176 -1042 -1069 -785 -760 507 363 541 -1398 1146 739 -932 -469 1106 892 -584 1489 526
885 526 -199 -689 -287 -591 -79 543 560 -168 54 -936 447 693 -980 -257 1300 -107 609 669 71 804
905H04j47j337O77j173J370k11R74R80j730l80p32L09n5J288n60J738j263j733
923a181J591J94j135R93m73J119k684K176j403Q01rj553J576p32M72n58R42k15
941g9J069q53j364J362l95L17J303j078N44j902O75m08J772r65J67Q53k888K831
959I61j379O16q30J85P76q94J236k528J910R74j554J346q42K10m60Q52N55p95
977C39Q96k384k24R08k65J228j500J111l42r95R0J183k471J873L00J51J512m97
995I13M97p78p10P0K70m59o6p13O66k4N81N97q38J7M28L43j500Q46J5o00L88l13
1017c70J755j360K85j69k8Q08j608K49J50P40K56j602K332j483P08k543L151q03
1035D68p76n52M49J97j615J799j184J543O01j577K100k769J423K66J04K7j324
$$ plain form
905 804 657 -680 -3 -1176 194 -17 957 1937 207 -173 -905 -596 -651 637 77 1815 552 -1181
923 -1181 410 604 -531 462 -11 1108 -1576 600 -803 -2 -11 -1564 12 -720 -248 -806 136 -79
941 -79 990 137 -1227 135 -260 57 1360 282 826 -1076 -401 -809 963 -2 165 1018 -1870 961
959 961 -418 198 -632 -447 329 -565 671 -1857 53 1027 -527 819 -23 187 -273 579 1134 339
977 339 1235 -1149 -1373 -465 -730 498 -1002 109 -233 -1228 -1138 45 -2426 -553 -253 -102 1410 913
995 913 1410 632 -78 -8 262 -197 -263 -976 -310 -334 247 844 6 23 451 794 -706 140 155 -445 -57 -370
1017 -370 1385 25 310 141 113 921 -687 -438 -288 452 708 -894 1438 -45 663 -1880 1271 468
1035 468 -308 -860 -411 -214 -1829 -30 -1214 329 930 -647 1453 -1316 107 373 477 504 -820
1052h20J353j247K99N99J39Q38J137j019q44n77J326k420J038o14J449j305p43
1069a411J746m76M11l89J99L5j340K088r99R59k86k16j022r22J431O87K74o31
1087A38l62O97k037K241k05j97J77k49K325l102R63j44K51K84o2K58j356J433
1105A053m53j633K25R08J19l10J687k557J41M93m24J042j587J459j35m12k1J834
1123A429o81q91k24Q78j477J201O63j774OK103j664n87L93P11m58p89J160K64
1141B63J225k185L11N64M93p1j173O77K50q53R77l11K17r85L51j396Q57O33Q33
1160F77K72p95Q4r25Q63m13Q94M8Lj002J164j543Q96P57q47r08J034m35q88O34
1180d30J137j218J58j097J790k022K116K74o65P24j421N02q27N03J918j457R87
$$ plain form
1052 -820 533 -714 -415 184 323 1161 2298 1279 435 -142 1184 -1236 -198 -812 637 -668 -1411
1069 -1411 335 -141 270 -119 80 115 -1225 863 -136 823 537 321 -701 -1623 -192 495 769 138
1087 138 -224 473 -1564 677 472 275 452 203 2528 -574 389 245 496 780 718 976 -380 1053
1105 1053 600 -1033 -808 100 219 -91 1596 -961 -820 -327 -751 291 -1296 163 28 -384 -405 1429
1123 1429 748 -143 -367 511 -966 235 898 -876 -870 1233 -431 -1018 -625 86 -372 -1161 -1 263
1141 263 1488 -697 -386 178 671 600 -573 104 354 -499 478 167 384 -601 -250 -1646 -789 -156 677
1160 677 949 154 238 -687 176 -237 657 705 708 -294 870 -673 223 980 133 -775 259 -176 -1064 -430
1180 -430 707 -511 -353 -1450 340 -1682 434 708 43 767 -654 -152 -979 -476 1442 -15 972
1197I72k234J176j143J317K63j44K33l80O54k582K114j717J324J455j882o65p03
1214a942J772P10r85O52o73R83r92R41j183j39P37N29J690k448J750j315M18j88
1232C17j54R79j660R62o36M91p76J41l3m52N21q39M72m56J997j124J176M10j279
1251E7m95N35l10Q19J49o08k33q15R71K14p08m90J073R7l65P34j028Q56r58Q39
1271C34K25j170K65j77R36p1o55R82r38P61r64P86J64o26J490k100n63R90m23
1290g54J120o68P86k596L545j439m94m94J206R55j305J363l239J897J134j753
1306g36J770R46j171j757J037j06j250K537j88o88j203J165k47k27R01k13O54
1323A224k261J496k219J481J126r34L54p48J39k31M86K15P42p26J13p02j191R1
$$ plain form
1197 972 -1262 -86 -1229 88 351 207 440 60 714 -1868 246 -1471 -147 1308 -574 -1239 -1942
1214 -1942 -170 540 -445 207 -466 517 -475 466 -717 -856 -119 410 2100 -348 1402 87 505 317
1232 317 163 1142 -518 444 -192 299 -477 -336 -369 -821 -300 -1139 -667 -1123 874 -250 926 1336 57
1251 57 -438 97 -213 606 755 147 -86 -901 70 284 -424 -914 159 256 -109 625 -403 453 -505 334
1271 334 559 -611 -346 -523 413 342 -313 669 -269 492 -472 314 478 -148 1342 -758 -1321 -331 -754
1290 -754 366 -302 484 -2112 1433 -6 -500 -994 212 1167 -138 1225 -2014 -117 1017 -736
1306 -736 1034 1980 809 -948 89 -17 -1267 1270 1082 394 -809 356 109 -118 783 570 1224
1323 1224 -1037 459 -1760 -279 847 -87 267 -481 -342 -573 -87 128 870 144 257 -445 -1636 -1545
1341a545K300j52m02R06k411J468n67J299p71J10M84k164J715m36J699p86j28
1358F19j029j163J978j399J94J156l06J642l561K948o23j256J288P2M16j591J459
1375H44j282J107L79p37J171k903J780k19J81r28J6Q84q90L52k10L95K0j200J832
1394E92q84J934j879l3R13n15N98j575P08n3J008j300L94M46o31J265j710j20
1412h42K25k73J42o50J421K85j86P81n10J275j525m0Jj517K291j163R8J11O64
1431E88j372J916o43k695K402m36O98j197Q39j35R22j67n56M57r38j124J236L90
1449A85l82L57l21l46p67J990k184J455l84R56J60p90j18r14R35R36o66L37j153
1468g14J519j115L07q57P31J119k514J143Q90m90j196O41K187k431J098n39L27
$$ plain form
1341 -1545 755 603 201 1107 -1304 164 -403 896 125 235 719 -1445 270 -166 1533 747 619
1358 619 -410 -1573 405 -994 -800 356 50 1692 -1869 1079 456 -800 488 560 976 -615 844
1375 844 -438 669 1048 311 1482 -1421 359 140 321 -607 -591 293 -597 -245 -455 -60 -40 -1240 592
1394 592 -292 1642 -237 -270 643 128 726 -849 -141 -194 814 -486 -92 354 -277 988 -722 -842
1412 -842 -617 -890 -748 -1398 23 308 122 903 393 1668 143 103 104 -1413 878 -285 -187 -76 588
1431 588 -784 1132 489 -2206 196 -240 458 -739 100 -35 887 720 164 621 -317 -1441 -205 185
1449 185 -197 160 -161 -507 -1274 716 -1468 -13 -397 559 719 -71 -189 -1103 -168 768 102 439 -714
1468 -714 805 -310 -3 -860 -129 990 -1524 -381 509 19 -1177 -536 1651 -780 318 -221 106
1485A06j150k7P07L70N63j785J145K72j65O89j911K324k820K880j199p83Q19r63
1503i28J862j562P32p28P10M81l41K89j621K62P46O75J085l101P13J185J228k152
1521d65n05J254l09N19j176P47j244O51N44J03J178r00j108J734j209O05K66j185
1539e00R95l04O53p85l10k84J114M40j289P17p78j42M22k52K06r13J930q77m19
1558c76Q53m46R3j983K474j680R78j181J109J182j815J517j244K84q33j135M012
1575A809l269J752J67J085j717o04J417k047K007j733K066j322Q77J77q81M29
1591B13j410K274n67j033l75L32J513k227J234Q6O48l69j820K584p49L44o63o93
1609f78J124j376K343j931R43p7O90j249k94J809j494R91L37j252M27K60m11N85
$$ plain form
1485 106 -1044 -1071 -364 6 569 -1216 -71 201 36 725 -1186 1138 -1682 1198 -1 -784 35 -928
1503 -928 934 -628 104 -624 86 567 226 515 -1106 -844 -98 577 1662 -1439 -726 459 1687 -465
1521 -465 -970 284 -25 494 -682 65 -1179 -528 16 119 1297 397 -711 1023 -186 419 685 -500
1539 -500 495 191 844 59 -251 -535 579 1019 -270 447 -331 -473 -51 -303 -97 -1010 920 43 -376
1558 -376 477 31 124 -1859 615 -1065 -87 -1268 -159 1023 -792 725 -519 -235 -1068 -2203 1809
1575 1809 -1460 292 459 1544 -173 -777 640 -1407 600 -1133 933 -389 488 665 -216 213
1591 213 -1197 1077 510 -523 -898 -566 947 -1280 -46 40 688 319 -1501 1083 334 678 15 -678
1609 -678 446 -930 1413 -518 425 348 1038 -211 -505 1304 -190 801 1138 -114 313 573 162 747
1627G47k72L18j825K055j656K079p34q46O86j445N18J417N1M37j237Q94j440k78
1645e31J75M23N1k077L026j309l39J084o07N75j042K53j527Q75k61Q59J464j603
1663e11L46m82M9J436o44l98L12j14m21J224j539P89Q72j302R32p27J271k005
1681i12M19P57m64K61J188j611M1J502p67j452P61k37K409o09k730J893Q6l88
1699A47q40J563k37j712J400j07O90j647r64L117j793P15r94K91j50O40P67j345
1717d59J36j294K092j57q92J803j906N5o04J173k27J142o41j393J867j586L86
1734e05J149j614J907j929J723j483j086K575j720K385k648J245j65o27J126K37
1750E70J28l31Q93k224M42R97j342J890m61K16n5j15j23j631Q31O6Q73p92m01
$$ plain form
1627 747 475 793 -1032 1023 -633 1446 712 -134 552 -893 -375 1042 1093 1530 293 1187 -253 -531
1645 -531 -356 67 118 -1959 1067 -242 -581 503 -104 471 -571 -318 -1845 -970 -1231 -372 1092 -511
1663 -511 -165 -647 -598 838 194 -204 108 -6 -427 797 -742 47 919 -383 549 -178 1093 -912
1681 -912 -493 264 -200 61 1249 -362 -321 1181 414 -1038 -277 -514 1895 1286 -1444 449 535 147
1699 147 -693 870 633 -1079 321 214 904 -743 -1707 1410 -383 332 -662 -371 -521 119 886 -459
1717 -459 -323 -1617 475 318 -574 1229 -677 -622 -1226 -53 -280 862 221 -1172 695 -891 -505
1734 -505 644 -970 937 -992 731 -752 -1838 737 -983 1402 -1246 -1 -166 -793 333 570
1750 570 698 367 1260 -964 -522 475 -867 1023 562 778 723 608 485 -1146 -315 -249 624 -168 -569
1769e69J009k64J265j671Q15j096l6j05L10N16p71M41o87l90Q37Q08k17j645J114
1788c36R08j259J398r04l03N43Q96j706O03M26j0L9k58o86J195j801L13J549j563
1807i56J03m5J081j622K661k589J455O76l91M95j042O51j402J939k219L59L85
1824d61j75K171k601J564p95M70P16j201J378j468q64J994j956L033k835K256
1840A226j102n86J53o75J377l00N11j675K445j710q06J170J3J299j223J18l89
1857a54M59q5k08J946l282J485l90p41J237l07K28P61j827J525j272k83J222p3
1875B41M60l43j765J378j055K360n23k90r98K68J10O91p21P15k76j680J875k54
1893A93r31l8L63O39j6l97j105J995M83k044J581j468J552j199J097j017R47Q5
$$ plain form
1769 -569 440 176 1441 -230 585 -511 -547 -652 -342 174 -597 -156 -843 -1233 -396 412 195 -1450 -336
1788 -336 572 -687 711 -193 -496 47 943 -763 -160 266 256 295 37 -649 546 -1255 -942 607 -956
1807 -956 -853 -898 183 -1439 1222 -1367 88 764 373 868 -174 477 -925 1014 -1205 -846 -461
1824 -461 -636 1535 -1066 498 -297 173 889 -312 1066 -402 -1266 728 -1228 1805 -1030 1226
1840 1226 124 -462 -309 -984 393 93 604 -1071 1374 -336 -1142 28 41 1340 117 235 -154
1857 -154 305 220 12 1958 -1324 161 -229 -970 267 -40 188 949 -878 647 -625 -908 314 241
1875 241 701 358 -1407 -29 -1084 1276 753 463 -535 -267 -157 534 -187 528 252 -1428 447 193
1893 193 -738 -776 -413 226 210 -187 -1292 703 1186 -858 723 -745 807 -392 705 -312 635 720
1911G20j570J309q08R43j950J450J74n97P48j423Q58Q33j708Q98n70J298o00R29
1929I34j102r06J204r62J955j487P13m22j108J005m52J927k821K122R3j238n65
1946a110N29J065O37j087L73m79J56m97L94O08k11L34j004n31O35O08n10n13K018
1965A415o47n29R83k94j505K35K08J048r86k65J111j793R04J126j026o76J198
1982E07k56J46j155J196L42J43j585N46R7j441J787l96n60n44J329r82J94O02
2000c0Q67j882J787j302K83n27R73l47Q81r19N64n35m89K564k769Q10N03k041
2018a609K227j682M19j00K863k961O43L39j562J283j618J781k48J656j201j532
2034a302K177j338J084l90j294J774m01R50j785J574k507N58J186o60J594j768
$$ plain form
1911 720 -850 459 -349 594 -1356 94 268 -329 419 -1004 -146 687 -1021 -123 -693 605 5 934
1929 934 -168 -1074 130 -832 1123 -364 349 -73 -1181 -176 -628 1299 -1522 600 693 -545 -1110
1946 -1110 -581 484 1121 34 407 -72 84 -413 -19 589 378 712 -292 -823 -188 420 -90 -603 1415
1965 1415 768 239 1222 928 -577 -342 -134 914 -72 -337 774 -1019 -115 1011 -15 -691 507
1982 507 251 397 -758 438 780 923 -662 -116 -19 -1460 327 -69 -629 -1173 156 -826 -632 -30
2000 -30 837 -1045 742 -560 -277 -804 169 -178 703 -216 348 -187 -676 1888 -881 -71 432 -1609
2018 -1609 618 -1064 -645 -745 2118 -843 -200 139 -1423 -140 -1758 23 -225 1431 230 -1302
2034 -1302 875 -463 621 231 -1063 711 310 1260 -525 1049 -1458 -900 286 -374 1220 -548
2050e48J0J019m72o60O35M58j089J569j150J300l93m89p47p0N93O09k81p29Q13
2069C78L7p72L91M35l0Q37j491N08K74j902J971j208R75j045R33P86q77O34j338
2088e04J026K9m89K12p61J488j477K146j361r63J635o86K03r40P08n76M59J296
2106A445k248K331k312K131j366r5k71j075K92R30M80R4n4k47p38R41j707K135
2124F66j978K492r35o45M50q64J445r4k37j41j50j73K17k03q59J250K43J207k
2143A689o46p01J3j662R65Q8K99k58p12J070j039K70m67J771k064K860kk051R42
2162C65o25J046m86j357J997n97k10n66Q8J533j694P81n70J494j836Q93J297k960
2180a407K238k213J117l45J859j643J082Q89j675J755k634K021j497J307j413
$$ plain form
2050 -548 -538 481 9 -651 -16 442 -647 922 -228 1072 679 190 -557 -627 -34 575 294 -435 378
2069 378 415 -357 34 469 439 1276 -215 293 567 -1335 636 -572 403 -642 291 1077 200 834 -504
2088 -504 522 551 62 274 -487 1001 -476 1670 309 -654 981 295 498 -442 266 -310 149 1445
2106 1445 -803 1528 -784 1347 -19 -114 -385 -1460 -1168 -238 242 336 282 35 -703 238 -1469 666
2124 666 -1312 1180 245 -400 50 -814 631 537 300 159 9 -164 53 -150 -1009 241 484 1691 1689
2143 1689 1043 342 355 -1307 -342 -254 45 -213 -925 145 -894 -624 -1091 680 -1384 1476 1474 -577 365
2162 365 -260 786 300 -1057 940 343 133 -433 -345 1188 -506 275 -295 1199 -637 256 1553 -1407
2180 -1407 831 -1382 -265 -610 1249 -394 688 1577 -98 1657 -977 1044 -453 854 -559
2195e59j53R08n96M90r54M81M80j940K929l012K568n35j266J540q41O72m33o48
2213h69J205q40P21k75L53n27M86K19j098P63Q6p84P17p89J057j161O82p94K75
2232e73L92O1j05n25L30O37k96Q68p81J77L21q32N10q62R72M46j676m4N21P49
2252B90j45o44n3l84J119M36J8j771K137q18K11j523K188j001m85J338k283J013
2270c57N48p70J291j963J941j831K039r80J516j101j067J656l70L44p69j157K79
2287g51N22M56j363J473p93j15R38l71L17r11J289j914P98J46J247q46J76l5j208
2306i45M25P34q18M67m55J005k55l45o8O20O9o35M16L79j673J901k143J868L43
2325H90j184qo61O55O57M12j231M38K7M43p6j593L059j61j314m66o05J54q24Q03
$$ plain form
2195 -559 -712 196 -400 90 -864 -383 97 -1843 1086 -1926 642 107 -1159 381 -460 212 -221 -869
2213 -869 336 -504 217 -58 295 -232 254 473 -625 138 224 -560 157 -632 425 -736 -54 -848 -573
2232 -573 -181 -120 -225 -750 -420 217 -79 789 8 185 506 -326 184 -678 294 740 -936 -980 -459 290
2252 290 145 -499 -552 -936 183 619 637 -1134 1003 185 396 -1127 1061 60 -425 913 -1370 -357
2270 -357 191 -579 712 -1251 690 -1141 898 -82 1434 333 -734 922 552 896 127 -1030 -751
2287 -751 -229 227 -1136 337 -456 -571 367 -4 313 -598 691 -1223 -425 -279 968 122 298 263 -945
2306 -945 -520 214 -604 -137 -592 413 158 -187 -255 365 434 -201 215 594 -1079 822 -1321 547 890
2325 890 -294 -302 -963 -308 349 761 -470 -32 -5 438 362 -1231 1828 1667 353 -113 -718 -564 -1388 -585
2345e85K296j841Nk31N27q96J634n14j506K158k296K370j962K213j042m27J160
2362A063o82M51j570P25q00j09J431j220J647n11l04Q97q44J17n84K6L68o02P7
2381d24P11N01j456J783k251L31J174r30J621n28K12o43o09L27O00k31j626J842
2399D04p79k14N68M08L18k038K142j342L47p9R41J10r78J63J44p80K314r58j132
2418d41N7m21M96N9M72k36k60Q40r38M23m18J92J086L70j079k77P18j062J81K78
2438D0n73Q17n23J234k292J637j038P42l75o89J073j321J303J8L80K17j306L98
2456b58kJ564k032P67j17j866J957K48M58k404L505j715j318J252j112J570r3
2473D04M90o32j88L03j301J943k579O07J098o26N75J42J09l57M56L23j55k46j428
$$ plain form
2345 -585 1711 -130 -125 -356 171 -725 909 395 -1111 1047 -1249 1121 -841 1372 330 -97 1063
2362 1063 381 832 -738 -13 -813 -922 509 -711 936 425 121 1018 174 291 -293 -267 101 -501 -424
2381 -424 287 788 -668 1115 -1136 -805 369 -561 1060 532 744 101 -508 -181 419 188 -1438 404
2399 404 -375 -589 -21 387 705 -1333 809 -533 -186 -265 676 786 -192 -29 115 -665 1649 691 -441
2418 -441 -384 -805 -309 -250 222 -14 -274 566 -372 51 -367 -175 911 1281 202 -75 643 -419 -238 40
2438 40 -533 284 -239 995 -1297 340 -698 44 -331 -1020 53 -1268 35 53 433 650 -656 -258
2456 -258 -260 1304 -728 39 -78 -1944 13 261 719 -1685 1820 105 -1213 39 -1073 497 404
2473 404 894 262 74 377 -924 1019 -1560 -953 145 -481 94 236 345 -12 444 767 612 366 -1062
2492a062K087j766O8m12J755J59j036l66R18j664J350L68M19q16o65J067p9O34
2510I59j894J165O73j102J086o16j687J074J91J495j608O58j430K109K57j016
2526C14l17M31J1r32K027j053O1K92j071Q69j449J120j893J082J512j024J69j365
2544a216J611n27N62j216k18J403k57M2p95J286j258K74J708l235K997j957K854
2561B058k169P81m57r93J272l88M66k08M90j622J148l65L23p52j245K259p47l03
2579d52K418j809Q48q61L4R98k167J632k00J79k83m57N91j168j27J548j358O54
2597B0m22Q70j454J979p20n76Q54j108J224n57K08p25K9J118l04l94k94o83K77
2616f58J91J127k252K120k08j454J609r16L50N97q77P49r82J366j661J780j844
$$ plain form
2492 -1062 1025 -741 -673 -1085 670 829 -207 -573 345 -1319 31 399 818 2 -663 404 325 959
2510 959 -935 230 903 -199 887 271 -1416 -342 -151 1344 -264 394 -1036 1073 1330 314
2526 314 -3 428 439 -493 1534 481 542 834 -237 632 -817 303 -1590 -508 1004 -20 149 -1216
2544 -1216 395 -132 430 -786 -1004 399 142 184 -611 675 -583 -309 1399 -1836 1161 -796 2058
2561 2058 -111 670 213 -780 492 104 570 362 852 -770 378 13 336 -416 -1661 598 -149 -452
2579 -452 1966 157 1005 144 178 1176 -991 641 441 620 337 -120 471 -697 -824 724 -634 20
2597 20 -402 468 -986 993 273 -303 551 -557 667 110 318 -407 -378 740 436 42 -252 -935 -658
2616 -658 -467 660 -1592 528 320 -1134 475 -441 -91 506 -371 378 -604 762 -899 881 -963
2633i63O20m02J057p13q89K084r60J584k571J42J24k17L65n41J659r14Q81P33
2651A079j677K629m386L560k889K08K314r51M22r14J490r62PM1q89r7P81P90j456
2670i00J018j17o66L21p85j22O92R33j034O7m66P81M34l64J182p80n65k0k48Q9
2690e50J261k103K183j721P25l0o84J99k92K778j499l43r75O04J94n66J088j026
2708g57R4J130L97j188o33J300j77O54q51j71R22m15l90k10j29P96m41P45q42
2727a66Q02p67k01J284m78J481k693M27k61O25no75O56n25J46L50J773l40k530
2746a097J181p87J243J50p42M84o26J312j578J541j295M54j558R78M61o32q7k04
2764h02R2J315k87J52m83j23o35J685p96J45m92M2Q42j145K205k467R99N69j12
$$ plain form
2633 -963 -343 -745 312 -401 -1290 794 -166 1418 -1153 -1011 -887 -1104 -739 -1280 379 -535 346 1079
2651 1079 -598 2031 -2355 1205 -1684 -1476 838 -113 309 -605 885 -77 -70 -29 -918 -1015 -234 556 -900
2670 -900 118 1 -665 -344 -1129 -1251 -559 374 -660 -593 -1059 -278 156 -208 974 194 -371 -391 -639 -550
2690 -550 711 -1392 791 -930 -205 -235 -919 -720 -1012 1766 267 -76 -1051 -447 -253 -819 269 -757
2708 -757 -663 467 864 -324 -957 343 166 820 -31 -202 720 305 -85 -295 -424 372 -69 676 -166
2727 -166 636 -131 -332 952 474 1955 -738 -311 -572 53 48 -627 29 -496 -350 0 1773 1433 -1097
2746 -1097 84 -703 540 690 -52 432 -194 1118 -460 1081 -214 240 -1318 -340 121 -511 -598 -802
2764 -802 -710 605 318 470 -13 -136 -771 914 118 263 -229 -187 655 -490 1715 -752 247 816 704
2783G04O70o31l75l52M74p43K167j972J76j039K463j620l1r11J062o42J069l62
2801A07L55N5O63j167P67j437J403j077J235j067L5P99j651J891j766J284j921
2818a492J240q1M68k01L35l22N44j403R66j175M17p80Q79J070j37J127q82l76
2836A97K8J70p07R24K08K06m2j157O69o66J74J67o09n74m7j34J369l02J63P5M81
2857E93j141P59L52K29j847J415N77k492M74N73m9R44j427L145k201R90q1j103
2875b90M15J024k10l51j54m76M53j488J577m3r0j817J625j050R98o98n9J178n13
2894C1K10o94J28M58r41J293j24r7j457J305n68O0J172j633J747k365J986j041
2912e30K6R19K0M58j315m23O20J6J163j196L99m96O54j018M81L47j75J147k957
$$ plain form
2783 704 1374 743 368 16 490 -253 1914 -58 118 -921 1542 -78 -109 -1020 42 -600 469 107
2801 107 462 517 1180 13 780 -657 746 -331 904 -163 -128 671 -980 911 -855 429 -1492
2818 -1492 -252 -333 135 -66 269 -53 491 -912 54 -1121 -704 -1484 -605 465 328 1455 573 197
2836 197 225 395 -312 612 820 1026 984 -173 496 -170 4 171 -438 -1012 -1059 -1193 176 -126 37 112 593
2857 593 -548 211 563 792 -1055 360 937 -1555 -1081 -508 -557 387 -1040 2105 -96 894 813 -290
2875 -290 125 1149 939 588 434 -42 411 -1077 500 457 367 -1450 175 -875 123 -575 -634 544 31
2894 31 241 -453 -325 133 -808 485 361 264 -1193 112 -456 -396 776 -857 890 -1475 511 -530
2912 -530 -504 415 435 893 -422 -845 -225 -209 954 -242 157 -339 315 -703 -222 125 -50 1097 -1860
2931a860J879p12J85J352j883K003j555J150m0p59J43q19K242k676J437j028J368
2948D27m67j717J285M34o90M51K04o75O27M80r89N16l2K50J79r83M42m12L69J26
2968a75j74J55R49j924P18K2J251j306J170j155O53K8n46J057j462Q30K40q64
2986e33J011R54r53j431J349k97j421J351j990K370j888J160l62l28R07N7m9o56
3004g49J731p49r15J413j153J64O14j544J485o78M97K83Q47k317K067n24j187
3021g15R73j038J437k295J583k12n00N32M21K69k552K442r37Q49j62J907k090
3038h8K55o67J15P78n70r8O97k59rO05J69j103K6M34q48m37J787k063J755j977
3058a498J585l91j049J434M47m08R4j143J015K72m58m52K151k131K40J591k574
$$ plain form
2931 -1860 19 -693 -508 844 -1039 964 -591 559 519 -240 -97 -916 1326 -1350 87 -941 427
2948 427 -40 -1757 -472 -38 -728 -277 -73 -748 -121 359 -630 -114 -146 104 283 -700 -258 -670 -301 -175
2968 -175 -349 -194 755 -1169 -451 -429 822 -484 686 -469 184 212 -334 723 -739 91 331 -533
2986 -533 478 1432 479 -952 397 100 -1321 30 -1960 410 -1478 -318 -680 -1008 -101 -44 -93 -749
3004 -749 982 233 -682 731 -422 -258 356 -1188 297 -381 116 399 1246 -1071 996 472 -715
3021 -715 258 -780 657 -1638 -55 -267 -767 -235 186 455 -2097 345 -592 257 95 2002 -88
3038 -88 167 -500 -385 393 -177 -275 422 163 154 759 928 -175 -149 285 -563 -1000 787 -1276 479 -1498
3058 -1498 87 -304 -1353 81 528 120 214 -929 86 358 -100 -552 1599 -532 -292 1299 -1275
3075a275K125k018J265o53M32J366k637J844r16N88Q4k57J214j171J514k626J885
3092G64j191L67o91n65N71m26J424R22o67p12o30J967k030J349j747P96j29N71
3110e7M40j028j95R03p03J296j193N94q99J525q52M4P04k54L34j168L96j09k39
3129d61J311j194J167r57O72p23O24o6M31K12l15j406P46j34q7M89p68O88k63
3148c4o63L89p69O71L93p19J13K114j706L44r90J735j313M44k61k16J243L5o14
3167A96L74P47k505L41J721r91r31K723j515J104l279L163r71j127J492o17M78
3184D03k092J958m41l73k40J008Q33o31L35r28M94n37O40L97j257J651j715O54
3202A59p74N98K6q15J647r82k1J016j359R15l01L22j218J116m43M39O71q35J272
$$ plain form
3075 -1275 850 -1168 97 -556 -124 1242 -1395 449 -467 121 205 -52 1162 -9 1505 -1121 764
3092 764 -427 -60 -751 -1316 -745 -1171 253 1175 508 -204 -834 1133 -897 452 -1295 -499 -628 -57
3110 -57 383 -645 -840 63 -640 656 -537 57 -842 683 -169 -125 579 325 659 -509 -113 -222 -461
3129 -461 850 -344 823 -134 538 -185 439 373 804 1016 701 -705 41 -93 -180 309 -459 229 -34
3148 -34 -697 -308 -1077 -406 -13 -732 -619 1495 -211 133 -857 878 -435 9 -252 -468 775 810 196
3167 196 570 1317 -1188 -847 874 -117 -1048 1675 160 1264 -2015 1148 177 -950 542 -75 403
3184 403 -1689 269 -172 -545 -785 223 1056 425 760 -168 326 -211 429 826 -431 1220 -495 159
3202 159 -615 -17 9 -806 841 -141 -162 854 -505 410 109 431 -787 329 -114 325 996 161 1433
3221A433j716O80p37r53j04p0J363j9N63m84q36l99J913j486J376j107j65L06
3239d42M15J43K26j95R68O17l141K372j460M51k10K37O70m86m30J37o41J112j027
3258f84K11J148j299J588j919J342j043L97P29m73P5j011M84j084J786q89J524
3275H82o49j458K416j908J815j393N94p83P11M04q73R50j960K308j400n02K218
3292A372k202R46m76M35R85j885R60j265J275N00q68Q00o65R81o38K50k09q48
3310e52R81l03j39Q3L06j539J005j02k10J556k148J576j23l45r1o5J500J18j010
3329D98k33P26l70K36n0K2j827J412K93l15j563J347P01r13N33j535L122j701
3347C83rJ80p64J108j355J476j326O11J80r76l24L2K565k619P49J038k853K952
$$ plain form
3221 1433 -283 397 -340 -1293 -1397 -1467 -104 -123 440 -44 -880 -1279 634 -852 524 -583 -748 -442
3239 -442 -27 116 342 147 1115 1732 -1409 963 -497 -46 -256 -19 651 165 -265 -128 -769 343 -684
3258 -684 -473 675 -624 964 -955 387 -656 -259 470 -3 72 -939 -455 -1539 247 -642 882
3275 882 233 -1225 1191 -717 1098 -295 299 -484 227 631 -242 708 -1252 1056 -344 -846 1372
3292 1372 -830 116 -360 75 1060 -825 135 -1130 145 645 -223 577 -88 893 255 505 296 -552
3310 -552 429 126 -13 70 376 -1163 -158 -260 -470 1086 -1062 514 391 46 -45 -110 1390 1508 498
3329 498 265 991 621 857 807 829 -998 414 707 392 -1171 176 877 -36 497 -1038 2084 383
3347 383 374 554 -210 898 -457 1019 -307 304 484 -492 -816 -784 1781 -838 -89 949 -1904 1048
3365A048o41N44j52j03l03l11N95k90R43j795L75l37K52M07L83o64r7K35j004
3384i15R42M31j15J417j135M95l66j032j86l51J324r01N58p88P50K83k95J631
3402A747j341M79k156J347O93R4j128k45J412p84o76K55N79p04N02m95J569j082
3420F6N7o8K32l11M90L6j652N37P60k57L5q13J760j907J970j012O54p72p32K758
3440A831k266J803j902J78Q15l11m5l92M41R08j854J342j376J889j750K001j769
3457d57J96O92q39L48p9J508j912M68K90j639J022O09K28r13l52K235k128J928
3475A205k252K162j341J517N6j987K249j634J307j880M24P0r58L400j881M7K34
3492G38j189P00j387J606M09m6M96j359K39l16J04R55r0l52m82J222j46j888k75
$$ plain form
3365 1048 407 951 799 696 393 82 677 387 1330 -465 -90 -427 -175 232 615 -49 -146 89 -915
3384 -915 27 458 343 1760 625 1120 754 -278 -464 -815 509 -392 166 -622 128 411 116 1747
3402 1747 406 885 -1271 76 769 863 -265 -510 902 118 -558 -303 276 -428 74 -421 1148 66
3420 66 123 55 287 -24 466 502 -1150 -613 147 -110 -75 -888 872 -1035 935 -77 577 -195 -927 1831
3440 1831 -435 1368 -534 -356 459 148 103 -289 152 1060 -794 548 -828 1061 -689 1312 -457
3457 -457 -261 431 -408 -60 -139 1369 -543 -75 215 -1424 -402 207 435 -478 -830 1405 -723 1205
3475 1205 -1047 1115 -226 1291 1347 -640 1609 -25 1282 -598 -174 -104 -1062 2338 457 504 738
3492 738 -451 249 -1138 468 877 831 1327 -32 207 -109 -5 950 860 508 26 1248 1102 -786 -1061
3511a061M93J030j842O37N04M67O68k339K062p44j28Q28j368K211j518J49j825
3528a776K178n35J26P47j345J685q17k68l3P35L54j175J267j583Q0l31M49J004
3546G62n42r7j20M19j335L12R26q34J336j401q67J346L86J650k259M79k39O64
3564E86m32j212J885p50Q1j272J414Q01j105M13q40J104j598J480j273J469r63
3581b12j432K117j235n81K111pr54m14o1J304K73j248Q54k62J77m16J86O14o65
3600A49O25j035l46m04J025r28K14l78J062l86j83O00l62J226m50Q73j374L73
3618C01K56J02l8j209K570k387P15j06j265J994k370J322m60L57J070j771J714
3635G95j829J509j088M11J381k133J566j155J705j562N50k0j666L308k942K139
$$ plain form
3511 -1061 -568 462 -1380 -743 -239 228 896 -1443 619 -125 -253 575 -793 1418 -100 49 -1776
3528 -1776 402 -133 -7 740 -605 1080 263 -5 -38 697 1051 -124 1143 -440 -360 -691 -242 762
3546 762 220 123 3 422 -913 -601 325 -509 827 -574 -1441 -95 291 1941 -318 161 -78 586
3564 586 154 -1058 827 77 158 -1114 300 1101 -4 409 -431 673 -925 555 -718 751 -212
3581 -212 -1644 473 -762 -1343 768 761 -193 -607 -668 636 909 -339 515 253 430 14 200 814 149
3600 149 774 -261 -607 -1011 14 -914 -700 -1078 -16 -402 -585 15 -347 879 429 1302 -72 301
3618 301 557 659 621 -588 1982 -405 310 204 -1061 933 -1437 -115 -575 -218 852 -919 795
3635 795 -1034 475 -613 -202 1179 -954 612 -543 1162 -400 150 130 -1536 1772 -1170 969
3651I69j506J318l22j913J222n33J695j522p14J407o56J849j357P76k53j019L05
3668b54M96j114M05J043j010J352p21p88J96M46M31L79r98L0l21J14M20j279J045
3687a28o56R39j149N20J53R50O13j084L37l01l00J378j798N67n49J263j829M35
3705f39J171j590K578j681J729k372K316j826q4O02r88R20j58N15J332k378M98
3722e5j792L394j959L83n67J245L49k495K443o55R45l70k800K415k356J340j189
3739a724K151j13j278J130j470K327k507K433j432r48K503j910J409n45K0o35
3755e89J779j254p45O07o87J402j564M23J983k763K172r41Q43j563M91M48jq96
3773h55J026k12J531o52r77q59M88O20K6K96p64J80O84k279J916m34J191o07m26
$$ plain form
3651 969 -537 781 459 -1454 -232 -765 930 -592 -1306 101 -555 1294 -63 713 460 -559 -254
3668 -254 242 -872 -467 576 -434 918 197 -591 -395 51 482 861 -137 -107 -428 -314 106 -1173 -128
3687 -128 -784 155 -994 -474 -321 629 1242 158 495 194 -106 1272 -526 41 -508 755 -1074 -639
3705 -639 532 -1058 1520 -161 1568 -804 1512 -314 -398 204 -784 136 -22 493 1825 -553 -55
3722 -55 -1847 1547 -412 -29 -596 649 998 -1497 946 291 1236 866 -1934 481 -1875 -535 -1724
3739 -1724 427 314 -964 166 -1304 1023 -1484 949 -483 -1431 1072 -838 571 26 46 -589
3755 -589 1190 -64 -809 -202 -889 513 -1051 -628 1355 -1408 764 -177 666 -897 -406 42 41 -855
3773 -855 171 -41 1490 838 -139 -998 -510 110 136 432 -332 -152 532 -1747 169 -265 926 319 -107
3792a07J548j171P1p26L69k92R47o7k145J554r65K292j318M23O37j099R31p90
3810I2R49k229J673l79j258J083j295L430k139r03K411j748O08j209L139k798
3826e73R12O4r2j352N42O07r97P8J110r79q39J339O02j073Q93j173J110o17N49
3845A11N62j132J507j416J023M32j867J235j257L20L57m42j49O35n71O55j209
3862a206J554j857K295N50j872P1n30J099p48j28J954l13j89p70p69R85K39j639
3880a274J245K15k461J941O33L27q07K46K57mO28j903J198L79p79Q97q58M06o73
3899c87L30o85P98Q49j921J816q07J189o02n37j21J7J80l66J272j270L21J113
3917A189l68m74q00M54Q29k053J863k4J63k033K314r98p02K011j85n13j122K778
$$ plain form
3792 -107 1441 270 341 -385 -16 -308 639 572 -1573 -19 -984 1308 -10 413 1050 -49 882 92
3810 92 1041 -1188 485 106 -1152 -69 -1364 2066 -73 -976 1435 -313 295 -914 2225 -573
3826 -573 339 403 311 -1041 -499 108 -889 -811 299 -680 -1519 -180 422 -651 242 -931 179 -438 111
3845 111 673 -459 1048 -368 655 1087 -780 455 -802 -482 -125 -567 -716 -81 -652 3 -1206
3862 -1206 348 -1509 786 1336 -536 -465 -995 104 -644 -772 1182 869 680 -90 -859 126 365 -1274
3880 -1274 -29 186 -2275 -334 299 626 -181 65 322 318 946 -957 241 620 -159 738 -120 286 -387
3899 -387 -57 -742 56 905 -1016 800 -7 1182 580 43 -78 -61 119 -247 1025 -245 76 1189
3917 1189 821 347 -453 1 830 -1223 640 616 779 -1254 1060 62 -640 1371 1186 673 -449 2329
3935B329l173J110N16j971J409k75J223o72o13Q11l16L18P71j614M71o97M28o70
3953f15O62l75m71J455j88p64Q70o16p19l94J900k548J877O12j676R74j138L091
3971A937k309J290r59q78R67n96J070j986J562o9p32Q35k136J286j12J346m14
3988A02k86Q53k049K715k057k74L75N6J257p11K060k985J704k36j503J639q91
4005b31J394j793J609j245n77K244k649J207n17J997k195J95n1l32M34M11J886
4022A787k999J301l40q06J427p76N71q1k03Q46l70n03p00k97J142n78K64j87J102
4041F00j179P93M10j123J768m75n71N8l58J084j207J451j242j337K481j403J239
4058I89j150N97j26k38l42P0P57j859P62k10J939j508p84K095j709K48J478k21
$$ plain form
3935 2329 -844 266 782 -1189 220 -55 1168 496 -117 694 378 696 1467 -147 324 -373 55 -615
3953 -615 47 -328 -799 656 468 -296 574 -42 -761 -1155 745 -1803 74 686 -990 -16 -1154 1937
3971 1937 -372 918 -41 -919 48 -548 522 -1464 98 29 -703 132 -2004 -718 -830 516 102
3988 102 -184 669 -1380 1335 -722 -996 -621 -565 692 -19 2041 -944 760 524 -979 660 -231
4005 -231 1163 -630 979 -266 -843 1401 -1248 -41 -558 1439 -756 -561 -612 -944 -510 -99 1787
4022 1787 -1212 89 -251 -1057 370 -406 165 84 -119 727 357 -146 -846 -1143 -1 -579 -315 -502 600
4041 600 -579 214 624 -499 1269 794 223 281 -77 1007 -200 1251 9 -1328 1153 -250 989
4058 989 -161 436 310 72 -270 -200 557 -1302 -540 -750 1189 -319 -1103 992 -717 -469 1009 788
4076G88l53o89M33j426J812j874O61R59j694K182k049J349j097P55O04p62J815
4093A414j422J59O20j291P63j86l61OJ632j414j29J509j700Q10r41L10k89K76
4111b34Pj59J186p55j82q85J047R57m72R95j708rn02J284j193m7R35j003J407
4130F69m41o15P0o45J524o32m10J006j14r5N78j575L08N94J99l50M02j15j102
4149g44J031j1J00k150K666o67n06Q91j444J622k134L530k386L55m32j667L343
4166A397j651K274k861J403r18O49o12j131K489k562K358p39o57k43Q48P58j145
4183c43J783k130l62K153j798K102k600J130L9j315K084k163K821r26k49L6O08
4200H70j816P45O97p21M52J15o00J234k132J085q09N14K94j041O22P66J198m79
$$ plain form
4076 788 435 -254 179 -1247 565 -1309 -648 311 -1383 799 -1250 99 -998 -243 361 -401 1414
4093 1414 -8 151 771 -520 243 57 -304 -298 1334 -80 -209 1300 -400 410 -531 -221 -510 -234
4111 -234 -227 -386 800 45 -137 -1022 25 982 510 1505 -203 -212 -714 570 -623 -670 265 -738 669
4130 669 228 -387 -317 -962 562 -70 -480 526 412 317 895 -680 -372 222 421 71 473 358 -744
4149 -744 287 276 376 -1774 892 225 -281 610 -834 788 -1346 2184 -202 153 -279 -1946 1397
4166 1397 -254 2020 -841 562 -356 293 -319 -1450 1039 -1523 835 96 -561 -804 44 802 -343
4183 -343 1440 -690 -1052 1101 -697 1405 -1195 -65 -26 -1341 743 -1420 1401 475 226 262 870
4200 870 -946 -201 496 -225 227 342 -258 976 -1156 -71 -880 -366 -72 -1113 -491 275 1473 994
4218I94j886M93K21P7p1P78q72N94j095O91m9K24n35J880j280R50M24j034K36
4237G40r31l4O5M12q40J864q53m99R52j955R30j16M98q01j329K336p95J751j501
4256a06Q80j98j136J371j529J601j326L1K25k91R42n12J486j955J40J39k41O56
4274A77q39M79q90J396j84l80J558j732J536j662Q31m7q87J131n43O40K9j441
4292h28P32M01q85M27j56J462j737p29J600Q19j989J745j245M89J585k611N40
4309c80l47Q92N43ML00k57j182R24l48R42k090J609j947R11R89j88J73p18K11
4328D1j176J864j176Q09J05j228J525q19P69j884K667q11j766Q28m17Q49m64q27
4346a111J568j036R39j149O2K10O85n48j46J697k245J700m33J66J830j727o50
$$ plain form
4218 994 -892 -399 -178 -101 -172 606 -266 328 -767 -76 -125 99 -436 1444 164 1114 1538 504 740
4237 740 -191 -225 -160 252 -588 1276 423 -76 876 -1079 -149 -265 233 -568 -1897 439 -356 1395 -106
4256 -106 774 576 -560 811 -718 883 -443 -412 -187 -478 464 -48 1438 -517 -377 -238 -479 177
4274 177 -662 -183 -1073 323 139 -241 1317 -415 1121 -541 290 243 -644 487 -56 584 613 -828
4292 -828 -96 305 -580 -153 -309 1153 -584 -1313 287 1106 -883 862 -383 106 1691 -920 -380
4309 -380 -727 165 708 712 1012 755 -427 497 149 1091 -999 610 -1337 -426 563 375 548 -170 41
4328 41 -1135 729 -447 362 467 -761 764 -55 714 -1170 1497 686 -1080 -252 -669 180 -284 -1111
4346 -1111 457 -579 360 -789 -727 -517 168 -380 -526 1171 -1074 626 193 359 2189 462 -188
4363a88j583J190J18k0J111l58L21j142P7L65J74j06J90J178j700Q68M2j113R23
4382C47K89K13j197n47J290o77Q35j320J035j415K909k330L11j40L86N13M93j338
4400c43k41j84J46J083j794K261o22k42p56Q67n63M7o19J954k62n29J180j602
4418b19K84jj294J469n40O74J83o01M48j028N82L1k15J128n00J28k647L202k804
4437a720J808K19J07j41n68O6j35J399q18j57J66j134J175j515J815j085J141
4454F23J88j220J537j503J238j282J053j56L64p63j176J958r71K93P59j134J492
4471A300r15n05m26R27O0J55q54P86p33J148n59J052j734J321q66k91J64K08N84
4490H22q34K03L11r14l54R03J394n54j548J716n26j539O16O10j31m13O79l99l09
$$ plain form
4363 -188 -1771 -581 -463 -483 628 270 591 -551 -474 -109 65 -41 149 1327 -373 495 537 -576 347
4382 347 636 849 -348 -895 395 -282 553 -767 268 -1147 1762 -568 -257 -397 -11 502 995 -343
4400 -343 -584 -768 -622 461 -1333 928 306 64 -692 175 -388 -341 -960 994 732 203 1383 -219
4418 -219 65 64 -1230 239 -301 373 556 -45 403 -625 -43 -12 -227 901 401 529 -2118 1084 -1720
4437 -1720 88 307 414 273 -295 -229 -364 1035 217 60 226 -908 267 -1248 567 -518 623
4454 623 811 -409 1128 -375 863 -419 634 478 842 79 -1097 861 -110 183 942 -192 1300
4471 1300 385 -120 -546 381 441 596 -258 528 -205 943 384 1436 -298 1023 157 -134 30 238 822
4490 822 -12 191 502 -412 -766 137 1531 977 -571 1145 619 -920 -304 306 175 -238 441 42 -267
4509b67j016Q79j11j43O33j99P73j292O49P29r34N83j630J482K19N60j01j375
4527e61J013r38R16j593K408j993M08J275k348K149q85J347j186M51M06j494J141
4544E16l20M62m78N44j190N61Q71j341J548l345K772j081J92R91j782J969m48
4561D41m47L57R49j667j276J000K69J476j274J659j549p35P10r27J902j227m59
4578g98J193j566J973k80o89l88N60J91K41j405L70O57n57p31J177o04M46L00
4596I0j811J933k006K893R17k493J695j329J786k377o57J913j655K456j381O88
4612F62r66N20l95O34M39k465K366j266J90L24m91K430j978J194j126L32j449
4629a045J691L94j280J529j624P99j53j623J627n93n53J258j965J117O77K18j160
$$ plain form
4509 -267 -1283 -404 -515 -658 -25 -224 549 -743 -94 635 -299 284 -1346 136 355 915 814 -561
4527 -561 452 -486 430 -1163 1245 -748 -340 935 -1413 736 -149 1198 12 463 869 -625 516
4544 516 196 658 180 724 -466 95 966 -375 1173 -2172 600 -481 -289 702 -1080 889 441
4561 441 -6 351 1300 -367 -1643 -643 -374 1102 -172 1487 -62 -797 -87 -1014 888 -339 -798
4578 -798 395 -1171 802 522 -167 -555 5 196 437 -968 -598 59 -498 -1229 -52 -656 -210 90
4596 90 -1721 212 -1794 1099 2016 -477 1218 -111 1675 -702 -1359 554 -1101 1355 -26 662
4612 662 -304 216 -179 455 894 -1571 795 -471 -281 43 -448 1982 4 1198 72 404 -1045
4629 -1045 646 1040 -240 1289 -335 464 311 -1312 315 -278 -831 427 -1538 -421 256 474 -686
4646f86J881j317j23o75J243J23j060J270j719Q51J7n16J712j2j202L18r28O75
4664a48K68q13P09O77q63k07Q86n32L46k80j188J764j908J419q57L59J009K45
4682H86m49k91N05j957K104n76n07K103j433Q99l230J827J22o25q3m72J439j180
4700i18K207j637J210n74k64R5K95j115O57j003J107N79q70k46q3K015j702J272
4718A025j364J616k625K334M62r97R43j856O43j324K377r55o1M14q34j40l32N77
4736i7M78k284K065j86j89R89o13n56K27O66n70m4k17O27r3k95J8j163K229j937
4756i45L72K088j213j073J54J018M79r81O59p13K38j355J005P44k368K635o67
4773G7L42N00j490P97r11J628j734K63M71o62J636k482J790o09K64k88j202K092
$$ plain form
4646 -686 1195 -122 -245 -920 323 446 -614 656 -1063 -212 -195 -711 1001 989 -213 105 -823 -148
4664 -148 120 -693 16 693 -170 -377 509 -23 323 43 -1145 619 -1289 130 -727 -368 641 886
4682 886 437 146 651 -1306 798 222 -285 1818 385 1284 -1946 -119 3 -622 -705 -1177 262 -918
4700 -918 1289 -348 862 288 24 119 414 -701 -44 -1047 60 639 -231 -477 -560 1455 -247 1025
4718 1025 -339 1277 -1348 986 1448 451 1394 -462 181 -1143 1234 279 218 632 -202 -342 -674 -97
4736 -97 381 -1903 162 -24 -213 776 163 -393 -166 500 -70 -114 -331 296 203 -92 -74 -1237 992 -945
4756 -945 -573 1515 302 -771 -617 401 880 -101 558 -155 83 -1272 -267 477 -1891 744 77
4773 77 419 919 -571 226 -685 943 -791 -528 -57 -719 917 -1565 225 -384 -120 -408 -1610 482
4791D82j052J394j155O65M21j587P76n89J988k362K248j004j037J582j934J931
4807G67k016M63J189k95o31J245j734N15J476l89j160m24O49L99j336J332k66
4824b16J18o9K0J060p02l02L40p70p9j23Q37O2P03p37P99q60M5R01j277Q01k34
4845C17l40m89J950N6j850L22j275J107N82j559K70J176r1N8r36K535j039m12
4863C82m82q95J500m50q28J28j33J046n24NL61Q7K05q41P43q13J786j951J019
4882C45l8L98n0j804R73o31J494r58l78K13p74J463m62l8o0M41O12k097K361j264
4902b54J251j165R18n39j084J360j121O31P63m27k07k37K26j327J257L6l43J193
4920I31p44J470k130Q77m48l65P70j365O66n36Q26M69l99R63j368K783r70j311
$$ plain form
4791 482 -570 824 -331 334 755 -832 -56 -645 1343 -1019 1229 225 -812 770 -1164 767
4807 767 -1249 -786 403 108 -523 722 -1012 -497 979 590 -570 -994 -345 54 -1282 50 -216
4824 -216 -98 -167 -147 913 211 -91 249 -521 -600 -723 114 176 879 142 941 81 126 1027 -250 551 317
4845 317 -23 -512 1438 1494 -356 -34 -1309 -202 380 -1179 -909 267 176 234 -702 1833 794 382
4863 382 -100 -995 505 55 -773 -645 -778 268 -256 -251 110 197 402 -439 304 -509 1277 -674 345
4882 345 307 705 655 -1149 -176 -807 687 -271 -649 -436 -1210 253 -209 -247 -307 134 746 -1351 1010 -254
4902 -254 997 -168 750 211 -873 487 -634 -3 760 333 126 -111 115 -1212 45 81 -262 931
4920 931 187 1657 -473 404 -44 -409 361 -1004 -338 -874 -48 421 22 985 -383 2400 1430 119
4938A19k21J47N09j209P50r30J354o99n99J183J41l68q76n29J771J55k37j52q14
4957e05N75l09J74l4J538j368n16N52r11J103j157J719j593K025k62j645M78K57
4975A21M53k066J100J45k28J533j747J049o63k13Q86k39K29j04L25n21j0K53q37
4994e34Q28P58j009m12r78J205k7J060j803J132M89q44k81J463j074O2J259j724
5012d30j62J268j413J832n21l17J003j421O28o08n99j77O2K905k492K85R30o83
5030I0j64N45n73k62k31L20P28PK14j134J69K72P00j94q55N04k53j167J723j640
5050a201J737l57q50J541o10M34l76k007L039j948M29l62N85K38q74K50M36N05
5068F09j079P37k47O48m96l64K341k193N91j078L4J139j324K370j474Q83j088
$$ plain form
4938 119 -102 45 554 -655 95 -835 519 -180 -779 404 545 177 -699 -1228 543 698 461 309 -505
4957 -505 70 -239 -65 -99 1439 71 -445 107 -804 299 -858 861 -732 1293 1031 -614 -136 121
4975 121 574 -1492 -392 -247 -475 1058 -689 360 -303 -516 370 131 360 256 581 60 50 303 -534
4994 -534 294 1052 43 -369 -1347 -142 -169 891 -912 220 709 -135 -416 1047 -27 35 1294 -430
5012 -430 -592 676 -737 1095 574 257 1260 -161 467 -141 -740 -917 -855 2050 -442 -157 773 90
5030 90 -74 471 -102 -364 -595 -275 453 460 674 -460 -291 -19 681 487 -368 136 -117 -1284 439 -1201
5050 -1201 536 179 -671 870 260 694 318 -1689 1350 -598 -169 -531 54 292 -582 -332 104 609
5068 609 -470 267 20 668 172 -192 2149 -44 547 -531 -497 642 -682 1688 214 1097 9
5085IL67L76j062K74r56N87J164j328N86p68N14p19Q85O23k29k91O30p88n94J536
5105H16j88j591R78K59O72j162J20p33m62J792l83M79j889J358J251j331M74P60
5123A220M22k074J459M60q91l06p78j76J560j646N45n06J272k003J837J49k634
5140b090J593J39R86j621K453k311N57J033j353J947k294K3J220j873L050k674
5156a215K250j397J9K106j850m2j120J362K69q22l70K057k8k132P68j03M97p80
5174e31K42L39j79N99p71N96N6p8o66n27J604j89j34M23j25k40j463J446j37L17
5194E82o35o32J253l58m34J09J323o27m57L3l3N14o49p35P88M9j004O60j86J022
5214E83j368J123j173Q09L56M1J251j584j058P3J185p5R1j06k35N98o71Q36q92
$$ plain form
5085 9 376 752 -310 -36 -992 -405 759 -569 17 -751 -237 -956 -71 552 323 32 662 -126 -720 816
5105 816 628 -963 15 274 946 -216 -96 -829 -1291 501 118 597 -1292 66 1317 -14 460 1220
5123 1220 1642 -432 1027 1487 596 290 -488 -664 896 -750 -205 -711 561 -1442 395 544 -2090
5140 -2090 -497 -358 628 -993 1460 -851 -294 739 -614 1333 -961 -938 282 -1591 1459 -1215
5156 -1215 1035 -362 -343 1763 -87 -129 -1249 113 382 -440 -810 1247 1219 -913 -145 -248 249 -531
5174 -531 -289 50 -129 470 -301 295 351 273 -393 -920 684 495 361 784 659 419 -1044 402 265 582
5194 582 -53 -685 568 210 -224 -115 1208 581 124 157 124 638 -11 -746 42 91 -913 -253 -439 583
5214 583 -785 338 -835 -26 330 371 1622 38 -1020 -947 238 163 254 148 -87 511 -160 676 -216
5233b16l34J065j297J130j546O86P65j192J425j670J890r44Q32L76o43O12j477
5250e38p7N92m7q53p4J260j063K210k432J535j35j870K259j281K081k128J49L44
5268f8N46p28p62Q13r57J812r09q99J137j351J920p49K58N75p59q11J245J170
5286A483k011J54R04o28O9J363k150n65J504J105k331R11L38n59K7q02J028M56
5304B96j747K001j245k29L05J407j221P24J283j304j02j41P09k76k4l96q13K434
5322A661k341J866k534M59J287j929J707j210J665j477K172n73k070J923m80L34
5338D60K07j315m91K41J955j30P54j199l15o72J8J964k061J106p16N06m33K15
5356I4K32j45J258k342K077j369L7L12o96J756k644K334p46n21J332j100K75q22
$$ plain form
5233 -216 -550 515 -782 348 -1198 -512 253 -939 486 -1184 706 -238 594 970 327 939 -538
5250 -538 -615 -23 -70 -923 -997 263 -800 1410 -1022 513 378 -1492 767 -514 1567 -561 -412 -68
5268 -68 478 -250 -1012 -199 -1156 656 -253 -1152 -15 -1366 554 -195 63 638 -121 -932 313 1483
5286 1483 -528 -374 530 -98 -29 1334 -816 -1381 123 1228 -1103 -192 146 -413 -386 -1188 -160 296
5304 296 -1451 550 -695 -924 -619 788 -433 291 1574 270 168 27 736 460 436 40 -773 1661
5322 1661 -680 1186 -1348 -889 398 -1531 176 -1034 631 -846 1326 753 -1317 606 126 460
5338 460 667 -648 -1139 -898 1057 927 1681 482 167 -505 -487 1477 -584 522 -194 312 -121 94
5356 94 326 181 1439 -903 1174 -195 -158 154 -542 1214 -1430 904 158 -363 969 -131 144 -678
5374f78K548j578m8M60l25j48o55O47k60j50J127R75j834j535N82J114L3P40m52
5393E63J55j185J408k176R45P17k97k43j42R1M70Q68r12J293j205M99k285J478
5411D2p51J120J57j405R15n79J155j023O87l10p50O81j856K150o12J248k084J582
5429C67P29k327M01j478J112r7J668J128j280o14N61p36J202j162M74j122J860
5446F86r18N52l95r06N68o62J05M96J836j588l90N74j84P05m55q2m74J344j020
5465b08M52Pq35J117j658M01K64J55J418o43L99n22j501J537k35K61R15j329p52
5484g57L68N07o60M47K66j026K425k121M74L89j638J448j499J667n89K021k371
5501f49k9K372j349L78k392K773r22O5K78j227J833k209O40j048R88J241o09m26
$$ plain form
5374 -678 1870 292 244 704 379 231 -424 223 -37 -187 940 1915 81 -1454 -872 242 275 1015 563
5393 563 718 -467 941 -1235 -290 427 130 -113 -255 -164 306 1174 262 1555 350 849 -1436 42
5411 42 -709 411 568 -837 78 -501 654 -369 318 8 -742 -61 -1917 233 -379 869 -1215 367
5429 367 1096 -1231 -830 -2308 -1196 -1293 375 1503 223 -391 170 -566 636 -526 -52 -1174 686
5446 686 -232 320 -75 -981 -413 -1075 -970 -474 1362 -226 -616 -42 -226 479 24 -58 -532 812 -208
5465 -208 244 251 -584 533 -1125 -724 -460 -305 1113 470 869 347 -1154 383 148 409 1324 -5 -757
5484 -757 -389 118 -542 -95 171 -855 1570 -551 -77 312 -1326 122 -1377 290 -299 1722 -649
5501 -649 -678 1694 345 723 -1669 1104 182 247 525 -702 1131 -1078 -438 -1486 -498 743 134 -292
5519b92q1J148O5m23j794J02K478j577p38K07R00N7j443K884j772K14l13K22Q35
5538F79j747K641j401P93j353L01m75L21L73q44R12m79o62J354j424K439m42l2
5556I54l07K1o24Q4R25q41l3J68l15J308j272o1m9P34n38L76q04K48j192J716
5576D98J08p48p30J945j822Q20L04l68N98j436Q44j805J439M38j541J840n14R30
5594H00J18k170J271r24J827l44j506j286J715m80n73L662k800J116k44p19J04
5611d33l95J786r36J43j71k03M61p83J096j231Q01j088L91M95l29J093j446O69
5629h0q53N30J829j551M12R59o92q8m59j31Q49o71m25k28n60M27R1Q94O33j898
5649a012j06k3l32K202o76J478j417p08J592j407Q67j206J18O43o68L120k024
$$ plain form
5519 -292 -373 775 840 417 -1377 -1275 1203 -374 -1112 -905 -5 52 -1391 1493 -279 -65 -378 -156 679
5538 679 -1068 1573 172 965 -388 -87 -562 -241 132 -712 200 -279 -941 413 -1011 1428 986 954
5556 954 647 668 44 128 1053 212 179 347 32 1340 68 7 -42 692 154 530 -274 -26 -1218 498
5576 498 606 -142 -872 1073 -749 71 375 7 605 -831 13 -1792 -353 85 -1456 384 -130 800
5594 800 918 -1252 19 -905 922 578 -928 -2214 -499 -979 -1552 2110 -690 426 182 -537 -433
5611 -433 -828 958 22 165 -6 -209 252 -531 565 -666 135 -953 -562 -67 -396 697 -749 -80
5629 -80 -933 -403 1426 -125 287 1246 554 466 7 -124 725 54 -371 -599 -1159 -732 -641 253 886 -1012
5649 -1012 -1118 -1141 -1473 729 53 1531 114 -594 998 -409 458 -748 -630 13 -655 2465 441
5666D41l43N54m33M5M59j44r08Q08j578K383j374kQ40r47K74r22J316L00r55K048
5686A862k286J196j164o03J460L38q39k36J275k180J46J988j939J771p44M67r09
5703c97J026j153K77R74p74J139j495N47j53j02J166j486J73J04J914j248j090
5720e78P80J69P76r09r94J318m78o23L85n8r04Q08J91J0j68k46K42M47R3p70M25
5741h4N81l75k55L09O05j068L87q9L65o41P96l24J64L6m02l58l53P57L06k38m12
5762b93N79l71O42K90j243J638j780k53K14Q93M64j131J094k90O94J28k286J609
5780E98j448J876k687J296N99M6P01k375J919o53p47O52J72L41j296K152j693
5797e47J711q18J01Q02k352J115n31J171j850J239J550j513M14r95L0M57M93n45
$$ plain form
5666 441 98 652 219 264 723 579 -329 479 -1099 1284 -90 -92 748 -199 75 -847 469 769 -186 1862
5686 1862 -424 772 -392 -995 465 803 -36 -272 1003 -1177 -1031 957 -982 789 45 512 -397
5703 -397 629 -524 -247 727 -47 1092 -403 144 -9 -111 1055 -431 -258 -154 1760 512 -578
5720 -578 202 371 1147 238 -756 562 84 -539 -154 -212 -1116 -308 -117 -107 -275 -521 -279 168 261 -509 -84
5741 -84 497 122 -133 176 781 -287 100 11 376 -265 531 207 371 407 5 -353 -706 51 357 119 -293
5762 -293 286 -85 557 847 -396 1242 -538 -791 -577 316 780 -351 743 453 1147 1275 -1011 598
5780 598 -850 1026 -1661 -365 234 280 981 -1394 525 -128 -875 -223 -51 290 -1006 1146 -547
5797 -547 1164 346 447 1249 -1103 12 -519 652 -1198 41 1591 78 492 -503 -473 -16 477 -68
5815f8j042K277j235J82k76n33K360j038n51j28L14n18L49k21r91Q07M99l12N02
5834C77K70k09r54J279n58n22m74O37j21J9l6j32p11J992j224Q41J03l83M99j806
5854a113J660J09j02n06o82O94n53J198n56o17J09o43K059k047K652j992rq67
5872a206J633J936l070K813l359P66J252o65J303k653L491k703N39O78j622J80
5888f87k68K09Q26j19M04p80j41m2J977j871K371j271j416K340k979J642R34N40
5906A669j168j15m53j195K361j185J470j179l2Q86j095O08m74q09J455j218m47
5923i21O75O4n65M19Q23j202L31J23P24l99J38M04o37j61P92k83k17j463K420
5942A065j346R18N67k317J504j051J721j608J542j758P32j19m17J602j516J545
$$ plain form
5815 -68 -1110 1167 -68 114 -162 -695 1665 627 76 -52 262 -256 93 -128 -1119 -312 187 -125 377
5834 377 647 438 -516 763 205 -317 -791 -154 -275 -256 -292 -424 -1135 857 -367 474 577 194 693 -1113
5854 -1113 547 656 554 48 -634 60 -493 705 149 -468 -359 -1002 1057 -990 1662 -330 -339 -1206
5872 -1206 427 2363 -707 2106 -1253 -487 765 100 1403 -1250 2241 -462 77 755 -867 -687
5888 -687 -955 -746 80 -39 365 -415 -556 -598 1379 -492 1879 608 -808 1532 -1447 195 1129 1669
5906 1669 501 386 -67 -1262 1099 -86 1384 205 173 1059 -36 572 98 -711 744 -474 -921
5923 -921 -246 -182 -747 -328 495 -707 -376 -253 471 72 210 614 -23 -184 608 325 108 -1355 1065
5942 1065 -281 637 1204 -1113 391 -660 1061 -547 995 -763 -31 -150 -567 1035 -481 1064
5958A064p61m17M93j348K769k141n67J180K35J067k531J193j951K619j69j250
5974e15M11j170J616j145R98mo17J376k082K081j697K084k029J526j320J03M48
5991F4j624K114j109N54P04k131J372n56K292l155J773J49o81j349J092J516j235
6008b10K84j70K89J64l26j632J056j27J11M3J38M88J93R17k343J159o4j121J549
6027C98j620K118k96j146l27J063p73J57J95L90k63r57J443N08j683J518p21J196
6045A200l49j003J52L26J560l374K950j924n00J666j809K101j378N84p63M23O94
6062E56p33Q51k629K509m65J65J30l44Q25j218J399j043J511j481J6p93o66R92
6080d18J541j64k227J418l16r35J932j965K799j900o02J62L2J910j256K63o55
$$ plain form
5958 1064 303 -114 379 -969 1800 -341 -908 272 507 1574 -957 236 -1715 904 735 -515
5974 -515 -104 -1274 342 -803 195 191 -426 950 -1132 949 -748 1336 -693 833 -487 -384 64
5991 64 -1560 554 -555 -1 703 -1428 -56 -612 1680 -1475 298 447 -234 -1583 -491 1025 -210
6008 -210 74 -96 193 357 31 -1601 -545 -672 -561 -518 -380 108 301 1218 -1125 34 -30 -1151 398
6027 398 -1222 896 600 -546 -873 190 -583 -426 -231 159 -104 -1061 382 890 -793 725 4 1200
6045 1200 851 -152 0 326 1886 -1488 1462 -462 -962 704 -1105 996 -382 202 -561 -138 556
6062 556 -177 674 -1955 554 89 254 384 40 865 -353 1046 3 1514 33 49 -744 -1410 -418
6080 -418 1123 959 -1268 150 -166 -1101 831 -1134 1665 -235 -837 -675 -643 1267 11 274 -381
6097c81J665m8j355J159j076M52l50K82N46n35n26m11N22N05r07L97N51r09Q99
6116D80j399O03J759l69k150J419j52o28J286r05n16J345k315J942k510K394m17
6133a33rO92k484K257o88L59Q2r07R95M8M85k588K749k058J706P10q31O04j401
6152d12Q72n20j3J225j440l86J269m68j023J658o91L76M43k056K581j351J411
6169A475l366J658J027l06l73j218K74R74L08r28Q66K7k56J03k43j39l08N05Q84
6188I64j109k8K11J70m45m12J077j47N87k25j207J32J072j755J525p38K47o60
6206g41L76K31J40O29k297K533k565K107n57j75J197j53j64j165J266j374J6J586
6224H90k629K174o20J321j441N39J54j872K720k295J563k243L611j208j644K186
$$ plain form
6097 -381 1284 1236 -119 1040 -36 416 66 348 894 359 -167 -578 -56 449 -458 -61 490 -419 480
6116 480 -919 -316 1443 1074 -1076 343 191 -437 849 -56 -572 773 -1542 400 -2110 284 -133
6133 -133 -142 550 -1934 323 -365 -6 76 -831 164 212 697 -1891 858 -1200 506 1216 385 989 -412
6152 -412 460 -60 -73 1152 -288 -674 595 127 -896 762 71 447 890 -1166 1415 64 1475
6169 1475 -1891 -233 794 488 115 -1103 -829 145 453 -475 391 418 162 265 22 -117 -425 80 964
6188 964 -145 -173 38 208 -237 -649 428 281 868 643 -564 -432 640 -1115 410 -328 -81 -741
6206 -741 -365 -134 6 635 -1662 871 -1694 413 -144 -319 878 725 561 -604 662 -712 -696 890
6224 890 -1739 435 -185 1136 -305 234 388 -1484 1236 -1059 504 -1739 1872 664 -980 1206
6240A206j323J148j831P5P4L91K17o40L44Q40m71J378j977R04o35Q88j268L41
6258c39j54j128K098o62j11j24K08R62j556K113k927K480q62P81q13q98M04n95
6276a123K235p36q24Q91p71R31l28j047J325j055l05J255K57n34p54J26N05M83
6294E31n93k48O17p02K527l212P91P12j206J269p71L11q09J915r49Ok37m64J986
6313A474j851Q95n22j93N31n55Q90l53n73L00r0J731j858J019l06Q9j502K79q90
6332a485J399P41j580Q70K55j303P75L60J171j857J589j314j02m61J73K585k048
6349b32J211j707M30j5J34J021j908J592M64n09m50o66J59j7N87n46M07j50n67
6368g62J235r0l22J45p08J455l66j590M62n39J375j93N95K81p85r5M22l41j110
$$ plain form
6240 1206 -117 1031 -800 -725 -651 -260 -43 -683 -339 501 30 1408 -569 335 -300 588 -680 -339
6258 -339 -493 -1621 477 -185 -296 -420 -212 750 -806 1307 -1620 860 -2 779 -34 -932 -528 -1123
6276 -1123 1112 376 -448 443 -328 603 275 -772 553 -502 -807 448 705 171 -583 -457 48 531
6294 531 -62 -310 307 -395 2132 -1080 -289 423 -783 486 -285 26 -783 1132 183 189 -48 -512 1474
6313 1474 -377 518 -4 -197 334 -221 669 316 -257 43 -47 1684 -174 845 539 628 -874 -595 -1485
6332 -1485 -86 655 -925 -55 200 -1103 -328 32 1203 -654 935 -379 -481 -942 -769 1816 -232
6349 -232 979 -728 -298 -313 -179 842 -1066 526 990 481 31 -635 -476 -493 94 -452 -45 -195 -762
6368 -762 473 383 61 206 -502 953 587 -1003 -541 -1080 295 102 697 978 193 98 520 179 -931
6387i31R25o30K140o73k090K407j375R68k74o19J125o74L17k47R31j936K24R15
6405E03q58J282k482J851j568L47J889k035J316k090K767q13m11N82o6j331M29
6422f88J194q46J25P80k093K797k398J807j484J785r78n98J370j261O31N9n35
6439c33j300J450J022o27j029P98k88J556k065J493K43k091j42K976j527n10O38
6456B64L47j950J499J76m88o17Q47K97j869R52K20K72m67J916o19j508P0L54P85
6475D81j59n34J126k89o85o28P99q17M10R5j19q19o7J286l66q57J590j988J359
6494a82j031J521q84L19J585k859K656j364O97o43O33m5J35L53j469Q69j343P88
6512b64J35q21J739j057J070j198m48O95J12K59j142Q57J06J252m95j137J057
$$ plain form
6387 -931 -6 -636 1504 831 -1259 1148 -227 741 467 -152 973 299 616 369 1300 -636 -412 503
6405 503 -355 927 -1555 296 -1272 -925 964 -1071 245 -1845 922 109 -302 280 214 -1117 -688
6422 -688 506 -340 -215 565 -1528 1269 -1129 678 -806 979 1 -597 773 -488 143 202 -333
6439 -333 -1633 -183 839 212 -817 -19 -307 1249 -816 677 920 -1171 -1313 1663 136 -374 264
6456 264 611 -1339 160 336 -152 -769 78 375 -1494 -542 -322 -50 -517 1399 780 -728 -658 -304 481
6475 481 322 -212 914 625 -60 -688 111 -706 -296 -201 -320 -1139 -1206 80 -286 -1143 447 -1541 -182
6494 -182 -1213 308 -576 -257 1328 -1531 1125 -239 458 -185 448 403 538 891 -578 291 -1052 -264
6512 -264 -129 -950 789 -268 802 -396 -844 -149 -37 222 -920 -63 43 1295 800 -337 720
6529G20r63J48n96K75P04q7N18j518L4M75R06l65Q3J527k773J175L3j111p1R47
6549F1O73j399R72j8n96M41j137n46J178l89R00K98K83j120L03J075j799P73M2
6568eJ599j44j036l24j193J383q61L55P68k3n85q77J770k647J567J91K02m50p70
6587a080J473j287K115j376P85l06j986J591r56O13q8K84j80N54J4j542K615k057
6605h14J834j238j224K566k150J492n51J428j186M83P71k122J371n83r2N82q15
6622b48O64n92R69J46p40M97l87K544l633J869o44j538J166K23P31j653Q40r41
6640g27J284J37o43k49O54n95P29p79k19j049J278O27o4J61J25R22j830m87N79
6659a46L36j88k23J319j124L13P6n4j7j806K822k099M13K10k98M54q99R53k46
$$ plain form
6529 720 -243 -95 -691 -416 288 201 719 -799 -765 -290 616 251 334 1861 -912 263 296 -815 -886 61
6549 61 734 -665 307 289 -307 134 -1003 -1549 -371 -760 140 438 721 -399 -96 979 -820 -47 -5
6568 -5 1594 1450 414 90 -1103 280 -581 -226 542 519 -66 -943 827 -1820 -253 -62 140 -310 -1080
6587 -1080 393 -894 1221 -155 630 324 -1662 -71 -1027 -414 -502 -218 -398 156 170 -1372 1243 -814
6605 -814 1020 -218 -1442 1124 -1026 466 -85 1343 157 640 1411 -711 660 77 -15 567 -248
6622 -248 416 -176 793 939 199 696 309 2853 -780 1089 445 -1093 73 296 1027 -626 214 -727
6640 -727 557 694 51 -198 456 -139 590 -189 -408 -1457 -179 448 384 545 670 1592 -238 -725 -146
6659 -146 190 2 -221 1098 -26 287 363 309 292 -1514 1308 -791 -378 -168 -466 -12 -911 42 -204
6678b04J003q14N64P02j121o92K72J852k097k43J531j344J356j21l46l02j117
6695a121K636k921J815R17o26O21r32M41o62J909k306J599m49j101R9j012K009
6712I16r92j81J336p99p6l6j62n01O26r97Q75k29O82J30N90k83j972J691j090
6731d72l61k61J483K84r65M19m87P05q39J557m45j01k03n11J94J046J90j526J464
6750A171r22m81P12l26O25j976J953j487J344j538N21J324j577J221r83Q42M97
6767I20j834Q11m23J496j043N11j32o44O50r18J125m44J271j932J099j74j37J128
6785A330k021M98Q14L36j50j163J739k503J112r3n55P02j180K138j316k63k16
6802g91K694j715k117K587j619J289m79Q4J29j252J434J8l60j361J965J16j035
$$ plain form
6678 -204 799 -15 549 1251 130 -562 -290 1562 -535 -778 753 -591 765 644 298 -4 -1121
6695 -1121 1515 -1406 409 1326 700 1321 389 830 168 2077 -229 1370 921 -180 -81 -1093 916
6712 916 -76 -257 1079 280 204 168 6 -495 131 -866 9 -220 462 592 1182 899 -1073 618 -472
6731 -472 -833 -1094 389 673 -292 127 -360 345 -494 1063 618 517 314 -197 -3 1043 1233 -293 1171
6750 1171 249 -232 480 154 779 -1197 756 -731 613 -925 -404 920 -657 564 -419 423 920
6767 920 -914 -103 -526 970 -73 438 306 -338 312 -606 519 75 1346 -586 513 339 202 1330
6785 1330 -691 -193 621 957 807 -356 1383 -1120 -8 -101 -656 46 -1134 1004 -312 -575 -791
6802 -791 1903 188 -1929 658 -961 328 -151 -67 62 -1190 244 262 -98 -1459 506 622 -413
6819d13K11L68m89L41J09R97j806M93o1J8J120j472l56O89L0M31j409J691J06
6838E98j035R58J45k10j834K146p78L96o92j291K405j042P42j292J262j712J663
6855D29K62j692K669k271K189j439r24K231k678K185k008N57r5k44J994j980Q43
6872B8o09K98j352K031K45j748K359j809J295j502R48P57j705J852r24M71J55
6889G90r76m01O88J341k265K063j769L24Q71q10L84m18J348j91L37j766m72k51
6907a173p42J292m09R94P67r08N92p52J002k66j305J289n39Q17r99l55N8j66O80
6926a23p08J366n92k41J589j086Q89j756M22J004q01nj341L218k030O40r22m83
6944i60R23j389J648j293J105R14k177J515o03J487l41j407q1Q81J849j910J413
$$ plain form
6819 -413 -202 166 -323 18 127 1124 -682 -189 -250 -232 888 -584 -940 -251 -221 210 -1199 492 598
6838 598 -437 521 666 456 -1378 768 -10 386 -306 -1597 808 -234 508 -784 478 -1234 429
6855 429 691 -1001 1668 -603 1586 147 -777 1454 -1224 961 -1047 -490 -585 -829 1165 -815 28
6872 28 -581 -283 -1635 396 641 -1107 1252 -557 738 -764 184 941 -764 1088 164 635 790
6889 790 -186 -587 101 1442 -823 1240 -529 -205 666 -144 240 -178 1170 979 1316 -450 -922 -1173
6907 -1173 -1915 -623 -1032 -38 729 -179 413 -339 663 397 -908 381 -158 659 -340 -695 -637 -803 -123
6926 -123 -831 535 -57 -298 1291 205 1094 -662 -240 764 -37 -42 -1383 1835 -195 445 -477 -960
6944 -960 -37 -1426 222 -1071 34 948 -1229 286 -317 1170 829 -578 -659 222 2071 161 1574
6961A574k212J38O70M08K47j083L61n63J7Q42j999K204j324n3J904j423q14J086
6979b0M40j019K73R52p16K9r92J728p53K99j45q50J302j25m63j027L47J329M75
6998A064p74o54l60J938k434J250O1r50L32k87J060k24r6P3J191n17l87j261l99
7017a374K597k187Q56J523j768J05n14J798j160J267j373o9J99O14Q30j420k48
7034c24M45n01O38j620K749j847p53J784k03N4j079J750k491K785k086P54N90
7051F45j669J829j422O36p21R85O06M7P81k349J517j106P79M31k727K025j895
7068a608K048k05r34J294j007j17l4P8N44m24l10Q75L21j733O90j03P37J07q94
7087f75J606p77M43j177P83N17J04J74J32j043p51M92J383j351J133l63k75K21
$$ plain form
6961 1574 -638 -500 170 578 825 -258 103 -460 -443 399 -1600 604 -720 -773 1131 -292 -1106 -20
6979 -20 420 -599 -326 626 -90 -61 -1053 675 -78 221 76 -774 528 403 -60 -1087 -740 589 1064
6998 1064 290 -364 -724 1214 -1220 30 91 -859 -527 -814 246 22 -74 -1 1190 673 286 -975 -1374
7017 -1374 1223 -964 -108 1415 -353 -248 -762 1036 -124 1143 -230 -299 -100 514 1344 -76 -324
7034 -324 121 -380 258 -1362 1387 -460 -1213 571 368 422 -657 1093 -1398 1387 -699 55 645
7051 645 -1024 805 -617 19 -702 283 889 936 1717 -632 885 -221 558 989 -1738 287 -1608
7068 -1608 440 235 -699 595 -412 -529 -563 -485 59 -365 -675 200 521 -1212 -522 -625 112 219 -675
7087 -675 931 154 597 -580 203 720 824 998 1130 87 -664 -172 1211 -140 993 630 355 576
7105E76j209Q71j005J503j308m22J33K19K353j224j486J415l40N83L73Mj980P61
7123a83L48j655K716k617K811j017n42L99q15J522j537J222n02r0r11J56J254
7140E59j339J959j342J451j650j41R83k539L069j110J67m15M46l3r84P22J80k70
7158b87p8N2O67p29j30K58o9Q70j19o57r92Q46P13p05m5m77J162O22q20l66L01
7179A7k00N09O19j011K00P98r25k96P98q86q9Q57J316j705L82o10q48O03k56N82
7199a45j73N38q22K92J842j919O78j671J879q30Q57q64j30O60o33P84m54O06o61
7218a66m73J353n97N19m48J11K65k32J56j895J816j843L105j795k09J09j047L027
7236A756k434R37K76j201N07j124K247j075j61R70o03J59r11N88o95K142j635
$$ plain form
7105 576 -633 238 -767 736 -572 -994 -861 -642 1711 487 -999 416 76 659 1032 1036 -944 -183
7123 -183 165 -1490 1226 -1391 1420 403 -139 260 -555 967 -570 652 150 60 -851 -695 559
7140 559 -780 1179 -163 1288 -362 -503 480 -2059 1010 -100 67 -348 98 65 -919 -197 -17 -287
7158 -287 -365 -313 354 -375 -505 -247 -316 554 435 -222 -1214 -368 345 -360 -405 -882 280 902 82 -284 17
7179 17 -183 326 945 -66 134 932 7 -289 509 -377 -466 391 1707 2 384 -226 -1074 -471 -727 -145
7199 -145 -318 220 -602 -310 1532 -387 291 -1380 499 -331 526 -338 -468 192 -441 343 -111 495 -166
7218 -166 -639 714 117 636 188 299 564 332 488 -1407 409 -1434 1671 -124 -333 -224 -1271 1756
7236 1756 -678 259 535 -666 -159 -1283 964 -111 -272 698 95 254 -657 -69 -764 1378 -257
7253b57j18P27p50j40o25J622O78j785J331j960J964p76N83L35r22K63k59r16
7271a005J316R2m63L85j077J9K33P84m0R69j172J3Q05k188R06R1J538j821J364
7290G49j08n4l89m35J143k103J109L17J601p52j252J604j653N40k74o94K099j520
7308g2R46j114J131n54j083K492k106K783k088Q8q36j89P71j175J838j263O20
7325A89j461J282P82j611K619j157j580L09M98o06J640P40j725M68n21k28O91
7342C29q57K213j177r98J019o64R80j719K382k01m70n52R67j48r39l23p24P81
7360a01J08K90J484k148L51K67o14Q04p72N64l1j038N62j28O90m16J15k79j14
7379d06L09n65J149n93L96o05R59j088l30J237k386J011P33J42N14p33Q31j13
$$ plain form
7253 -257 -375 352 -398 -538 -1163 459 1137 -648 683 -1277 687 -89 494 829 -93 170 -89 -1005
7271 -1005 311 403 -60 325 -752 -733 -500 284 244 1213 41 54 859 -1329 -423 -332 1206 -615 749
7290 749 641 587 198 -237 906 -1197 -88 229 1830 1078 -174 1430 -223 317 43 -651 1448 -72
7308 -72 874 -240 891 337 -746 1746 -360 2423 335 423 -413 -602 169 -1006 832 -431 189
7325 189 -1272 10 792 -819 1800 643 -937 -628 -130 -736 904 1644 -81 387 -134 -362 329
7342 329 -528 1685 508 -490 529 -135 845 -874 1508 1307 837 285 1252 1104 165 -158 -882 -101
7360 -101 7 297 1781 -367 -16 251 -363 441 -331 233 202 -836 -274 -402 288 -128 -13 -292 -406
7379 -406 -97 -662 487 -106 290 -315 644 -444 -774 463 -1923 -912 -179 -37 477 -256 575 462
7397D62J013j965L80L99l60P80j574K326j978L82R84j002J43m03J127o71q37K075
7415A281k471J756k296K164j047P77J081k588J822L94j77n35j70O74j080L71K3
7432b1j274Q9J418m53o63J480j229L61L65P5l8j26L53j37j38q78R59l27p18k77
7452a179J388N70j284O13n5N3m46n7J262J088l127K03J422O51r34Q6O78o02J10
7471D40n47o61O91J094l11j963K173k185J798L23k665K785k368J667k68L76O96
7488A075j569J632k826K563j800J071k76j085J052j340J578q92J816j295m11p3
7504g80j57K236p04M64j304j58J475p56M87K18j641m23J349J148j970M84j73M22
7522B17j72j420K305j382J577j603n24J296j459O32Q61p37P84o06n8J96l85L53
$$ plain form
7397 462 1475 -490 -110 289 -71 709 -865 1461 -517 -135 849 -153 -10 -413 714 43 -794 1281
7415 1281 -1190 566 -1730 434 -613 164 1245 -1343 479 873 696 161 -9 665 -415 -44 -21
7432 -21 -1295 -1206 212 -241 -904 576 -653 -292 73 148 110 -16 337 200 62 -816 143 -184 -902 -1179
7452 -1179 209 779 -505 108 53 106 -340 -397 865 1953 -1174 -971 451 1102 168 254 932 330 440
7471 440 -107 -768 -77 1017 706 -1257 916 -1269 529 852 -1813 972 -1396 271 3 379 1075
7488 1075 -494 1138 -1688 875 -925 146 -130 -1215 -163 -1503 75 -817 999 -296 -707 -780
7504 -780 -937 1299 595 1059 -245 -403 1072 316 803 1021 -620 -1043 306 1454 -516 -32 -205 217
7522 217 45 -1375 930 -452 1125 -478 -1002 294 -1165 -533 328 -409 375 -231 -289 -93 -478 -125
7540a25M26L50n31P53k130L18J67J439j215k39J133k68n89J324j390L77j145K330
7558I85q87K97R4j709J933j095P67l59No26p65J751J048j264J040j511j36P02
7576B70n2j016J874j608o14K008j905J528j565K491j031p09L75J21K2n65K108
7593A732k147R84j167j62K944k863J426O37r20K47k089K770k518J547j127M42
7609b64N65Q5J9P34r45j108K491j150r38R54L61k041K299o46n63k04M97q21Q36
7628A61j217q77J840j024J779l13j007K032k05j873J103l49k8k85Q41k653K258
7645A83j409J001j73Q71j54j024J502k232J110P10k23R84j804J822p78l53O03
7662F36k101J549k78J415j873J846j015Q68K92k854J499K95r81J065j080J777
$$ plain form
7540 -125 301 651 120 873 -1257 -939 -772 667 -548 -787 346 78 -511 813 -577 -200 -1345 985
7558 985 98 395 489 -1220 713 -382 385 26 31 -595 -1360 391 1439 175 1215 -296 -432 270
7576 270 218 -798 1076 -532 -1146 862 -1043 485 -1080 1411 380 -329 46 167 189 -376 1732
7593 1732 -415 569 -598 -760 2184 -679 747 1384 464 711 -1378 1392 -1126 421 -706 -264
7609 -264 301 386 405 1139 194 -914 1577 427 -511 443 804 -1237 1062 416 -147 -351 146 -675 161
7628 161 -1056 -1933 -93 -1117 662 349 -658 1374 1169 -704 399 50 22 -263 578 -2075 183
7645 183 -1226 -225 -398 473 319 -705 797 -1435 -325 385 162 1146 -658 1164 386 33 636
7662 636 -1465 84 -194 1221 -652 1194 179 1047 1339 -1515 -16 279 -702 363 -717 1060
7678A060j505J188j368R43k007R30R59q07N39p2K5n28O64J89r6J163j891K44P40
7697C70m14J296j233L4J069p62m55p90K115j699N01L18O60q32l34L43m83L58j056
7716i94K50K057j544k54J091m95J5M13m63O6o0L72p32j45j95M66J45K72q78n40
7736a153J592j305J688j46j065j38j215N80O65J589k296K171j242O47j1j325J735
7753G71k332J424j62K95k25j85J248j666J309j571J263J91j375J553j830J604
7769C12k717K175N29p42J162j84K05p89n22J380j573J043N43q25O99l06n03O08
7787D95k67O0l57j27r70K186n24j28Q88j004r65Q58J129j860k22l87O78J598j396
7806c15Q66m23j677K322j921L39L96l85j221J478M32n36P62q32n31J024J55O74
$$ plain form
7678 1060 -445 743 -625 318 -1689 -759 200 -607 -68 -140 -115 -643 21 210 114 1277 -614 -370 370
7697 370 -44 1252 19 53 1122 360 -95 -885 1230 -469 32 350 1010 178 -156 187 -296 62 -994
7716 -994 -744 1313 -231 -485 606 111 126 539 76 142 82 454 -278 -423 -618 -152 -7 265 -613 -1153
7736 -1153 439 -866 822 676 -389 -527 -1742 -1162 -497 1092 -1204 967 -275 372 361 -964 771
7753 771 -1561 -137 -299 -4 -229 -414 834 -832 477 -1094 169 360 -1015 538 -1292 312
7769 312 -2405 -230 299 -443 719 535 740 -49 -571 809 -764 279 822 -3 696 390 -113 495
7787 495 228 288 -69 -196 -1166 1020 496 368 1256 252 -713 145 1274 -586 -808 -1195 -517 1081 -315
7806 -315 551 128 -1549 773 -1148 -809 -413 -798 -2019 -541 -109 -645 117 -715 -1246 -222 -67 607
7824F07j679Q63K98J178j821n77J254l26P19j381J907j244p12Q32l04J481k241
7841a146K770k316J679j72j122J988k165k07N12O6j5j51J102k179J786j019J652
7858A063J24k080R98q62J489j087N68L25j650J498j343K70L43J241k51j831P02
7875d83L40J114r49j532K336r40M76L26j341O08Q09j55j404J488j569M84j70m27
7893i89L34P3J39l69J840j658M52K82k90J273q88k02J182n31j107n76Q65J082
7911I12j956J216J28p8L69n39J009j322Q21n67n90k14J381l03k77J250j203R2
7929A29m72Q64O08k470J921r14M18N11J72o64j325L212k182k8K70Q1j02q58J572
7948G43j630Q50j665J197O61m24R10j496P86m21J546j659l89J965k252J367K73
$$ plain form
7824 607 -1072 -209 89 1267 -554 -1131 123 -203 516 -865 1042 -202 -914 -82 -386 1095 -1146
7841 -1146 1624 -692 987 815 -307 1681 -484 -691 -179 -113 -128 -279 823 -1356 430 -589 1063
7858 1063 1187 -893 105 -757 732 -355 213 538 -1112 386 -957 -687 -344 897 646 -1185 -483
7875 -483 -143 971 22 -1510 826 -114 362 688 -653 -45 764 609 -795 693 -876 -392 -562 -989
7893 -989 -655 -582 -443 -812 1028 -630 -178 104 -186 1087 199 -3 1179 648 -459 -1035 -170 912
7911 912 -1044 172 300 222 591 52 1061 -261 560 -7 -597 -811 570 267 -10 1240 37 129
7929 129 -343 521 1129 -1341 580 -334 84 595 767 103 -1222 1990 -192 -220 50 131 29 -829 743
7948 743 -887 -37 -1702 -505 156 -268 642 -854 -68 -489 1057 -602 -991 974 -1278 89 362
7965C62j153O19J7J821k452J213j113R17l35K9M00n84l07J740o16j797J604m94
7983a29j057Q81M50m04J127j246J63P32n32M84q78Q73r12J57N30j186M88R32n92
8002a19o47J041M63l91J58j322J637k091J306P98j039N14N41q27j575J429J50
8019B6p49K014k639P69J480j855J668j351K276k679K484k400K164j025n31J297
8035I49j296J075k225J953l91M34j90j387Q43R61K17j112k96K492k629J025J74
8052E97M1j547j21Q38o28J451o83J78P9Q45p16p91J824j577R97j213L99L26r71
8071f72J284j999K655K32j365L34q98O78j52J074k033RN54P64k04M22j223M55
8089h5l8L13l80j12O97j355J205q05N90k2N28n8q56J05j952J661K152k092L14
$$ plain form
7965 362 -791 -172 -155 1666 -786 427 -686 231 -104 -75 325 -259 -566 1174 558 -1239 365 -129
7983 -129 -1186 -305 145 -259 868 -378 -215 517 -15 469 -409 464 -448 -291 239 -947 -459 473 -119
8002 -119 -766 275 738 347 505 -817 820 -1271 35 833 -206 308 849 22 -1553 -124 26
8019 26 -723 1291 -1348 -579 901 -954 714 -637 1639 -1040 1444 -956 1208 183 -348 949
8035 949 -347 728 -1497 456 65 499 309 -1078 -235 726 943 -169 -465 2027 -602 423 597
8052 597 638 -909 -1030 -192 -820 631 -52 126 205 1050 334 -457 1367 -210 787 -426 -27 299 -672
8071 -672 612 -1387 1268 1500 135 469 -429 249 97 1171 -862 -853 -299 465 261 683 -540 -85
8089 -85 -123 190 -190 -302 395 -960 245 -560 30 8 536 478 -378 -273 -2225 -564 1588 -504 -190
8108a90q08J847j501Q72J02r3Q8j178k88Q14J020l62j402J962r59Q43k132J542
8126A77Q25j025n66M09O08j331J404m37K8J95m48J658m122L445q33O39R52j576
8144BL29m09Q71j062k73P38j199R15r47K074j275L6N68r55J573j556J534q25q49
8163g10J633p12o85p10j96P01J447j724O91l12n74J989l44k95N06O20k130P36
8181f9J6o60J63P12M44k165J293m75J379j685J454m41M03j53j000K901l912K057
8199B62j045J285J097l300K940j657R23j294j60J686l079L696k071J815r59r42
8215h03J183l20K33O96o35q35J627k001O25Qj516K644j312O03L73r97N50P5O71
8234H69j306j93R59j32Q15L53j798p51J693m76m2o33O35o6O83o09M89N45k146
$$ plain form
8108 -190 -998 849 -652 220 322 229 317 -861 -1149 -335 685 323 -1079 883 -76 767 -1365 177
8126 177 1002 -23 -589 -180 428 -903 501 64 92 287 -161 1497 -2625 820 -13 626 1578 2
8144 2 331 -78 793 -269 -542 196 -1003 -88 -1035 1039 -236 -200 368 -587 986 -570 964 139 -710
8163 -710 923 211 -474 -1184 -1380 -679 768 -956 -265 -577 -1151 838 494 199 705 1325 -805 -69
8181 -69 -53 -713 -550 162 606 -1559 -266 -741 638 -1047 407 -34 369 216 -784 2117 -1795 262
8199 262 -783 502 1599 -1701 1239 -418 505 -789 -949 737 -2342 1354 -717 1098 139 -803
8215 -803 380 60 293 989 354 -481 1146 -855 -230 -222 -1738 906 -406 197 570 -427 123 198 869
8234 869 -437 -630 329 197 1012 1365 -433 -1184 509 33 -9 -642 -7 -73 610 1 490 1035 -1111
8253a111J293o71J741j691M38o04p78K005l49j97o62N49k79l23J344O34q45r26
8271d32J478j116K1j00p87N30q22K723q38m48L26j688J775n60n27J350o74j76
8289C5m85L05n88J551j781O8O34lL93j285J340R7n94J174j439R26r01J11l20J12
8309f50k80m0K627k360Q21l23l95O24o33J313k34J51L27j092J63j005J440l13
8327A41M09j023M54Q9m08J068p42L53l81n16R29q74P79l53J966j913J24M52j978
8346a424Q19J450j359N76j998J854k83M18j33J19M2r57J444j18l09J86m64m70
8364f07q7l77J042Q23r55o28J792o45P02k869J080J879j642K515k505k38L92M6
8382b82M22P9J347k295J451q14O47k03r68J176j783J777J36k8m03j313K176j761
$$ plain form
8253 -1111 182 -489 1252 -439 -1 -605 -1383 622 273 76 -586 -37 -316 -639 705 1339 494 -432
8271 -432 1046 -70 -49 -149 -936 -406 -1228 1495 657 209 535 -1153 622 62 -465 885 211 35
8289 35 -450 -145 -733 818 -963 -895 -261 -264 129 -1156 184 281 -313 861 -578 348 -553 -442 -762 -650
8309 -650 -930 -970 1657 -703 118 -205 -600 24 -609 704 470 621 948 -144 19 -986 454 141
8327 141 550 -473 -19 70 -338 730 -12 341 -40 -556 373 -501 278 -75 1891 -22 102 554 -1424
8346 -1424 -605 845 -514 62 -1936 -82 -365 53 -80 39 81 -876 568 450 141 327 -137 -607
8364 -607 -694 -1071 -29 794 -161 -789 1003 358 1060 -1809 -729 1150 -492 2023 -482 -720 -328 -282
8382 -282 140 219 1566 -729 722 -92 555 352 -616 560 -1223 554 690 662 259 -1054 1122 -639
8400f39J833j864O89O82q21O48j260J2m72K205n90l62K094l169k87J079J505k215
8418i32J935m78j13N32n59k69K89j556J623M26j446R84q06J089j893J540k49L9
8436A56k36j57j0j489J503J72R37j066L54n25P08n59N40k01J62q51J209R3j692
8455i52K341j189J359o94m64J51k50p96j043J346J03O8l73J298p00j426L125j268
8473F36N74P72p67p40l40J210j657M46k80N38L64n61j37j668K627j653J771j137
8491bJ03M05j165O00Q21l48j73r85P65L95P9k39J88p6j717K274j789K118k620
8510a366K034q02O89m88K30n29j68J353j100L03p39N42r59R17N23N28k012K448
8528A404j840N59J075p5p48k0q00J029j862K089j715J323k033Q3K644j454J12
$$ plain form
8400 -639 1194 -670 19 701 -120 528 -732 -720 -1192 1013 423 61 2155 -1014 -1301 -222 1283 -932
8418 -932 1003 525 412 944 385 116 405 -1151 472 898 -548 436 -370 719 -1174 366 117 156
8436 156 -80 -237 -247 -1736 -233 -61 876 -190 164 -361 347 -212 328 127 289 -562 647 740 -952
8455 -952 1389 200 1559 865 401 552 302 -494 -1537 -191 -88 -20 -393 905 205 -1221 1904 636
8473 636 1210 1982 1215 475 135 1345 -312 134 -146 392 756 195 58 -1610 1017 -636 1135 -2
8491 -2 101 506 -659 -59 762 414 241 -744 21 416 495 256 444 368 -1349 925 -864 1254 -1366
8510 -1366 668 -134 555 67 297 -232 -400 953 -147 156 -583 -41 -1000 -83 440 968 -1044 1404
8528 1404 -436 123 1198 1123 375 355 -445 584 -1278 811 -904 419 -1614 -1531 1113 -341 -229
8545b29j64Q37p53L19pK15j143P0J314j194j11J281r42P67j319J639j098m4J101
8564E39K2m13q89J308k059J938J27j122O31q21K770k604O29O60k482J769O90k3
8582F70k204N82K54L98O15j961K963j880o47J118r35K060k156J449j046J284j073
8599e09L36k05q00J254j253J671j20R8j40l9R17j313r91K010j439J761j173NJ14
8618A84q5k31O21j338R54J58K25j251L26J178p24M79P20j518M31Q23k186O81J28
8637d25n81J634j313L44J062o12O50j773K192k494J938j220L41M21j086J583j000
8654c39J019n33j91o22M54R87j705L252k691J208j054R05J57r53O55j962J734
8671C21q44J03P68j243J918o30J443j231k944K205Q4j47Q22Q76j275J80J11r89
$$ plain form
8545 -229 -393 444 -309 10 3 218 -925 -855 459 -735 -846 435 -507 260 -1059 580 -518 -562 539
8564 539 561 148 -741 567 -1492 446 573 -549 82 -739 2031 -573 56 716 -1766 3 693 670
8582 670 -1534 -952 -698 -300 315 -1646 1317 -563 -1210 -92 -1027 1033 -1123 326 -720 564 -509
8599 -509 -173 -378 -1178 76 -1177 494 374 472 332 293 1210 -103 -1094 916 -523 1238 65 70 184
8618 184 99 -132 489 -849 105 263 488 -763 -437 741 17 496 1216 -302 129 952 -1234 -553 -425
8637 -425 -1006 628 -685 -341 721 109 759 -1014 1178 -1316 622 -598 -257 164 -922 661 -339
8654 -339 680 147 -44 -666 -212 775 -930 2322 -369 839 -215 690 847 -106 549 -1413 321
8671 321 -523 -420 348 -895 1023 393 1836 605 -2339 -134 -50 -197 625 1501 226 406 517 -472
8689d72J461l85r35k66k90J105N41o5l59n43l88O51O26J55r07P01q11qM17m0L36
8710E24n97k75o6j17J296n29K154k951J102j134n5J841j668L49p85J910j017m09
8728d27J6J135p13l32O62j548O54o30K994j398J92l91r14K295j513l5l0O00j318
8747g01j21K869l207J001L35j94P89q19J333k327J374k168K527K30j600J329J08
8764G58j033O95m29K61j580L068j081j172M14O83m22r79J638p70Q86k353J497
8781H1P85p64p24k9Q77q24N34J277j101N92n76o84J11l55P66M5L0q93L54J010
8801E12j024M82N20J18o72j52R06r98J375k23m31J268j030n72r52K61O44K20m43
8820a91m08K198j463O67o47N67q27M10n59M9l20Q28k33N3m86J802j637O19o97
$$ plain form
8689 -472 989 604 -331 -597 -887 218 759 694 335 -208 -596 55 681 836 -71 630 -181 -189 228 188 524
8710 524 -73 -348 -414 -531 765 236 2390 -561 541 -593 -648 1193 -475 -126 -911 999 -18 -427
8728 -427 -411 724 11 -321 341 -1207 -553 -1183 1811 413 605 214 -700 1595 82 47 17 617 -701
8747 -701 -822 2047 -1160 -159 176 -18 771 -48 1285 -1042 332 -1836 691 921 -679 650 758
8764 758 -275 420 -9 252 -1328 1740 659 -513 -99 584 162 -817 821 51 937 -1416 81
8781 81 866 102 -622 -651 226 -598 -64 1213 112 704 128 -556 -445 -800 -34 11 41 -852 -498 512
8801 512 -512 -30 490 608 -64 -216 690 -308 1067 844 413 1681 651 79 -873 -612 32 252 -191
8820 -191 -599 1599 136 803 156 723 -104 306 -253 -204 -524 304 71 124 -362 1440 -197 422 -275
8839b75K15j229R23J895l252M908k558j284l9q63K153p76J259j661R56r32K72
8856b88J785r5j134Q02j323M31K89o28N22N6K09K1l18o10M0q06L13P54O50l80
8876B90N39q40J100q14l14n68Q16q36J210j192K27J611j558J60p80L01O76N93
8894F21o36q90J140j361L76K742j139m66j968R34l4Q24J89m26J525r52O4j410
8912h67J382j209k4J237j147R02J72l67P9r22J575n72k83j088R93p7j342J835
8930B77o73R00j166M09NJ51J419l409J555j08K231j609r75J522j647K605j202
8947B85j096J036q91J263k194K141o23m96O66m23K309k868J964j143J391j003
8963C18q88K086j753n35J069n97PJ017K02j496K10P58j880K230j178Q65O25j030
$$ plain form
8839 -275 -60 -1289 -366 1529 -1723 3185 627 -657 -696 -1559 594 -182 1077 -584 372 -560 -288
8856 -288 1497 1402 268 1070 -253 178 467 -161 361 417 626 647 329 -281 -241 -1047 -734 20 670 290
8876 290 829 -11 1089 275 -39 -607 209 -627 583 -609 -382 1229 -329 -169 -949 -648 28 621
8894 621 -15 -905 235 -1126 -750 1992 853 387 -1581 -647 -681 143 332 -94 1431 479 543 -867
8912 -867 515 -694 -718 519 -628 274 446 79 158 -764 811 239 -44 -1132 -139 -216 -1558 277
8930 277 -396 504 -662 -253 -248 -97 1322 -2087 -532 -640 1591 -18 -993 529 -1118 1487 285
8947 285 -811 225 -666 597 -1597 544 -79 -575 91 -332 1977 -891 1073 -70 1321 318
8963 318 -570 1516 -237 -772 297 -300 -293 724 926 -570 -360 398 -1482 748 -430 435 1060 30
8981C0j110n19K905j228L47m49P02j90k62j66L65J80J02j866J551j055L43J128
8999H08p96J140n89P69k221K229k488M64J628k167K285j379J551j780J676k109
9015i79J541m41j350K581j733k87O80q45M20R52m52j870K777o88j118R81o61J301
9033H09j472N93o6M86j90m84R2j196K545r95n93K99j167K417j827K4J63J26j02
9052e38n40J541K78q50r15J673q49p04J158j28l28k83O92Q39j090J191k795K104
9070D56j35j185N39q61K430j044j357J579j37R72j776O13L80m37Q56p10K29n61
9088a49L05J43j092J333j745K156L08j789J773l40j743R79K29j75m73M91j566
9105a355J750j053J746j275q40K306k276J698k088J854J88j591K026k919K289
$$ plain form
8981 30 -1080 -1599 1306 78 425 -24 678 488 226 60 425 605 707 -1159 392 -663 -320 808
8999 808 12 1152 563 1332 -889 1340 -1148 -684 944 -1223 1062 -317 1234 -546 1130 -979
9015 -979 562 121 -1229 1352 -381 -668 12 -833 -413 539 87 -1783 994 306 -812 169 -492 809
9033 809 -663 -70 -136 350 160 -324 -232 -1428 1117 122 -471 -172 -1339 1078 -749 -725 -562 -436 -538
9052 -538 -1078 463 741 -109 -1024 649 -200 -904 254 126 -202 -485 207 1046 -44 1147 -1648 456
9070 456 321 -864 -325 -1186 1244 200 -1157 422 285 1257 -519 94 474 37 893 183 412 -149
9088 -149 156 299 -793 540 -1205 951 1259 -530 1243 903 -840 139 368 193 -280 211 -1355
9105 -1355 395 -658 1088 -187 -1027 1279 -997 701 -1387 467 655 -936 1090 -1829 460
9120D60j505J240J3r83J370k397K817j716K56O92j795K519j715J237p67J083j233
9137d24K97P61m98J597q39m25o68k69j271J448l48P24Q73j403n5J497j280K56
9155b7N80j433J170K52q03n17o5J034j112K026j776J655o52j311J574j379J105
9172C21M51q13J266j702Q13n91J65q60Q55O75j270J067m98J070j796Q86k54M25
9190B10P22k997L370k041J758o14j485J985j692J416j878J823r31K26J78q36J938
9207A152j175R45o77o59N98r1N01o07Q8n12k80J068p24O44k97k09M62k10m15J289
9227H91q01k39J189J55k556N42n37P41J702k84p70P49l36p18j145K529k015Q56
9245d7l43o3j7j45J092j856J964j063J164j62r94R07m48J520j799K64L15J8N6
$$ plain form
9120 460 -1045 195 208 -775 595 -1802 1015 -701 -445 247 -1548 971 -744 493 -274 809 -424
9137 -424 -127 634 136 1733 894 469 -199 -468 -1739 -291 -639 85 958 -445 -500 997 -283 -27
9155 -27 553 -880 290 542 -261 -778 -843 191 -921 1105 -671 984 332 -979 595 -784 321
9172 321 772 -41 1225 -477 336 -255 -90 -950 -95 580 -690 377 -121 949 -847 39 -215 210
9190 210 932 -2065 1305 -736 1022 408 -1077 908 -784 632 -1246 577 -354 -128 50 -786 1152
9207 1152 -23 922 245 -414 184 93 594 -13 75 -437 -717 351 -373 271 -26 -235 227 17 -398 891
9227 891 90 -149 1040 1195 -1361 -819 -1356 -615 1087 803 33 782 446 -272 -1417 1112 -903 -47
9245 -47 -390 -453 -470 -615 477 -1379 585 -478 686 524 -470 437 -11 1509 -290 -26 289 307 363
9264C63o09J721k493O07M18o17O75q43K124k327J036Q4p77Q88p54R80r64p96J421
9283A37q32N54J49Q15k017K150j663J27J183k453K187j005O91q22M65P08n64Q74
9301F84j033J043j382J022P85k40j30k77L73j604J625m40l75M17o31L70j175P84
9319a84N7o44J178J26P23o37n47K29l76K8J071k164J657n68m15o10Q8J439m45
9338FN18K75j175r4M32j15m48Q7r27J442j309J275p01Q89l80j199K335p74m49
9357c12l13p52K142L7j635K19J72J811k280K158j537J887j166M69q38k042K235
9374B55j145J655j137J32J20n42L58k64J434j628P15L44o2o17p71J682q29P60
9392D60m34l25J986k014J211L14n46r86M27n45J204L75n85j034p28J791n58k17
$$ plain form
9264 363 -246 1475 -1018 -411 7 -610 65 -778 1346 -981 55 139 -638 250 -504 476 -488 -1284 137
9283 137 -695 -141 8 823 -1194 956 -707 -580 603 -1850 337 -668 23 -799 -334 374 -190 684
9301 684 -349 694 -688 334 1119 879 749 472 845 -759 866 426 51 468 -163 207 -968 -184
9319 -184 -127 -771 407 533 1256 619 72 301 -75 -47 1024 -1140 517 -51 -466 -1076 -988 451 6
9338 6 524 799 -376 -470 -38 -153 -601 -514 -1441 1 -1308 -33 -734 155 -225 -1424 911 137 -312
9357 -312 -625 -1377 765 802 -833 -614 -442 1369 -911 1247 -290 1597 431 900 62 -1980 255
9374 255 -890 765 -372 -240 -120 -662 -304 -568 866 -762 -47 297 235 -382 -1153 529 -300 460
9392 460 26 -299 1687 -327 884 1198 652 -334 93 -452 752 1127 542 -492 -1220 571 13 -204
9410b04o90J133K43n83l49Q44p09q04R28j25K76J64r27P22Q65m98j196P48M30
9429B68r5M24l00M10j213j43N12K98o02K58J213k046J092Q56r70l76K19J386j421
9448b30P74l92J07R7p3j40o21J965j327l07j47m36K075k502J879r95l75l46n48
9467a542J843l23J08j12j4J133l117K768j484J713j125LR79p27R30j009J273j271
9485B6p45K17J193O9j883R98K04k57R00l86n35P60j475J464j396Q91j99k60o21
9504a035J516j025K27L2j182K645q37M40j521P25n84J23R86q44j33J799j703L75
9522Dj029J014p22K66n59R82k47l26k32J389j39P79k126J836k856J156J017L79
9540E86o1k496L465j801P46L34j81L74j474J863j728J09L86j139K471k400J772
$$ plain form
9410 -204 -894 239 482 -101 -450 394 -315 -1119 -191 -316 -40 124 -803 -81 784 286 -910 -162 268
9429 268 173 597 297 707 -506 -649 -137 161 -441 -183 1030 -1016 76 932 -38 -414 -195 1191 -230
9448 -230 544 152 259 356 283 143 -478 1487 160 -147 -294 -730 1345 -1157 722 -273 -648 -994 -1542
9467 -1542 301 -22 86 -26 -40 1093 -2024 744 -740 973 -152 -149 830 103 1033 24 1297 26
9485 26 -719 -502 691 760 -1123 -125 79 -178 722 336 -199 561 -914 550 -846 45 -154 -414 -1035
9504 -1035 481 -544 -317 -285 -1467 1178 341 781 -740 -15 -599 -476 510 -334 -467 1332 -371 4
9522 4 -1025 -11 -733 -467 -1026 -44 -291 -617 -849 540 401 1180 -946 890 -1966 -810 207 586
9540 586 525 -1971 1494 -307 439 773 592 966 -508 1355 -373 -264 122 -1017 1454 -946 826
9557H26j175K432k684p70J643j907K621j391J297r87n59J837k141O06J74J206
9573A028q07q98J639k135K051j676J428o51j065R37j57O84o83J430j261m33J516
9590I47j464K49m11j33N71J640k135P87M42k86k17j185J681l05n65N10J178j093
9608B11j66J39L19q6N07m54p21Jk57J97M44P49r0j635J411r03R10q84m10J398
9628F80j672L059k673O14J132j274L27j258J522n26j138J699p69J581j556Q77
9644F25j064M31P15j856J782j193P84m11O81M59j636J052k52K77o1O66p67m16
9662a84N88J12p37m29O07K54r63K214j837J599j101L73k55p24n19J055K27n83
9680c03N48p7l07P47m41M41m33q90J131O52m88j090M36N05j135m70J355Q02j506
$$ plain form
9557 826 -349 2083 -601 -1371 272 -1635 986 -405 892 -95 -654 1183 -958 -352 -178 1028
9573 1028 221 -677 962 -1173 878 -798 630 -21 -1086 -149 -306 378 -305 1125 -136 -569 947
9590 947 -517 -268 -679 -812 -241 1399 -736 51 493 207 -10 -1195 486 181 -384 126 1304 211
9608 211 45 184 503 417 924 470 -251 -250 -507 -310 134 883 793 -842 569 -334 576 -308 -718 680
9628 680 -992 2067 -606 8 1140 -134 193 -1065 457 -69 -1207 492 -277 1304 -252 625
9644 625 -439 -8 707 -1149 633 -560 224 -187 494 953 -683 369 117 394 333 999 232 -184
9662 -184 404 516 -221 -650 -43 211 -752 1462 -375 1224 123 496 241 -483 -1002 53 280 -303
9680 -303 245 168 -139 608 167 608 175 -715 416 1068 580 -510 -74 431 -704 -1174 181 983 -523
9699e23N12M80r56J72J165p39Q80p85n60J80l81M33p53O04o48J355p24J086k48
9718E50K36q63NJ102k259J941j210O43%j232J209j329J809m25O93k2j558P14o17
9737f13K058k860J857k54K67k61p22J019j647K724j425j057J359m72M97k70J051
9754A251j846M12O51r70J247p75P39j353J147m78J209l75j427J087n85j01P39
9771E72o49J36J87j68l92J130j01j269J382j403O59M08j301k49Q06L64p23O69
9789E8n18O21r44N91J14R04j069P54r79J187q14q88J873k385K655j316J050k051
9807a157J757p72J124m01k361K069k24O80j204K82J013n66r87J063j076J664q95
9824IL99j689K046o61M57J205k148n74nJ264m82P92K31r56Q30j020O84j563J751
$$ plain form
9699 -523 -11 469 -487 -315 850 111 991 206 -354 -174 -555 -122 -875 -271 -919 436 -288 798 550
9718 550 786 -77 -72 1030 -1229 712 -498 145 145 -1087 122 -1207 602 177 870 848 -710 4 -613
9737 -613 1445 -1415 442 188 455 194 -528 491 -1156 1568 143 -914 445 -27 470 200 1251
9754 1251 -595 -183 468 -502 745 -30 709 -644 503 25 1234 859 -568 519 -66 -167 572
9771 572 -77 59 246 78 -314 816 715 -554 828 -575 84 492 -809 -1058 -252 112 -611 58
9789 58 -460 161 -783 -192 -78 826 -243 511 -468 719 -95 -983 890 -1495 1160 -156 894 -1157
9807 -1157 600 -172 952 551 -1810 259 35 715 -489 -207 806 240 -747 316 -760 904 9
9824 9 408 -1281 765 104 561 1766 -382 -956 -961 303 -179 613 844 -112 718 -302 382 -1181 570
9843E70J39m62J61j659K323j82q71J531k099J294k006J902j035K69q11k59J179
9860a6l99O07l49N27k03j509K513j474o6N38Ll37r62K126j903J584q48n01O86
9879A7j177P15J114m67O6K88J82j206J60R18o44J397j054L82k000J152M37r93
9897g13J084j790K431m40j113J134j566R62l81J59q01q6J257q63J101k85n2J025
9915A063k538O57K30J021j172J126j340J725r79J91P61j600K481k041M16k32M1
9932a90L40j857L557k070j96J510k601K863j478O24j000n8N46j146J914o42k90
9949a74p00k92K155j585J004j110N77l67Q61K27r58O81Q17q24l41r43J55p4K61
9968f30J084m47L31q48M49Q85j327J104j550J463j378O86N57o37Q8m86J30Q96
$$ plain form
9843 570 709 247 408 -1251 1072 890 19 1550 -549 745 -1261 641 -394 -125 -936 -1195 -16
9860 -16 -415 192 -157 370 167 -1342 1171 -303 -369 169 172 -165 -1127 999 -904 680 -168 -669 17
9879 17 -1160 -445 669 202 268 556 738 -468 -308 610 -34 1363 309 691 -1309 -157 280 -713
9897 -713 371 -1419 1012 572 -541 593 -973 -11 -392 -233 -1034 -1120 137 -726 375 90 38 1063
9915 1063 -1475 -818 -588 433 -739 387 -953 772 -207 -16 745 -855 1626 -415 1 -231 -190
9932 -190 150 -1707 1850 -220 -416 1094 -1507 1356 -122 502 -498 -556 -10 -1156 758 116 -174
9949 -174 -874 -1166 989 -596 408 -702 -125 -492 369 596 -362 319 1136 312 -29 -972 -817 -891 -630
9968 -630 454 7 338 -510 -61 824 -503 601 -949 514 -864 -178 379 -258 -170 -656 -526 370
9986C70L29j295J79L98q2K017k798K112k223J495P25k130J109j14P79j308J314
10003H77p00n14J491k555K017k184N64J950p14K37j169J446j530P68J83m75K182
10020A874k074K09j450J711J11j6K49j183P93j324J055m79P4l07k34K041j174
10037a24k43O9M7l50p83K300j192J07J27r40J607q58N47o08L74r54R26L85M27
10056H64r29o9k5J065j458J57q30K47k64J668L41j148J051j17k301K249j107M77
10074a29o8N85p15j0J826k163J793k395J774o16j490L041j999J320j923J286P85
10091I02o12J55j300J858j282R89L0j495J473l100L734j657Q86j287P8J135l98
10108A09O84k097J337j68q59J181J75o8k197K325j234J402J238k322K068j571
$$ plain form
9986 370 699 -596 -417 -19 -101 1916 -882 1230 -993 502 1227 -903 206 92 871 -437 877
10003 877 177 -337 1154 -1401 616 -1568 -1004 946 232 469 -700 746 -784 -16 167 -308 1874
10020 1874 -200 9 -1441 270 381 365 614 -569 224 -1100 -45 -524 -450 -757 -991 1050 -124
10037 -124 -367 -298 -251 -601 -1384 916 -276 -169 -42 -982 625 -233 314 -294 80 -874 52 437 864
10056 864 -65 -134 -159 906 -552 -395 -1225 -978 -1242 426 767 -381 670 553 -1748 501 -606 -129
10074 -129 -197 388 -327 -337 1489 -674 1119 -1276 498 -118 -1608 1433 -566 754 -1169 117 902
10091 902 290 445 -855 1003 -279 710 740 -755 718 -2382 1352 -305 581 -706 -628 507 109
10108 109 793 -1304 33 -135 -994 187 362 294 -1903 422 -812 590 1828 -494 1574 3
10124CJ237l94j373J706j174J606j509j24l6M51k4l70m02R28l10p76J037j641
10142a165J721j821J470p51J79J257j529J293q45K54j551J958K06Q7k73j119J119
10159D90o33J236j069N34n54N63l46j443K426k052J356L91j181P68j727J136m47
10176e52N30o28p3K197k391K209j829J434j146J62J056j954K618k291N61j378
10192a475K128J09k198K488j372Q50j086Q43n44K54O02j368R91k72R70m63j316
10209h59M30O42j022L76k29R09j679R16J115P49j007n71l0L49n15p29J610j77
10227B78L52o69O17q82O91q12M02Q84J86k083J734j3q71J775k329M83Q86j781
10245a152K174k017J564j015n86M55L58J851k285J155j058J110q65l58K112k620
$$ plain form
10124 3 1240 846 -527 1179 5 1611 102 -22 -58 393 369 -1 -403 525 215 -561 476 -1165
10142 -1165 556 -1265 205 -546 -367 890 -639 654 -191 63 -1488 470 676 763 490 -629 490
10159 490 -143 1093 24 558 4 567 221 -1222 1204 -848 508 899 -282 486 -1241 -105 -552
10176 -552 -22 -650 -723 1474 -917 1292 -537 897 -249 -87 969 -985 1633 -658 -97 -1475
10192 -1475 653 762 -1436 1052 -320 530 -556 287 -257 -3 599 -769 222 -50 920 457 -859
10209 -859 -429 213 -809 -433 -662 247 -1432 -516 599 1348 341 -230 -260 89 -426 -1155 455 278
10227 278 630 -39 578 -304 387 -425 -23 861 1047 -1036 698 685 -186 1589 -740 -257 629 -1152
10245 -1152 1022 -995 569 -446 -1032 -577 -219 1632 -653 502 -556 554 -311 -669 1443 -1177
10261a177J192n90L05n45J678j076j728L803k739R74R66j312J33l62O38K30J212
10278A602j791j89M88k18J284j832K327k922Q12L09j07P99j677N31Q46n58n07
10295h03P99J830p17j092n30R39L11j516J491j369J462j176J480j441p00J746
10311G14j128j23J464j198M58M6l3k99j06p82J277j18j274J203P36j036K9m89
10329f59O77m5r57J870p44J40J64n34O3J800j630k06P76q87j11r25J773j240j33
10348h08J115P98J7j846P06J445p40j174P15L80k91r77L02J20N85p97jJ93J06
10367a52O39j314M80j062J510k32k53J81q24K661j900J350j959J142j4k31O44
10384F66k199J721n49R26j277M53J088k063K252j89m30L46r18Q9r35J414j948
$$ plain form
10261 -1177 15 -575 -270 -815 863 -213 -1941 1862 -877 97 1063 -249 -116 -478 160 390 1602
10278 1602 -189 -378 110 -108 1176 -656 1671 -1251 -439 -130 -237 562 -1115 -584 262 -296 -803
10295 -803 -4 1826 1109 17 -513 426 737 -779 712 -657 805 -371 1109 -332 -1032 714
10311 714 -414 -537 927 -271 187 233 200 -99 -205 -987 290 172 -1102 101 837 -199 -170 -659
10329 -659 18 -27 -984 886 142 282 446 -88 -25 1775 145 -61 715 -172 -283 -1208 565 -675 -808
10348 -808 307 1105 1122 -724 -18 1427 687 -487 228 608 317 -660 -358 -238 347 -450 -451 -258 -152
10367 -152 487 -827 -347 -1409 101 -131 -384 -203 -1027 1634 -266 1084 -875 267 253 22 666
10384 666 -1533 188 -361 565 -712 -259 829 -1234 1018 829 399 745 -173 -84 -1019 395 -1553
10401a553R22r81K154m78m76J174j845M35K25K48J017k253J492O25j712O10j81
10418e77M97L96n39K129k560R37K71j427J851j681K038p07k03L35p27k84p80J079
10436D8q87J959j345l10J584j472K507k942J027L76L95j803Q72J139j292J791
10452A647k531N15p46J163J095j699Q92o64m0J20M89k46k120M575l164K102j155
10469B33J99l99r20J736j359L49J323n83J53j693J919n36n77M51p66J633j263
10486a00k16j83P92o05l28L54J89M91J27o28Q86j245K426k570P79j212K196o53
10504E00n12p23M60P11j079J176l83n8k62J025k118J676p24O18j674N3K091q51
10522g4k30o25J721k320J577l64Q85P78j648R7j49J117n44q12J047j322K025j467
$$ plain form
10401 -1553 -631 -1612 542 64 -412 762 -1083 -648 -423 -175 842 -1411 81 706 -1006 -396 -577
10418 -577 -80 316 -223 1906 -654 283 554 -873 978 -703 1335 628 425 760 33 -251 -1031 48
10436 48 -839 1120 -225 -535 1049 -423 2084 -858 169 545 940 -863 9 1148 -144 1647
10452 1647 -884 -369 -1115 48 1143 -556 336 -328 -368 -248 241 -5 -2125 2450 -714 1388 233
10469 233 432 33 -887 849 -510 -161 1162 579 732 -961 958 422 -155 296 -470 1163 -100
10486 -100 -316 -499 293 -312 -640 -286 -97 394 521 -107 779 -466 1960 -610 169 -1043 1153 500
10504 500 -12 -735 -275 436 -643 533 150 92 -170 855 -1263 413 -311 307 -1367 -1314 777 -74
10522 -74 -304 -929 792 -1528 49 -315 570 1348 -300 -203 -352 765 221 -591 456 -866 1159 -308
10540c08J151r51o77J530j203R62j479J634R59l137K791j857J475k012N28J413
10556H19j552J457p92K331k914N61o38N96m04o81K158j397M14k78j45J14j119
10573a470K330j592J135j045J210N40j588J043j155P2J209K56M22j637O96o03
$$ plain form
10540 -308 843 -108 -785 745 -458 504 -975 659 1618 -1519 1272 -585 890 -1122 -594 819
10556 819 -733 724 -68 2263 -651 -90 -728 -132 -536 -1217 941 -456 -42 -320 -465 -351 -1470
10573 -1470 860 -732 403 -642 568 1108 -480 563 -592 -520 689 945 1367 -270 426 -177
$$ [...]
16383i01
##END NTUPLES=NMR FID
##END=
