##TITLE=31P_DE-80H_X3
 64 sc D2O
 26.2.2025
##JCAMPDX= 6.0         $$ Bruker NMR JCAMP-DX V2.0
##DATA TYPE= NMR SPECTRUM
##DATA CLASS= NTUPLES
##ORIGIN= UXNMR, Bruker Analytische Messtechnik GmbH
##OWNER= root
$$ XWIN-NMR		Version 3.5
$$ Wed May 14 16:42:34 2025 Russian Standard Time (UT+4h)  Yarkov@DPX200
##.OBSERVE FREQUENCY= 81.013821
##.OBSERVE NUCLEUS= ^31P
##.ACQUISITION MODE= SIMULTANEOUS
##.ACQUISITION SCHEME= undefined
##.AVERAGES= 64
##.DIGITISER RES= 17
##SPECTROMETER/DATA SYSTEM= spect
##.PULSE SEQUENCE= zgpg30
##.SOLVENT NAME= CDCl3
##.SHIFT REFERENCE= (INTERNAL, CDCl3, 0, 198.062)
##AUDIT TRAIL= $$ (NUMBER, WHEN, WHO, WHERE, WHAT)
$$ ##TITLE= Audit trail, XWIN-NMR		Version 3.5
$$ ##JCAMPDX= 5.01
$$ ##ORIGIN= Bruker BioSpin GmbH
$$ ##OWNER= Yarkov
$$ C:/Bruker/XWIN-NMR/data/yarkov2/nmr/P31/2/pdata/1/auditp.txt
$$ ##AUDIT TRAIL=  $$ (NUMBER, WHEN, WHO, WHERE, WHAT)
(   1,<2025-05-14 16:41:39.78 +0400>,<Yarkov>,<DPX200>,
      <created by zg, POWCHK disabled, PULCHK disabled
       configuration hash MD5:
       00 E9 B6 7A A2 85 ED C7 34 08 36 98 17 FE 4E 26
       data hash MD5: 32K
       78 B6 DC 32 9D BB 1B CA A6 E4 EA 04 73 F8 91 CE>)
(   2,<2025-05-14 16:41:46.51 +0400>,<Yarkov>,<DPX200>,
      <Start of raw data processing
       efp BC_mod = 2 LB = 1.5 FT_mod = 6 PKNL = 1 PHC0 = 1794.935 PHC1 = 13.55945 SI = 64K 
       data hash MD5: 64K
       4E FD C2 C1 E6 DB AF 99 78 8A 17 EB 38 95 14 58>)
(   3,<2025-05-14 16:42:05.64 +0400>,<Yarkov>,<DPX200>,
      <pk PHC0 = -5.72145 PHC1 = -12.4 
       data hash MD5: 64K
       25 FF F0 C1 25 D3 73 78 8D E0 0A FB 6C 3D 5A 35>)
$$ ##END=
$$ 
$$ hash MD5
$$ 1F 28 9E 53 A5 A7 CE FE ED 55 29 A8 0A A4 EA 0B
##$RELAX= 
##$RELAX= 
##$RELAX= 
##$RELAX= 
##$RELAX= 
##$RELAX= 
##$RELAX= 
##$RELAX= 
$$ Bruker specific parameters
$$ --------------------------
##$DU= <C:/Bruker/XWIN-NMR>
##$EXPNO= 2
##$NAME= <P31>
##$PROCNO= 1
##$TYPE= <nmr>
##$USER= <yarkov2>
##$AMP= (0..31)
100 100 100 100 100 100 100 100 100 100 100 100 100 100 100 100 100 100 
100 100 100 100 100 100 100 100 100 100 100 100 100 100 
##$AQSEQ= 0
##$AQ_mod= 1
##$AUNM= <au_zg>
##$AUTOPOS= <>
##$BF1= 81.014009
##$BF2= 200.13
##$BF3= 200.13
##$BF4= 200.13
##$BF5= 200.13
##$BF6= 200.13
##$BF7= 200.13
##$BF8= 200.13
##$BYTORDA= 1
##$CFDGTYP= 0
##$CFRGTYP= 5
##$CHEMSTR= <none>
##$CNST= (0..31)
1 1 145 1 1 1 1 1 1 1 1 1 1 1 1 1 1 1 1 1 1 1 1 1 1 1 1 1 1 1 1 1 
##$CPDPRG= <waltz16>
##$CPDPRG1= <>
##$CPDPRG2= <waltz16>
##$CPDPRG3= <>
##$CPDPRG4= <mlev>
##$CPDPRG5= <mlev>
##$CPDPRG6= <mlev>
##$CPDPRG7= <mlev>
##$CPDPRG8= <mlev>
##$CPDPRGB= <>
##$CPDPRGT= <>
##$D= (0..31)
0 1 0 0 0 0 0 0 0 0.06 0 0.03 2e-05 3e-06 0 0 0.0002 0 0 0 0 0 0 0 0 0 
0 0 0 0 0 0 
##$DATE= 1747226499
##$DBL= (0..7)
120 120 120 11 120 120 24 19 
##$DBP= (0..7)
150 150 150 150 150 150 150 150 
##$DBP07= 0
##$DBPNAM0= <>
##$DBPNAM1= <>
##$DBPNAM2= <>
##$DBPNAM3= <>
##$DBPNAM4= <>
##$DBPNAM5= <>
##$DBPNAM6= <>
##$DBPNAM7= <>
##$DBPOAL= (0..7)
$$ [...]
##$SUBNAM3= <"">
##$SUBNAM4= <"">
##$SUBNAM5= <"">
##$SUBNAM6= <"">
##$SUBNAM7= <"">
##$SUBNAM8= <"">
##$SUBNAM9= <"">
##$SW= 400.765351723535
##$SWIBOX= (0..15)
0 1 3 0 0 0 0 0 0 0 0 0 0 0 0 0 
##$SW_h= 32467.5324675325
##$TD= 32768
##$TD0= 1
##$TE= 0
##$TE2= 300
##$TE3= 300
##$TEG= 300
##$TL= (0..7)
0 120 53 12 22 120 120 120 
##$TP= (0..7)
150 150 150 150 150 150 150 150 
##$TP07= 0
##$TPNAME0= <>
##$TPNAME1= <>
##$TPNAME2= <>
##$TPNAME3= <>
##$TPNAME4= <>
##$TPNAME5= <>
##$TPNAME6= <>
##$TPNAME7= <>
##$TPOAL= (0..7)
0.5 0.5 0.5 0.5 0.5 0.5 0.5 0.5 
##$TPOFFS= (0..7)
0 0 0 0 0 0 0 0 
##$TUNHIN= 0
##$TUNHOUT= 0
##$TUNXOUT= 0
##$USERA1= <user>
##$USERA2= <user>
##$USERA3= <user>
##$USERA4= <user>
##$USERA5= <user>
##$V9= 5
##$VALIST= <valist>
##$VCLIST= <CCCCCCCCCCCCCCC>
##$VD= 0
##$VDLIST= <DDDDDDDDDDDDDDD>
##$VPLIST= <PPPPPPPPPPPPPPP>
##$VTLIST= <TTTTTTTTTTTTTTT>
##$WBST= 1024
##$WBSW= 4
##$XGAIN= (0..3)
0 0 0 0 
##$XL= 0
##$YL= 0
##$YMAX_a= 20463
##$YMIN_a= -4536
##$ZGOPTNS= <>
##$ZL1= 120
##$ZL2= 120
##$ZL3= 120
##$ZL4= 120
##$ABSF1= 0
##$ABSF2= 0
##$ABSG= 0
##$ABSL= 0
##$ALPHA= 0
##$AQORDER= 0
##$ASSFAC= 0
##$ASSFACI= 0
##$ASSFACX= 0
##$ASSWID= 0
##$AUNMP= <proc_1d>
##$AZFE= 0.1
##$AZFW= 0.5
##$BCFW= 0
##$BC_mod= 2
##$BYTORDP= 0
##$COROFFS= 0
##$CY= -3
##$DATMOD= 1
##$DC= 0
##$DFILT= <>
##$DTYPP= 0
##$F1P= 0
##$F2P= 0
##$FCOR= 1
##$FTSIZE= 65536
##$FT_mod= 6
##$GAMMA= 0
##$GB= 0
##$INTBC= 1
##$INTSCL= 9.790993e-09
##$ISEN= 30
##$LB= 1.5
##$LEV0= 0
##$LPBIN= 0
##$MAXI= 10000
##$MC2= 0
##$MEAN= 0
##$ME_mod= 0
##$MI= 50
##$NCOEF= 0
##$NC_proc= -8
##$NLEV= 6
##$NOISF1= 182.463
##$NOISF2= 159.3651
##$NSP= 0
##$NTH_PI= 0
##$NZP= 0
##$OFFSET= 198.0616
##$PC= 4
##$PHC0= 1789.214
##$PHC1= 1.159451
##$PH_mod= 1
##$PKNL= yes
##$PPARMOD= 0
##$PSCAL= 0
##$PSIGN= 0
##$REVERSE= no
##$SF= 81.0140089999434
##$SI= 65536
##$SIGF1= 159.3651
##$SIGF2= -187.1042
##$SINO= 113.3802
##$SIOLD= 16384
##$SREGLST= <1H.CDCl3>
##$SSB= 0
##$STSI= 65536
##$STSR= 0
##$SW_p= 32467.5324675325
##$SYMM= 0
##$S_DEV= 0
##$TDeff= 32768
##$TDoff= 0
##$TI= <>
##$TILT= no
##$TM1= 0
##$TM2= 0
##$TOPLEV= 0
##$USERP1= <user>
##$USERP2= <user>
##$USERP3= <user>
##$USERP4= <user>
##$USERP5= <user>
##$WDW= 1
##$XDIM= 65536
##$YMAX_p= 154151212
##$YMIN_p= -249883736
$$ End of Bruker specific parameters
$$ ---------------------------------
##NTUPLES= NMR SPECTRUM
##VAR_NAME=  FREQUENCY,     SPECTRUM/REAL,   SPECTRUM/IMAG
##SYMBOL=    X,             R,               I
##VAR_TYPE=  INDEPENDENT,   DEPENDENT,       DEPENDENT
##VAR_FORM=  AFFN,          ASDF,            ASDF
##VAR_DIM=   65536,         65536,           65536
##UNITS=     HZ,            ARBITRARY UNITS, ARBITRARY UNITS
##FACTOR=    0.49542278885378, 1,            1
##FIRST=     16045.7642231865, 0,            0
##LAST=      -16421.768244346, 0,            0
##MIN=       -16421.768244346, -249883736,   0
##MAX=       16045.7642231865, 154151212,    0
$$ Real data points
##PAGE= N=1
##DATA TABLE= (X++(R..R)), XYDATA
$$ [...]
##PAGE= N=2
##DATA TABLE= (X++(I..I)), XYDATA
7483A125008K88131L44905l38606o3678J507025K285768J386582Q31032J538830
7474H904997Q86781k642174n437538l549656P49852J997374j98087j157178Q38549
7465C92920J990341l02162l087321k656650O6252J758821J539407P09797k56682
7456A54723j528023j976349j96553K911795M632791L525727Q19104j127301r95306
7447F220608M81459J229185J31462j349930j023036N95013O45231j702869l547353
7438A679770k307053N59144J768269N35533j364666k487635k409143o51939K477448
7429b200272M528720L042707q41312l197252k123290K26165R25391k36152j357013
7420a232308j080377K63061J263408O13133j535887l128409k059134J265018M159888
$$ plain form
7483 1125008 1413139 1758044 1419438 1355760 2862785 5148553 6535135 7366167 8904997
7474 8904997 9791778 7149604 1712066 -1837590 -1087738 909636 711549 -445629 392920
7465 392920 2383261 2081099 -1006222 -3662872 -3596620 -1837799 -298392 411405 154723
7456 154723 -1373300 -3349649 -3546202 -634407 3998384 7524111 8343215 7215914 6220608
7447 6220608 6702067 7931252 8062714 6712784 5689748 6284761 6929992 5227123 1679770
7438 1679770 -627283 -68139 1700130 2235663 870997 -1616638 -4025781 -4677720 -2200272
7429 -2200272 2328448 5371155 4529843 1332591 -790699 -564534 360857 124705 -1232308
7420 -1232308 -2312685 -2049624 -786216 -173083 -1708970 -4837379 -6896513 -5631495 -1471607
7411a471607M628227L016898O32210j759719l415591l129262o34373K199969K853259
7402B920011Q18101j861716k727824j315851N50937R31536J81654L76564J826808
7393A700220J720739j839344n717248m961585r2040K781001M90173k615871j523811
7384a0057766J761025J964580n64621o14122K794822M301559P81909l447818l103534
7375f183966O00719K777732K096728J029692Q78534P73990O11123J086070J256095
7366D926717l74686k522014k317429R5340J566135Q67531J41994P04388R42477
7357D030453k77731j451343j477748j821771l434328m219888k177505J101505
7349i728356K770754K747175K618688K160060J39904k328251k523337j37762K151981
$$ plain form
7411 -1471607 3156620 6173518 6805728 5046009 1630418 -1498844 -2133217 66752 2920011
7402 2920011 3738112 1876396 -851428 -2167279 -1616342 -684806 -503152 -126588 1700220
7393 1700220 3420959 1581615 -4135633 -9097218 -9189258 -6408257 -5918084 -8533955 -10057766
7384 -10057766 -8296741 -6332161 -6896782 -7510904 -4716082 -414523 367386 -3080432 -6183966
7375 -6183966 -5583247 -2805515 -708787 320905 1199439 1973429 2584552 3670622 4926717
7366 4926717 4552031 2030017 -287412 -192072 1374063 2241594 2383588 3087976 4030453
7357 4030453 3752722 2301379 823631 -998140 -4432468 -8652356 -10829861 -9728356
7349 -9728356 -6957602 -4210427 -1591739 568321 708225 -1620026 -4143363 -4281125 -2129144
7340b129144K363640J229586K95338J0160J31969M19830M94605J31518k45132
7331B702370k47032k30773l08144L91257J956595K349765M3180k836581k718047
7322A102590L01834K378238J249985j114320j979593j320975m94746L20324J466818
7313A910155K053908R18413j128854j673458L69446L009330L001865m42032m213761
7304C805012m444729j057304K145833K263505L39901j202648j836587j924089
7296a911106q80299J057877J407870j005751l024134j444088J436798J068670
7288c294163j904994k690998k12462J800671J749422K118433L493136K910595
7280C969640P7381j060302M21378L3637l731940n233616q06643M127227L257419
$$ plain form
7340 -2129144 234496 1464082 1759420 1769580 1901549 2321379 2815984 2947502 2702370
7331 2702370 2455338 2224565 1916421 2307678 4264273 6614038 6657218 3820637 1102590
7322 1102590 1404424 3782662 5032647 3918327 1938734 617759 123013 443337 1910155
7313 1910155 3964063 4882476 3753622 2080164 2449610 5458940 8460805 8018773 3805012
7304 3805012 -639717 -1697021 448812 2712317 3052218 1849570 12983 -1911106
7296 -1911106 -2791405 -1733528 -325658 -1331409 -4355543 -5799631 -4362833 -3294163
7288 -3294163 -5199157 -7890155 -8102617 -6301946 -4552524 -2434091 1059045 3969640
7280 3969640 4047021 2986719 3408097 3441734 -290206 -5523822 -6330465 -2203238 1054181
7271A054181o67082j232604P89913J67240k434313j796019J583691J669536k342656
7262c208113m044750l61177L658137L345299R34942J46478J41962j033707j758762
7253b179691j8517K152011J589888r77116k345002j492654N7138J065044J394033
7244g54866J194083R56159J173292R86457j090658m327371n828864m268971j306988
7235a3267727J275719L087393L275684P03654k886802l579663p48106J822247
7227a0317601J879251J582647K308742J432344k174814m045782m42694M691998
7219e085909M648559l96287m121543l113985J37737K631046M031084M279083K654667
7210E664452k742j769083k667928l803012l706380J63721N887852P694400L603101
$$ plain form
7271 1054181 387099 -845505 -55592 111648 -2322665 -4118684 -2534993 -865457 -3208113
7262 -3208113 -7252863 -7614040 -3955903 -610604 324338 470816 612778 -420929 -2179691
7253 -2179691 -2198208 -46197 1543691 566575 -1778427 -3271081 -3213943 -2148899 -754866
7244 -754866 439217 1395376 2568668 3555125 2464467 -1862904 -7691768 -11960739 -13267727
7235 -13267727 -11992008 -8904615 -5628931 -4925277 -7812079 -11391742 -12139848 -10317601
7227 -10317601 -8438350 -6855703 -4546961 -3114617 -5289431 -9335213 -9777907 -5085909
7219 -5085909 -437350 -833637 -4955180 -8069165 -7931428 -5300382 -1269298 3009785 5664452
7210 5664452 5661710 3892627 1224699 -2578313 -6284693 -6120972 -233120 7461280 11064381
7201A1064381j630929l190346k089158j878979k760350k352053l24631J145476
7193b016589Q28734k91757j024365j271779j252781q28916J03673J234129J958045
7184b561606J745205P30761p1222J96079J026314J258939Q92508R77909J657228
7175E852115J793506R28969O9580j65282o63383k066298l233757k837040j562252
7166a883842j197052j971508k314926j284328J16669N68363M26433J157450L081867
7157c300874M652775M316755K370566K84647j244157k445813k986631j953616
7149c06348K61510J697769J418298R60132J919929L345996L108571Q75468j930871
7140A1350454m192432n270451m160197r36382J541911K61347l431209m781712
$$ plain form
7201 11064381 9433452 6243106 4153948 2274969 -485381 -2837434 -3162065 -2016589
7193 -2016589 -1187855 -1479612 -2503977 -3775756 -5028537 -5857453 -5753780 -4519651 -2561606
7184 -2561606 -816401 -85640 -156862 39217 1065531 2324470 3216978 4194887 5852115
7175 5852115 7645621 8574590 8644170 8478888 7815505 5749207 2515450 -321590 -1883842
7166 -1883842 -3080894 -5052402 -7367328 -8651656 -8534987 -7966624 -7540191 -6382741 -3300874
7157 -3300874 1351901 5668656 8039222 8323869 7079712 4633899 1647268 -306348
7149 -306348 -44838 1652931 3071229 4031361 5951290 9297286 12405857 13281325 11350454
7140 11350454 7158022 1887571 -2272626 -3209008 -1667097 -1405750 -4836959 -9618671
7132i618671j845560J955621K770394J256114N89090J561856K292817J799995
7124G61656J136748R72865L88281j172595k448973k028362m33982P25963J115424
7115i82975J689447K419510J804836m64938k046882r97637Q56772K26574k329878
7106A74829k632879P79944L855899K587452j373571l390086k065901K23309J459491
7097c81513J428895J77163j692020k033655J74372K011562K08413l094595k630971
7088e832349J874714M769898K774075o71026j488456p96616j441075k532408j508438
7079d851681Q77054J739122Q31500M93280J571663K496549K087717Q00562n88045
7070E457721j588790j671774r07016l52498n62116p13520l54754m43017j214695
$$ plain form
7132 -9618671 -11464231 -9508610 -6738216 -5482102 -4893012 -3331156 -1038339 761656
7124 761656 1898404 2871269 3259550 2086955 -362018 -2390380 -2824362 -2098399 -982975
7115 -982975 706472 3125982 4930818 4465880 2418998 1421361 2278133 2504707 174829
7106 174829 -2458050 -1678106 2177793 4765245 3391674 1588 -2064313 -1841004 -381513
7097 -381513 1047382 1224545 -467475 -2501130 -2326758 -315196 -106783 -3201378 -5832349
7088 -5832349 -3957635 812263 3586338 2915312 1426856 630240 -810835 -3343243 -4851681
7079 -4851681 -3974627 -2235505 -1404005 -910725 660938 3157487 5245204 6045766 5457721
7070 5457721 3868931 2197157 1290141 937643 375527 -337993 -692747 -1135764 -2350459
7061b350459r88946R28091K174398O80465j755065k150460j007511r85847k085356
7052g540690j775017N27832K554866K795764K010338J059962R950n40393J28058
7043g69330J111181J045579O80280J536010K527962J244390j670912l088523k410795
7034B05842k073512k635145j733459R40226K126379M07357j109221q2004J040626
7025b912911n16999k838797k490624J8996J818967K520574L509493M113640K632451
7016E854790K04931l10547J098031J665847K28899j716950l111141m273037m797156
7007e156333l632505j475522k98383l92888m94279n38759j282269j542575N84996
6998a4228517L740967M408849K389526J052591J455634Q76564j404880j991241
$$ plain form
7061 -2350459 -3339405 -2411314 -236916 443549 -1311516 -3461976 -4469487 -5455334 -7540690
7052 -7540690 -9315707 -8787875 -6233009 -3437245 -1426907 -366945 -356995 -897388 -769330
7043 -769330 341851 1387430 2067710 3603720 6131682 7376072 5705160 2616637 205842
7034 205842 -1867670 -4502815 -6236274 -5296048 -3169669 -2762312 -3871533 -3953537 -2912911
7025 -2912911 -3429910 -6268707 -8759331 -8740335 -6921368 -4400794 -891301 3222339 5854790
7016 5854790 6059721 5749174 6847205 8513052 8741951 7025001 3913860 -359177 -5156333
7007 -5156333 -8788838 -10264360 -10562743 -10955631 -11449910 -11988669 -13270938 -14813513 -14228517
6998 -14228517 -10487550 -6078701 -3689175 -2636584 -1180950 -304386 -1709266 -3700507
6990c700507M07177J693085r31332l622676k020793J292114J260604q42520Q7134
6981f377714L427612L281641j392315m452500k152491J565140K205433J197378
6973b697816J374917J189417j586029m241819k764583J278799K873469J236167
6965c337478J95779J406683K221456Q78267o65911m50025N19865O75771M53683
6956A898090P29273Q73440O2950j032413j284425o97632n548L13612K2261q28375
6946E1233j487469j230189n47459l58140l20824L44034P49356n50374k428511
6937e778343k055197N98191K188045R63355q46939j145664j151780k104592j963625
6928a1296549J146542M505449L884398n1229k424562r98913J407993J845469J042197
$$ plain form
6990 -3700507 -3293330 -1600245 -2531577 -6154253 -8175046 -6882932 -5622328 -6464848 -6377714
6981 -6377714 -2950102 331539 -1060776 -5513276 -7665767 -6100627 -3895194 -2697816
6973 -2697816 -1322899 -133482 -1719511 -5961330 -8725913 -7447114 -4573645 -3337478
6965 -3337478 -3141699 -1735016 486440 1364707 698796 248771 768636 1444407 1898090
6956 1898090 2627363 3500803 3563753 2531340 1246915 549283 543735 857347 879608 51233
6946 51233 -1436236 -2666425 -3213884 -3572024 -3892848 -3548814 -2799458 -3349832 -5778343
6937 -5778343 -7833540 -7235349 -5047304 -4083949 -4930888 -6076552 -7228332 -9332924 -11296549
6928 -11296549 -10150007 -5644558 -1760160 -1811389 -4235951 -5234864 -3826871 -1981402 -939205
6919i39205Q71801P99684r03077l760481n008951k856439J267488M034214L553298
6910b941668J151199m25981k74452J78434n0821Q3670J544224L087090K793420
6901E145115O33969j974273m059347m971195l724024o12819J611359P36333j365776
6892h580658q22473K872064O184107O230975L587910K83816k304429l066082j386734
6883B998496J177614J659370p45913l547230m126502k348033L79471K565988K737725
6874G50986N06505j756454r19383K315100L668668J397701j074541o20770Q38568
6865E106380O8068j905655j901717k85129j14207j521965j503391O20849J936884
6856E00117J069607M22881J471424J608233j397804m658033l614250J165136M405298
$$ plain form
6919 -939205 -67404 732280 -170797 -3931278 -8940229 -11796668 -10529180 -6494966 -2941668
6910 -2941668 -1790469 -2216450 -2490902 -2312468 -2363289 -2279619 -735395 2351695 5145115
6901 5145115 5779084 3804811 -254536 -5225731 -8949755 -9562574 -7951215 -7214882 -8580658
6892 -8580658 -9403131 -6531067 -346960 5884015 9471925 9755741 7451312 4385230 2998496
6883 2998496 4176110 5835480 5089567 1542337 -2584165 -4932198 -4552727 -1986739 750986
6874 750986 1257491 -498963 -1418346 896754 4565422 5963123 4888582 4267812 5106380
6865 5106380 5174448 3268793 1367076 1081947 967740 -554225 -2057616 -1436767 500117
6856 500117 1569724 1992605 3464029 5072262 3674458 -983575 -4597825 -3432689 972609
6847I72609L198802K49593q02420l42702j117256l456314m676836k902040N30096
6838h346468K913554L147295K226019J532799J347051Q95281l79430j692045j540434
6829A03622J52205J353960N31326q03985p1676K128134K328656o14746l460133
6820A647363l292033j610484j223194j417737K73393K966567L189824N08393j576072
6811e33980r78957L35530K90060p8469P68245J739651R61369j024839k125433
6802f46823j670269p30180k02115L5255N15179J518398K544297K363375N88555
6793D315672j032723n12871J348115J854414K86425j427019j840497j099968Q75258
6784B766806L788851M513053j38369p122871q865776l565998J511242N06266k715427
$$ plain form
6847 972609 4171411 4421004 3618584 3275882 2158626 -1297688 -5974524 -8876564 -8346468
6838 -8346468 -5432914 -2285619 -59600 1473199 2820250 3715531 3336101 1644056 103622
6829 103622 255827 1609787 2141113 1337128 1265452 3393586 5722242 5107496 1647363
6820 1647363 -1644670 -3255154 -4478348 -5896085 -5622692 -2656125 533699 1042092 -533980
6811 -533980 -1512937 -1177407 -887347 -965816 -197571 1542080 2503449 1478610 -646823
6802 -646823 -2317092 -3047272 -3249387 -3214132 -2698953 -1180555 1363742 3727117 4315672
6793 4315672 3282949 2770078 4118193 5972607 6259032 4832013 2991516 1891548 2766806
6784 2766806 6555657 11068710 10930341 3807470 -5058306 -8624304 -7113062 -6606796 -9322223
6775i322223j793408J576545J377892j674936j024401M485759Q066205N037182
6767F728615r73811m112119l458106j610802k17635M51419L91306L75435J354489
6758a071209K303069J144983j615891l135243k579414j891039j652801n6482K905353
6749e648674M238175K635283O13081N5454o23434k577963l485189j314678J905553
6740d202392L059235K120085P28818p17829j830652r00084K059899L556816J332972
6731E206868j539911r73509J829382K426826q4305k567317l161300k916780k473837
6722d253883j069612Q65955J482057L95507q00645j098486q45476k09955P41111
6713d793427R22093k89088j164078k2797J442632O92797p04300R83367M874161
$$ plain form
6775 -9322223 -11115631 -9539086 -8161194 -9836130 -10860531 -6374772 1691433 6728615
6767 6728615 5754804 1642685 -1815421 -3426223 -3643858 -3192439 -2801133 -2425698 -1071209
6758 -1071209 1231860 2376843 760952 -2374291 -4953705 -6844744 -8497545 -8554027 -5648674
6749 -5648674 -1410499 1224784 1837865 1893319 1269885 -1308078 -4793267 -6107945 -4202392
6740 -4202392 -1143157 976928 1705746 987917 -842735 -1742819 317080 3873896 5206868
6731 5206868 3666957 2693448 4522830 6949656 6865351 4298034 1136734 -1780046 -4253883
6722 -4253883 -5323495 -4457540 -2975483 -2579976 -3380621 -4479107 -5324583 -5534538 -4793427
6713 -4793427 -3871334 -4160422 -5324500 -5347297 -3904665 -3211868 -3916168 -2932801 1941360
6704A941360N609147J407442k835431k703983j85717N92014j85310K57166J726572
6695E623260J593747l09541j331637l55942Q06086O53233j98228j045627k440327
6686B995024m387542n113435l159174K39800K207128J422859n60436j197459L52073
6677g201162K551516L269870J934656j85812j510768j489337n69160M63380R03200
6668a833617N01520j99809l25816K41423O56329K82919m27078o73351m96272o15304
6658b889056j242742j662877j135356J63945J381606J979329K058567J609624
6650B63040R1024k476420m355894l376059J93561L265213L334119J293158k21250
6641a989508l13301j17269k90474j80891M93367R46906P34798L94977K53661k6656
$$ plain form
6704 1941360 7550507 8957949 6122518 3418535 3232818 3824832 3639522 3896688 5623260
6695 5623260 7217007 6907466 5575829 5219887 6025973 6679206 6480978 5435351 2995024
6686 2995024 -1392518 -6505953 -9665127 -9425327 -7218199 -5795340 -6355776 -7553235 -7201162
6677 -7201162 -4649646 -1379776 554880 369068 -1141700 -2631037 -3200197 -2736817 -1833617
6668 -1833617 -1332097 -1531906 -1857722 -1616299 -959970 -677051 -1104129 -1777480 -2273752 -2889056
6658 -2889056 -4131798 -5794675 -6930031 -6766086 -5384480 -3405151 -1346584 263040
6650 263040 354064 -2122356 -6478250 -9854309 -9660748 -6395535 -3061416 -1768258 -1989508
6641 -1989508 -2302809 -2420078 -2710552 -2891443 -2398076 -1451170 -716372 -321395 -67734 -94390
6631i4390k76477K98943J438166J611466M57265j41520J140550K526487J369249
6622H329739j768693l479066k055693L70120J014018K0211n70214k35825l00767
6613A323830j079740j006519M48067J026695j123962l841045l368162o4168J662062
6604f022942j9037j374265R16462M014628L003500j289326l282122r91281J481617
6595c562766P67151j013734n01752J610427K487377J662055N78480l68188j331780
6586C27270j202146O36808K070655R68259r45846m26541J738304J409314k451830
6577B124247n870847n455003k419917N14324K915159M995756N074612J967119
6569C845450j728403k162107M54618K067791M09013k303974k963387j486755J69629
$$ plain form
6631 -94390 -370867 -71924 1366242 2977708 3434973 3293453 4434003 6960490 8329739
6622 8329739 6561046 3081980 1026287 1396407 2410425 2430636 1860422 1624597 1323830
6613 1323830 244090 -762429 -314362 712333 -411629 -4252674 -7620836 -7685004 -6022942
6604 -6022942 -6041979 -7416244 -6499782 -2485154 518346 -770980 -4053102 -5044383 -3562766
6595 -3562766 -2795615 -3809349 -4311101 -2700674 -213297 1448758 2027238 1659050 327270
6586 327270 -874876 -238068 1832587 2800846 1855000 1428459 3166763 4576077 2124247
6577 2124247 -3746600 -9201603 -11621520 -11107196 -8192037 -3196281 1878331 3845450
6569 3845450 2117047 -45060 409558 2477349 2886362 582388 -2380999 -3867754 -3698125
6560c698125J129613J904276K416019J610769p21031k981389l345362j837756
6552e522986j98442K17118k17932l61419P7190O23801J284785K403250L169935
6543A475300J932877j050972k746819j038587J775361J618676j594680l671284
6535c300128k113381O25278J328313N92540P49048J577185J390760P93936J512831
6526C156382K330406N03681k747369k909461N40465K453189P662k505988q41519
6517a2552J681684m56511n077059m877799Q09472M233302P86641m334110m435353
6508a1682285q06786Q38534m96933j031566P23938K234015J907452J218958J333263
6499e761410J309416N94400K92798Q54838R56654k04458j517069j804252j241072
$$ plain form
6560 -3698125 -2568512 -664236 1751783 3362552 2641521 -339868 -3685230 -5522986
6552 -5522986 -5721428 -5504310 -5722242 -6083661 -6006471 -5382670 -4097885 -1694635 1475300
6543 1475300 3408177 2357205 -389614 -1428201 347160 1965836 371156 -3300128
6535 -3300128 -5413509 -4788231 -3459918 -2867378 -2118330 -541145 849615 1643551 3156382
6526 3156382 5486788 5990469 3243100 333639 874104 3327293 3334955 828967 -12552
6517 -12552 1669132 1212621 -3864438 -8742237 -7932765 -3699463 -2912822 -7246932 -11682285
6508 -11682285 -12489071 -11650537 -12147470 -13179036 -12455098 -10221083 -8313631 -7094673 -5761410
6499 -5761410 -4451994 -3857594 -3564796 -2709958 -1753304 -1957762 -3474831 -5279083 -6520155
6490f520155j70450J556282L214932L214444J513638L561o55469k183749m955589
6481d982555n790127k411541J927281K183420j034173k115919J176781M547956
6473f498877M064043J879491J839845K852883J262480k102053k587968O45377
6465A355221K807255P37210k542331l057955j796017j838810k546476j066441
6457g948344J831028K141938j046643l725816k596789O18182K051081O31431j377905
6448i421837j316891J458632M940097N785535K676269j450675k306144M08144
6440G73130K706088J762987q63899k351513k331106j984868j680598j293220j125316
6431f388315r44331K28477K086124K775403J944531J605704K343867J593074j857753
$$ plain form
6490 -6520155 -6690605 -5134323 -1919391 1295053 2808691 2812252 2156783 -26966 -4982555
6481 -4982555 -10772682 -13184223 -11256942 -9073522 -10107695 -12223614 -11046833 -6498877
6473 -6498877 -2434834 -555343 1284502 4137385 5399865 3297812 709844 1355221
6465 1355221 4162476 4899686 2357355 -700600 -2496617 -4335427 -6881903 -7948344
6457 -7948344 -6117316 -3975378 -5022021 -8747837 -11344626 -10726444 -8675363 -8043932 -9421837
6448 -9421837 -10738728 -9280096 -4339999 1445536 4121805 2671130 364986 773130
6440 773130 3479218 5242205 4378306 2026793 -304313 -2289181 -3969779 -5262999 -6388315
6431 -6388315 -7332646 -7104169 -5018045 -2242642 -298111 1307593 3651460 5244534 3386781
6422C386781m585520l150988L88857J496450j18667j033655j35865M61955Q6497
6413c204155N21993K052263K661720J827041J212788R11187r34424l708121l818519
6404b478227m50125K213402J005565j551136j570480K66014O35096p52724j153422
6395c836037N65002K484777K506825L68004k717340m564974l028241J466958N162662
6386a592364M798328J545647q71336j202864j389382k597725l292346j985492
6378f587534J92561R86608J3263r32338l02120J255849J695421J76068j739786
6369e242008k080833j084036n48542q58726n45678P90970J256319m32403k602440
6360a1347377k849256j312685j1278J39381n7336K00938Q92564J619066J731796
$$ plain form
6422 3386781 -1198739 -4349727 -3960870 -2464420 -2583087 -3616742 -3752607 -3290652 -3204155
6413 -3204155 -2682162 -629899 2031821 3858862 5071650 5982837 5048413 1340292 -2478227
6404 -2478227 -2928352 -714950 290615 -1260521 -2831001 -2564987 -1929891 -2682615 -3836037
6395 -3836037 -3271035 -786258 1720567 2088571 -628769 -5193743 -8221984 -6755026 -1592364
6386 -1592364 3205964 4751611 3880275 2677411 1288029 -1309696 -4602042 -6587534
6378 -6587534 -6394973 -5408365 -5395102 -6327440 -6629560 -5373711 -3678290 -3502222 -5242008
6369 -5242008 -7322841 -8406877 -8955419 -9814145 -10359823 -9568853 -8312534 -8744937 -11347377
6360 -11347377 -14196633 -15509318 -15520596 -15381215 -15438551 -15237613 -14345049 -12725983 -10994187
6351a0994187O57410q72986q60144J444653M004440M379511K753068J086910J42034
6342A740709q94646k325329l212650k703526r83915R14888J680000Q25534k54216
6333e213151L95570K310617K782482R78945m61401M25289J807463J478329P12004
6324E216147J379157J631143j184809m852568m481428m453L350052K539219J45959
6315C738419o18016o8248K74657L24476K6848j261332k368859p42576K961427
6306B266796M329283J440873j887119j830231j39621o03429k761935l133707r76648
6297c295738R64991O22583j439425l421195l332883r93M602247N831441K005843
6288B536871k339191k214043P82891J486258l22719P8222L849256N908559K660568
$$ plain form
6351 -10994187 -10336777 -11209763 -12069907 -10625254 -6620814 -2241303 511765 1598675 1740709
6342 1740709 846063 -1479266 -4691916 -7395442 -8379357 -7464469 -5784469 -4958935 -5213151
6333 -5213151 -4817581 -2506964 275518 1254463 793062 1218351 3025814 4504143 5216147
6324 5216147 6595304 8226447 7041638 2189070 -2292358 -2296811 1053241 3592460 3738419
6315 3738419 3120403 3052155 3326812 3651288 3678136 2416804 47945 -694631 2266796
6306 2266796 6596079 8036952 6149833 4319602 4179981 3576552 814617 -2319090 -3295738
6297 -3295738 -2330747 -1708164 -3147589 -6568784 -9901667 -9902660 -5300413 531028 2536871
6288 2536871 197680 -2016363 -1233472 252786 -69933 8289 3857545 9766104 12426672
6279A2426672k462346m209464k628658j453792j884236j820639k26609J230331
6271a028741J015352k61782j146756r83638J82774K025896L621682L559673J184850
6262H169310k340599m649300m172297j618561P76650J580669J276130Q29078R6928
6253e1992j371456k747144k686345j433393n29740l61409K65689J672923K244687
6244d998180Q37695j190123j696178n44265O53096R41273Q44748J082152J653317
6235b416465K190927K309354J597182P9269j271928j345983m90686m84931k249752
6226b083013m094267l307359K97661L458013L034387m1207j804220l08633K047859
6217b800779K106808J98444r87477p20352r51458k677902l957348k567491R35076
$$ plain form
6279 12426672 9964326 5754862 3126204 1672412 -211824 -2032463 -2259072 -1028741
6271 -1028741 -13389 -275171 -1421927 -2405565 -2222791 -196895 3424787 6984460 8169310
6262 8169310 5828711 1179411 -2992886 -4611447 -3834797 -2254128 -977998 -148920 -51992
6253 -51992 -1423448 -4170592 -6856937 -8290330 -8820070 -9181479 -8915790 -7242867 -4998180
6244 -4998180 -4160485 -5350608 -7046786 -7591051 -6937955 -5996682 -5151934 -4069782 -2416465
6235 -2416465 -225538 2083816 3680998 3760267 2488339 1142356 651670 166739 -2083013
6226 -2083013 -6177280 -9484639 -9186978 -5728965 -2694578 -2735785 -4540005 -4848638 -2800779
6217 -2800779 -693971 -495527 -1483004 -2203356 -3154814 -5832716 -9790064 -12357555 -11422479
6208a1422479L956087M594601K708297o18759l449660l701872r90222K433201
6200f490806L726973K416438M48659m74816m42113r1490P61446K233693K949364
6191E037348J159518k403585m273442k133505J813125L079846M28041k756108
6183d8762l156449j473379k70404J02407J000299K170259J944444M87575n6452
6174F99538R29124J513684M62346r19257j151085n16202M02894J728310K551432
6165E700784Q45804k957274m858121k359555J485352K150278K2700q67278N89695
6156b47615J350403m22551k631827k829231j332585N10235K380213L763039L131891
6147C671972L10583k133220j795148M89098K054062J736821L04381j308597k513675
$$ plain form
6208 -11422479 -7466392 -2871791 -163494 -782253 -4231913 -7933785 -8924007 -6490806
6200 -6490806 -2763833 -347395 101264 -373552 -815665 -907155 -145709 2087984 5037348
6191 5037348 6196866 3793281 -480161 -2613666 -800541 2279305 2707346 -48762
6183 -48762 -3205211 -4678590 -4948994 -4846587 -3846288 -1676029 268415 755990 699538
6174 699538 1628662 3142346 3604692 2685435 1534350 1018148 1421042 3149352 5700784
6165 5700784 6546588 3589314 -1268807 -3628362 -2143010 7268 29968 -837310 -247615
6156 -247615 1102788 680237 -1951590 -4780821 -6113406 -5603171 -3222958 540081 3671972
6147 3671972 3982555 1849335 54187 543285 2597347 4334168 4638549 3329952 816277
6138H16277k617800j455830j1692P76865J185852J564445R95636j277352l711776
6129c735375l623220n56196K873949L710396J380116k100628l777307k091889
6121g920154J323678K714868L78342k833790k901999l1996J695355K63480j358338
6112h670554L97152M423156O151059L197655j980201m917017l486357M92493L257676
6103a134938K791571O87986j59208N53691N84299p12591r02142J225258K518537
6094E452463j51946m128519l898946N22740K944423O2501l445636j905200K988272
6085a559848N065382K683980m3472l08423J9727j112142k396558k113296j375043
6076a139693j918646k851421k137295K9405J560426J324701p1921j515609j916228
$$ plain form
6138 816277 -1801523 -3257353 -3269045 -2492180 -1306328 258117 1253753 -23599 -3735375
6129 -3735375 -7358595 -7914791 -5040842 -1330446 49670 -2050958 -5828265 -7920154
6121 -7920154 -6596476 -3881608 -3503266 -6337056 -9239055 -9271051 -7575696 -7312216 -8670554
6112 -8670554 -8273402 -3850246 2300813 5498468 3518267 -1398750 -4885107 -4392614 -1134938
6103 -1134938 1656633 2344619 2185411 2739102 3323401 2610810 1708668 2933926 5452463
6094 5452463 5300517 1171998 -2726948 -2204208 740215 802716 -2642920 -4548120 -1559848
6085 -1559848 3505534 6189514 6146042 5837619 5857346 4745204 2348646 235350 -1139693
6076 -1139693 -3058339 -5909760 -8047055 -8017650 -6457224 -5132523 -5204444 -6720053 -8636281
6067h636281n54370J543783J732714r54348l756584l477391p66294J231875J512147
6058a2124749J608411J962512J322950l073J75518J979459K527685O19483q11221
6049b743025P27312L089909K987685J427035J779735L643999L004370j216772
6041A2700248m820867m080121p18547R87934j15365j717402j995674j333565m89451
6032a582810O35179J960285K567275J829319L23373r31294j522249j564816j228790
6023D85472q14662p27002p80679j9400J983279L920639L838764J549266r59666
6014H476011j876564j444168r39399p85191p32291j102198k289018l319053k637435
6005f649306n35862Q94949P59130N58986J482933K292678J494454R6393N296N96496
$$ plain form
6067 -8636281 -9190651 -7646868 -5914154 -6868502 -10625086 -14102477 -14868771 -13636896 -12124749
6058 -12124749 -10516338 -8553826 -7230876 -7233949 -7058431 -5078972 -2551287 -1931804 -2743025
6049 -2743025 -2015713 1074196 4061881 5488916 7268651 10912650 13917020 12700248
6041 12700248 7879381 3799260 3080713 4068647 3953282 2235880 240206 -1093359 -1582810
6032 -1582810 -947631 1012654 3579929 5409248 5732621 4801327 3279078 1714262 485472
6023 485472 -329190 -1056192 -1836871 -1856271 127008 4047647 7886411 9435677 8476011
6014 8476011 6599447 5155279 4215880 3430689 2698398 1596200 -692818 -4011871 -6649306
6005 -6649306 -7185168 -6290219 -5531089 -4972103 -3489170 -1196492 297962 394355 399651 996147
5995I96147n06016l267458m445331j833799K645729N307571M736186K195601p62387
5986E066243l370565m810239m113482j486355J175819J853453L77245j484384
5978f792265j916807q19655M23087O17538k62835j540492k345020j555139J411237
5969a2780351M946985N812869K909691n56198p08097J851629K923791N40933k831360
5960B109892m343765m064344l027938r22226K082554L520530J519292j787854
5952d913859k485701J45081L216971M191440K939644M49222j957707k394377j19107
5943i28393K358298J530675k252036m724866l209547L69681K896975L723801L343688
5934C108276J153170k857105n988935n366319j849070J049131J694944J442923
$$ plain form
5995 996147 490131 -2777327 -7222658 -9056457 -6410728 -1103157 3633029 5828630 5066243
5986 5066243 1695678 -3114561 -7228043 -8714398 -7538579 -5685126 -5307881 -6792265
5978 -6792265 -8709072 -9528727 -9105640 -8488102 -8750937 -10291429 -12636449 -14191588 -12780351
5969 -12780351 -7833366 -2020497 889194 332996 -375101 1476528 4400319 4941252 2109892
5960 2109892 -2233873 -6298217 -9326155 -10248381 -8165827 -4645297 -3126005 -4913859
5952 -4913859 -7399560 -7254479 -4037508 153932 3093576 3542798 1585091 -809286 -928393
5943 -928393 1429905 2960580 708544 -4016322 -7225869 -6856188 -3959213 -235412 3108276
5934 3108276 4261446 1404341 -4584594 -9950913 -11799983 -10750852 -9055908 -7612985
5926g612985J455086R82458o00466k182382k450855j626454n56705Q43363K955122
5917h793818M833053M629128J900231j407953k912076k339558j376827j062683
5909f530503n08501J037295K045400N06593k431941l005912J76465L846896M340895
5900e23313K297064Q60834O24699n54534l006318l890457j527287J564982J931938
5891b222392j47576j425304l07934J489780J953104J439633J424383J880168J417254
5882E501116k60830j602939j571097j518784l200611n449587m988621j163640
5874a4254993K240854J583008j757522l363026j763280L42853Q61199J236801
5866a4874106L257936N355879M497631Q06430j992412r69147K545850M483996
$$ plain form
5926 -7612985 -6157899 -5175441 -5775907 -7958289 -10409144 -12035598 -12592303 -11748940 -8793818
5917 -8793818 -3960765 668363 2568594 1160641 -1751435 -4090993 -5467820 -6530503
5909 -6530503 -7039004 -6001709 -3956309 -3449716 -5881657 -8887569 -8711104 -4864208 -523313
5900 -523313 1773751 2634585 3259284 2704750 -301568 -4192025 -5719312 -4154330 -2222392
5891 -2222392 -2369968 -3795272 -4103206 -2613426 -660322 779311 2203694 4083862 5501116
5882 5501116 5240286 3637347 2066250 547466 -2653145 -8102732 -13091353 -14254993
5874 -14254993 -12014139 -10431131 -12188653 -15551679 -17314959 -16972106 -16110907 -14874106
5866 -14874106 -11616170 -6260291 -1762660 -956230 -2948642 -3917789 -1371939 3112057
5858C112057K525814j382388l162257j210617J768364K168140q3319j972963j842418
5849g9587j188672j633106k431395k248409j405173o47897O22736K811230M184549
5840b015724K922673K80087q61259j90245o4153j395933k266901j382903k54775
5831e229133m38046p08781R66202L889193N208467L715249J358217P21940K062954
5822A1546262L287879K446530n9564j872659j453712j20598m69634k789276m339241
5813F175987k908955K4497R89524j104856l658330l581261p07683K503321L882321
5804A614565L283162J685256k54662k070936k692316j233825J182776J804165
5796C318185n65515l690306m450345k584706m51796M59292R90937K255313L863565
$$ plain form
5858 3112057 5637871 4255483 1093226 -117391 1650973 3819113 3735794 1762831 -79587
5849 -79587 -1268259 -2901365 -5332760 -7581169 -8986342 -9634239 -9011503 -6200273 -2015724
5840 -2015724 906949 1187036 325777 135532 71379 -1324554 -3591455 -4974358 -5229133
5831 -5229133 -5667179 -6375960 -5409758 -1520565 3687902 7403151 8761368 9483308 11546262
5822 11546262 14834141 17280671 17221107 15348448 13894736 13774138 13304504 10515228 6175987
5813 6175987 3267032 3291529 4281053 3176197 -482133 -4063394 -4771077 -2267756 1614565
5804 1614565 4897727 6582983 6328321 4257385 1565069 331244 1514020 3318185
5796 3318185 2752670 -937636 -5387981 -7972687 -8424483 -7965191 -6974254 -4718941 -855376
5787h55376M686258M007762J597066j894985m284280l396059j3268K403563J849286
5778D099967m7051r34128q34439q40239p18160L5889L12293r80811k490925k115173
5768d512777k80257R86966J454964K283727K805867J099207k053824l207268j121546
5759b544941J503596K264837J926139J590956K48206k549467m374132l220266
5751e155072j011675p19788j614985p08547K160285M122149L684145K026856m9
5742B783319k821662n592119n880556l032628O10270K833404L610708L290747
5734d198517J480857r01812j237187J045946K626268P15937k461770k479966J118348
5725d291896M395329M348744J921297m15804j597175j887092j839653k118977
$$ plain form
5787 -855376 3830882 7838644 9435710 7540725 3256445 -139614 -152882 2250681 4099967
5778 4099967 4052916 3118788 2284349 1444110 725950 761839 1074132 93321 -2397604 -4512777
5768 -4512777 -4793034 -3806068 -2351104 -67377 2738490 3837697 1783873 -1423395 -2544941
5759 -2544941 -1041345 1223492 3149631 4740587 4988793 2439326 -1934806 -5155072
5751 -5155072 -6166747 -6886535 -8501520 -9210067 -7049782 -2927633 756512 2783368 2783319
5742 2783319 -38343 -5630462 -11511018 -14543646 -13933376 -11099972 -7489264 -4198517
5734 -4198517 -2717660 -3619472 -4856659 -3810713 -1184445 -468508 -2930278 -5410244 -4291896
5725 -4291896 103433 4452177 6373474 5957670 4360495 2473403 633750 -1485227
5717a485227k980440l439581k217246J88019J721676J375325J83030o60428j068595
5708h383467r63927K77720K274949L146198J954451M24131P15616K415312L305898
5699E166881K428315O99091j075257k913260m280458l813002j226993J651850
5691c362833K706464J812516O21265M42193R50760Q66587n31936k634744m062691
5682c192419l900484k322129j23158J936900L162957K947380J499023K32402M81075
5673G21547J730127J997239K92129k105170l352532l271487k950740k607876j207126
5664a0753889J470711L602476L237860R00833r58685j076857o11308p71201n97463
5655e557523J499744M670799N858853L395334r02839l769110l725122j823218
$$ plain form
5717 -1485227 -4465667 -7905248 -10122494 -9934475 -8212799 -6837474 -6654444 -7314872 -8383467
5708 -8383467 -9347394 -9069674 -6794725 -3648527 -1694076 -1269945 -554329 1860983 5166881
5699 5166881 7595196 8294287 7219030 4305770 25312 -3787690 -5014683 -3362833
5691 -3362833 -656369 1156147 1777412 2219605 3170365 4036952 3505016 870272 -3192419
5682 -3192419 -7092903 -9415032 -9538190 -7601290 -4438333 -1490953 8070 240472 721547
5673 721547 2451674 4448913 4741042 2635872 -716660 -3988147 -6938887 -9546763 -10753889
5664 -10753889 -9283178 -5680702 -2442842 -1542009 -2500694 -3577551 -4188859 -4960060 -5557523
5655 -5557523 -4057779 613020 6471873 9867207 8964368 5195258 1470136 -353082
5647c53082n1903L51914l31553o15384N86354K280686K168328k75940k461068
5638A298352j581839J654938L533179J647051k296885m460827l164907n93382
5630c964320l718j616021k347065k09999K433586J992084p65105j259259K234402
5621c505415N710222M966886J149449j795839k733686l109944l022908j521888
5613c863123J09149m93317k467591k538570l79077Q66990P2759j09373J689771
5604g112382L008328K172370J380986K369175K788126M60225k077289j505647
5596A483892M66606J7981j933118j114253K550863M211583J569188j781064k077497
5587C394181l93291K14109p00260j609665j830475j430279j94060J300538J232882
$$ plain form
5647 -353082 -404985 -53071 -384624 -1000008 -413654 1867032 4035360 3759420 1298352
5638 1298352 -283487 1371451 4904630 6551681 4254796 -206031 -3370938 -3964320
5630 -3964320 -3968038 -5584059 -7931124 -8141123 -5707537 -3715453 -4480558 -5739817 -3505415
5621 -3505415 2204807 7171693 8321142 6525303 3791617 681673 -2341235 -3863123
5613 -3863123 -3753974 -4247291 -6714882 -9253452 -9632529 -8765539 -8692780 -8802153 -7112382
5604 -7112382 -4104054 -1931684 -550698 1818477 4606603 5066828 2989539 1483892
5596 1483892 1950498 1968479 35361 -1078892 1471971 5683554 7252742 5471678 3394181
5587 3394181 3000890 3214999 2514739 905074 -925401 -2355680 -2549740 -1249202 -16320
5578a6320q65577k515458j293639J735928L568676L250476K237433J454473L00308
5569G856300j379108k392128j967813j011592p13341p99827k03084Q78860P55803
5560A024070j374668l570582k980340K69402K503205R81212k225916k807796j12169
5551h293582K072240J085489r01157l82930K328744L918373L012406J571336J246437
5542E657356R18279r09083l053421k964770n26997J395992O78620j284382j634236
5533a722642K8568J361884P49300o66861j012760k94262J23621l11650q98324
5524b643126q55442K4036J346476K005721J015069o86683o27959J595813K728273
5515C902178J41493l613923l666211K96785L462148K526232n56586k478388k852807
$$ plain form
5578 -16320 -881897 -3397355 -4690994 -2955066 613610 3864086 6101519 7555992 7856300
5569 7856300 6477192 4085064 2117251 1105659 392318 -407509 -610593 268267 1024070
5560 1024070 -350598 -3921180 -6901520 -6632118 -4128913 -3147701 -5373617 -8181413 -8293582
5551 -8293582 -6221342 -5135853 -6037010 -6419940 -4091196 -172823 2839583 4410919 5657356
5542 5657356 6575635 5666552 2613131 -351639 -878636 517356 1195976 -88406 -1722642
5533 -1722642 -1694074 -332190 417110 -249751 -1262511 -1556773 -1433152 -1744802 -2643126
5524 -2643126 -3498568 -3474532 -2128056 -122335 892734 206051 -421908 1173905 3902178
5515 3902178 4043671 429748 -3236463 -2939678 522470 3048702 2492116 13728 -2839079
5506b839079k742645j862845J55972J722957J187102m19055q34143J27153P52322
5497d752261J88098q00713j234174n51290J434434L747278M256989K057627q78090
5488C467898j909812q63718M12346O71137p7620j480652k666283k160875J39417
5479d468162J899625J255349k80554j41072J153064J044255n92363j314047l26991
5470a770896N49881N47732J144267K610312K719589N49817j451497j306505p17804
5461B874896j871408l349343k423435R9544Q58818p52210j681632k3585K266628
5452d001727K567942J149949M3605Q4784P32891J595732K341335J850822o33588
5443E731745l706947m928433l896523k450601j436586N63486L989064N938791
$$ plain form
5506 -2839079 -5581724 -7444569 -7288597 -5565640 -4378538 -4797593 -5631736 -5504583 -4752261
5497 -4752261 -4564163 -5364876 -6599050 -7150340 -5715906 -1968628 2288361 4345988 3467898
5488 3467898 1558086 694368 1106714 1777851 1700231 219579 -2446704 -4607579 -4468162
5479 -4468162 -2568537 -1313188 -1593742 -1734814 -581750 462505 -129858 -1443905 -1770896
5470 -1770896 -1221015 -673283 470984 3081296 5800885 6350702 4899205 3592700 2874896
5461 2874896 1003488 -2345855 -4769290 -4669746 -3810928 -4563138 -6244770 -6268355 -4001727
5452 -4001727 -1433785 -283836 -240231 -155447 577444 2173176 4514511 6365333 5731745
5443 5731745 2024798 -2903635 -6800158 -9250759 -10687345 -10123859 -6134795 -196004
5435a96004L642616q11277k403400O1185K324273R43667j830349j770201R53898
5426I14408K289837L31587k340150k677039r78017L38020O9857q98078j222638
5417d172213o05671J39150J71369j92892L01516K056367L605466L216790J107637
5408E627519q77302j497006j048912l34619K41674N88386Q13654J144045J346029
5399F003468O62789q97263j885005j209447p5755o54520k963998m512695l299014
5390h831440j57033K184679J867635k74685j512656l41308J347385O43862j793067
5381f866628k084242Q90738L048176J137094j840162j169936J886270J970368
5373c028322j748499m247539k423514R02866K213773J974117J956974J779635
$$ plain form
5435 -196004 3446612 2635335 231935 293120 2617393 3561060 1730711 -39490 914408
5426 914408 3204245 3535832 1195682 -1481357 -2459374 -2121354 -2051497 -2949575 -4172213
5417 -4172213 -4777884 -4638734 -4467365 -4660257 -4358741 -2302374 1303092 4519882 5627519
5408 5627519 4750217 3253211 2204299 1869680 2111354 2699740 3513394 4657439 6003468
5399 6003468 6666257 5768994 3883989 2674542 2598787 1944267 -1019731 -5532426 -8831440
5390 -8831440 -8988473 -6803794 -4936159 -5210844 -6723500 -7064808 -5717423 -5073561 -6866628
5381 -6866628 -8950870 -8060132 -5011956 -3874862 -5715024 -6884960 -4998690 -3028322
5373 -3028322 -4776821 -9024360 -11447874 -10545008 -8331235 -6357118 -4400144 -2620509
5365b620509O52951m36411o09627n90974n45733O94313K493249J843021j744809
5356h64529m102108k028903J927754L408036K152091O66455k86139j081220n32173
5347g40736J993494L619048J486510k123745k558909L86638K843806L160081K974486
5338A1040673K400236n08948m713257n779412k389045J098272Q98807j135349
5330I11977j382992j22741m1803j263381j316055P68400L054360L340082J549491
5321E497338m69810p17192R59187K269295R17928k035813k910565l52331K299782
5312E457819J224866k713473n113900l702695p06907N76632k73352j180788p24626
5303g156424M56022J205624J447669J554221J128179k01844j231766l08591J773408
$$ plain form
5365 -2620509 -1967558 -2403969 -3013596 -3604570 -4150303 -3455990 -962741 880280 -864529
5356 -864529 -4966637 -6995540 -5067786 -1659750 492341 1158796 872657 -208563 -740736
5347 -740736 1252758 4871806 6358316 4234571 1675662 2062300 4906106 8066187 11040673
5338 11040673 13440909 12931961 8218704 2439292 50247 1148519 2047326 911977
5330 911977 -471015 -593756 -635559 -1898940 -3214995 -2446595 607765 3947847 5497338
5321 5497338 5027528 4310336 5269523 7538818 8456746 6420933 3510368 3158037 5457819
5312 5457819 6682685 3969212 -1144688 -4847383 -5554290 -4977658 -5251010 -6431798 -7156424
5303 -7156424 -6700402 -5494778 -4047109 -2492888 -1364709 -1566553 -2798319 -3106910 -1333502
5294a333502K134041k5892j817633p87914J505267K252015J694067J697274J661217
5285F978940m00017l455275m133188j874723M02578J181437J891361K726624J329053
5276D646790k360889m095036j252169K500520K116630j632045l710307k019728
5268e806234Q59824K428835L007328L472936L377020K192189L88720j372962k655927
5259E891729k734875j217280P43809J330409K31216j289064k219255k362697j599753
5250c225761k73132K18810q23342j600258j75832J818764R99779k062058k715098
5241g838128Q13335M101263K813471r25728k110501m39721J87228j357125j872691
5232f628597L87642K925746L348013K538495J669323j36810k676063k872405M69820
$$ plain form
5294 -1333502 800539 774647 -1042986 -1830900 -325633 1926382 3620449 5317723 6978940
5285 6978940 6578923 3123648 -1009540 -2884263 -2481685 -1300248 591113 3317737 4646790
5276 4646790 2285901 -1809135 -3061304 -560784 1555846 -76199 -3786506 -5806234
5268 -5806234 -4946410 -2517575 489753 3962689 7339709 9531898 9920618 8547656 5891729
5259 5891729 3156854 1939574 2683383 4013792 4245008 2955944 736689 -1626008 -3225761
5250 -3225761 -3498893 -3280083 -4103425 -5703683 -5879515 -4060751 -3060972 -5123030 -7838128
5241 -7838128 -7024793 -2923530 -110059 -1035787 -3146288 -3586009 -3398781 -4755906 -6628597
5232 -6628597 -6240955 -3315209 32804 2571299 4240622 4103812 1427749 -1444656 -974836
5223i74836L228894J398135k483003k973373J9413J855758R55497J70189M45405
5214A642079o56332k934566k380765J493501L208896j21490l338831j179399L093526
5205a173381K882023j424565l696285j457660K186314M629308N639019M000144
5197A1584917j346538o660809o057368J14173M937996M159573N62854k079222
5189E215576l785908m940978l575877N74957L658167K898141P51745N83126J406864
5180B785813M36013j828677k688418j567942j17693N56392K62166j173783l011689
5171f347818l397591j893081m00351l9021N14543J925486K410618J270147J010530
5162d946538L000739M103290J331543k710971l223917j93691K272823K322974
$$ plain form
5223 -974836 2254058 3652193 1169190 -1804183 -1784770 70988 1026485 1196674 1642079
5214 1642079 985747 -1948819 -4329584 -2836083 372813 251323 -3087508 -4266907 -1173381
5205 -1173381 1708642 284077 -3412208 -4869868 -2683554 1945754 7584773 11584917
5197 11584917 10238379 3577570 -2479798 -2365625 2572371 6731944 7294798 5215576
5189 5215576 1429668 -3511310 -7087187 -6512230 -2854063 44078 795823 1378949 2785813
5180 2785813 3221826 1393149 -1295269 -2863211 -2980904 -2424512 -2162346 -3336129 -6347818
5171 -6347818 -9745409 -11638490 -12038841 -12077862 -11563319 -9637833 -7227215 -5957068 -4946538
5162 -4946538 -1945799 2157491 3489034 778063 -2445854 -2639545 -366722 1956252
5154A956252J779527J833047J480218L75634k99661k47026n09272j275176j643226
5145C450317j517864j440351q88694P77910K127015J195515r64169j213745R53029
5136B478963K455907J086962j569102k727438j956471q86314o31114p31401k77199
5127b757207O23674Q15271j82035q65643N02697K848351K993600J36118k569158
5118A545668k221373R4624J394908O61464j127156k897473l535427j943472J005903
5109g022334K430728J178126m49017l90819L33184L75179M79926P55731q27197
5100c136493m037129m420205O6877M297555L011274q92911j186972J586611K039547
5091b671846j0349N19154M247303N572753J987687k024268k634143j938687k838953
$$ plain form
5154 1956252 3735779 5568826 7049044 7424678 7125017 6877991 6368719 5093543 3450317
5145 3450317 1932453 492102 -396592 381318 2508333 3703848 2739679 1525934 2478963
5136 2478963 4934870 6021832 4452730 1725292 -231179 -1117493 -1748607 -2480008 -2757207
5127 -2757207 -2133533 -1318262 -1500297 -2365940 -1863243 985108 3978708 4114826 1545668
5118 1545668 -675705 -581081 813827 1475291 348135 -2549338 -6084765 -8028237 -7022334
5109 -7022334 -4591606 -3413480 -3862497 -4253316 -3920132 -3544953 -3065027 -2309296 -3136493
5100 -3136493 -7173622 -11593827 -11526950 -7229395 -4218121 -5111032 -6298004 -4711393 -2671846
5091 -2671846 -2682195 -2163041 2084262 7657015 9644702 7620434 4986291 3047604 208651
5082B08651m014187l080064o24075J479794K441336J763192l49955j028716K485290
5073g18734P361369P458124K145615k549006k999185k190563k764600k350925
5065C392095O33507K581377P07470j588307l71859K042319J156196k305324m243305
5056B004169l731774k776345j777592k1406J051414l82124k684536k653900k47721
5047a1219815J948386K729368K618552J682202J61752j80770J528737K999028
5039B267440J953822k8840q5588J108940O20877j788752l473844k978508j228512
5030c632965P70560K661249L654639L100944J667157K30310j327717k681641k226346
5021B216190L35576K485209K114946K67838j380604l141681m881911m085443P5927
$$ plain form
5082 208651 -3805536 -6885600 -7509675 -6029881 -3588545 -1825353 -2175308 -3204024 -718734
5073 -718734 6642635 14100759 16246374 13697368 10698183 8507620 5743020 3392095
5065 3392095 4025602 6606979 7314449 5726142 5354283 7396602 8552798 6247474 2004169
5056 2004169 -1727605 -4503950 -6281542 -6302948 -5251534 -5633658 -8318194 -10972094 -11219815
5047 -11219815 -9271429 -6542061 -3923509 -2241307 -2079555 -2260325 -731588 2267440
5039 2267440 4221262 4192422 4106834 5215774 5836651 4047899 574055 -2404453 -3632965
5030 -3632965 -2862405 -201156 3453483 6554427 8221584 8451894 7124177 4442536 2216190
5021 2216190 2551766 5036975 7151921 7419759 6039155 2897474 -1984437 -6069880 -5993953
5012e993953L531922K442969p41185j034196J172595J302956j322968k451292
5004c093152l53025J245071m97263k821727j768149J826873L783785K431517K41967
4995I95897j30799O09723k33156l215424n552636m817350k371768j079507o45809
4986a6440829J544243N067248N922987K576927j210535j583677O46435K515255
4978i61946K932154J954711n91586l176878k590157J231306L651673J621198j801504
4969B268971k389616p19007L70608P51635J389280J056400r86666k069016k61990
4960e89401J556672L13089j694266p21195J927725K532857J295906O95090K57843
4951E574320j400974k028052P02818L486829J683292k651627l627283q88078N46849
$$ plain form
5012 -5993953 -2462031 -19062 -760247 -1794443 -621848 681108 -641860 -3093152
5004 -3093152 -3446177 -2201106 -2698369 -5520096 -7288245 -5461372 -1677587 753930 995897
4995 995897 865098 1474821 1241665 -1973759 -7526395 -12343745 -14715513 -15795020 -16440829
4986 -16440829 -14896586 -9829338 -3906351 -1329424 -2539959 -4123636 -3477201 -961946
4978 -961946 1970208 3924919 3333333 156455 -2433702 -1202396 2449277 4070475 2268971
4969 2268971 -120645 -839652 -469044 282591 1671871 2728271 1741605 -327411 -589401
4960 -589401 967271 1280360 -413906 -1135101 792624 3325481 4621387 5316477 5574320
4951 5574320 4173346 2145294 2848112 6334941 8018233 5366606 1739323 851245 1398094
4942A398094j208920l058425k983284j945092l17231K012490K927652Q70591j192526
4933c496651j83034R78750j825576n461062l663963K065320M161999J024128j144835
4924g544924J030221L622481K803178k15743k881255m068528k641572J421961
4916h474181M868157N095210M398865N032894L700673k061125o471005l447426
4908B642062K258695K211554j486472r07609K497741R33090m154397m220641O5666
4899a60311M5185l944380k958380K793624L461508j789516l037412J358019K011101
4890b220562k466966k611508K402993K404335k828542j820399N020729L913654
4882A793734m868259m926432M003134K621681r436593p931239Q576783R200302
$$ plain form
4942 1398094 189174 -2869251 -5852535 -7797627 -8114858 -6102368 -3174716 -2304125 -3496651
4933 -3496651 -3679685 -2700935 -4526511 -9987573 -13651536 -11586216 -7424217 -6400089 -7544924
4924 -7544924 -6514703 -2892222 -89044 -304787 -3186042 -7254570 -9896142 -8474181
4916 -8474181 -3606024 1489186 5888051 10920945 14621618 12560493 6089488 2642062
4908 2642062 4900757 7112311 5625839 4718230 7215971 8149061 3994664 -225977 -160311
4899 -160311 -115126 -4059506 -7017886 -4224262 -762754 -2552270 -5589682 -4231663 -2220562
4890 -2220562 -4687528 -7299036 -4896043 -2491708 -5320250 -7140649 -2119920 1793734
4882 1793734 -3074525 -8000957 -3997823 -1376142 -10812735 -18743974 -10167191 -966889
4874i66889o214011J5251396R2904534J48030599R3536952l5469299j14412116
4867A92661166q8529151k7054506p835067k0762342j8139318N68713M293656p768550
4859B7434601j0859863j770728J355450m328410n038351P61218J598672l055703
4851F096886l003088J849019K504813m86434J007063N231505L320546l182715
4843A3337595m666108r17631j29335k603005j093610L980996M546594m61900l899701
4834H093895l359058k894708k705268P13298M815725L279517k296117m113703
4826A533581j169243L02328j164063p58954K111035K516099j85234j132668O70000
4817B722881J007943q45660q59025J668616K927133J849494Q60341k07955l049441
$$ plain form
4874 -966889 -7180900 8070496 100975030 249005629 342542581 307073282 192661166
4867 192661166 104132015 77077509 69242442 48480100 30340782 30909495 35203151 27434601
4859 27434601 16574738 14804010 16159460 11831050 6792699 7553917 9152589 6096886
4851 6096886 3093798 4942817 7447630 6961196 7968259 13199764 16520310 13337595
4843 13337595 8671487 7753856 7624521 5021516 3927906 7908902 12455496 11993596 8093895
4834 8093895 4734837 1840129 -865139 -151841 4663884 7943401 5647284 1533581
4826 1533581 364338 666666 -497397 -1256351 854684 3370783 3185549 2052881 2722881
4817 2722881 3730824 2885164 2026139 3694755 6621888 8471382 9331723 9123768 6074327
4808F074327m677123q92302M777194M648185r23630m091702k222877n75369j705206
4799D11497j799255Q74083K798842K374550K029517J636354j909673o913651p087594
4790g585330j625300K956602L147244K610764L814164L718151Q08809j276480
4782F568624m70199L55262l09839J07282J837404Q62650l266321m866890j208031
4773c90058K606288J998182j90427L20633K094157J551867r89961l086544l883310
4764C0827k818778R55434M960386M161063j470552n205974k790202J596688K285238
4755A704130N6644j061666n09560j84397j64740M50711J106960J301466J880427
4746D579975K639433J796904m17880j395638p87308j062603k108285o64785L046621
$$ plain form
4808 6074327 1397204 504902 5282096 9930281 9006651 4914949 2692072 2116703 411497
4799 411497 -1387758 -513675 2285167 4659717 6689234 8325588 6415915 -497736 -7585330
4790 -7585330 -9210630 -6254028 -3106784 -496020 3318144 7036295 7845104 6568624
4782 6568624 6098425 6453687 6143848 6251130 8088534 8951184 5684863 817973 -390058
4773 -390058 2216230 4214412 4023985 4344618 6438775 7990642 7000681 3914137 30827
4764 30827 -2787951 -1832517 3127869 7288932 5818380 612406 -2177796 -581108 1704130
4755 1704130 1760774 699108 189548 5151 -159589 291122 1398082 2699548 4579975
4746 4579975 7219408 9016312 8598432 7202794 6415486 5352883 3244598 2579813 5626434
4737E626434M196378J355029p38061M69486R53931j922378l955366j743878P25623
4728D967198q06755l102808j572874J021418m70644m069158l965752m10525J414087
4719f995813M58074L56895J990983K370332O92416n03463l57942p25139j992089
4710d705746k210406n02226K096564M589304N803438L793431j116185m564876
4702C183298l202278L86815J597321M17537o8351N52675N46564L70629J497600
4693E281810K460075R60707j490733j857977j003845j885746l790135l549186
4685d875030j284265K40604P81631J855289K165294m45411l536770k684915J051991
4676f731582K459211N60692p35128k48310q86161k826019k436153N79738J869401
$$ plain form
4737 5626434 9822812 11177841 10439780 10909266 11863197 9940819 5985453 4241575 4967198
4728 4967198 4160443 1057635 -515239 506179 35535 -4033623 -7999375 -8409900 -6995813
4719 -6995813 -6537739 -6180844 -4189861 -1819529 -1127113 -1630576 -1988518 -2713657 -4705746
4710 -4705746 -6916152 -7418378 -5321814 -732510 5070928 8864359 7748174 3183298
4702 3183298 -18980 367835 1965156 2382693 2314342 2867017 3413581 3784210 5281810
4693 5281810 7741885 8702592 7211859 5353882 4350037 2464291 -1325844 -4875030
4685 -4875030 -6159295 -5918691 -5137060 -3281771 -1116477 -1561888 -5098658 -7783573 -6731582
4676 -6731582 -4272371 -3711679 -4446807 -4695117 -5581278 -8407297 -10843450 -10263712 -8394311
4667h394311K40072m4252K630320L652062L42947k639575o90801L223765L520055
4658A840282K98837k352871k972955k631790r64850K615589N515430M493046O44314
4649F485032k071235k394553k198325k180219j006016J264116K424533J548128
4641A871461M47187O77269J142477M5554k009654k439442j57386K517172K327927
4632D422565q59150l767605l812704j853388J22676J973158L974921M430855J957264
4623F588592j084846j260515M03322k50225l553930n009436k331504J072056J713254
4614c713232R17318J294133K005099J080489l77343j92068O28548m11992k454580
4605a223628k072163J189347L545636K069566j533900l477545k484868m04280
$$ plain form
4667 -8394311 -8154239 -8198491 -5568171 -1916109 -1573162 -4212737 -4903538 -1679773 1840282
4658 1840282 2139119 -213752 -3186707 -5818497 -6783347 -4167758 1347672 5840718 6485032
4649 6485032 4413797 2019244 -179081 -2359300 -3365316 -2101200 323333 1871461
4641 1871461 2318648 2995917 4138394 4183948 2174294 -265148 -422534 2094638 4422565
4632 4422565 3563415 -204190 -4016894 -5870282 -5747606 -3774448 200473 4631328 6588592
4623 6588592 5503746 4243231 4646553 4396328 842398 -4167038 -6498542 -5426486 -3713232
4614 -3713232 -2795914 -1501781 503318 1583807 1206464 1014396 1642944 1230952 -1223628
4605 -1223628 -3295791 -2106444 1439192 3508758 1974858 -1502687 -3987555 -4391835
4597d391835Q50344J336205J787246J600448l59022l137600l946944k072565n28203
4588h861926j812474l739079k352552K108841N472487N333590L032949J63789
4580f54375k988200n103672m042011o02099J678691J822048K629849N007587N446304
4571C194122J889460j971463j963333K75939M69582j273275j204922J527861L498441
4562D442412K102272j348004l933048m080427k127434J12128N23830r46671j689359
4553f944301K31315L080542L704120J869620J74855J76423Q14320O39325k22711
4544C523508o63308j20874O73234K86179j548927k857488j641247R79678K061829
4535F92584J368127J545361L063485K766310o55916l573048k705140j52031L18641
$$ plain form
4597 -4391835 -3541491 -2205286 -418040 1182408 823386 -2314214 -6261158 -8333723 -8861926
4588 -8861926 -10674400 -14413479 -16766031 -14657190 -9184703 -3851113 -818164 -654375
4580 -654375 -3642575 -8746247 -12788258 -13390357 -11711666 -9889618 -7259769 -2252182 3194122
4571 3194122 5083582 3112119 1148786 1424725 1894307 621032 -583890 943971 4442412
4562 4442412 6544684 5196680 1263632 -2816795 -4944229 -4832101 -4308271 -5254942 -6944301
4553 -6944301 -6712986 -3632444 71676 1941296 2116151 2292574 3106894 3746219 3523508
4544 3523508 2860200 2739326 3412560 3698739 2149812 -707676 -2348923 -1369245 692584
4535 692584 2060711 3606072 6669557 9435867 8779951 5206903 2501763 2349732 2668373
4526B668373r74133j464927j251517j778420j814533M97263L192133K958883Q32463
4517B865585L87052J210008k98761l866742m915382j969162J034401J325561R94044
4508c233396K031895K570642Q83986r89954p98554P9926n68094j994263k444754
4499d462566k259895j992090k1081M376502P593553N403044p06345m645443l263017
4490B2662L17517J482545k92213j836555p10267K135639L782747K675357K11846
4481G789278j038938k66087J109390J548300Q44499m97314k022102l200440l677453
4472E89133l762140l524282j741159K361995O424490O566904K449115j726264
4464G637792k480923j048317n46666j402816j804163j093108k25287L67853J227851
$$ plain form
4526 2668373 1694240 229313 -1022204 -2800624 -4615157 -4117894 -925761 2033122 2865585
4517 2865585 3252637 4462645 4163884 297142 -4618240 -6587402 -5553001 -4227440 -3233396
4508 -3233396 -1201501 1369141 2253127 1263173 464619 544545 -23549 -2017812 -4462566
4499 -4462566 -6722461 -8714551 -8735632 -4359130 3234423 8637467 7931122 3285679 22662
4490 22662 340179 1822724 1530511 -306044 -1016311 1119328 4902075 7577432 7789278
4481 7789278 6750340 6484253 7593643 9141943 9986442 9489128 7467026 4266586 589133
4472 589133 -3173007 -6697289 -8438448 -6076453 348037 6914941 9364056 7637792
4464 7637792 5156869 4108552 3561886 2159070 354907 -738201 -963488 -595635 632216
4455F32216K486631L550632L793871K527501p82265m944644o808340m446471O5567
4446c925302K845987K709888J685420J429995J308909M06149n13049j88077J051793
4437F811713J610027P75648l75166n22744K4134j89482j406005j971399q89398
4428C867328P7432j357194m210321m936392k151434J579806L360741L190011K509042
4419A929019J641991K65970j190499k206038k906355k894466j002518K303110
4411d059786M116189K674100J35792m31933O06591O09819j040203k518138k691616
4402b599185j982591n29755J869760M066492M168535J965676j031536l570729
4394B356667m882933l925103q69322J565387J158009k51559M98478K482843K160893
$$ plain form
4455 632216 3118847 6669479 10463350 12990851 12208586 7263942 455602 -3990869 -3925302
4446 -3925302 -1079315 1630573 3315993 4745988 6054897 6461046 5947997 5759920 6811713
4437 6811713 8421740 9197388 8822222 8299478 8323612 8134130 6728125 4756726 3867328
4428 3867328 3944760 2587566 -1622755 -6559147 -8710581 -7130775 -3770034 -580023 1929019
4419 1929019 3571010 3836980 2646481 440443 -2465912 -5360378 -6362896 -4059786
4411 -4059786 56403 2730503 2866295 2434362 3040953 3650772 2610569 92431 -2599185
4402 -2599185 -4581776 -5111531 -3241771 824721 4993256 6958932 5927396 2356667
4394 2356667 -2526266 -6451369 -7320691 -5755304 -4597295 -4848854 -4350376 -1867533 293360
4385B93360j69020m53528J892427K376110q82075l306668j220535J827246Q53317
4376A210634k266485k005360J707021L651692J694272p87972j040113k15572L34413
4367B282530J143546J539567q76894n423395p120555l192135K513019M675781
4359d458536L245558J667362R13614n41388k230761j689220J021342K636121J399122
4350A963214n96783q86356J62938J006376J516774K111467J985963L77565j299727
4341F341431p61168J755669L209101J429887k140798m214113l413677j278744
4333I27588J85446P11043J052180J165418L98943q37076j091814N7955J221318
4324C791001J131439K38137m55565r48795j434043j068815P22343K419311J875724
$$ plain form
4385 293360 124340 -329188 1563239 3939349 3057274 -249394 -1469929 357317 1210634
4376 1210634 -1055851 -3061211 -1354190 2297502 3991774 3203802 2163689 1948117 2282530
4367 2282530 3426076 4965643 4088749 -1334646 -8455201 -11647336 -9134317 -4458536
4359 -4458536 -1212978 454384 1367998 826610 -1404151 -3093371 -2072029 564092 1963214
4350 1963214 1366431 480075 643013 1649389 3166163 5277630 7263593 7641158 6341431
4341 6341431 5580263 7335932 10545033 11974920 9834122 5620009 2206332 927588
4333 927588 1113034 1824077 2876257 4041675 4440618 3603542 2511728 2569683 3791001
4324 3791001 4922440 5160577 4705012 3756217 2322174 1253359 1975702 4395013 6270737
4315F270737n08222j998862j196457K46521J70056j290317k279764j634827o263
4306b227398Q86195p9043j953790k239897J41448K935519L113246Q47514j075504
4297C48290j467427j690034k173905j155476J821333M051071L342886J247735
4289D324473L95050O03694J17103r39202j058575k29456K48227O6346k22270q17395
4279B487995j928741k300057q35125J111765J511646R11017J236614K071845J172608
4270E439567j512526l354657k816818j127066k2196k07927j905935m309508m787493
4261a4604559j662977K402787L195982J063845L28634K283904L384723J740643
4253a867018N69994K514095M716040L151476j229346m343364m600799l230189
$$ plain form
4315 6270737 5762515 3763653 2567196 2813717 2983773 1693456 -586308 -2221135 -2227398
4306 -2227398 -1341203 -1420246 -3374036 -5613933 -5472485 -2536966 576280 1423794 348290
4297 348290 -1119137 -2809171 -4983076 -6138552 -4317219 -266148 3076738 4324473
4289 4324473 4719523 5323217 5440320 4501118 3442543 3213087 3461314 3527660 3305390 2487995
4279 2487995 559254 -1740803 -2575928 -1464163 47483 958500 2195114 4266959 5439567
4270 5439567 3927041 572384 -2244434 -3371500 -3393696 -3601623 -5507558 -9817066 -14604559
4261 -14604559 -16267536 -13864749 -10668767 -9604922 -9276288 -6992384 -3607661 -1867018
4253 -1867018 -1297024 1217071 5933111 9084587 7855241 3511877 -1088922 -4319111
4245d319111j054603J472084K599802J211930o65252n01984O38682q4522k273604
4236b976578k632516r9178K658838L140735J609024n46786k461716l246199k054515
4227f608891M28449K126073J852613M31717n99924m45387O49144J643307J581887
4218A058988Q66250Q24458J443670J081063n91617j451893m07288L10186j160500
4209A973317k507312n15823L384949M679098K210928o31268j090381K2437Q17131
4200H343076O50954n01781k339155l473855k653190q14060J64639K90047P13922
4191C80597J083347N48783M41319K410648M577752L443774o66335l981865m792715
4182C445305m428240l188284k18434K519762J593995j813583k633355J63003K076097
$$ plain form
4245 -4319111 -5373714 -3901630 -1301828 -89898 -755150 -1257134 -618452 -702974 -2976578
4236 -2976578 -5609094 -5708272 -3049434 91301 1700325 1153539 -1308177 -4554376 -6608891
4227 -6608891 -6180442 -4054369 -2201756 -1770039 -2369963 -2815350 -2166206 -522899 1058988
4218 1058988 1925238 2749696 4193366 5274429 4682812 3230919 2823631 3133817 1973317
4209 1973317 -533995 -1049818 2335131 7014229 9225157 8593889 7503508 7525945 8343076
4200 8343076 8994030 8492249 6153094 2679239 26049 -788011 -623372 -333325 380597
4191 380597 1463944 2012727 2454046 4864694 9442446 12886220 12219885 8238020 3445305
4182 3445305 -982935 -4171219 -4389653 -1869891 -275896 -2089479 -4722834 -4559831 -2483734
4173b483734J007965M25670K203399K748493j60003k641115j126788J784488K355588
4164D113963J589622J502453N44519k299835l780523j956142m49445j679005j477184
4155c891577L179257P123500N305963J915805K209124J975336l311582n571754
4147H934072L954788J4061258M577705k0481027l1581052j3483267J2153315J6779858
4139e084350K472439p067352k426890L903838J792154l342194l661137o09723
4131a4023215J339333K303917L413867L094157J088903L63931J800330K179470
4123A560693K6222j619975p58830J95658p05978j323944L12222K174215J784918
4114A645201K14797l59507q4746K20211J253279L120075L673811J578638j242581
$$ plain form
4173 -2483734 -1475769 -1050099 1153300 3901793 3741790 1100675 -26113 1758375 4113963
4164 4113963 5703585 7206038 7750557 5450722 1670199 -285943 -735388 -2414393 -3891577
4155 -3891577 -712320 6411180 11717143 13632948 15842072 17817408 14505826 8934072
4147 8934072 12888860 26950118 31527823 11046796 -20534256 -34017523 -21864208 -5084350
4139 -5084350 -2611911 -9679263 -12106153 -8202315 -6410161 -9752355 -13413492 -14023215
4131 -14023215 -12683882 -10379965 -6966098 -3871941 -2783038 -2419107 -618777 1560693
4123 1560693 1586915 -33060 -791890 -596232 -1302210 -2626154 -2313932 -139717 1645201
4114 1645201 1859998 1500491 1415745 1635956 2889235 6009310 9683121 11261759 10019178
4105A0019178k463247k309351j666356n3859K101788K148058p78265l096535j681397
4096B220014Q99497J34532l139147l862617o72239K015519P17164k307507k851203
4087f845987n19213J674948J867217J100700Q86602R45390J30964j281780j467828
4078c508987M85945K977195L753644K717239J434910L86154j203349k846186k775433
4069A421132j202005q24127k581837l556529j285023K176065L231105J919369
4061g01850J023796J393688J533488J083051J203371J551798J95704k872007m935056
4052e24017m158223j826889k56503k85916j305084k030314j010384J865093M342219
4043e190018M220707K565850K102310K645626J295635k388401m887101l717029
$$ plain form
4105 10019178 7555931 5246580 3580224 3526365 5628153 7776211 6997946 3901411 2220014
4096 2220014 3119511 3254043 114896 -3747721 -4419960 -2404441 -1687277 -3994784 -6845987
4087 -6845987 -7365200 -5690252 -3823035 -2722335 -1835733 -890343 -759379 -2041159 -3508987
4078 -3508987 -3023042 -45847 3707797 6425036 7859946 8246100 7042751 4196565 1421132
4069 1421132 219127 -605000 -3186837 -6743366 -8028389 -5852324 -2621219 -701850
4061 -701850 321946 1715634 3249122 4332173 5535544 7087342 7283046 4411039 -524017
4052 -524017 -4682240 -6509129 -6765632 -7051548 -8356632 -10386946 -11397330 -9532237 -5190018
4043 -5190018 -969311 1596539 3698849 6344475 7640110 5251709 364608 -3352421
4035c352421p52637J235999K395002L828541M479257K893303K97668r85286r58854
4026I080572j151831j542607j050496k40575o04103j529682r36635R96147J647606
4017D668396J09546j249804o05244M05195n02704k361692k395946n15902M07450
4008b040705r16259k007347m89458J889273J747846l66883l26288L104046N657165
3999F251390L557008q25051k548353j192394l23279j166106j567684j116172k138460
3990a069101m429943m065774J17904L394625J814572j804818k427384k16188R14390
3981g771717j46492j094786p33679L7243P75079J398002O95354j493766k111710
3972a0446472J079336M844314M518482J330968K66964J523162M85244l475599
$$ plain form
4035 -3352421 -4105058 -2869059 -474057 3354484 7833741 10727044 11024712 10039426 9080572
4026 9080572 7928741 6386134 5335638 5095063 4490960 2961278 2024643 3020790 4668396
4017 4668396 4777942 3528138 2922894 3328089 2825385 463693 -1932253 -2448155 -2040705
4008 -2040705 -2956964 -4964311 -5453769 -3564496 -1816650 -2183533 -2509821 594225 6251390
3999 6251390 9808398 8983347 6434994 5242600 4919321 3753215 2185531 1069359 -1069101
3990 -1069101 -5499044 -9564818 -9446914 -6052289 -4237717 -6042535 -8469919 -8686107 -7771717
3981 -7771717 -7918209 -9012995 -9746674 -9709431 -8934352 -7536350 -6840996 -8334762 -10446472
3972 -10446472 -9367136 -4522822 -4340 1326628 1593592 3116754 3601998 126399
3964A26399n060075j782251J829601J853346R21765K472963M144318J982084k431771
3955D056379m317936k747247n35547J037804K697718L613096J985840j170567
3947D619540k744497j915142n42481M91860J926500L136119J972292j621182m529234
3938G93775m104860j231605R32733K41072k470784l983913j938819J878423L059897
3929f824081M50912j851319l62635K618710K856609P12978l97378k64990j445118
3920d506312l271985j973791K491132N115671L243532N04371P27915K159934J202794
3911E693261j398901k180133p65714m4640j272531k392689j423634Q31890J938541
3902a014550M66943k543170m168792k348218J439029L489441K509377J062775
$$ plain form
3964 126399 -4933676 -6715927 -4886326 -3032980 -2111215 361748 4506066 6488150 4056379
3955 4056379 -261557 -3008804 -3544351 -2506547 191171 3804267 5790107 4619540
3947 4619540 1875043 -40099 -582580 -90720 1835780 4971899 6944191 5323009 793775
3938 793775 -3311085 -4542690 -3609957 -3368885 -5839669 -9823582 -11762401 -9883978 -6824081
3929 -6824081 -6373169 -8224488 -8587123 -5968413 -3111804 -2398826 -2796204 -3061194 -4506312
3920 -4506312 -7778297 -9752088 -7260956 -2145285 1098247 1602618 2330533 4490467 5693261
3911 5693261 4294360 2114227 1348513 1303873 31342 -2361347 -3784981 -2953091 -1014550
3902 -1014550 -547607 -3090777 -7259569 -9607787 -8168758 -4679317 -2169940 -1107165
3894a107165J228653J213455j290597m323723l766314L18282L040691J171500
3886c515218k641948l739262j463567Q32733Q49346R5336J128449L644009M780254
3877b9868L048113M28324k94103P70529J148526j29164j157309k10161J605869
3868E180756J971636M18047j556027k538321k058323k06857K022690K510126j00393
3859E643334m163017o146678m422199r10691J395310J593534J056667J243850
3851d709890K089792K413115J501724J18275k86156N39599J088798M3512j693202
3842A105567k033958p58257j08701j550497l134084j732679K372303N057808L355358
3833B572860n93515k194918k52437J916736J322459r61136k027205j298867n49691
$$ plain form
3894 -1107165 121488 1334943 44346 -4279377 -8045691 -7727409 -4686718 -3515218
3886 -3515218 -6157166 -9896428 -11359995 -10527262 -9677916 -9582580 -8454131 -4810122 -29868
3877 -29868 3018245 3446569 3152466 3922995 5071521 4942357 3785048 3574887 5180756
3868 5180756 7152392 7570439 6014412 3476091 1417768 1210911 3233601 5743727 5643334
3859 5643334 1480317 -4666361 -9088560 -9999251 -8603941 -7010407 -5953740 -4709890
3851 -4709890 -2620098 -206983 1294741 1413016 1126860 1666459 2755257 2798769 1105567
3842 1105567 -928391 -1686648 -1795349 -3345846 -6479930 -8212609 -5840306 -782498 2572860
3833 2572860 1979345 -215573 -468010 1448726 2771185 1810049 -217156 -1516023 -2065714
3824b065714p06970p27191M11018K223757L438935L077896R09401k004279l413060
3815A143793j928894J017164K562254J699478j52719j602408k494650k640082
3807b396064j430650O44275J890686J588547P48754J38018o75563j586376j258968
3798b337341O07407K061556J409590m22128j402308j034825j67904O35128J142140
3789D91315Q54251l44824j673099k417364k517132j774674K7998J808083K023489
3780c521957J447604K492134M759626M555754P43205k504481j827127j07776j599438
3771D437544m520707l832195L06884K720091J444614q3187K53509J03771j919104
3762a088780k888817o02061K166869J808763p88300k267781j716244m88294Q29120
$$ plain form
3824 -2065714 -2772684 -3499875 -3088857 -865100 2573835 5651731 6561132 4556853 1143793
3815 1143793 -785101 232063 2794317 4493795 4341076 2738668 244018 -2396064
3807 -2396064 -3826714 -3182439 -1291753 296794 1045548 1183566 508003 -1078373 -2337341
3798 -2337341 -1729934 331622 1741212 1319084 -83224 -1118049 -1285953 -650825 491315
3789 491315 1345566 1000742 -672357 -3089721 -5606853 -7381527 -7353529 -5545446 -3521957
3780 -3521957 -2074353 417781 5177407 9733161 10476366 7971885 6144758 6036982 4437544
3771 4437544 -83163 -3915358 -3608474 -888383 556231 473044 726553 830324 -1088780
3762 -1088780 -3977597 -4579658 -2412789 -604026 -1392326 -3660107 -5376351 -5864645 -5035525
3753e035525K273645K912509K144857J296700J509847J454806m08446k733798
3745C414595l122871j818320p86397j94317J173887K762046K800721J793161K054630
3736H077135L370454K516373j583352n179085m354578m43352J671926j76944l193941
3727G04636l703371j551132N44872R15665O40776J264513K319607K293052J220684
3718D649302N83234O82146J8695k063763l861998l600744j871670m71375M6222
3709e889951K57696L45676K11995K77765P02198O46202k21395n34331O66988J723243
3699a813914N08456j998822k874895j592880m82031q43530j392586r83429j61897
3690a1635528P06800K184242L683628L358756J373446N97010K310953L790717
$$ plain form
3753 -5035525 -2761880 150629 2295486 3592186 5102033 6556839 6148393 3414595
3745 3414595 291724 -1526596 -2312993 -2507310 -1333423 1428623 4229344 6022505 8077135
3736 8077135 11447589 13963962 12380610 7201525 2846947 2403595 4075521 3898577 704636
3727 704636 -2998735 -4549867 -4004995 -3089330 -2448554 -1184041 1135566 3428618 4649302
3718 4649302 5232536 5914682 5933377 3869614 7616 -3593128 -5464798 -5936173 -5889951
3709 -5889951 -5632255 -5286579 -5074584 -4796819 -4094621 -3448419 -3669814 -4204145 -3537157 -1813914
3699 -1813914 -1305458 -3304280 -6179175 -7772055 -8254086 -9097616 -10490202 -11473631 -11635528
3690 -11635528 -10928728 -8744486 -5060858 -1702102 -328656 268354 2579307 6370024
3682F370024K332303o67696k229662k289040k650344l140644k289273p94990o17513
3673e976835j029675O09022L897456N057479K563833m77629j171283o87650j052236
3664A732482j164225Q41006L407401L283279L91561k272161l095985l111003k919788
3655b907433j550905R29378K389403J442232o59215j993432k169602j676343p69368
3646f965285l9903m38584j598945j722287k82082R20237P96188J022602K908096
3637e399963M099415J534323l256374n266883k589625J313371K716862K022517
3629d826357J498976J251511o8310k004731k448041q17144R71130J056243k22874
3620e609597j200792r68276l9202N99238O22201N07694O30485N43487k86606j135889
$$ plain form
3682 6370024 8702327 8034631 5804969 3515929 865585 -2275059 -4564332 -5359322 -5976835
3673 -5976835 -7006510 -6397488 -2500032 2557447 5121280 4643651 3472368 2784718 1732482
3664 1732482 568257 1409263 4816664 8099943 8491504 6219343 3123358 12355 -2907433
3655 -2907433 -4458338 -3528960 -1139557 302675 -356540 -2349972 -4519574 -6195917 -6965285
3646 -6965285 -7005188 -7443772 -9042717 -10765004 -11047086 -10126849 -9330661 -8308059 -5399963
3637 -5399963 -1300548 233775 -3022599 -8289482 -10879107 -9565736 -6848874 -4826357
3629 -4826357 -3327381 -2075870 -2144180 -4148911 -6596952 -7414096 -6442966 -5386723 -5609597
3620 -5609597 -6810389 -7778665 -7817867 -7218629 -6596428 -6088734 -5458249 -4914762 -5201368 -6337257
3610f337257m47212J881609L628855K769377K98780q47238L31087J575058N66304
3601C419363j787300k599850j007008P47874N89100n85906n93823N88147R03100
3592c26303m87685j981101k114738j514008j219892p46862O72623K254105K865857
3583b598004K997195L562333L699237K089058k07371q92884j29606k04366j414337
3574F901255j519277m1465L05651j863774l785192k633545R8211J103614J62697
3565a271825n19575l95409o39987r18053M26029K835336L406995J192073r48524
3556C167060j79393K404756L295011J090768j895366k495997l40336J856249J676861
3547H579613o5792q32080k74057n39227k275879l020416j173309R62808O59708
$$ plain form
3610 -6337257 -6784469 -4902860 -1274005 1495372 1794152 946914 1278001 2853059 3419363
3601 3419363 1632063 -967787 -1974795 -1226921 -637821 -1223727 -1817550 -1229403 -326303
3592 -326303 -813988 -2795089 -4909827 -6423835 -7643727 -8390589 -7717966 -5463861 -2598004
3583 -2598004 399191 3961524 7660761 9749819 9542448 8649564 8519958 8315592 6901255
3574 6901255 5381978 5340513 5646164 3782390 -2802 -2636347 -2538136 -1434522 -1271825
3565 -1271825 -1791400 -2186809 -2826796 -3744849 -3318820 -483484 2923511 4115584 3167060
3556 3167060 2987667 5392423 8687434 9778202 7882836 5386839 5046503 6902752 8579613
3547 8579613 8513821 7681741 7407684 6868457 4592578 1572162 398853 1361661 2021369
3538B021369q64707p96485K43520m81065k368875j903196J246880L161957J971395
3529B230793P88832K089912L221184R52636k582696k785529K15173J722718l37295
3520E515728k478851j140391J979987K296281j464804n662275o152609k691366
3512i798300J543303L668292L238536J253907j193514k664735j476062K186382
3504c242191N098793M017061k27896l525881l511547j860733j123032j315193
3496e690619q32709P31885K115629K088203P13831p67769j076114l54709j76473
3487c248845j217173j711781P1871K576603K717553O58996k53926J197591K201200
3478B992089N72578j917007k803294k602333k808212k723880j059088J208024
$$ plain form
3538 2021369 1156662 360177 603697 122632 -2246243 -4149439 -2902559 259398 2230793
3529 2230793 3019625 5109537 8330721 9283357 6700661 3915132 4130305 5853023 5515728
3520 5515728 3036877 1896486 3876473 6172754 4707950 -954325 -7106934 -9798300
3512 -9798300 -8254997 -4586705 -1348169 -94262 -1287776 -3952511 -5428573 -3242191
3504 -3242191 1856602 5873663 5645767 2119886 -1391661 -3252394 -4375426 -5690619
3496 -5690619 -6523328 -5791443 -3675814 -1587611 -873780 -1641549 -2717663 -3072372 -3248845
3487 -3248845 -4466018 -6177799 -6105928 -3529325 -811772 -152776 -406702 790889 2992089
3478 2992089 3564667 1647660 -1155634 -3757967 -6566179 -9290059 -10349147 -9141123
3470i141123K233673K008669J349306M5796j518051j051108K238818M862690L248938
3461D277608q20164k789478k016127j569808k232714j603509O56546J608748K10970
3452d277928p90061J13015M47512j509625k955923p71694L120540M137294J352767
3443a134103j749686k254933q47089K16958J16666k01103K92832J343754J767722
3434b448982J090959K36570K1605j16601o94984o21911Q97129J918684J79729
3425D62198k516858j993252J798325L914880J491664k166922k850908j272761
3417c133634n26593o64812L43049K144633K541984J640460J725168L074894L123964
3408A0269113L05566l652489n799513m714953j240135J983732K105535j024554
$$ plain form
3470 -9141123 -6907450 -4898781 -3549475 -3503679 -5021730 -6072838 -3834020 1028670 4277608
3461 4277608 3457444 667966 -1348161 -2917969 -5150683 -6754192 -6097646 -4488898 -4277928
3452 -4277928 -5067989 -4954974 -4507462 -6017087 -8973010 -9744704 -6624164 -2486870 -1134103
3443 -1134103 -2883789 -5138722 -5985811 -5768853 -5652187 -5853290 -5560458 -4216704 -2448982
3434 -2448982 -1358023 -1121453 -1099848 -1216449 -1911433 -2533344 -1636215 282469 462198
3425 462198 -2054660 -4047912 -2249587 1665293 3156957 990035 -1860873 -3133634
3417 -3133634 -3660227 -4325039 -3981990 -1837357 704627 2345087 4070255 7145149 10269113
3408 10269113 10574679 6922190 1122677 -3592276 -4832411 -2848679 -743144 -1767698
3400a767698l887000l022836O55263L104951K253389j60667j533991j066897N06275
3391d919211J923827J985443O45307o17140p64892o94322j134942n22761K342953
3382a755738M835151L430695l85744j454233J309918L031554M22849l119224k875827
3373C439401K30119J751276M34840j173104j582072j872215k513707k119944j29775
3364c535181J731619J689823J11969j253828j243270j43554O98686J96012j004464
3355b752188r85311P15143J909622P06171j414893j519812M13100J471226J46917
3346a310025j750172k091639j109609r4972O60917J359089J660340J473686J515732
3337C13347J858146J230200p91465k192011j004117J506926K262228N72518j222284
$$ plain form
3400 -1767698 -5654698 -8677534 -8022271 -4917320 -2663931 -2824598 -4358589 -5425486 -4919211
3391 -4919211 -2995384 -1009941 -364634 -981774 -1746666 -2440988 -3575930 -4098691 -1755738
3382 -1755738 3079413 6510108 6124364 4670131 5980049 9011603 9434452 6315228 3439401
3373 3439401 3669520 5420796 5855636 4682532 3100460 1228245 -1285462 -3405406 -3535181
3364 -3535181 -1803562 -113739 -1770 -1255598 -2498868 -2642422 -1943736 -1747724 -2752188
3355 -2752188 -3737499 -3022356 -1112734 -406563 -1821456 -3341268 -2928168 -1456942 -1310025
3346 -1310025 -3060197 -5151836 -6261445 -6356417 -5695500 -4336411 -2676071 -1202385 313347
3337 313347 2171493 3401693 2610228 418217 -585900 921026 3183254 3755772 2533488
3328B533488j324016n34189k62626m98902p13670j080236j550674j053508R64958
3319c519375L126484L615015K433243J004543K08966m2736n4641l90215j739555
3310D641729l319791k643918J020252M160729K956197r60536k346738j06946J098002
3301D498980j541238m216697k458938J769600L164984Q57902j541909k252664
3293a719980k726391l101714j271108K584471M876321L583187P68779j346493
3285A647072l229387n125279m960870j788927J688133K886269K990461L864438
3277b028090L940232R26209l266741m397027j818067J152408K248674K115537
3269a126865J472193N2991j375799j307949l55653p35024k305645k301951J7385
$$ plain form
3328 2533488 1209472 675283 412657 -86245 -799915 -1880151 -3430825 -4484333 -3519375
3319 -3519375 -392891 3222124 5655367 6659910 6868876 6826140 6771499 6381284 4641729
3310 4641729 1321938 -1321980 -301728 3859001 6815198 5854662 3507924 3400978 4498980
3301 4498980 2957742 -1258955 -3717893 -1948293 1216691 2074593 532684 -1719980
3293 -1719980 -4446371 -7548085 -8819193 -6234722 -1358401 2224786 2993565 1647072
3285 1647072 -1582315 -6707594 -11668464 -13457391 -11769258 -8882989 -5892528 -2028090
3277 -2028090 1912142 2838351 -428390 -4825417 -6643484 -5491076 -3242402 -1126865
3269 -1126865 345328 398319 -977480 -2285429 -2641082 -3376106 -5681751 -7983702 -7966317
3260g966317J630951K67142k036527j867208J022439L954822M681248L054580
3252B741130O26210l51758J139702L176743K720446k53292k539195k326733j402313
3243C530940j516638j553547l53005N65535j38586o35650R15304K461260J143215
3234D418828j512331j882084n16061j112893l499453l144323J109150M127310
3226b011857J960345k162725k877925l70962J143592M28320J88067J753957K958597
3217A009409J878826l87577j684465j447594n43597L3178k57743j024250q71696
3208c295509R36575K839819K596013N39981o91632n2467M09462j106185l286131
3199a110074l737812k404151j096387o01630k51648J35481p158k57552P24047
$$ plain form
3260 -7966317 -6335366 -6068224 -8104751 -9971959 -8949520 -4994698 -313450 2741130
3252 2741130 3367340 3015582 4155284 7332027 10052473 9799181 7259986 4933253 3530940
3243 3530940 2014302 460755 107750 673285 534699 -100951 814353 3275613 4418828
3234 4418828 2906497 1024413 508352 -604541 -4103994 -7248317 -6139167 -2011857
3226 -2011857 -51512 -2214237 -5092162 -5463124 -4319532 -3891212 -3703145 -1949188 1009409
3217 1009409 2888235 2500658 816193 -631401 -1174998 -1141820 -1399563 -2423813 -3295509
3208 -3295509 -2358934 480885 3076898 3616879 2925247 2872780 3282242 2176057 -1110074
3199 -1110074 -4847886 -7252037 -8348424 -8950054 -9201702 -9066221 -9073379 -9330931 -8606884
3190h606884K697157L256661J099560j434635r93317K042973L498736P06323l767310
3181a500736n110257k133712J615375K582401J177976J12008L24480M47594k55717
3172b740588n87772M20734J750594J887107R35352K1089n91122j373349j997633
3163b275588j472263J17165J308324J037772k43712j447070j876135j205952M31981
3154e625478J933774J915014N26486m20821K23797J535842K107274J850974J253127
3145E299989J19984j510793k324872j365686J03152K92084k52793K51829J329277
3136A942171O55814j755852k784140q12589J520015J017693j691618l576309l388894
3127h873709k145832o13107J210083K668422K830217K186098K065191K423197
$$ plain form
3190 -8606884 -5909727 -2653066 -1553506 -2988141 -3981458 -1938485 1560251 2266574 -1500736
3181 -1500736 -6610993 -8744705 -7129330 -4546929 -3368953 -3256945 -2932465 -2484871 -2740588
3172 -2740588 -3328360 -2907626 -1157032 730075 1665427 1686516 1095394 -277955 -2275588
3163 -2275588 -3747851 -3630686 -2322362 -1284590 -1528302 -2975372 -4851507 -6057459 -5625478
3154 -5625478 -3691704 -1776690 -1250204 -1671025 -1447228 88614 2195888 4046862 5299989
3145 5299989 5419973 3909180 1584308 218622 321774 613858 361065 612894 1942171
3136 1942171 2597985 842133 -1942007 -2754596 -1234581 -216888 -1908506 -5484815 -8873709
3127 -8873709 -11019541 -11632648 -10422565 -7754143 -4923926 -2737828 -672637 1750560
3119A750560J973977N30563m66675M5552J548242K770085K615251O61601j946219
3110I482937k759179q93910J085076L19085k002162k272284j64937P42126j313441
3101B223311l453995k664250o0604J496907J532782J247805P27158m95874j523026
3092i69786j207652j14932O90806J526919K650207K447618l26447l682010m505004
3083c490281k670288m46960J156920K478295K616585L84324k446649k552816j5757
3074d986627J642261Q88656j1306M34554L84769j530207l231679k393710L5706
3065h767583J883391L028823M232502M697635L325186R28484r53696k063997k506731
3056C804014j693598j62086k61015k561834l817989j529985J589806J446708q93535
$$ plain form
3119 1750560 3724537 4255100 3788425 3833977 5382219 8152304 10767555 11429156 9482937
3110 9482937 6723758 5829848 6914924 7234009 5231847 2959563 2794626 3536752 2223311
3101 2223311 -1230684 -3894934 -3955538 -2458631 -925849 321956 1049114 553240 -969786
3092 -969786 -2177438 -2292370 -1601564 -74645 2575562 5023180 4696733 1014723 -3490281
3083 -3490281 -6160569 -6607529 -5450609 -2972314 -355729 28595 -2418054 -4970870 -4986627
3074 -4986627 -3344366 -2455710 -2467016 -2032462 -1647693 -3177900 -6409579 -8803289 -8767583
3065 -8767583 -6884192 -3855369 377133 5074768 8399954 9328438 8374742 6310745 3804014
3056 3804014 2110416 1948330 1687315 -874519 -4692508 -6222493 -4632687 -3185979 -4079514
3047d079514r92637J531102K402456r3740k249262r74984J506573J554065m99591
3038a895532j729093j186136k34101L26493Q87555J427714J287759L41013q21734
3029a596062j525005j180221L24782J821014J647873m0231j156989o79755n0248
3020b434842m33488n33934J010551K765267K441175N84625k78643L64774N18712
3011D004197p91400j958868j387866L09560J561324J850062J655997J391512J042631
3002G677149K72353j215494k752554k635468l22725J783814Q17384k271761l418810
2993b066112j170914J044525J24423j861084j002831K032736K843266K00851k069223
2984a924363j286188m4825j457882l384886j515662L240167N123869J712238k566510
$$ plain form
3047 -4079514 -5072151 -3541049 -1138593 -1232333 -3481595 -4456579 -2950006 -1395941 -1895532
3038 -1895532 -3624625 -4810761 -5044862 -4718369 -3830814 -2403100 -1115341 -774328 -1596062
3029 -1596062 -3121067 -4301288 -3976506 -2155492 -507619 -547850 -1704839 -2384594 -2434842
3020 -2434842 -2868330 -3402264 -2391713 373554 2814729 3399354 3120711 3485485 4004197
3011 4004197 3212797 1253929 -133937 175623 1736947 3587009 5243006 6634518 7677149
3002 7677149 7949502 6734008 3981454 1345986 1023261 2807075 3624459 1352698 -2066112
2993 -2066112 -3237026 -2192501 -2068078 -3929162 -4931993 -2899257 -55991 144860 -1924363
2984 -1924363 -3210551 -3255376 -4713258 -8098144 -9613806 -6373639 -1249770 462468 -2104042
2975b104042k942352p30273k37237j776297j654602J740161N508367O224861L580915
2966G609501m54800l701313m457941k501429j40965r7601j695547j623381P92557
2957f270919K218018P75451n63042J091636L215057J524350k913839m882272k727415
2948h532975j86170k3148m29489O14750J558766O09737l89608J122272L689454
2939a966411L690331R50713j037425m32340O71403l5749j874841k992394l100238
2930f126951k668486j186397J540532L519999K662593M35925N45274L309345M337979
2921F369813P73365l684081l269314J618555M636568K133529k390028l943326
2913B245081k588887j653545k096562k107221r01465M14136J209147J778407J840843
$$ plain form
2975 -2104042 -5046394 -5776667 -6013904 -7790201 -9444803 -7704642 -2196275 4028586 7609501
2966 7609501 7154701 3453388 -1004553 -3505982 -3646947 -3744548 -5440095 -7063476 -6270919
2957 -6270919 -4052901 -3277450 -3840492 -2748856 466201 1990551 -923288 -5805560 -8532975
2948 -8532975 -8719145 -8742293 -9171782 -8557032 -6998266 -6388529 -6778137 -5655865 -1966411
2939 -1966411 1723920 2674633 1637208 1204868 1876271 1840522 -34319 -3026713 -6126951
2930 -6126951 -8795437 -9981834 -8441302 -4921303 -2258710 -1822785 -1277511 2031834 6369813
2921 6369813 7143178 3459097 189783 1808338 6444906 8578435 6188407 2245081
2913 2245081 -343806 -1997351 -4093913 -6201134 -7102599 -6688463 -5479316 -3700909 -1860066
2904a860066J065823N40312J221547J706546L72534j179893l31154J610418R51945
2895D098012j925699k548434K26201J912903l03039k931090k116150K19772L84900
2886b982624o11706M22140K514330K132375k62038o33075J907799L653037K116581
2877H256819p95167k329377k228444j576445j055683j115367j667569j418809
2869c930042L94998K075223J741942O35223R83537J675879J85917j984026r53568
2860H25083K293982K158888k561873n769462l063535J688281K766541J050437
2852f11658J146048L375577L981516J540916j656545l704590m449735l500911
2844c879382o66735K038874K169077K89277j155838j593916j950982j577139Q67682
$$ plain form
2904 -1860066 -794243 -253931 967616 2674162 3046696 1866803 1535649 3146067 4098012
2895 4098012 2172313 -376121 -149920 1762983 1459944 -1471146 -3587296 -3367524 -2982624
2886 -2982624 -3594330 -3172190 -657860 1474515 1212477 579402 2487201 6140238 8256819
2877 8256819 7461652 5132275 2903831 1327386 271703 -843664 -2511233 -3930042
2869 -3930042 -3535044 -1459821 282121 917344 1900881 3576760 3762677 1778651 825083
2860 825083 3119065 5277953 2716080 -3053382 -6116917 -4428636 -1662095 -611658
2852 -611658 534390 3909967 7891483 9432399 7775854 4071264 -378471 -3879382
2844 -3879382 -4546117 -2507243 -338166 -48889 -1204727 -2798643 -4749625 -6326764 -5459082
2835e459082L964777M559646K184132o95575k580258l815443l942979j934999
2827g719781Q01607J443456K62473M24577K646463L916781K570899P05638M2077
2818E094190o91227k193282k216659M49683K829166J797331j188540k603065k081297
2809h03700j834998k316316j809622K78319K439147L075785J645915j389091m066754
2800d781315l717112l22303K338907J286270j367419j533531P60560J866015M65567
2791e004361p36345L76078K420363L174177K380160Q44592q59798j750058p75050
2782F9758J039259R41399j735460m147045l818677j991766j219624j359518m06384
2773a2628058J677377K633632J402986k89488m58558O48632J448270J310866R61361
$$ plain form
2835 -5459082 -1494305 3065341 5249473 4553898 1973640 -1841803 -5784782 -7719781
2827 -7719781 -6918174 -5474718 -5212245 -4787668 -2141205 1775576 4346475 5052113 5094190
2818 5094190 4402963 2209681 -6978 442705 3271871 5069202 3880662 1277597 -803700
2809 -803700 -2638698 -4955014 -6764636 -6486317 -4047170 -971385 674530 -714561 -4781315
2800 -4781315 -8498427 -8820730 -6481823 -5195553 -6562972 -8096503 -7335943 -5469928 -5004361
2791 -5004361 -5740706 -5364628 -2944265 229912 2610072 3454664 2594866 844808 69758
2782 69758 1109017 2050416 314956 -3832089 -7650766 -9642532 -10862156 -12221674 -12628058
2773 -12628058 -10950681 -8317049 -6914063 -7203551 -7662109 -7013477 -5565207 -4254341 -3292980
2764c292980J143268J786107K361878K399084J632896K23592j046321j389920
2756C817604j156660j705023l455778m670596l357904j99670J905854J562949
2748g259224O15557J307970L073199L491299J573580j263521k922223k183030
2740c566393P10505L703306L921376O33306l260396m283686k426273m02202M80328
2731d490129J296519K436818K357997L76527j539000j237932Q01786K377763K132792
2722D513141K68995k061352l080910j401979K026492M043357K690553k73044j539885
2713E185368k84771J285798J017082q82762k662817l141714k565036j737512q12033
2704d598397O08171K185313K677285J837502J351338K291067K659377l7719m199978
$$ plain form
2764 -3292980 -2149712 -363605 1998273 4397357 6030253 6253845 5207524 3817604
2756 3817604 2660944 955921 -2499857 -7170453 -10528357 -10728027 -8822173 -7259224
2748 -7259224 -6643667 -5335697 -2262498 1228801 2802381 1538860 -1383363 -3566393
2740 -3566393 -2855888 847418 4768794 5402100 2141704 -2141982 -4568255 -4970457 -4490129
2731 -4490129 -3193610 -756792 1601205 1977732 438732 -799200 2586 2380349 4513141
2722 4513141 4782136 2720784 -360126 -1762105 264387 4307744 6998297 6725253 5185368
2713 5185368 4900597 6186395 7203477 6320715 3657898 516184 -2048852 -3786364 -4598397
2704 -4598397 -3990226 -1804913 872372 2709874 4061212 6352279 9011656 8973937 4773959
2695D773959n277175k050123J485031J862131N95379P55823K015087K065848Q31991
2686G057951n19j93403n05850k09589J608385L061505J316489k740582n032936
2677D361451l717296j042404M96281P74384K75860j137178k632080k376830l92899
2668e390711R26133K83718q20976q76591l60427J98268J479706L178529L233216
2659A850865J138760n80028l99032o00179l191611n539731l855783N79780K882028
2650g714931J665058M84365J814436L591907L199206J578675J129745J726991
2642G475452J346667m21022j764524j431536m88301q27928k669309m103455l186931
2633f070887k83511K132176K170793M00468j372595k259730k293747j259719Q29823
$$ plain form
2695 4773959 -503216 -2553339 -1068308 793823 1389202 2145025 4160112 6225960 7057951
2686 7057951 7057432 6864029 6358179 6148590 7756975 10818480 12134969 9394387 4361451
2677 4361451 644155 -398249 98032 872416 1148276 11098 -2620982 -4997812 -5390711
2668 -5390711 -4464578 -4180860 -5001836 -5878427 -6238854 -6040586 -4560880 -1382351 1850865
2659 1850865 2989625 2409597 2010565 1410386 -1781225 -7320956 -11176739 -10596959 -7714931
2650 -7714931 -6049873 -5565508 -3751072 -159165 3040041 4618716 5748461 7475452
2642 7475452 8822119 8401097 6636573 5205037 4716736 3888808 1219499 -2883956 -6070887
2633 -6070887 -6354398 -4222222 -2051429 -1650961 -3023556 -5283286 -7577033 -8836752 -8006929
2624h006929K517757K033117j78133j680340j167282J77426R03734J223873J793750
2615b383027J997434Q03890j447507l312666l838399k980248r38139J837572M100421
2606f160669M244863J712994k174112m834721m097415N5731N041193P450827N865509
2597G104200J952167j251428j945992o56962O92247O71490l31476p66635j99029
2588E268582k56222k271029m586830m041261l34871K964385K657021l47801k617360
2579c565386k256539j24560J977706K898867K469282J392856M53922o73685k759014
2570a86551m539867k877763K760272P674669O663370P07480m054765l994199j519335
2561F33311l24781m41164P9959J161333J168308R4343l93288K65082Q65238O07315
$$ plain form
2624 -8006929 -5489172 -3456055 -3634188 -5314528 -6481810 -6304384 -5400650 -4176777 -2383027
2615 -2383027 -385593 418297 -1029210 -4341876 -8180275 -11160523 -12098662 -10261090 -6160669
2606 -6160669 -1915806 -202812 -2376924 -7211645 -11309060 -11253329 -6212136 1238691 7104200
2597 7104200 9056367 7804939 5858947 5201985 5894232 6565722 6234246 5467611 5268582
2588 5268582 5012360 2741331 -1845499 -5886760 -6221631 -3257246 -600225 -948026 -3565386
2579 -3565386 -5821925 -5946485 -3968779 -1069912 1399370 2792226 3246148 2572463 -186551
2570 -186551 -4726418 -7604181 -4843909 2830760 9494130 10201610 6146845 2152646 633311
2561 633311 308530 -132634 -52675 1108658 2276966 2371309 1978021 2243103 3108341 3715656
2551C715656J16828j0772j83639p67665j192067q28207j07303n8111q92029j465765
2541a673074l79289K191462L916958K383158j802807m856292l827511k34592J705015
2532b576972L63620j436369n04018K261192L037362K32699l198618l234077L81874
2523d673307L917791M164809J954112L88650M73120K49239j540453k966805j663375
2514C03781J242546K312149O67111q70909k38359P72766k99802k251273j870892
2505b32882Q35202K248781M66427j921171j932912o28475r06000k434436k029131
2496f534597J166194M138790M511341L631912L399551K605298o79653m645687
2488G593149n215869j829189J508071J680933J00500m14384K41361M91930K34743
$$ plain form
2551 3715656 3832484 3821712 3638073 2870408 1678341 850134 742831 684720 -207309 -1673074
2541 -1673074 -2052363 139099 4056057 6439215 4636408 -219884 -4047395 -4281987 -2576972
2532 -2576972 -2213352 -3649721 -4153739 -1892547 1144815 1377514 -1821104 -5055181 -4673307
2523 -4673307 -755516 3409293 5363405 5752055 6225175 6474414 4933961 1967156 303781
2514 303781 1546327 3858476 4525587 3654678 3416319 4189085 3889283 1638010 -232882
2505 -232882 602320 2851101 3317528 1396357 -536555 -1165030 -2071030 -4505466 -6534597
2496 -6534597 -5368403 -1229613 3281728 6913640 10313191 12918489 12238836 7593149
2488 7593149 2377280 548091 2056162 3737095 3837595 3423211 3664572 4156502 4391245
2479D391245M69315R35651N44940m49304q73906p80664j124346j747134j839632
2470d73835j959664l062617l758184j585236K558840M539041K721018L63924M03301
2461b53412J062507m17813k427995j389565K024981L491737J587794n18234n53241
2452B606759j66402q67652q56285J231224K447828o72270n936566p244705k611658
2443a2069727L084265M410551J582840j306194j982584j486192j151304p76391
2435i694736P7825J044975J900573L066201M329210M278946K095349r74584l035759
2426C088000l698455l628763k787244q53691J059869J279937L17515N02050K193646
2417b527136K697055L14236k706759l286407j772977o09330j89377Q93051K234143
$$ plain form
2479 4391245 4860560 5796211 6341151 5891847 5017941 4237277 3112931 1365797 -473835
2470 -473835 -2433499 -5496116 -9254300 -10839536 -8280696 -3741655 -1020637 -656713 -253412
2461 -253412 809095 391282 -2036713 -3426278 -1401297 2090440 3678234 3160000 2606759
2452 2606759 2440357 1572705 716420 1947644 4395472 3723202 -2213364 -9458069 -12069727
2443 -12069727 -8985462 -4574911 -2992071 -4298265 -6280849 -7767041 -8918345 -9694736
2435 -9694736 -9616911 -8571936 -6671363 -3605162 724048 5002994 7098343 6123759 3088000
2426 3088000 -610455 -4239218 -7026462 -7880153 -6820284 -5540347 -5222832 -4720782 -2527136
2417 -2527136 169919 484155 -2222604 -5509011 -7281988 -7891318 -8080695 -7187644 -4953501
2408d953501J746767l75817j162882O58436K617877K368405R69974M78699N99710
2399B947668M6170o22809j66016N68363k44767k163264k952001k109037j462672
2390f158365k024547k465468j338118R38997K965639L793195K978727O44287j921965
2381b587618l035114k602857k144445k323874j920156q4471J858232K205079J421751
2372i213473J345431K382480L007609J993256r1316j819199k470612k363278k149077
2363i378179k024002j483704k1457J782104K445706J431218J97123M36653J655133
2354d959405J797371K85829j056392o74158N32783P98046J80409J07430P76740
2345b211347Q17150l27408j363139j136426k70077R6682O2296L79434J055008
$$ plain form
2408 -4953501 -3206734 -3582551 -4745433 -4086997 -1469120 899285 1869259 2347958 2947668
2399 2947668 2993838 2371029 2205013 2773376 2528609 365345 -2586656 -4695693 -6158365
2390 -6158365 -8182912 -10648380 -11986498 -11047501 -8081862 -4288667 -1309940 -665653 -2587618
2381 -2587618 -5622732 -8225589 -10370034 -12693908 -14614064 -14698535 -12840303 -10635224 -9213473
2372 -9213473 -7868042 -5485562 -2477953 -484697 -576013 -2395212 -4865824 -7229102 -9378179
2363 -9378179 -11402181 -12885885 -12907342 -11125238 -8679532 -7248314 -7051191 -6614538 -4959405
2354 -4959405 -3162034 -2876205 -3932597 -4606755 -4073972 -3275926 -3095517 -2988087 -2211347
2345 -2211347 -1394197 -1721605 -3084744 -4221170 -4491247 -4394565 -4332269 -3952835 -2897827
2336b897827J703214K447275L155455K634827K94174j988582j700719P32206K286829
2327F666852J459878n2024k90204M61964R48741P24983l33089k345812m142609
2318C098680l712945j258118M14805P9982N4577J795748K513097l52335l800797
2309a167306l086282N69519J385651j958939m203677j734222K136487K680360
2301e378409M46928p87466K09917J697215K262496J694065J40438j279695p39899
2292a734410J349226J774531q18178l180786k280269k94248j017679l420528l334181
2283a2956522k78254K240247K737177L102025L768008K645323m6833q55029J098800
2274A454942K030542j91115k002743J19321L614418L750898Q01659j310921j672417
$$ plain form
2336 -2897827 -1194613 1252662 4408117 7042944 7337118 5348536 3647817 4380023 6666852
2327 6666852 8126730 8074706 7784502 8246466 9195207 9920190 9587101 7241289 3098680
2318 3098680 -614265 -1872383 -1457578 -1377596 -1323019 472729 2985826 2633491 -1167306
2309 -1167306 -4253588 -3684069 -2298418 -4257357 -8461034 -10195256 -8058769 -5378409
2301 -5378409 -4931481 -5718947 -5509030 -3811815 -1549319 144746 285184 -994511 -1734410
2292 -1734410 -385184 1389347 571169 -2609617 -4889886 -5184134 -6201813 -9622341 -12956522
2283 -12956522 -13234776 -10994529 -8257352 -5155327 -1387319 1258004 1211171 356142 1454942
2274 1454942 3485484 3294369 1291626 1410947 5025365 8776263 9577922 8267001 6594584
2265F594584k708949m544142m015548j64706L324835K831112p95902m003494m632386
2256h114596l004830o87855O49496M52985J15641J349784L430589L799732J857997
2247a51057O1201L13519J358242J123563k33420j302787j750295j724749m51071
$$ plain form
2265 6594584 3885635 -658507 -4674055 -4838761 -1513926 1317186 521284 -3482210 -8114596
2256 -8114596 -11119426 -11807281 -11157785 -10704800 -10589159 -9239375 -5808786 -2009054 -151057
2247 -151057 -89856 223663 1581905 2705468 2472048 1169261 -581034 -2305783 -2756854
$$ [...]
##END NTUPLES=NMR SPECTRUM
##END=
