##TITLE=31P_DE-80H_X3
 64 sc D2O
 26.2.2025
##JCAMPDX= 6.0         $$ Bruker NMR JCAMP-DX V2.0
##DATA TYPE= NMR SPECTRUM
##DATA CLASS= NTUPLES
##ORIGIN= UXNMR, Bruker Analytische Messtechnik GmbH
##OWNER= root
$$ XWIN-NMR		Version 3.5
$$ Wed May 14 14:44:44 2025 Russian Standard Time (UT+4h)  Yarkov@DPX200
##.OBSERVE FREQUENCY= 81.013821
##.OBSERVE NUCLEUS= ^31P
##.ACQUISITION MODE= SIMULTANEOUS
##.ACQUISITION SCHEME= undefined
##.AVERAGES= 64
##.DIGITISER RES= 17
##SPECTROMETER/DATA SYSTEM= spect
##.PULSE SEQUENCE= zgpg30
##.SOLVENT NAME= CDCl3
##.SHIFT REFERENCE= (INTERNAL, CDCl3, 0, 198.062)
##AUDIT TRAIL= $$ (NUMBER, WHEN, WHO, WHERE, WHAT)
$$ ##TITLE= Audit trail, XWIN-NMR		Version 3.5
$$ ##JCAMPDX= 5.01
$$ ##ORIGIN= Bruker BioSpin GmbH
$$ ##OWNER= Yarkov
$$ C:/Bruker/XWIN-NMR/data/yarkov2/nmr/P31/2/pdata/1/auditp.txt
$$ ##AUDIT TRAIL=  $$ (NUMBER, WHEN, WHO, WHERE, WHAT)
(   1,<2025-05-14 14:42:46.68 +0400>,<Yarkov>,<DPX200>,
      <created by zg, POWCHK disabled, PULCHK disabled
       configuration hash MD5:
       00 E9 B6 7A A2 85 ED C7 34 08 36 98 17 FE 4E 26
       data hash MD5: 32K
       C1 05 17 CA 7C FB 9F 0E D4 8D 30 74 34 A3 50 57>)
(   2,<2025-05-14 14:42:57.87 +0400>,<Yarkov>,<DPX200>,
      <Start of raw data processing
       efp BC_mod = 2 LB = 1.5 FT_mod = 6 PKNL = 1 PHC0 = 1789.996 PHC1 = 8.695429 SI = 64K 
       data hash MD5: 64K
       B3 CB 96 4D 6E 36 87 F7 66 16 BA 95 C2 7A B9 6F>)
(   3,<2025-05-14 14:43:34.50 +0400>,<Yarkov>,<DPX200>,
      <abs ABSG = 5 
       data hash MD5: 64K
       13 91 4C 46 AF 2A 51 B3 69 E0 61 24 EA B9 DD 97>)
(   4,<2025-05-14 14:43:50.90 +0400>,<Yarkov>,<DPX200>,
      <pk PHC0 = -21.64684 PHC1 = -0.335999 
       data hash MD5: 64K
       89 F3 E3 6A 5D 1F D7 39 0B CE 53 37 78 C8 99 10>)
(   5,<2025-05-14 14:44:16.34 +0400>,<Yarkov>,<DPX200>,
      <pk PHC0 = 26.5864 PHC1 = 5.200024 
       data hash MD5: 64K
       86 3B AD 55 F4 11 60 1A 45 ED 5E BB 6A 38 17 28>)
$$ ##END=
$$ 
$$ hash MD5
$$ 75 C6 E7 C7 AB 8C 9D DD 34 9D AA 05 5A CB E7 FB
##$RELAX= 
##$RELAX= 
##$RELAX= 
##$RELAX= 
##$RELAX= 
##$RELAX= 
##$RELAX= 
##$RELAX= 
$$ Bruker specific parameters
$$ --------------------------
##$DU= <C:/Bruker/XWIN-NMR>
##$EXPNO= 2
##$NAME= <P31>
##$PROCNO= 1
##$TYPE= <nmr>
##$USER= <yarkov2>
##$AMP= (0..31)
100 100 100 100 100 100 100 100 100 100 100 100 100 100 100 100 100 100 
100 100 100 100 100 100 100 100 100 100 100 100 100 100 
##$AQSEQ= 0
##$AQ_mod= 1
##$AUNM= <au_zg>
##$AUTOPOS= <>
##$BF1= 81.014009
##$BF2= 200.13
##$BF3= 200.13
##$BF4= 200.13
##$BF5= 200.13
##$BF6= 200.13
##$BF7= 200.13
##$BF8= 200.13
##$BYTORDA= 1
##$CFDGTYP= 0
##$CFRGTYP= 5
##$CHEMSTR= <none>
##$CNST= (0..31)
1 1 145 1 1 1 1 1 1 1 1 1 1 1 1 1 1 1 1 1 1 1 1 1 1 1 1 1 1 1 1 1 
##$CPDPRG= <waltz16>
##$CPDPRG1= <>
##$CPDPRG2= <waltz16>
##$CPDPRG3= <>
##$CPDPRG4= <mlev>
##$CPDPRG5= <mlev>
##$CPDPRG6= <mlev>
##$CPDPRG7= <mlev>
##$CPDPRG8= <mlev>
##$CPDPRGB= <>
##$CPDPRGT= <>
##$D= (0..31)
$$ [...]
##$SUBNAM3= <"">
##$SUBNAM4= <"">
##$SUBNAM5= <"">
##$SUBNAM6= <"">
##$SUBNAM7= <"">
##$SUBNAM8= <"">
##$SUBNAM9= <"">
##$SW= 400.765351723535
##$SWIBOX= (0..15)
0 1 3 0 0 0 0 0 0 0 0 0 0 0 0 0 
##$SW_h= 32467.5324675325
##$TD= 32768
##$TD0= 1
##$TE= 0
##$TE2= 300
##$TE3= 300
##$TEG= 300
##$TL= (0..7)
0 120 53 12 22 120 120 120 
##$TP= (0..7)
150 150 150 150 150 150 150 150 
##$TP07= 0
##$TPNAME0= <>
##$TPNAME1= <>
##$TPNAME2= <>
##$TPNAME3= <>
##$TPNAME4= <>
##$TPNAME5= <>
##$TPNAME6= <>
##$TPNAME7= <>
##$TPOAL= (0..7)
0.5 0.5 0.5 0.5 0.5 0.5 0.5 0.5 
##$TPOFFS= (0..7)
0 0 0 0 0 0 0 0 
##$TUNHIN= 0
##$TUNHOUT= 0
##$TUNXOUT= 0
##$USERA1= <user>
##$USERA2= <user>
##$USERA3= <user>
##$USERA4= <user>
##$USERA5= <user>
##$V9= 5
##$VALIST= <valist>
##$VCLIST= <CCCCCCCCCCCCCCC>
##$VD= 0
##$VDLIST= <DDDDDDDDDDDDDDD>
##$VPLIST= <PPPPPPPPPPPPPPP>
##$VTLIST= <TTTTTTTTTTTTTTT>
##$WBST= 1024
##$WBSW= 4
##$XGAIN= (0..3)
0 0 0 0 
##$XL= 0
##$YL= 0
##$YMAX_a= 10035
##$YMIN_a= -22965
##$ZGOPTNS= <>
##$ZL1= 120
##$ZL2= 120
##$ZL3= 120
##$ZL4= 120
##$ABSF1= 198.0616
##$ABSF2= -202.7028
##$ABSG= 5
##$ABSL= 3
##$ALPHA= 0
##$AQORDER= 0
##$ASSFAC= 0
##$ASSFACI= 0
##$ASSFACX= 0
##$ASSWID= 0
##$AUNMP= <proc_1d>
##$AZFE= 0.1
##$AZFW= 0.5
##$BCFW= 0
##$BC_mod= 2
##$BYTORDP= 0
##$COROFFS= 0
##$CY= -3
##$DATMOD= 1
##$DC= 0
##$DFILT= <>
##$DTYPP= 0
##$F1P= 0
##$F2P= 0
##$FCOR= 1
##$FTSIZE= 65536
##$FT_mod= 6
##$GAMMA= 0
##$GB= 0
##$INTBC= 1
##$INTSCL= 9.790993e-09
##$ISEN= 30
##$LB= 1.5
##$LEV0= 0
##$LPBIN= 0
##$MAXI= 10000
##$MC2= 0
##$MEAN= 0
##$ME_mod= 0
##$MI= 50
##$NCOEF= 0
##$NC_proc= -8
##$NLEV= 6
##$NOISF1= 182.463
##$NOISF2= 159.3651
##$NSP= 0
##$NTH_PI= 0
##$NZP= 0
##$OFFSET= 198.0616
##$PC= 4
##$PHC0= 1794.935
##$PHC1= 13.55945
##$PH_mod= 1
##$PKNL= yes
##$PPARMOD= 0
##$PSCAL= 0
##$PSIGN= 0
##$REVERSE= no
##$SF= 81.0140089999434
##$SI= 65536
##$SIGF1= 159.3651
##$SIGF2= -187.1042
##$SINO= 113.3802
##$SIOLD= 16384
##$SREGLST= <1H.CDCl3>
##$SSB= 0
##$STSI= 65536
##$STSR= 0
##$SW_p= 32467.5324675325
##$SYMM= 0
##$S_DEV= 0
##$TDeff= 32768
##$TDoff= 0
##$TI= <>
##$TILT= no
##$TM1= 0
##$TM2= 0
##$TOPLEV= 0
##$USERP1= <user>
##$USERP2= <user>
##$USERP3= <user>
##$USERP4= <user>
##$USERP5= <user>
##$WDW= 1
##$XDIM= 65536
##$YMAX_p= 252045005
##$YMIN_p= -296178975
$$ End of Bruker specific parameters
$$ ---------------------------------
##NTUPLES= NMR SPECTRUM
##VAR_NAME=  FREQUENCY,     SPECTRUM/REAL,   SPECTRUM/IMAG
##SYMBOL=    X,             R,               I
##VAR_TYPE=  INDEPENDENT,   DEPENDENT,       DEPENDENT
##VAR_FORM=  AFFN,          ASDF,            ASDF
##VAR_DIM=   65536,         65536,           65536
##UNITS=     HZ,            ARBITRARY UNITS, ARBITRARY UNITS
##FACTOR=    0.49542278885378, 1,            1
##FIRST=     16045.7642231865, 0,            0
##LAST=      -16421.768244346, 0,            0
##MIN=       -16421.768244346, -296178975,   0
##MAX=       16045.7642231865, 252045005,    0
$$ Real data points
##PAGE= N=1
##DATA TABLE= (X++(R..R)), XYDATA
$$ [...]
##PAGE= N=2
##DATA TABLE= (X++(I..I)), XYDATA
$$ plain form
6716 -6040759 -8542645 -10492987 -10226950 -8255350 -6332651 -5424572 -5069063 -4633475 -4296517
6707 -4296517 -4388086 -4567471 -4328091 -3760721 -3202208 -2667719 -2245462 -2485421 -3713781 -5448699
6697 -5448699 -7048440 -8309752 -8934257 -8378349 -7003355 -6255953 -6610228 -6464319 -4486590
6688 -4486590 -1960196 -1050547 -1711680 -2393245 -3022828 -4734906 -6924532 -7408713 -6016016
6679 -6016016 -5405788 -7243899 -9677438 -9908087 -7649353 -4776103 -2845867 -2105232 -1911807
6670 -1911807 -1258736 187707 1107243 -153011 -2904030 -4449046 -3701646 -2535225 -2607663
6661 -2607663 -3036352 -2741400 -2906826 -4814286 -6847324 -6377446 -3832819 -2267989 -3111676
6652 -3111676 -4706972 -5208768 -4727046 -3932184 -2247712 1461733 7040956 12437114 14812340
$$ packed form
6716f040759k501886j950342K66037J971600J922699R08079L55509M35588L36958
6707d296517r1569j79385K39380N67370N58513N34489M22257k39959j228360j734918
6697e448699j599741j261312o24505N55908J374994P47402l54275J45909J977729
6688d486590K526394R09649o61133o81565o29583j712078k189626m84181J392697
6679f016016O10228j838111k433539k30649K258734K873250J930236P40635J93425
6670a911807O53071J446443R19536j260254k751019j545016P47400J166421p2438
6661b607663m28689K94952j65426j907460k033038M69878K544627J564830q43687
6652c111676j595296n01796M81722P94862J684472L709445N579223N396158K375226
$$ plain form
6643 14812340 12636986 7275060 2043504 -993227 -2715372 -4777009 -6843689 -7368703
6635 -7368703 -6247096 -4905324 -4140290 -3601166 -3195858 -3251945 -3335306 -2677054 -1827708 -2003705
6625 -2003705 -2514164 -880967 3638246 8323747 9830449 7504129 3054691 -1651818
6617 -1651818 -5294906 -6824899 -6132331 -4638966 -4021782 -4378874 -4335049 -2822676 -294128
6608 -294128 1639805 1548447 -471575 -2680586 -3474638 -3261775 -3714604 -5239457 -6637828
6599 -6637828 -7627876 -9742926 -13322338 -15297222 -12403550 -6067281 -1569776 -1897844 -4557709
6590 -4557709 -5516659 -4406811 -3943628 -5271684 -6334370 -5123085 -2494848 -660359 -320876
6581 -320876 -908031 -2760129 -6836978 -12019033 -14751526 -12655556 -7367578 -2555939 11315
$$ packed form
6643A4812340k175354n361926n231556l036731j722145k061637k066680n25014
6635g368703J121607J341772P65034N39124M05308n6087q3361O58252Q49346j75997
6625b003705n10459J633197M519213M685501J506702k326320m449438m706509
6617a651818l643088j529993O92568J493365O17184l57092M3825J512373K528548
6608b94128J933933r1358k020022k209011p94052K12863m52829j524853j398371
6599f637828r90048k115050l579412j974884K893672O336269M497505l28068k659865
6590d557709r58950J109848M63183j328056j062686J211285K628237J834489L39483
6581c20876n87155j852098m076849n182055k732493K095970N287978M811639K567254
$$ plain form
6572 11315 1100807 1595201 1435145 988819 1542284 3554283 5597879 5971402 4683304
6563 4683304 3125432 2360484 2430388 2864143 3031222 2155364 -213431 -3462240 -6084345
6554 -6084345 -7068998 -7155896 -8236323 -11030718 -13664724 -13464990 -10273928 -6829944 -5262393
6545 -5262393 -4436624 -1961614 2145393 5401859 5946768 4068663 1005994 -1973669 -3348245
6536 -3348245 -2147818 486277 2017085 1233256 -962290 -3463285 -5936966 -7759749
6528 -7759749 -8072686 -7478479 -7613992 -8301307 -7392739 -4514819 -2507804 -3493584 -5811689
6519 -5811689 -6868911 -6773336 -6646895 -5549886 -2438131 403047 -157555 -2750052 -2670497
6510 -2670497 1216068 4468800 3106467 -1529333 -5460928 -6871225 -6378569 -4864804
$$ packed form
6572A1315J089492M94394j60056m46326N53465K011999K043596L73523j288098
6563D683304j557872p64948O9904M33755J67079q75858k368795l248809k622105
6554f084345r84653q6898j080427k794395k634006J99734L191062L443984J567551
6545e262393Q25769K475010M107007L256466N44909j878105l062669k979663j374576
6536c348245J200427K634095J530808p83829k195546k500995k473681j822783
6528g759749l12937N94207j35513o87315R08568K877920K007015r85780k318105
6519e811689j057222R5575J26441J097009L111755K841178n60602k592497P9555
6510b670497L886565L252732j362333m635800l931595j410297M92656J513765
$$ plain form
6502 -4864804 -3268914 -2949865 -4040221 -4384334 -1977547 2182151 5165546 5400335 3625368
6493 3625368 1391613 67182 571415 2344108 2917804 303712 -4034969 -6119131 -3878771
6484 -3878771 465556 3055447 2574107 950308 341087 515747 -261359 -2376527 -4073287
6475 -4073287 -3866871 -2616091 -2027264 -1869659 -505904 1858958 2583282 154621 -3338643
6466 -3338643 -4683711 -3371027 -1562026 -1103159 -2035395 -3499031 -4633403 -4767404 -3919216
6457 -3919216 -3031511 -2841270 -2825298 -2148723 -1203407 -1137774 -2192461 -3523197 -4342902 -4312132
6447 -4312132 -3366593 -2287060 -2732450 -5158115 -7204465 -5995758 -1971442 1326894 1447682
6438 1447682 -565020 -2110854 -1842701 -358788 517470 -754706 -3147649 -2942013 1676660
$$ packed form
6502d864804J595890L19049j090356l44113K406787M159698K983395K34789j774967
6493C625368k233755j324431N04233J772693N73696k614092m338681k084162K240360
6484c878771M344327K589891m81340j623799o09221J74660p77106k115168j696760
6475d073287K06416J250780N88827J57605J363755K364862P24324k428661l493264
6466c338643j345068J312684J809001M58867r32236j463636j134372j34001Q48188
6457c919216Q87705J90241J5972O76575R45316O5633j054687j330736q19705L0770
6447d312132R45539J079533m45390k425665k046350J208707M024316L298336J20788
6438A447682k012702j545834K68153J483913Q76258j272176k392943K05636M618673
$$ plain form
6429 1676660 6447979 5109137 -1785304 -6274154 -3190183 3065497 5167606 2683210
6421 2683210 641074 842627 448789 -1362651 -1423226 1230054 2365586 -1276368 -6565755
6412 -6565755 -8257001 -6209757 -4607603 -5275484 -5566836 -3081171 501248 1451009 -1740284
6403 -1740284 -7110682 -11345522 -12315553 -9950694 -5523466 -671209 2967665 4177863
6395 4177863 3250777 2108672 2005851 1503349 -1434343 -5488353 -6704515 -3935175 -924088
6386 -924088 -1366884 -4260763 -6270088 -6462823 -5871360 -4236176 -859692 2229600 1986395
6377 1986395 -603365 -979868 2502665 5984831 5632765 2751101 1108220 1509290 1803467
6368 1803467 940846 225790 820682 2125367 2812391 2117935 39964 -2739364 -5107274
$$ packed form
6429A676660M771319j338842o894441m488850L083971O255680K102109k484396
6421B683210k042136K01553l93838j811440o0575K653280J135532l641954n289387
6412f565755j691246K047244J602154o67881k91352K485665L582419R49761l191293
6403a740284n370398m234840r70031K364859M427228M852257L638874J210198
6395D177863r27086j142105j02821n02502k937692m054010j216162K769340L011087
6386i24088m42796k893879k009325j92735N91463J635184L376484L089292k43205
6377A986395k589760l76503L482533L482166l52066k881664j642881M01070K94177
6368A803467q62621p15056N94892J304685O87024o94456k077971k779328k367910
$$ plain form
6359 -5107274 -6338473 -6499826 -5770077 -4117378 -2182166 -1461589 -2633474 -4448071 -5226915
6350 -5226915 -4714746 -3531793 -1752112 713861 3127166 4695547 5664422 6244646 5284237
6341 5284237 1883703 -2160954 -3712096 -2235676 -505644 -1101416 -4043022 -8206147
6333 -8206147 -12837371 -16644316 -17511037 -14955458 -11580359 -10239342 -10600676 -10290302 -8706523
6324 -8706523 -7508725 -7396556 -6726096 -4208048 -1244488 -244664 -1644402 -3847329 -5306598
6315 -5306598 -5278299 -3176247 943228 5169370 6832738 5540979 3734275 3433281 3947419
6306 3947419 4032826 4646054 7239680 10207417 9989686 6150810 2689573 2968083 5389611
6297 5389611 5907770 3322756 -93074 -2404694 -4002226 -5620632 -6522179 -5775773 -4202388
$$ packed form
6359e107274j231199j61353P29749J652699J935212P20577j171885j814597p78844
6350e226915N12169J182953J779681K465973K413305J568381R68875N80224r60409
6341E284237l400534m044657j551142J476420J730032n95772k941606m163125
6333h206147m631224l806945q66721K555579L375099J341017l61334L10374J583779
6324h706523J197798J12169O70460K518048K963560R99824j399738k202927j459269
6315e306598K8299K102052M119475M226142J663368j291759j806704l00994N14138
6306C947419Q5407O13228K593626K967737k17731l838876l461237K78510K421528
6297E389611N18159k585014l415830k311620j597532j618406r01547P46406J573385
$$ plain form
6288 -4202388 -3732044 -5027013 -6721112 -7352558 -7386971 -8406969 -10314275 -10602748 -7363159
6279 -7363159 -2094997 1896315 3244858 2853371 1065585 -2732185 -7282172 -9269500
6271 -9269500 -7528255 -4956735 -4338702 -4584255 -3458548 -1763408 -1688797 -2749675 -2992062
6262 -2992062 -3148723 -5609178 -9564192 -11291614 -9835522 -8515074 -9544077 -10673713
6254 -10673713 -8997354 -5148205 -1662763 410717 1259421 875026 -31731 297511 1881306
6245 1881306 1797711 -1686588 -5390558 -4615621 500055 4892389 4763465 1425935 -1373290
6236 -1373290 -1940883 -1646344 -2627165 -5248499 -7589552 -7475745 -5085268 -2813085 -2283564
6227 -2283564 -2712530 -2868402 -3074598 -3956277 -4671818 -4233393 -3519153 -3931499 -4803120 -4363192
$$ packed form
6288d202388M70344j294969j694099o31446l4413j019998j907306k88473L239589
6279g363159N268162L991312J348543l91487j787786l797770m549987j987328
6271i269500J741245K571520O18033k45553J125707J695140P4611j060878k42387
6262b992062j56661k460455l955014j727422J456092J320448j029003j129636
6254a0673713J676359L849149L485442K073480Q48704l84395r06757L29242J583795
6245A881306q3595l484299l703970P74937N115676M392334j28924l337530k799225
6236a373290n67593K94539r80821k621334k341053J13807K390477K272183N29521
6227b283564m28966j55872k06196q81679p15541M38425P14240m12346q71621M39928
$$ plain form
6217 -4363192 -2957052 -2983875 -5331361 -7873158 -8240377 -6607360 -4838913 -3845637 -2788911
6208 -2788911 -752024 1416786 1575145 -873774 -3240594 -2306674 1071635 2362437 -650910
6199 -650910 -4747500 -6006555 -5138665 -5095949 -5474720 -3496336 295615 1996245 562149
6190 562149 -350104 1528642 3028235 294668 -5228733 -8781559 -8616525 -7240614 -6986892
6181 -6986892 -7095793 -5494865 -1719303 2432469 4361287 2827934 -766232 -3566382
6173 -3566382 -4117828 -3399008 -2765921 -2188413 -1399786 -1406592 -3285248 -6278688 -8697496
6164 -8697496 -10249395 -11868113 -13415499 -13256732 -10565460 -6840242 -4495392 -4654737 -6773816
6155 -6773816 -9713175 -12405545 -13700941 -12480527 -8668632 -4129297 -1750283 -2753840
$$ packed form
6217d363192J406140k6823k347486k541797l67219J633017J768447R93276J056726
6208b788911K036887K168810J58359k448919k366820R33920L378309J290802l013347
6199f50910m096590j259055Q67890M2716l78771J978384L791951J700630j434096
6190E62149r12253J878746J499593k733567n523401l552826J65034J375911K53722
6181f986892j08901J600928L775562M151772J928818j533353l594166k800150
6173c566382n51446P18820O33087N77508P88627o806j878656k993440k418808
6164h697496j551899j618718j547386J58767K691272L725218K344850j59345k119079
6155f773816k939359k692370j295396J220414L811895M539335K379014j003557
$$ plain form
6147 -2753840 -4999729 -4875905 -1262120 3054118 4456665 2524284 302513 732932 3560770
6138 3560770 6148458 6883184 6812026 7419194 7717476 5206172 -127850 -4663236 -5220931
6129 -5220931 -2899882 -1255990 -1817606 -3414036 -5043527 -6800961 -8089212 -7551001 -5364017
6120 -5364017 -3462866 -2854055 -2656062 -2289241 -2452683 -3262856 -3713439 -3876164 -5265153
6111 -5265153 -7903753 -9557634 -9366181 -9625352 -11973792 -14306166 -13958099 -11755010 -10096117
6102 -10096117 -9006638 -7310074 -6030847 -6826550 -7941863 -5720765 -176271 4570385
6094 4570385 5943688 5763955 6582929 8096728 8488189 7055837 4245185 843408 -1889389
6085 -1889389 -2919577 -3096879 -4656662 -8452050 -12949813 -16070094 -16458692 -13249548 -6967174
$$ packed form
6147b753840k245889J23824L613785M316238J402547j932381k221771M30419K827838
6138C560770K587688P34726p1158O07168K98282k511304n334022m535386n57695
6129e220931K321049J643892n61616j596430j629491j757434j288251N38211K186984
6120e364017J901151O08811J97993L66821j63442q10173m50583j62725j388989
6111e265153k638600j653881J91453k59171k348440k332374L48067K203089J658893
6102a0096117J089479J696564J279227p95703j115313K221098N544494M746656
6094D570385J373303j79733Q18974J513799L91461j432352k810652l401777k732797
6085a889389j030188j77302j559783l795388m497763l120281l88598L209144O282374
$$ plain form
6076 -6967174 -776253 1916109 1733367 2515574 5501986 7401271 5602270 2131433 286751
6067 286751 125737 -69585 -214362 604634 1274203 -15071 -2526249 -3860104 -3326666
6058 -3326666 -1942792 -53240 2257661 3293564 1548392 -1007367 -867474 1657791
6050 1657791 2568686 376439 -1483997 -154370 1973099 728689 -3904790 -8246640
6042 -8246640 -9961783 -9691937 -8207665 -4961264 -160500 3913545 5010580 3404409
6034 3404409 1395452 865610 1878512 3165467 3368059 2082660 207158 -885872 -914001
6025 -914001 -1187523 -2942534 -5286469 -5770157 -3498307 -792628 -663699 -3014832 -4714650
6016 -4714650 -3592890 -994698 266670 -715315 -2625698 -4070027 -4749848 -4914725 -4775514
$$ packed form
6076f967174O190921K692362j82742P82207K986412J899285j799001l470837j844682
6067B86751j61014j95322j44777Q18996O69569j289274k511178j333855N33438
6058c326666J383874J889552K310901J035903j745172k555759J39893K525265
6050A657791R10895k192247j860436J329627K127469j244410m633479m341850
6042h246640j715143K69846J484272L246401M800764M074045J097035j606171
6034C404409k008957n29842J012902J286955K02592j285399j875502j093030k8129
6025i14001k73522j755011k343935m83688K271850K705679J28929k351133j699818
6016d714650J121760K598192J261368r81985j910383j444329o79821j64877J39211
$$ plain form
6007 -4775514 -4336240 -3080246 -220231 3974607 7695786 9410292 9494013 8871270 6873018
5998 6873018 2340069 -3447318 -7108206 -6922476 -4639580 -3092217 -3512378 -5503390 -7773263
5989 -7773263 -8178429 -5039781 230333 3343818 1499231 -3490601 -7548570 -8514265 -6744870
5980 -6744870 -3245675 614775 2548094 1021671 -2559478 -5210437 -5849093 -5796598 -6116071
5971 -6116071 -6480455 -6731328 -7390450 -8073276 -7414428 -5501812 -4592027 -6100485 -8265950
5962 -8265950 -8345007 -6278299 -4666124 -5487097 -8176946 -10933323 -12756578 -13714474 -13804883
5953 -13804883 -12380633 -9111281 -5217109 -2777565 -2294131 -1894038 -39885 1878733
5945 1878733 1440330 -842493 -1844980 -384032 1118072 572624 -645476 -307895 1024836
$$ packed form
6007d775514M39274J255994K860015M194838L721179J714506Q3721o22743j998252
5998F873018m532949n787387l660888J85730K282896J547363m20161j991012k269873
5989g773263m05166L138648N270114L113485j844587m989832m057969r65695J769395
5980f744870L499195L860450J933319j526423l581149k650959o38656N2495l19473
5971f116071l64384k50873o59122o82826O58848J912616R09785j508458k165465
5962h265950p9057K066708J612175q20973k689849k756377j823255r57896r0409
5953a3804883J424250L269352L894172K439544M83434M00093J854153J918618
5945A878733m38403k282823j002487J460948J502104n45448j218100L37581J332731
$$ plain form
5936 1024836 1367304 752962 446429 -454465 -4450389 -11374773 -17339478 -18831050 -15999265
5927 -15999265 -11172028 -5965395 -936712 3375949 6419017 7990127 7995386 6598015 4942860
5918 4942860 4541914 5252202 4936934 1964079 -2812917 -7256493 -10170839 -11522528 -11418879
5909 -11418879 -10007766 -7889037 -5721890 -3777139 -2394898 -2153183 -2884240 -3324556 -2592364
5900 -2592364 -1238925 11938 1494850 3269231 3667620 1241730 -2314888 -3616574
5892 -3616574 -2344466 -2184027 -5732607 -10385316 -11361951 -7858028 -3833524 -2645281 -3153005
5883 -3153005 -2250225 405025 2146840 1311097 -510205 -801310 738274 2416680 2910929
5874 2910929 2073702 -49589 -3370428 -6720101 -8035371 -6337303 -2907152 -51515
$$ packed form
5936A024836L42468o14342l06533r00894l995924o924384n964705j491572K831785
5927a5999265M827237N206633N028683M312661L043068J571110N259j397371j655155
5918D942860m00946P10288l15268k972855m776996m443576k914346j351689J03649
5909a1418879J411113K118729K167147J944751J382241K41715p31057m40316P32192
5900b592364J353439J250863J482912J774381L98389k425890l556618j301686
5892c616574J272108J60439l548580m652709r76635L503923M024504J188243n07724
5883c153005R02780K655250J741815q35743j821302k91105J539584J678406M94249
5874B910929q37227k123291l320839l349673j315270J698068L430151K855637
$$ plain form
5866 -51515 837480 -106285 -1738919 -2685922 -2332082 -1485206 -1547705 -2799242 -4105678 -4438396
5856 -4438396 -3835473 -2672078 -1035218 741729 1969819 2612602 3422661 4473892 4614487
5847 4614487 3122631 884914 -849539 -1818671 -2064660 -1219560 397850 1265770 659690
5838 659690 35742 891161 2375455 2802623 2480397 2928880 4043744 4272892 3132812
5829 3132812 1343961 -1066532 -4333710 -6895017 -6518072 -3751876 -1670208 -1789759 -2878174
5820 -2878174 -4217031 -6780645 -9876166 -9921900 -5058750 1310489 4255607 3046894 681605
5811 681605 -940227 -2507501 -4521652 -5789065 -5142891 -2984126 -725006 327356 -301870
5802 -301870 -1701854 -2150892 -1138482 -115494 -234670 -430377 706217 2179185 1851383
$$ packed form
5866e1515Q88995r43765j632634r47003L53840Q46876o2499j251537j306436l32718
5856d438396O02923J163395J636860J776947J228090O42783Q10059J051231J40595
5847D614487j491856k237717j734453r69132k45989Q45100J617410Q67920o06080
5838F59690o23948Q55419J484294M27168l22226M48483J114864K29148j140080
5829C132812j788851k410493l267178k561307L76945K766196K081668j19551j088415
5820b878174j338857k563614l095521m5734M863150O369239K945118j208713k365289
5811F81605j621832j567274k014151j267413O46174K158765K259120J052362o29226
5802c01870j399984m49038J012410J022988j19176j95707J136594J472968l27802
$$ plain form
5793 1851383 -49819 -1003124 154251 1786344 2079419 1104477 -475948 -2937749 -6529398
5784 -6529398 -10188586 -12428836 -12848588 -11987659 -10399319 -8605754 -7281277 -6627304 -6006327
5775 -6006327 -4936377 -4094571 -4578583 -6306870 -7822061 -7811317 -6440480 -5005964 -4476093
5766 -4476093 -4687037 -5091416 -5928015 -7956908 -10908448 -13023369 -12815040 -10814527 -8842539
5757 -8842539 -7913744 -7618560 -7192569 -6209444 -4425573 -2101727 -606069 -1557007 -4834781
5748 -4834781 -8166212 -9184731 -7475476 -4391084 -1487954 468713 1473975 1824080
5740 1824080 1674770 999585 50018 -530977 -592757 -1121834 -3110888 -5870570 -7476748
5731 -7476748 -7057487 -5631663 -4380386 -3227607 -1856978 -1162482 -2502709 -5767206 -9079411
$$ packed form
5793A851383j901202r53305J157375J632093K93075r74942j580425k461801l591649
5784f529398l659188k240250m19752Q60929J588340J793565J324477O53973O20977
5775f006327J069950Q41806m84012j728287j515191J0744J370837J434516N29871
5766d476093k10944m04379q36599k028893k951540k114921K08329K000513J971988
5757h842539R28795K95184M25991R83125J783871K323846J495658r50938l277774
5748d834781l331431j018519J709255L084392K903130J956667J005262L50105
5740A824080j49310o75185r49567n80995o1780n29077j989054k759682j606178
5731g476748M19261J425824J251277J152779J370629O94496j340227l264497l312205
$$ plain form
5722 -9079411 -10460586 -9312159 -6390835 -2888206 337216 2883787 4364706 4149231
5714 4149231 2041354 -827264 -2608954 -2735653 -2697603 -4138713 -6535101 -7522134 -5473204
5705 -5473204 -1261132 2386780 2844734 -648072 -6171211 -10024861 -9495935 -5347273 -1113678
5696 -1113678 422343 -393744 -1376567 -1228068 -251876 814198 1393074 830448 -972661
5687 -972661 -2554735 -2009943 360065 1993767 1578948 1066920 2643636 5081628 5470947
5678 5470947 3889468 3442650 5290645 6558209 4645118 1252111 -46343 1322730
5670 1322730 2896218 3156670 3052136 3628877 4387349 4511785 4021697 2957658 700642
5661 700642 -3015988 -7140612 -10025200 -10781583 -9718259 -7845194 -6001019 -4112719 -1570740
$$ packed form
5722i079411j381175J148427K921324L502629L225422K546571J480919k15475
5714D149231k107877k868618j781690j26699L8050j441110k396388r87033K048930
5705e473204M212072L647912M57954l492806n523139l853650N28926M148662M233595
5696a113678J536021q16087r82823J48499R76192J066074N78876n62626j803109
5687i72661j582074N44792K370008J633702m14819n12028J576716K437992L89319
5678E470947j581479m46818J847995J267564j913091l393007j298454J369073
5670A322730J573488K60452j04534N76741P58472J24436m90088j064039k257016
5661G00642l716630m124624k884588p56383J063324J873065J844175J888300K541979
$$ plain form
5652 -1570740 1202500 2274419 471852 -2332303 -2862807 -531211 1740352 1364425 -746001
5643 -746001 -1877601 -1202072 -327194 -627996 -1426177 -1188870 138734 627073 -1534975
5634 -1534975 -5510560 -8070998 -7043820 -3996856 -2406428 -3461284 -5181704 -5769998
5626 -5769998 -5906064 -6811491 -7857844 -7833265 -7361185 -7835359 -8399155 -6449486 -1727948
5617 -1727948 2205372 1966316 -1526056 -4471858 -4776024 -3276472 -881206 2867859 7395298
5608 7395298 9571118 6924640 1469859 -2084559 -1933102 -818719 -1676813 -3847075 -4766341
5599 -4766341 -3610072 -1650992 -270196 -245260 -1983880 -4715810 -6221080 -5159117 -3130760
5590 -3130760 -2690310 -3861345 -4565566 -4046639 -3538004 -3549529 -3047781 -2008285 -2385014
$$ packed form
5652a570740K773240J071919j802567k804155n30504K331596K271563l75927k110426
5643g46001j131600O75529Q74878l00802p98181K37307J327604M88339k162048
5634a534975l975585k560438J027178L046964J590428j054856j720420n88294
5626e769998j36066r05427j046353K4579M72080m74174n63796J949669M721538
5617a727948L933320k39056l492372k945802l04166J499552K395266L749065M527439
5608G395298K175820k646478n454781l554418J51457J114383q58094k170262r19266
5599d766341J156269J959080J380796K4936j738620k731930j505270J061963K028357
5590c130760M40450j171035p04221N18927N08635j1525N01748J039496l76729
$$ plain form
5581 -2385014 -5192642 -8448395 -9677375 -9291002 -9787224 -12161001 -14647854 -15092692 -13483467
5572 -13483467 -11599679 -10525283 -9290642 -6590410 -3328980 -1832207 -2105714 -1010546
5564 -1010546 3143670 7081280 6365399 1561246 -2632185 -3903775 -4344844 -5645405 -6156895
5555 -6156895 -4241189 -1342087 236145 115078 -1328702 -4366620 -8120161 -9741892
5547 -9741892 -7769804 -4443053 -2513206 -1613421 -5048 2029105 3121198 3472655 3874620
5538 3874620 3484926 1275055 -1556487 -3262750 -4366957 -6072398 -7256402 -6256223
5530 -6256223 -4553768 -5143857 -7799835 -9453940 -9015669 -8346550 -8503658 -8529529 -8175064
5521 -8175064 -8298293 -8174461 -6078019 -3179004 -2898056 -5166774 -5462875 -1641107 2236417
$$ packed form
5581b385014k807628l255753j228980L86373m96222k373777k486853m44838J609225
5572a3483467J883788J074396J234641K700232L261430J496773k73507J095168
5564a010546M154216L937610p15881m804153m193431j271590m41069j300561n11490
5555f156895J915706K899102J578232j21067j443780l037918l753541j621731
5547i741892J972088L326751J929847Q99785J608373K034153J092093L51457M01965
5538C874620l89694k209871k831542j706263j104207j705441j184004J000179
5530f256223J702455n90089k655978j654105M38271O69119j57108k5871L54465
5521h175064j23229J23832K096442K899015K80948k268718k96101L821768L877524
$$ plain form
5512 2236417 1927887 -503311 -160377 3021453 4559872 2565844 265060 759014 2821762
5503 2821762 3586297 2962884 3050796 4241007 4406926 2423135 552482 1605583 4450973
5494 4450973 4657165 282296 -5023572 -6281710 -3013771 1166102 3435164 3664276 2418449
5485 2418449 307693 -749877 1073594 4241956 5053823 2995279 1742053 3491568
5477 3491568 5573143 4858364 2630597 2176180 3628663 4352484 3247406 1777813 1326253
5468 1326253 1928648 3238513 4737284 5356520 4570357 3373554 2771446 2199317 998569
5459 998569 263244 1138911 2263464 1301060 -1495947 -3609690 -3947112 -4054392 -5643416
5450 -5643416 -8743281 -12213966 -14414160 -13745777 -10465491 -7591976 -7931552 -10536570 -12316249
$$ packed form
5512B236417l08530k431198L42934L181830J538419j994028k300784M93954K062748
5503B821762P64535o23413Q7912J190211J65919j983791j870653J053101K845390
5494D450973K06192m374869n305868j258138L267939M179873K269062K29112j245827
5485B418449k110756j057570J823471L168362Q11867k058544j253226J749515
5477C491568K081575p14779k227767m54417J452483P23821j105078j469593m51560
5468A326253O02395J309865J498771O19236p86163j196803o02108n72129j200748
5459I98569p35325Q75667J124553r62404k797007k113743l37422j07280j589024
5450e643416l099865l470685k200194O68383L280286K873515l39576k605018j779679
$$ plain form
5441 -12316249 -12612999 -13257740 -14220929 -12851841 -8514048 -4546982 -3560787 -3502892 -950971
5432 -950971 3697478 7102607 7646829 6286019 3573448 -830870 -5296575 -5962619 -1148741
5423 -1148741 5593387 8780196 6860241 3315909 2040840 3113128 3790343 2518870
5415 2518870 480808 -680603 -1111456 -1920891 -3121449 -3647629 -3133345 -2537768 -2835377
5406 -2835377 -3783603 -4167541 -2952149 -409313 1550534 745599 -2895896 -6955697 -9398503
5397 -9398503 -10961371 -13294475 -15642519 -15665492 -13421001 -11932489 -13013161 -14824116 -14859489
5388 -14859489 -13303990 -11681554 -9918547 -7065338 -3928966 -2533501 -3181637 -4141221
5380 -4141221 -4313792 -4275418 -4314340 -3316209 -548591 2713180 4406020 3888035 2253466
$$ packed form
5441a2316249k96750o44741r63189J369088M337793L967066R86195N7895K551921
5432i50971M648449L405129N44222j360810k712571m404318m465705o66044M813878
5423a148741O742128L186809j919955l544332j275069J072288O77215j271473
5415B518870k038062j161411m30853q09435j200558n26180N14284N95577k97609
5406b835377r48226l83938J215392K542836J959847q04935l641495m059801k442806
5397i398503j562868k333104k348044k2973K244491J488512j080672j810955l5373
5388a4859489J555499J622436J763007K853209L136372J395465o48136r59584
5380d141221j72571L8374l8922R98131K767618L261771J692840n17985j634569
$$ plain form
5371 2253466 1006652 950800 1820348 2448902 1756251 96978 -783841 257033 2050012
5362 2050012 2060030 -773745 -4461227 -5573268 -2635949 2140526 4861015 3766498 597385
5353 597385 -1979070 -3319289 -4389949 -5472744 -5982497 -6155983 -6837205 -7291374 -5406470
5344 -5406470 -1042688 2857905 4039286 3957790 4917852 5782407 3583244 -1158056 -4097719
5335 -4097719 -2779666 159377 885227 -828803 -2559163 -3292218 -4225478 -6179925 -8217795
5326 -8217795 -8936856 -7976224 -6195174 -4994223 -5119944 -5627093 -4720969 -2251551 -388748
5317 -388748 -903369 -2894313 -4521187 -5861982 -8138158 -10729836 -11180152 -8416956 -4342773
5308 -4342773 -1849902 -2359588 -5228624 -8229978 -8709338 -5878699 -2224484 -1214834 -3301206
$$ packed form
5371B253466j246814n5852Q69548O28554o92651j659273q80819J040874J792979
5362B050012J0018k833775l687482j112041K937319M776475K720489j094517l169113
5353E97385k576455j340219j070660j082795n09753j73486o81222m54169J884904
5344e406470M363782L900593J181381q1496R60062Q64555k199163m741300k939663
5335d097719J318053K939043P25850j714030j730360p33055r33260j954447k037870
5326h217795p19061R60632J781050J200951j25721n07149R06124K469418J862803
5317c88748n14621j990944j626874j340795k276176k591678m50316K763196M074183
5308d342773K492871n09686k869036l001354m79360K830639L654215J009650k086372
$$ plain form
5299 -3301206 -5477264 -4979387 -2040786 1176138 2768745 1813275 -1466418 -5475069 -8321028
5290 -8321028 -9548676 -9755445 -8700746 -5767111 -2515570 -2244251 -5751711 -9582123 -10039407
5281 -10039407 -7311611 -4082756 -1705262 328104 2405793 4460754 6898589 9856968
5273 9856968 11836727 10802043 6715988 1841324 -1466970 -2603233 -2786143 -3898611
5265 -3898611 -6581133 -9001734 -8615079 -5740829 -3879248 -5463925 -8950914 -11477075
5257 -11477075 -12600437 -13477536 -13979902 -13109878 -11202879 -9219419 -6644878 -2605510 1528888
5248 1528888 3238179 2245546 461541 -1032138 -2419734 -3038216 -1806993 199562 576303
5239 576303 -695406 -1234313 -293571 375791 334123 1582979 4534231 6376026 5530177
$$ packed form
5299c301206k176058M97877K938601L216924J592607r55470l279693m008651k845959
5290h321028j227648k06769J054699K933635L251541K71319l507460l830412m57284
5281a0039407K727796L228855K377494K033366K077689K054961K437835K958379
5273I856968J979759j034684m086055m874664l308294j136263j82910j112468
5265c898611k682522k420601L86655K874250J861581j584677l486989k526161
5257a1477075j123362q77099n02366Q70024J906999J983460K574541M039368M134398
5248A528888J709291r92633j784005j493679j387596o18482J231223K006555L76741
5239E76303j271709n38907R40742O69362m1668J248856K951252J841795q45849
$$ plain form
5230 5530177 4461046 5344411 5913613 3110977 -1351525 -3107256 -1608603 -418704 -1381692
5221 -1381692 -2539213 -2448571 -2761771 -4795694 -6486890 -5190951 -1865594 -221609 -2495803
5212 -2495803 -7711723 -13368305 -17125889 -17316255 -13813732 -8884029 -5817844 -5963284 -7734559
5203 -7734559 -8870429 -8910898 -9039449 -10270502 -12440377 -14426093 -14760822 -12647265 -9106508
5194 -9106508 -6498046 -5963551 -6004711 -4854229 -3542418 -4576754 -7634206 -9019663 -6408594
5185 -6408594 -2064404 227080 -183803 -1103038 -1252874 -1518124 -2846157 -4858167 -6616579
5176 -6616579 -7393069 -6771575 -5205624 -4183950 -4572810 -5191251 -4424692 -2753850 -1999413
5167 -1999413 -2491634 -3014014 -3361433 -4557532 -6162151 -5887421 -3048081 -278222 -187937
$$ packed form
5230E530177j069131Q83365N69202k802636m462502j755731J498653J189899r62988
5221a381692j157521R0642l13200k033923j691196J295939L325357J643985k274194
5212b495803n215920n656582l757584j90366L502523M929703L066185j45440j771275
5203g734559j135870m0469j28551j231053k169875j985716l34729K113557L540757
5194i106508K608462N34495m1160J150482J311811j034336l057452j385457K611069
5185f408594M344190K291484m10883r19235j49836k65250j328033k012010j758412
5176f616579p76490O21494J565951J021674l88860o18441P66559J670842P54437
5167a999413m92221n22380l47419j196099j604619K74730K839340K769859R0285
$$ plain form
5158 -187937 -1909302 -2845920 -2687777 -3371493 -5315016 -6095091 -3876934 -576097 134852
5149 134852 -2489773 -5443376 -6280790 -6320199 -7904950 -10026493 -9583001 -6654824 -5081224
5140 -5081224 -6790538 -8869355 -8229094 -6103636 -5076792 -4412400 -2200876 -207410 -1980724
5131 -1980724 -6766883 -9772242 -8734257 -6193007 -4677163 -3700195 -2721926 -3200157 -5709348
5122 -5709348 -8058794 -8313507 -7289143 -6434172 -5721850 -5292275 -6586276 -9768936 -12228014
5113 -12228014 -11804288 -9727210 -8381242 -7904194 -7039604 -5800532 -5092359 -4695782 -3499254
5104 -3499254 -1180205 1411508 2777837 1318914 -3009582 -7103169 -6998417 -2752251
5096 -2752251 1169795 1429013 -719144 -2661509 -4089215 -5370002 -5208903 -2955701 -1243383
$$ packed form
5158a87937j721365r36618J58143o83716j943523p80075K218157L300837P10949
5149A34852k624625k953603q37414l9409j584751k121543M43492K928177J573600
5140e081224j709314k078817O40261K125458J026844O64392K211524J993466j773314
5131a980724m786159l005359J037985K541250J515844R76968R78269m78231k509191
5122e709348k349446k54713J024364Q54971P12322M29575j294001l182660k459078
5113a2228014M23726K077078J345968M77048Q64590J239072P08173L96577J196528
5104c499254K319049K591713J366329j458923m328496m093587J04752M246166
5096b752251L922046K59218k148157j942365j427706j280787J61099K253202J712318
$$ plain form
5087 -1243383 -3126993 -7571448 -10341499 -8781423 -3977621 894205 2941180 1523818
5079 1523818 -809197 -670786 2056483 4394659 5045601 5832652 7259837 6711872 3456400
5070 3456400 1245582 2439277 3457298 487099 -3799831 -4546916 -2927947 -3980836
5062 -3980836 -7876928 -9690368 -7429292 -4254409 -2391957 -658687 902859 -527271
5054 -527271 -5449993 -9942646 -10867351 -9470948 -7858631 -5523143 -1739137 1602631 2109475
5045 2109475 -112916 -3323390 -6204919 -7838822 -7608430 -6304255 -5530685 -5247139 -3891909
5036 -3891909 -1483015 -171018 -923484 -2144751 -2542380 -2866750 -3685596 -3956565 -3288926
5027 -3288926 -3400710 -5653467 -8844072 -10894514 -11288743 -10670516 -9435091 -7815852 -6249499
$$ packed form
5087a243383j883610m444455k770051J560076M803802M871826K046975j417362
5079A523818k333015J38411K727269K338176O50942P87051J427185n47965l255472
5070C456400k210818J193695J018021k970199m286930p47085J618969j052889
5062c980836l896092j813440K261076L174883J862452J733270J561546j430130
5054e27271m922722m492653r24705J396403J612317K335488L784006L341768N06844
5045B109475k222391l210474k881529j633903K30392J304175P73570K83546J355230
5036c891909K408894J311997p52466j221267l97629l24370q18846k70969O67639
5027c288926j11784k252757l190605k050442l94229O18227J235425J619239J566353
$$ plain form
5018 -6249499 -4956823 -4148312 -4632676 -6677872 -8466168 -7809115 -5415543 -4048614 -4277864
5009 -4277864 -3870825 -1991207 -946656 -2411232 -4605873 -5051135 -4011608 -3265187 -3023506
5000 -3023506 -2073335 -212035 1006970 -85613 -3327476 -6289628 -6313877 -3718370 -1970031
4991 -1970031 -3360667 -5904462 -6573684 -5979515 -6729639 -8382793 -7981647 -5223826 -3031865
4982 -3031865 -2824529 -3312040 -4399022 -7788381 -12529558 -14462160 -12119309 -9253538 -9167095
4973 -9167095 -10136884 -9137827 -6848042 -5802357 -6079170 -6116419 -6160443 -7747949 -10419867
4964 -10419867 -11432688 -8945320 -4447402 -1941159 -4524103 -11017440 -16545388 -17636520
4956 -17636520 -15678843 -13743649 -12039964 -9518469 -7839117 -9241603 -11744850 -11540377
$$ packed form
5018f249499J292676Q08511m84364k045196j788296O57053K393572J366929k29250
5009d277864M07039J879618J044551j464576k194641m45262J039527P46421K41681
5000c023506R50171J861300J219005j092583l241863k962152k4249K595507J748339
4991a970031j390636k543795o69222N94169p50124j653154M01146K757821K191961
4982c031865K07336m87511j086982l389359m741177j932602K342851K865771Q6443
4973i167095r69789R99057K289785J045685k76813l7249m4024j587506k671918
4964a0419867j012821K487368M497918K506243k582944o493337n527948j091132
4956a7636520J957677J935194J703685K521495J679352j402486k503247K04473
$$ plain form
4948 -11540377 -9502288 -9871335 -12732968 -13789603 -11929244 -10599034 -10666346 -8720063 -4365957
4939 -4365957 -2366829 -4733474 -7151976 -6502129 -5658492 -7201919 -8529947 -7380774 -6435738
4930 -6435738 -8003426 -9534211 -8818661 -8296066 -9775844 -10403525 -8560026 -8058382 -11278834
4921 -11278834 -13816442 -11700634 -8483427 -8938802 -10799411 -9310872 -5448763 -3068458
4913 -3068458 -2070002 -704984 -535437 -2936204 -4866509 -4072989 -3972023 -7517313 -11343958
4904 -11343958 -12034665 -12351823 -14672658 -14773841 -9698824 -5117269 -6627004 -10597482 -12237574
4895 -12237574 -14891614 -21391290 -24696596 -19023023 -12104915 -13265243 -17446801 -15564823
4887 -15564823 -12220423 -16483503 -23227878 -22301357 -18537889 -22095597 -26907447 -22396196
$$ packed form
4948a1540377K038089l69047k861633j056635J860359J330210o7312J946283M354106
4939d365957J999128k366645k418502O49847Q43637j543427j328028J149173R45036
4930f435738j567688j530785P15550N22595j479778o27681J843499N01644l220452
4921a1278834k537608K115808L217207m55375j860609J488539L862109K380305
4913c068458R98456J365018J69547k400767j930305P93520J00966l545290l826645
4904a1343958o90707l17158k320835j01183N075017M581555j509735l970478j640092
4895a2237574k654040o499676l305306N673573O918108j160328m181558J881978
4887a5564823L344400m263080o744375R26521L763468l557708m811850M511251
$$ plain form
4879 -22396196 -18418061 -30205606 -45945858 -43843221 -35201408 -44460744 -43457750 35689708
4871 35689708 194469233 326938507 331883609 232913156 137647847 102295882 93233818
4864 93233818 70552725 45019025 38824208 41960915 35127232 23159574 19582855 20264348
4856 20264348 15164510 9635509 13778664 22916743 25971066 23439517 22262478 21673973
4848 21673973 17776376 14384169 16440305 19145241 15511006 9102253 8141853 11835354
4840 11835354 13165525 11205229 10473159 11137789 9435376 5833197 4321892 4989818 4566827
4831 4566827 2987674 2927494 4213227 4641676 4919672 7209877 10123630 10418097 8526729
4822 8526729 7687521 8738343 10012059 11035684 12340768 13063288 12436948 11971586 12625062
$$ packed form
4879b2396196L978135j1787545j5740252K102637Q641813r259336J002994P9147458
4871C5689708J58779525J32469274M945102r8970453r5265309l5351965r062064
4864I3233818k2681093k5533700o194817L136707o833683j1967658l576719O81493
4856B0264348n099838n529001M143155R138079L054323k531549j177039n88505
4848B1673973l897597l392207K056136K704936l634235o408753r60400L693501
4840A1835354J330171j960296p32070O64630j702413l602179j511305O67926m22991
4831D566827j579153o0180J285733M28449K77996K290205K913753K94467j891368
4822H526729q39208J050822J273716J023625J305084P22520o26340m65362O53476
$$ plain form
4813 12625062 11960044 7992665 3717630 3506455 6617488 8438375 6910815 3896746
4805 3896746 1367373 -80664 81329 1728693 3020471 2620316 1734163 1593240 899639
4796 899639 -1562932 -4133585 -5180576 -6337487 -9353668 -12201125 -12257950 -10979296 -10935566
4787 -10935566 -10349773 -5769395 1126918 4842858 3910853 2324992 2746964 3076298 999738
4778 999738 -2082420 -3463850 -2703351 -1341275 -951934 -2206969 -4243912 -4838681 -2865772
4769 -2865772 -284242 152373 -1408223 -2557375 -2230696 -1307620 -210511 1561366 3756224
4760 3756224 5418409 6255104 6126488 4182936 697974 -1546899 -406801 2346181 3801893
4751 3801893 4456128 6352782 8136487 6613511 2708664 790867 1587876 849825 -3539506
$$ packed form
4813A2625062o65018l967379m275035k11175L111033J820887j527560l014069
4805C896746k529373j448037J61993J647364J291778m00155q86153j40923o93601
4796H99639k462571k570653j046991j156911l016181k847457n6825J278654M3730
4787a0935566N85793M580378O896313L715940r32005j585861M21972L29334k076560
4778I99738l082158j381430P60499J362076L89341j255035k036943n94769J972909
4769b865772K581530M36615j560596j149152L26679R23076J097109J771877K194858
4760C756224J662185Q36695j28616j943552l484962k244873J140098K752982J455712
4751C801893O54235J896654J783705j522976l904847j917797P97009p38051m389331
$$ plain form
4742 -3539506 -7992327 -9018391 -8163347 -8050493 -7264821 -3217146 2278496 4536193 2311683
4733 2311683 -813996 -1312144 582639 2293260 2171452 880490 480829 2243029 4909977
4724 4909977 5636991 3192326 -571823 -3098293 -3899495 -3848857 -2742727 548708 5461312
4715 5461312 8897744 8010532 3392143 -1253777 -2699977 -989904 1546922 3313462
4707 3313462 4387860 4782604 3691088 1389364 190307 1737111 4368817 5116796 3653843
4698 3653843 2167762 1726659 1191361 -86013 -941542 -620877 -246331 -834082 -1451347
4689 -1451347 -789231 492086 428653 -1705506 -4585369 -6398423 -6586469 -6083224 -6039770
4680 -6039770 -6294082 -5475110 -3058471 -638406 -102964 -1075756 -1619291 -1208907 -1273176
$$ packed form
4742c539506m452821j026064Q55044J12854P85672M047675N495642K257697k224510
4733B311683l125679m98148J894783J710621j21808j290962l99661J762200K666948
4724D909977P27014k444665l764149k526470q01202N0638J106130L291435M912604
4715E461312L436432q87212m618389m645920j446200J710073K536826J766540
4707C313462J074398L94744j091516k301724j199057J546804K631706P47979j462953
4698C653843j486081m41103n35298j277374q55529L20665L74546n87751o17265
4689a451347O62116J281317o3433k134159k879863j813054j88046N03245M3454
4680f039770k54312Q18972K416639K420065N35442r72792n43535M10384o4269
$$ plain form
4671 -1273176 -2649574 -4315474 -5213473 -5705992 -6390277 -6860774 -6611802 -6036868 -5558003
4662 -5558003 -4697247 -2958021 -876787 639101 1360487 1420099 693342 -646649 -1502928
4653 -1502928 -711237 1563607 3767856 4263860 2667827 207383 -1310809 -1290927 -858970
4644 -858970 -1094038 -1437182 -968174 -544617 -1814011 -4285906 -5589213 -5097346 -5065841
4635 -5065841 -7095906 -9491021 -9751963 -8164903 -6980990 -6936102 -6522199 -4493801 -1618824
4626 -1618824 185797 -314196 -2548883 -4399583 -4118820 -2409471 -1709257 -2917944 -4136051
4617 -4136051 -3554208 -2106998 -1812481 -2872907 -4337596 -6377807 -9301086 -10997187 -8550390
4608 -8550390 -2864617 1239851 781573 -1997588 -3635046 -4431588 -6750211 -9867663 -10060255
$$ packed form
4671a273176j376398j665900q97999m92519o84285m70497K48972N74934M78865
4662e558003Q60756J739226K081234J515888P21386N9612p26757j339991q56279
4653a502928P91691K274844K204249M96004j596033k460444j518192J9882M31957
4644h58970k35068l43144M69008M23557j269394k471895j303307M91867L1505
4635e065841k030065k395115k60942J587060J183913M4888M13903K028398K874977
4626a618824J804621m99993k234687j850700K80763J709349P00214j208687j218107
4617d136051N81843J447210K94517j060426j464689k040211k923279j696101K446797
4608h550390N685773M104468m58278k779161j637458p96542k318623l117452j92592
$$ plain form
4599 -10060255 -6075855 -1526989 -484355 -2729953 -5075587 -5931775 -6455239 -7779338
4591 -7779338 -9261570 -9728706 -8854550 -6905899 -4507891 -3044878 -3713056 -5403766 -5097219
4582 -5097219 -1569128 2647064 4439107 3961723 3455041 3387004 2327771 235486 -980152
4573 -980152 -668688 -675987 -2327307 -4271619 -4613387 -3430027 -1833142 -234388 829581
4564 829581 -273208 -4263766 -8853694 -10734867 -9317164 -6831189 -5153292 -4274467 -3630359
4555 -3630359 -3073809 -2389509 -1421671 -854271 -1405560 -2145992 -1267687 1079354 2331508
4546 2331508 596493 -3109441 -6346222 -7625298 -6569723 -3271628 1118185 4247989
4538 4247989 4651790 3499823 2882862 2755312 1132183 -2679591 -6584732 -7958329 -6325858
$$ packed form
4599a0060255L984400M548866J042634k245598k345634q56188n23464j324099
4591g779338j482232m67136Q74156J948651K398008J463013o68178j690710L06547
4582e097219L528091M216192J792043m77384n06682o8037j059233k092285j215638
4573i80152L11464p299j651320j944312l41768J183360J596885J598754J063969
4564H29581j102789l990558m589928j881173J417703K485975J677897Q78825O44108
4555c630359N56550O84300R67838N67400n51289p40432Q78305K347041J252154
4546B331508j735015l705934l236781j279076J055575L298095M389813L129804
4538D247989M03801j151967o16961j27550j623129l811774l905141j373597J632471
$$ plain form
4529 -6325858 -3194669 -71398 2597117 4999344 7203880 8759500 8842108 7140286 4731082
4520 4731082 3408299 3680736 4073347 3041418 859911 -1394748 -4044280 -8237204 -13072081
4511 -13072081 -15230991 -12643154 -7280805 -2953319 -1242182 -1215384 -2375445 -5434814
4503 -5434814 -9711656 -12073534 -10176107 -5651282 -2349046 -1785853 -1869699 -204473 2756558
4494 2756558 4495601 3488171 634039 -2057203 -3446984 -3766038 -3638650 -3252701 -2721369
4485 -2721369 -2724565 -3906034 -5558497 -5940684 -4584306 -3405415 -4313609 -6226566 -6121573
4476 -6121573 -3242249 -507716 -769087 -3102056 -4388920 -3633856 -2595996 -2254375 -1017707
4467 -1017707 2417895 6133948 6766719 3618436 -673704 -3505687 -4828179 -5947899
$$ packed form
4529f325858L131189L123271K668515K402227K204536J555620Q2608j701822k409204
4520D731082j322783K72437L92611j031929k181507k254659k649532m192924m834877
4511a3072081k158910K587837N362349M327486J711137K6798j160061l059369
4503e434814m276842k361878J897427M524825L302236N63193q3846J665226K961031
4494B756558J739043j007430k854132k691242j389781l19054J27388L85949N31332
4485b721369l196j181469j652463l82187J356378J178891r08194j912957J04993
4476f121573K879324K734533k61371k332969j286864P55064J037860L41621J236668
4467a017707L435602L716053O32771l148283m292140k831983j322492j119720
$$ plain form
4459 -5947899 -7204653 -7872033 -7769342 -7962121 -9734988 -13151591 -16566978 -17562195 -14841092
4450 -14841092 -9538927 -4409605 -1561219 -1267014 -2804663 -5410549 -7916447 -8565960
4442 -8565960 -6502285 -3107529 -673247 237865 1034387 2632416 3975061 3556708 1460259
4433 1460259 -888826 -2308412 -2394961 -1117045 992417 2494394 2184134 873937 953161
4424 953161 3501084 6594444 7309400 4931669 1364618 -1206130 -2015259 -1429027 -427087
4415 -427087 -585099 -2995389 -6348623 -7407627 -4658120 -547023 1287096 190063 -1678476
4406 -1678476 -2842486 -3580069 -3779663 -2494518 -466045 -603464 -4245403 -8613166 -9856470
4397 -9856470 -7593675 -4739325 -3666715 -4272319 -5296022 -5816481 -5501418 -4636464 -3853085
$$ packed form
4459e947899j256754o67380J02691j92779j772867l416603l415387r95217K721103
4450a4841092N302165N129322K848386K94205j537649k605886k505898o49513
4442h565960K063675L394756K434282R11112P96522J598029J342645m18353k096449
4433A460259k349085j419586q6549J277916K109462J501977l10260j310197P9224
4424I53161K547923L093360P14956k377731l567051k570748q09129N86232J001940
4415d27087j58012k410290l353234j059004K749507M111097J834119j097033j868539
4406a678476j164010p37583j99594J285145K028473j37419l641939m367763j243304
4397i856470K262795K854350J072610o05604j023703n20459L15063Q64954P83379
$$ plain form
4388 -3853085 -3086017 -1465523 858461 1967268 807513 -596801 229451 2216053 2119709
4379 2119709 -378584 -2091078 -1435108 -968806 -3244037 -6736911 -8091252 -6574674 -4055690
4370 -4055690 -1986019 -800304 -1224948 -3451867 -5381900 -4420633 -1388478 -218903 -2826358
4361 -2826358 -6254844 -6328574 -2789276 799741 1615071 540779 595642 3441544 7731229
4352 7731229 10394400 9355135 5242492 598122 -2458819 -3530400 -3166713 -1762228
4344 -1762228 242486 1826521 2052466 1056488 -376959 -1917343 -3427805 -3938901 -2347053
4335 -2347053 581582 2342036 1586527 -241830 -1018299 -582693 -258438 -854814 -2478924
4326 -2478924 -5231355 -8279407 -9086582 -5883384 -747987 2056198 1097263 -959987 -1449103
$$ packed form
4388c853085P67068J620494K323984J108807j159755j404314Q26252J986602r6344
4379B119709k498293j712494O55970M66302k275231l492874j354341J516578K518984
4370d055690K069671J185715m24644k226919j930033R61267L032155J169575k607455
4361b826358l428486p3730L539298L589017Q15330j074292N4863K845902M289685
4352G731229K663171j039265m112643m644370l056941j071581L63687J404485
4344a762228K004714J584035K25945r95978j433447j540384j510462n11096J591848
4335b347053K928635J760454p55509j828357p76469M35606L24255n96376j624110
4326b478924k752431l048052q07175L203198N135397K804185r58935k057250m89116
$$ plain form
4317 -1449103 -733147 -342876 -485121 -891611 -2168795 -4431493 -5984109 -5201062 -2744866
4308 -2744866 -381900 1341475 2624297 2710358 677144 -2588023 -5003455 -5697863 -5446683
4299 -5446683 -5088894 -4905381 -5297978 -6706188 -8768793 -10399015 -10645413 -9193926 -6672194
4290 -6672194 -4672544 -4290701 -4360119 -2886214 -727463 -1335975 -5503551 -9148115 -8640523
4281 -8640523 -5813395 -4663149 -5227857 -4419648 -1481045 1365446 2964350 3998538 4003838
4272 4003838 1562986 -2180646 -3844870 -2415939 -483805 -271014 -1362615 -2880215
4264 -2880215 -4781414 -6189002 -5432974 -2832767 -861884 -677173 -958228 -812597 -1136230
4255 -1136230 -2374825 -3637953 -4745891 -6452680 -8106344 -8109110 -7288866 -8406156 -11371495
$$ packed form
4317a449103P15956L90271j42245m06490j277184k262698j552616P83047K456196
4308b744866K362966J723375J282822Q6061k033214l265167k415432o94408K51180
4299e446683L57789J83513l92597j408210k062605j630222k46398J451487K521732
4290f672194J999650L81843o9418J473905K158751o08512m167576l644564N07592
4281h640523K827128J150246n64708Q08209K938603K846491J598904J034188N300
4272D003838k440852l743632j664224J428931J932134K12791j091601j517600
4264b880215j901199j407588P56028K600207J970883J84711k81055J45631l23633
4255a136230j238595j263128j107938j706789j653664k766Q20244j117290k965339
$$ plain form
4246 -11371495 -12550717 -10214309 -7113612 -5884743 -5373654 -3696442 -1745407 -1153804
4238 -1153804 -1432247 -1475089 -1524000 -1584201 -393328 2028873 3463515 3238616 4094836 7859924
4228 7859924 11930128 12818409 10926646 9079076 8400524 8304983 8573982 8715553 7009740
4219 7009740 2885914 -1112775 -2010039 189560 3373003 5887173 6825786 5995800 5159151
4210 5159151 6793338 10002879 10601768 7127482 3381801 2536903 2313971 -666226 -4962752
4201 -4962752 -6674919 -5328793 -3525043 -2442900 -1180891 764121 3229905 6256581
4193 6256581 8994655 9479777 7354021 4674703 2654233 673206 -162963 3138646 9775031
4184 9775031 14032257 12948620 10413177 10257154 10436248 8310060 6440879 7888952 10308658
$$ packed form
4246a1371495j179222K336408L100697J228869N11089J677212J951035N91603
4238a153804k78443m2842m8911o0201J190873K422201J434642k24899Q56220L765088
4228G859924M070204Q88281j891763j847570o78552r5541K68999J41571j705813
4219G009740m123826l998689q97264K199599L183443K514170R38613q29986q36649
4210E159151J634187L209541N98889l474286l745681q44898k22932k980197m296526
4201d962752j712167J346126J803750J082143J262009J945012K465784L026676
4193F256581K738074M85122k125756k679318k020470j981027q36169L301609O636385
4184I775031M257226j083637k535443j56023J79094k126188j869181J448073K419706
$$ plain form
4175 10308658 10141611 8563295 8196170 8336182 8459867 11415669 17659056 21767026 20566466
4166 20566466 18800587 20444051 21256598 17370783 13868890 16127572 20198605 21360620
4158 21360620 23916517 31477555 36659459 33569636 30919734 37349187 44218663 41745480
4150 41745480 40973244 56056225 76457999 88546159 115216416 188772769 279106885
4143 279106885 299174856 208529353 73374576 -9992772 -22276759 -14803876 -21840175
4136 -21840175 -28586095 -19128509 -7182483 -7826130 -13486195 -13357161 -12285773 -16352264
4128 -16352264 -18869747 -13908713 -8668915 -10650066 -14847227 -13938095 -10450843 -9581551
4120 -9581551 -9552414 -7739040 -7804344 -12552701 -17061741 -16300164 -13061049 -11953519 -11902870
$$ packed form
4175A0308658j67047j578316l67125J40012J23685K955802O243387M107970j200560
4166B0566466j765879J643464Q12547l885815l501893K258682M071033J162015
4158B1360620K555897P561038N181904l089823k649902O429453O869476k473183
4150D1745480p72236J5082981K0401774J2088160K6670257P3556353R0334116
4143B79106885K0067971r0645503j35154777q3367348j2283987P472883p036299
4136b1840175o745920R457586J1946026o43647n660065J29034J071388m066491
4128a6352264k517483M961034N239798j981151m197161R09132L487252Q69292
4120i581551K9137J813374o5304m748357m509040P61577L239115J107530N0649
$$ plain form
4111 -11902870 -10606078 -10254446 -12925003 -15799909 -16226032 -16215172 -17333183 -16864792 -13724293
4102 -13724293 -12255723 -15089083 -17854490 -16263622 -13126823 -12885362 -14105955 -13067764
4094 -13067764 -10514305 -9301245 -9085282 -8540016 -9278543 -12480305 -14928458 -13427061 -10228443
4085 -10228443 -9322198 -10128330 -9516269 -7409216 -5656449 -3677053 -59149 3115154 2025019
4076 2025019 -3615504 -10324487 -14819055 -15615617 -12406826 -6737452 -1951197 -68102
4068 -68102 38690 -78096 -738953 -2123881 -2678402 -1552325 -163876 341734 451519
4059 451519 -261011 -3551135 -8640714 -11736048 -11449019 -10744704 -11372497 -10933289 -8250746
4050 -8250746 -6703338 -8403977 -9734252 -7246482 -3853055 -4005381 -6196844 -5737567 -2319057
$$ packed form
4111a1902870J296792L51632k670557k874906m26123J0860j118011M68391L140499
4102a3724293J468570k833360k765407J590868L136799K41461j220593J038191
4094a3067764K553459J213060K15963N45266p38527l201762k448153J501397L198618
4085a0228443R06245q06132O12061K107053J752767J979396L617904L174303j090135
4076B025019n640523o708983m494568p96562L208791N669374M786255J883095
4068f8102J06792j16786o60857j384928n54521J126077J388449N05610J09785
4059D51519p12530l290124n089579l095334K87029P04315o27793M39208K682543
4050h250746J547408j700639j330275K487770L393427j52326k191463M59277L418510
$$ plain form
4041 -2319057 605707 1929300 3132475 3958472 2810635 438839 -1141590 -2389773
4033 -2389773 -4870911 -7289226 -6881744 -3862993 -907231 736105 1330238 384830 -2165275
4024 -2165275 -4057529 -3595533 -2905377 -4690688 -7463471 -7900406 -6259328 -5290552 -5285569
4015 -5285569 -4556617 -3495656 -3611018 -3591299 -1017603 2667563 3543004 1274680 -571712
4006 -571712 -114759 1188373 2377407 4148895 5817172 5137286 1926585 -1371349 -3156928
3997 -3156928 -3828711 -3566859 -2004440 14571 1205832 1931963 2761110 2060234 -1554162
3988 -1554162 -5525294 -6114679 -4028184 -3112823 -4103117 -4112621 -2000197 331195 1915423
3979 1915423 3408774 3741172 863388 -3761075 -6167772 -5935845 -6331407 -7750933 -6502997
$$ packed form
4041b319057K924764J323593J203175Q25997j147837k371796j580429j248183
4033b389773k481138k418315M07482L018751K955762J643336N94133r45408k550105
4024b165275j892254M61996O90156j785311k772783m36935J641078R68776M983
4015e285569P28952J060961j15362J9719K573696L685166Q75441k268324j846392
4006e71712M56953J303132J189034J771488J668277o79886l210701l297934j785579
3997c156928o71783K61852J562419K019011J191261P26131Q29147p00876l614396
3988a554162l971132n89385K086495R15361r90294r504K112424K331392J584228
3979A915423J493351L32398k877784m624463k406697K31927l95562j419526J247936
$$ plain form
3970 -6502997 -1770904 1579645 -159689 -4274426 -6002084 -4480915 -1761443 611914
3962 611914 1369640 -958334 -5575856 -9090747 -9850440 -9924752 -10855134 -10639012 -7454650
3953 -7454650 -3383268 -1442847 -1259909 -587394 762193 1178456 -83660 -2725289 -6322312
3944 -6322312 -9422418 -9449127 -5691908 -1051743 1021229 43366 -2376421 -5058986 -7261798
3935 -7261798 -8073208 -7731390 -7971927 -9328852 -9716512 -7418374 -3825041 -1418389 -632135
3926 -632135 -430446 -282513 274233 2221496 5078769 6005759 3246369 -930432 -3184697
3917 -3184697 -3784296 -5629140 -9369929 -12364277 -12505264 -10592417 -8378235 -6294149 -4074219
3908 -4074219 -2261873 -1844982 -2793022 -3889155 -4222247 -4298453 -5063802 -6110403 -6048437
$$ packed form
3970f502997M732093L350549j739334m114737j727658J521169K719472K373357
3962F11914P57726k327974m617522l514891p59693p4312r30382K16122L184362
3953g454650M071382J940421J82938O72515J349587M16263j262116k641629l597023
3944f322312l100106k6709L757219M640165K072972r77863k419787k682565k202812
3935g261798q11410L41818k40537j356925l87660K298138L593333K406652P86254
3926f32135K01689J47933N56746J947263K857273R26990k759390m176801k254265
3917c184697n99599j844844l740789k994348j40987J912847K214182K084086K219930
3908d074219J812346M16891r48040j096133l33092p6206p65349j046601O1966
$$ plain form
3899 -6048437 -4964526 -4919036 -6899214 -8894626 -8781357 -7629737 -7774345 -8875466 -8859078
3890 -8859078 -7904594 -8077250 -9242694 -8868285 -6172035 -3162272 -1160876 432296 1566633
3881 1566633 1249742 266929 440658 736816 -1519717 -4735920 -3523694 2955316 8335694
3872 8335694 7826978 4878706 5172903 8164826 9299444 7431712 5007001 2957397 226230
3863 226230 -2819447 -4604470 -5101990 -5076254 -3871801 -1188248 578862 -573224 -2270125
3854 -2270125 -805555 2834715 3989520 894264 -3471556 -5946216 -6219143 -5280162 -3886383
3845 -3886383 -2861004 -2626539 -2490495 -2062479 -2342807 -3475691 -3181933 -131762 2948928
3836 2948928 2814573 600045 -554617 -1060892 -3480052 -6654297 -6479623 -2735326 -237046
$$ packed form
3899f048437J083911M5490j980178j995412J13269J151620j44608j101121J6388
3890h859078R54484j72656j165444L74409K696250L009763K001396J593172J134337
3881A566633l16891r82813J73729K96158k256533l216203J212226O479010N380378
3872H335694n08716k948272K94197K991923J134618j867732k424711k049604k731167
3863B26230l045677j785023m97520K5736J204453K683553J767110j152086j696901
3854b270125J464570L640270J154805l095256m365820k474660k72927R38981J393779
3845c886383J025379K34465J36044M28016k80328j132884K93758L050171L080690
3836B948928j34355k214528j154662n06275k419160l174245J74674L744297K498280
$$ plain form
3827 -237046 -2123780 -6137144 -8787800 -9463065 -8987404 -7456832 -5157987 -3133528 -1709621
3818 -1709621 -563892 -410223 -1875436 -2808497 -294068 4252123 5904301 3121176 -89979
3809 -89979 -351869 645057 -11827 -1739565 -2320038 -1727874 -1284362 -979887 -151373 678583
3799 678583 679100 75183 -951666 -3209944 -6832585 -10102420 -11257099 -10171041 -7550173
3790 -7550173 -4332428 -2470013 -3708424 -6498988 -6946262 -4356982 -2918038 -5841595
3782 -5841595 -10770838 -13592018 -14068661 -14452845 -14715004 -12939548 -9281558 -5976740 -3945371
3773 -3945371 -2474158 -1896857 -3535068 -6820805 -9109551 -8835085 -6870467 -4511865 -2028579
3764 -2028579 352434 1645094 997587 -1362800 -4230846 -6106689 -6388239 -6382313 -7968943
$$ packed form
3827b37046j886734m013364k650656o75265M75661J530572K298845K024459J423907
3818a709621J145729J53669j465213r33061K514429M546191J652178k783125l211155
3809h9979k61890R96926o56884j727738n80473N92164M43512L04475Q28514Q29956
3799F78583N17o03917j026849k258278l622641l269835j154679J086058K620868
3790g550173L217745J862415j238411k790564m47274K589280J438944k923557
3782e841595m929243k821180m76643l84184k62159J775456L657990L304818K031369
3773c945371J471213N77301j638211l285737k288746K74466J964618K358602K483286
3764b028579K381013J292660o47507k360387k868046j875843k81550N926j586630
$$ plain form
3755 -7968943 -10470289 -10583495 -6996261 -3256788 -3599075 -7148177 -9060660 -6738759 -2102578
3746 -2102578 1879853 3862476 3309243 311178 -2899305 -3126513 -272165 2070329 1424539
3737 1424539 -339989 -159132 1894275 3485573 3719644 3684742 4093197 4482592 4509580
3728 4509580 4371383 4039368 3352632 2594247 1736730 -382628 -4475703 -8595146 -9418596
3719 -9418596 -6161931 -1644224 1034318 1265828 -250686 -3437787 -7866745 -11257701
3711 -11257701 -11328691 -8947832 -7492476 -8786249 -11153325 -11754840 -9409240 -4830649 208052
3702 208052 3212231 2201069 -1963723 -5516944 -5400222 -2265716 1042391 2861182 3206309
3693 3206309 2148908 -110600 -2010292 -1790264 -182102 35305 -2191506 -4543975 -4392366
$$ packed form
3755g968943k501346j13206L587234L739473l42287l549102j912483K321901M636181
3746b102578L982431J982623n53233k998065l210483k27208K854348K342494o45790
3737A424539j764528J80857K053407J591298K34071l4902M08455L89395K6988
3728D509580j38197l32015o86736p58385q57517k119358m093075m119443q23450
3719i418596L256665M517707K678542K31510j516514l187101m428958l390956
3711a1257701p0990K380859J455356j293773k367076o01515K345600M578591N038701
3702B08052L004179j011162m164792l553221J16722L134506L308107J818791L45127
3693C206309j057401k259508j899692K20028J608162K17407k226811k352469J51609
$$ plain form
3684 -4392366 -2220549 -905061 -2330792 -5585033 -8007349 -7453578 -4056657 -281380
3676 -281380 1187090 -36164 -2044402 -3252457 -4111283 -5671559 -7293247 -7011095 -4306211
3667 -4306211 -1555288 -1734166 -4628353 -6436497 -4216564 -11476 1346059 -1454836
3659 -1454836 -4552754 -4546758 -3020048 -3191217 -4501094 -3989232 -1561935 131973 446762
3650 446762 999336 1065424 -2374324 -8463432 -11114278 -6807022 12319 2900661 1754240
3641 1754240 1077327 2247435 2395084 201978 -1912424 -1950026 -912338 -295996 -199685
3632 -199685 -1021423 -4026335 -8542518 -11043001 -9158599 -5075361 -2959810 -4004753 -5862844
3623 -5862844 -6372574 -5952340 -6160430 -7358778 -8593577 -9201650 -9666961 -10603114 -11351591
$$ packed form
3684d392366K171817J315488j425731l254241k422316N53771L396921L775277
3676b81380J468470j223254k008238j208055q58826j560276j621688K82152K704884
3667d306211K750923j78878k894187j808144K219933M205088J357535k800895
3659a454836l097918N996J526710j71169j309877N11862K427297J693908L14789
3650D46762N52574O6088l439748o089108k650846M307256O819341K888342j146421
3641A754240o76913J170108J47649k193106k114402l7602J037688O16342R6311
3632a99685q21738l004912m516183k500483J884402M083238K115551j044943j858091
3623e862844n09730M20234k08090j198348j234799o08073m65311r36153p48477
$$ plain form
3614 -11351591 -10485672 -8022133 -6181942 -6919197 -9261376 -10500336 -9861982 -9289355 -10081244
3605 -10081244 -10473758 -7969279 -3118299 675610 972982 -1425209 -4126573 -5726034
3597 -5726034 -6124010 -5434526 -3875176 -2435592 -2419498 -4013318 -6069492 -7554268 -8408970
3588 -8408970 -8636882 -7608197 -5267589 -3319772 -3811343 -6510424 -8776658 -8275947 -5093692
3579 -5093692 -1151670 1545440 1955032 359613 -1781226 -3020321 -3374898 -4034101 -5432060
3570 -5432060 -6433517 -5880818 -4245178 -3159664 -3705521 -5483525 -6944111 -6429322 -3446738
3561 -3446738 789903 4456753 6750554 7913478 7945713 6418742 3635828 710195 -1906215
3552 -1906215 -4746705 -7616268 -8849593 -7290579 -4088775 -1447465 -253979 -19438
$$ packed form
3614a1351591Q65919K463539J840191p37255k342179j238960O38354N72627p91889
3605a0081244l92514K504479M850980L793909K97372k398191k701364j599461
3597e726034l97976O89484J559350J439584J6094j593820k056174j484776q54702
3588h408970k27912J028685K340608J947817m91571k699081k266234N00711L182255
3579e093692L942022K697110M09592j595419k140839j239095l54577o59203j397959
3570e432060j001457N52699J635640J085514n45857j778004j460586N14789K982584
3561c446738M236641L666850K293801J162924L2235j526971k782914k925633k616410
3552a906215k840490k869563j233325J559014L201804K641310J193486K34541
$$ plain form
3544 -19438 -605082 -2640218 -6064048 -9188453 -9807780 -7227705 -3152832 -510444 -1172680
3535 -1172680 -4666964 -8919493 -11809750 -12007519 -9361657 -5312458 -2125777 -639585
3527 -639585 573160 2707774 4346071 3215117 -417420 -4034371 -5995249 -6307279 -4951344
3518 -4951344 -2146331 -54247 -1147135 -4441633 -6265985 -5343392 -4039414 -3779192 -2756733
3509 -2756733 181580 2742411 2578390 702226 -901788 -2556942 -5147021 -7243216
3501 -7243216 -6757322 -3936563 -476985 2696088 4806935 4525609 2194899 668020 1563712
3492 1563712 2899552 2806860 2805046 4323095 4907878 1875423 -2704002 -5019249 -5364749
3483 -5364749 -6243787 -6615839 -3623205 1005929 2186336 -899149 -3926971 -4519674 -4634089
$$ packed form
3544a9438n85644k035136l423830l124405o19327K580075M074873K642388o62236
3535a172680l494284m252529k890257j97769K645862M049199L186681J486192
3527f39585J212745K134614J638297j130954l632537l616951j960878l12030J355935
3518d951344K805013K092084j092888l294498j824352R22593J303978K60222J022459
3509b756733K938313K560831j64021j876164j604014j655154k590079k096195
3501g243216M85894K820759L459578L173073K110847k81326k330710j526879Q95692
3492A563712J335840r2692j814J518049N84783l032455m579425k315247l45500
3483e364749q79038l72052K992634M629134J180407l085485l027822n92703j14415
$$ plain form
3474 -4634089 -5077659 -3499777 278294 2415230 1289166 884893 4712347 10179606 12375369
3465 12375369 10392062 6765209 3328049 725439 -196290 452534 627112 -1131362 -3674299
3456 -3674299 -5378086 -6257644 -6385131 -4804297 -2065669 -1129917 -3197140 -5151362 -4002273
3447 -4002273 -1485127 -953272 -1764185 -617612 2700030 4768963 3439120 23179 -3363797
3438 -3363797 -5691326 -6036555 -3554898 689744 3831345 4040427 2119465 -4281 -1212677
3429 -1212677 -1481782 -1440510 -2058591 -4054013 -7252259 -10644750 -12908771 -13007211 -11098227
3420 -11098227 -8908297 -8068974 -7906287 -6322736 -3227734 -1315987 -2646606 -6187282
3412 -6187282 -9748440 -12589473 -14852345 -16084602 -15824244 -14356119 -11716332 -7460145
$$ packed form
3474d634089m43570J577882L778071K136936j126064m04273L827454N467259K195763
3465A2375369j983307l626853l437160k602610r21729O48824J74578j758474k542937
3456c674299j703787q79558j27487J580834K738628R35752k067223j954222J149089
3447d002273K517146N31855q10913J146573L317642K068933j329843l415941l386976
3438c363797k327529l45229K481657M244642L141601K09082j920962k123746j208396
3429a212677k69105M1272o18081j995422l198246l392491k264021r8440J908984
3420a1098227K189930Q39323J62687J583551L095002J911747j330619l540676
3412f187282l561158k841033k262872j232257K60358J468125K639787M256187
$$ plain form
3404 -7460145 -2590752 107316 -725894 -3019969 -3990626 -3304741 -2098766 -719671 700048
3395 700048 1135361 162162 -916815 -1280452 -2279687 -4992512 -7874770 -8997735 -8840703
3386 -8840703 -8615543 -7839777 -6259837 -6124221 -9200448 -13057154 -13779149 -11237211 -8334683
3377 -8334683 -6298156 -4472495 -3724838 -5710448 -8935898 -9683189 -7188184 -4248556 -2492890
3368 -2492890 -891445 633630 286588 -1784475 -2636074 -1135020 -27575 -1587609 -4216023
3359 -4216023 -5354682 -5183330 -5373044 -6248350 -6980134 -6872625 -5233475 -1903914 1148823
3350 1148823 1184231 -1265445 -2387510 -473697 1636328 1264870 -128839 -219476 -51408
3341 -51408 -1627369 -3606864 -3345090 -1842316 -2636563 -6227429 -9356214 -10037860 -9894408
$$ packed form
3404g460145M869393K698068q33210k294075r70657O85885J205975J379095J419719
3395G00048M35313r73199j078977l63637r99235k712825k882258j122965J57032
3386h840703K25160P75766J579940J35616l076227l856706p21995K541938K902528
3377h334683K036527J825661P47657j985610l225450p47291K495005K939628J755666
3368b492890J601445J525075l47042k071063q51599J501054J107445j560034k628414
3359d216023j138659J71352j89714q75306p31784J07509J639150L329561L052737
3350A148823L5408k449676j122065J913813K110025l71458j393709r0637J68068
3341e1408j575961j979495K61774J502774p94247l590866l128785o81646J43452
$$ plain form
3332 -9894408 -10715934 -11680220 -11237661 -9384960 -6654885 -2839189 1583149 4255269 3242514
3323 3242514 -51172 -2075004 -1283817 306774 42838 -2152843 -4293492 -5099496 -4923020
3314 -4923020 -4244491 -2886804 -1224403 -710268 -2069798 -3949696 -4614305 -4178017 -3755623
3305 -3755623 -3204482 -1580588 566388 1422334 464573 -1190322 -3127352 -6095270 -9578287
3296 -9578287 -11251939 -10107774 -8236111 -8014891 -8987059 -9024700 -7417271 -5353237 -4269984
3287 -4269984 -5001187 -7638976 -10954816 -12749611 -11986495 -9920971 -8247441 -7174076 -6392183
3278 -6392183 -6635038 -8579383 -11033357 -12000307 -11178866 -9936805 -9159750 -8561530 -7881687
3269 -7881687 -7366608 -7079843 -6820235 -6617214 -6421675 -5718285 -4528064 -4334825 -6630122
$$ packed form
3332i894408q21526r64286M42559J852701K730075L815696M422338K672120j012755
3323C242514l293686k023832P91187J590591k63936k195681k140649q06004J76476
3314d923020O78529J357687J662401N14135j359530j879898o64609M36288M22394
3305c755623N51141J623894K146976Q55946r57761j654895j937030k967918l483017
3296i578287j673652J144165J871663K21220r72168l7641J607429K064034J083253
3287d269984p31203k637789l315840j794795P63116K065524J673530J073365P81893
3278f392183k42855j944345k453974r66950Q21441J242061P77055N98220O79843
3269g881687N15079K86765K59608K03021J95539P03390J190221J93239k295297
$$ plain form
3260 -6630122 -10629135 -13660919 -13901993 -11826188 -9148824 -7367057 -7133402 -7918048 -8319297
3251 -8319297 -7650539 -6945929 -7298344 -7690515 -6182510 -3245373 -1991106 -4360951 -8532467
3242 -8532467 -10985882 -10042321 -6639268 -2867988 -776434 -1410025 -3528009 -4018219 -1250926
3233 -1250926 2313570 2579642 -1122267 -5291843 -7038080 -7484877 -8957194 -10618779 -9560977
3224 -9560977 -5679318 -2564315 -2793280 -4694893 -5154211 -3691414 -1882555 -223024 2008930
3215 2008930 4380196 5163406 3661784 867513 -2219502 -5171345 -7087743 -7041490 -5860535
3206 -5860535 -5359480 -5279681 -3311900 805643 3578582 1967583 -2437648 -5532161 -5757679
3197 -5757679 -4875365 -4474321 -4102004 -2977037 -1634928 -1155469 -1726406 -2456911 -2168325
$$ packed form
3260f630122l999013l031784k41074K075805K677364J781767K33655p84646m01249
3251h319297O68758P04610l52415l92171J508005K937137J254267k369845m171516
3242h532467k453415R43561L403053L771280K091554o33591k117984m90210K767293
3233a250926L564496K66072l701909m169576j746237m46797j472317j661585J057802
3224i560977L881659L115003k28965j901613m59318J462797J808859J659531K231954
3215B008930K371266P83210j501622k794271l087015k951843j916398M6253J180955
3206e860535N01055P9799J967781M117543K772939j610999m405231l094513k25518
3197e757679Q82314M01044L72317J124967J342109M79459n70937p30505K88586
$$ plain form
3188 -2168325 -348872 2263527 4177039 4497186 3477627 1701133 -419966 -2066899
3180 -2066899 -2181553 -995890 -275293 -1022118 -1914426 -1112420 1324023 3928686 5649861
3171 5649861 5833054 3597435 -820167 -4820613 -5659469 -3766126 -2127221 -2600431 -4602011
3162 -4602011 -7090060 -9536150 -10686298 -8761251 -3929446 1184749 4560943 6902680
3154 6902680 9647822 12355761 13573392 13205303 12223741 10505567 6847855 1476581 -2944434
3145 -2944434 -3813896 -1538138 907263 1274722 164035 -380069 335106 1042121 437806
3136 437806 -1277949 -3027607 -4159498 -4633040 -4596870 -4391181 -4460618 -4748739 -4701704 -4269984
3126 -4269984 -4105895 -4207050 -3405417 -1162569 1162388 2171138 2648577 4219083 6395682
$$ packed form
3188b168325J819453K612399J913512L20147j019559j776494k121099j646933
3180b066899j14654J185663P20597p46825q92308Q02006K436443K604663J721175
3171E649861J83193k235619m417602m000446q38856J893343J638905m73210k001580
3162d602011k488049k446090j150148J925047M831805N114195L376194K341737
3154F902680K745142K707939J217631l68089r81562j718174l657712n371274m421015
3145b944434q69462K275758K445401L67459j110687n44104P15175P07015o04315
3136D37806j715755j749658j131891m73542L6170K05689o9437k88121M7035M31720
3126d269984J64089j01155Q01633K242848K324957J008750M77439J570506K176599
$$ plain form
3117 6395682 7020587 5582134 4035047 3935816 4681243 5258524 5852484 6610576 6497580
3108 6497580 4917091 3208734 2759691 2494074 260769 -3586817 -6100198 -5563791 -3500118
3099 -3500118 -2038252 -1097895 293371 1329506 387860 -1827723 -2668749 -1579460 -1392300
3090 -1392300 -4345571 -8848516 -11982218 -13388129 -14262940 -14033647 -11336701 -7648391 -6143223
3081 -6143223 -6489563 -4590614 1043607 6197573 6520648 3214638 304033 -1278233 -3410110
3072 -3410110 -6278070 -7947476 -7826819 -7247691 -6815984 -6147944 -6032644 -7774006 -10234271
3063 -10234271 -10560226 -8349597 -6255727 -5782104 -5307520 -3313849 -895695 352514 662787
3054 662787 774268 239879 -1385071 -3303116 -4868478 -6682889 -8881752 -9848145 -8275380
$$ packed form
3117F395682O24905j438453j547087r9231P45427N77281N93960P58092j12996
3108F497580j580489j708357m49043k65617k233305l847586k513381N36407K063673
3099c500118J461866R40357J391266J036135r41646k215583q41026J089289J87160
3090a392300k953271m502945l133702j405911q74811K29293K696946L688310J505168
3081f143223l46340J898949N634221N153966L23075l306010k910605j582266k131877
3072c410110k867960j669406J20657N79128M31707O68040J15300j741362k460265
3063a0234271l25955K210629K093870M73623M74584J993671K418154J248209L10273
3054F62787J11481n34389j624950j918045j565362j814411k198863r66393J572765
$$ plain form
3045 -8275380 -5358554 -3403267 -3161739 -3791777 -4423505 -4464033 -3338003 -1312755 171024
3036 171024 154059 -661237 -1406124 -2623965 -4992347 -7430965 -8114814 -6893937 -5344094
3027 -5344094 -4795109 -5448909 -6944402 -8573825 -9322648 -8853103 -8184897 -8446159 -9259945
3018 -9259945 -9156898 -7134588 -3185211 1843236 6023095 7103366 4886429 1974015
3010 1974015 622453 -269956 -3166602 -7618514 -10421237 -10074627 -8654548 -8499442 -9127843
3001 -9127843 -8704995 -6998787 -5322145 -4448416 -4092030 -4106957 -4957829 -6938907 -9648054
2992 -9648054 -12250411 -13859332 -13950534 -12971594 -12260384 -12608881 -12971018 -11382313 -7369476
2983 -7369476 -2796603 13287 430221 -594094 -2044242 -3302565 -3488897 -1727210 1465850
$$ packed form
3045h275380K916826J955287K41528o30038o31728m0528J126030K025248J483779
3036A71024j6965q15296p44887j217841k368382k438618o83849J220877J549843
3027e344094N48985o53800j495493j629423p48823M69545O68206k61262q13786
3018i259945J03047K022310L949377N028447M179859J080271k216937k912414
3010A974015j351562q92409k896646m451912k802723L46610J420079J55106o28401
3001i127843M22848J706208J676642Q73729L56386j4927q50872j981078k709147
2992i648054k602357j608921r1202R78940P11210l48497l62137J588705M012837
2983g369476M572873K809890M16934j024315j450148j258323j86332J761687L193060
$$ plain form
2974 1465850 4068376 4598072 3661639 2806215 2524903 2335856 2253115 2873560 4053261
2965 4053261 4638233 3741641 1537945 -1178269 -3368385 -3843192 -2193902 187430 1179148
2956 1179148 346017 -809671 -1283174 -1848882 -3223869 -4391373 -4024579 -2593043 -1575034
2947 -1575034 -1149252 -282569 953717 790231 -1843899 -5412406 -7285591 -6769069 -5681310
2938 -5681310 -5896929 -7202475 -8031719 -7579393 -6314516 -4847150 -3474470 -2780728 -3315896
2929 -3315896 -4351986 -4352329 -3241713 -2717969 -3535604 -4256291 -3946263 -4139264 -6128210 -8099794
2919 -8099794 -7609856 -5563928 -4699481 -5021267 -4082995 -1379187 1005722 2049320 2526694
2910 2526694 1992032 -985812 -4902035 -5874039 -3535966 -2219062 -4291053 -6476242 -5459913
$$ packed form
2974A465850K602526N29696r36433q55424k81312j89047q2741O20445J179701
2965D053261N84972q96592k203696k716214k190116m74807J649290K381332R91718
2956A179148q33131j155688m73503n65708j374987j167504L66794J431536J018009
2947a575034M25782Q66683J236286j63486k634130l568507j873185N16522J087759
2938e681310k15619j305546q29244M52326J264877J467366J372680O93742n35168
2929c315896j036090l43J110616N23744q17635p20687L10028j93001j988946j971584
2919h099794M89938K045928Q64447l21786R38272K703808K384909J043598M77374
2910B526694n34662k977844l916223r72004K338073J316904k071991k185189J016329
$$ plain form
2901 -5459913 -3141030 -2841709 -3783220 -3392240 -2325438 -2864270 -4356346 -4503264 -3573490
2892 -3573490 -3251503 -2845431 -915698 707619 -814905 -3968357 -4559997 -2253874 -574257
2883 -574257 -692909 -586962 -715661 -4533884 -11525632 -15366894 -12181178 -6148181 -3388080
2874 -3388080 -4015694 -4138795 -2695821 -1954363 -3026609 -4920461 -7049189 -9227510 -9927585
2865 -9927585 -7818001 -4673780 -3740008 -5249517 -6290625 -5216479 -3471252 -2540366 -1724013
2856 -1724013 -140318 1138265 662980 -861116 -1377671 -440634 174742 -871449 -2493564
2847 -2493564 -2963811 -3097342 -5822159 -11772882 -16934189 -16722427 -11820599 -7476959 -6648644
2838 -6648644 -6479286 -3058122 2620624 6055909 5467326 3679373 3630845 4612135 4158389
$$ packed form
2901e459913K318883K99321r41511L90980J066802n38832j492076j46918R29774
2892c573490L21987M06072J929733J623317j522524l153452n91640K306123J679617
2883e74257j18652J05947j28699l818223o991748l841262L185716O032997K760101
2874c388080o27614j23101J442974P41458j072246j893852k128728k178321p00075
2865i927585K109584L144221R33772j509509j041108J074146J745227R30886Q16353
2856a724013J583695J278583m75285j524096n16555R37037O15376j046191j622115
2847b493564m70247j33531k724817n950723n161307K11762M901828M343640Q28315
2838f648644J69358L421164N678746L435285n88583j787953m8528R81290m53746
$$ plain form
2829 4158389 1892837 -240522 -771256 -49861 1069623 2337848 3392845 3199508 1311473
2820 1311473 -913726 -1551254 -432506 772806 734640 -325718 -1553196 -2265938 -1637840
2811 -1637840 913078 4408383 6783355 7397151 7620933 8147611 7506279 4522426 499353
2802 499353 -2630920 -4604580 -5532916 -4383080 -1248143 772517 -855571 -4089181 -5398181
2793 -5398181 -5648416 -8591900 -13857774 -16224239 -12868858 -7173896 -3757777 -3338182 -4230239
2784 -4230239 -5448363 -6138669 -4944822 -2322027 -1061317 -2469376 -4432134 -5099945 -5638667
2775 -5638667 -7056314 -7375071 -5106011 -2983277 -4587603 -9021636 -12554712 -14180989
2767 -14180989 -15755016 -17409237 -16784320 -13067366 -8571136 -5618536 -4255143 -3575512
$$ packed form
2829D158389k265552k133359n30734P21395J119484J268225J054997j93337j888035
2820A311473k225199o37528J118748J205312l8166j060358j227478p12742O28098
2811a637840K550918L495305K374972O13796K23782N26678o41332k983853m023073
2802D99353l130273j973660r28336J149836L134937K020660j628088l233610j309000
2793e398181k50235k943484n265874k366465L355381N694962L416119M19595q92057
2784d230239j218124o90306J193847K622795J260710j408059j962758o67811n38722
2775e638667j417647l18757K269060K122734j604326m434033l533076j626277
2767a4180989j574027j654221O24917L716954M496230K952600J363393O79631
$$ plain form
2759 -3575512 -3263978 -3271930 -3526016 -4284157 -5645733 -6901648 -7495020 -8032275 -9030923 -9483007
2749 -9483007 -8198943 -5677249 -3010910 -149330 2688739 3288387 98667 -4137561
2741 -4137561 -4765191 -1367696 1514084 357778 -3487204 -6792528 -8530092 -9402711 -9462289
2732 -9462289 -8273485 -6484726 -5572090 -6180540 -7476761 -7997155 -6911009 -4709004 -2574253
2723 -2574253 -882104 1014541 3003522 3352952 832972 -3277068 -6757049 -9062660
2715 -9062660 -10671970 -10900158 -8761290 -5509384 -3782288 -4143646 -4700741 -4285791 -3810770
2706 -3810770 -4182027 -5034733 -6023669 -7389163 -8678172 -8680999 -7166567 -5134080 -3144638
2697 -3144638 -1113375 218902 -276904 -1897328 -2449416 -1297543 -44560 242929 297355
$$ packed form
2759c575512L11534p952k54086p58141j361576j255915n93372n37255r98648m52084
2749i483007J284064K521694K666339K861580K838069N99648l189720m236228
2741d137561o27630L397495K881780j156306l844982l305324j737564q72619n9578
2732i462289J188804J788759R12636o08450j296221n20394J086146K202005K134751
2723b574253J692149J896645J988981L49430k519980m110040l479981k305611
2715i062660j609310k28188K138868L251906J727096l61358n57095M14950M75021
2706c810770l71257q52706r88936j365494j289009k827J514432K032487J989442
2697c144638K031263J332277m95806j620424n52088J151873J252983K87489N4426
$$ plain form
2688 297355 600271 404380 -367346 -499297 234133 277255 -1174958 -2921354 -4073054
2679 -4073054 -5445099 -7378019 -8352667 -7352432 -5726011 -5100593 -5085853 -4460338 -2935499
2670 -2935499 -443057 3296400 6876788 7044114 2647794 -2908513 -5437246 -4872340 -4303089
2661 -4303089 -5453168 -7436830 -8959128 -9387287 -8302234 -6057384 -4176806 -3404514 -2231716
2652 -2231716 739746 4023614 5097639 4120307 3264839 2970482 1669382 -818380 -2407527
2643 -2407527 -1840605 -400472 208109 -134293 -768852 -1523182 -2520832 -3960987 -6407405
2634 -6407405 -9966515 -12949974 -12902708 -9503412 -5173018 -2368462 -1528125 -2039162 -3654721
2625 -3654721 -6012713 -7887492 -8059258 -6523283 -4308388 -2567948 -2089424 -2915842 -3956034
$$ packed form
2688B97355L02916j95891p71726j31951P33430M3122j452213j746396j151700
2679d073054j372045j932920r74648J000235J626421O25418J4740O25515J524839
2670b935499K492442L739457L580388J67326m396320n556307k528733N64906N69251
2661d303089j150079j983662j522298m28159J085053K244850J880578P72292J172798
2652b231716K971462L283868J074025r77332q55468k94357j301100k487762j589147
2643b407527N66922J440133O08581l42402o34559p54330r97650j440155k446418
2634f407405l559110k983459M7266L399296M330394K804556Q40337n11037j615559
2625c654721k357992j874779j71766J535975K214895J740440M78524q26418j040192
$$ plain form
2616 -3956034 -3597885 -1322748 1493610 2628395 708299 -3966490 -9721960 -14535517
2608 -14535517 -17176061 -17492058 -15667539 -11827705 -6784241 -2328955 248794 1524328
2600 1524328 2777688 3768804 2866123 -541175 -4800535 -7509938 -7720515 -6509857 -5747222
2591 -5747222 -6244204 -6980124 -6583655 -5576251 -5948091 -7984539 -9143081 -7454519 -4536092
2582 -4536092 -3166177 -2991479 -1284421 2424937 5232213 4660537 1130095 -3822719 -9231680
2573 -9231680 -13667719 -15050258 -13208099 -10870442 -10359574 -10595231 -9034165 -5505437 -2378109
2564 -2378109 -1518069 -2535091 -3690260 -3485928 -1810460 -318950 -943228 -3214804 -4177841
2555 -4177841 -2179500 466228 425615 -1905449 -2903906 -816678 2064388 2968948 2206378
$$ packed form
2616c956034L58149K275137K816358J134785j920096m674789n755470m813557
2608a4535517k640544l15997J824519L839834N043464M455286K577749J275534
2600A524328J253360R91116r02681l407298m259360k709403k10577J210658P62635
2591e747222m96982p35920L96469J007404l71840k036448j158542J688562K918427
2582d536092J369915J74698J707058L709358K807276n71676l530442m952814n408961
2573i231680m436039j382539J842159K337657N10868k35657J561066L528728L127328
2564b378109Q60040j017022j155169K04332J675468J491510o24278k271576r63037
2555d177841J998341K645728m0613k331064r98457K087228K881066R04560p62570
$$ plain form
2546 2206378 1726458 1642657 186955 -3215896 -6523793 -7206026 -4953103 -1831868 -215430
2537 -215430 -866080 -2681757 -3941863 -3920903 -3497242 -4084353 -5899488 -7609694 -7945835
2528 -7945835 -7297837 -7179326 -8292146 -9734786 -10091104 -8711295 -6029102 -3453487 -2920400
2519 -2920400 -5341346 -9042699 -10882178 -9587761 -6926973 -4977401 -3870927 -3492066
2511 -3492066 -5426816 -10550928 -15700945 -16079319 -11368901 -6608129 -6007351 -8379028 -10028148
2502 -10028148 -9747627 -8792106 -7600167 -5215127 -1541701 1890851 3571646 3262887 1832492
2493 1832492 785433 1410046 3261892 4106345 2686546 945769 1838251 5203316 7647461
2484 7647461 6765135 3801732 1495116 663927 -73824 -2007272 -4746128 -6727964 -6826884
$$ packed form
2546B206378m79920q3801j455702l402851l307897o82233K252923L121235J616438
2537b15430o50650j815677j260106K0960M23661n87111j815135j710206l36141
2528g945835O47998J18511j112820j442640l56318J379809K682193K575615N33087
2519b920400k420946l701353j839479J294417K660788J949572J106474L78861
2511c492066j934750n124112n150017l78374M710418M760772O00778k371677j649120
2502a0028148K80521R55521J191939K385040L673426L432552J680795l08759j430395
2493A832492j047059O24613J851846Q44453j419799j740777Q92482L365065K444145
2484G647461q82326k963403k306616q31189p37751j933448k738856j981836r8920
$$ plain form
2475 -6826884 -5500425 -4329067 -4223883 -4461756 -4067467 -3637149 -4648558 -7090631 -9095183
2466 -9095183 -9234241 -8074628 -7088966 -7129279 -8394647 -10617449 -12495274 -12162772 -9395326
2457 -9395326 -6471208 -5634665 -6423629 -6783217 -6090284 -5390135 -4999337 -3866841 -1686703
2448 -1686703 79683 97405 -1173569 -2466381 -3220321 -3308704 -2487155 -1269155 -1274774 -3168636
2438 -3168636 -4916605 -3822103 -152409 2883134 2995444 1263892 308256 1210050 2845372
2429 2845372 3419809 2183249 289848 104224 2715114 6001535 6413093 3058301 -1299325
2420 -1299325 -3789721 -4326178 -4096732 -3213845 -1797680 -1848362 -5275076 -10424862 -13172719
2411 -13172719 -11853268 -8954038 -7284144 -6590305 -5244431 -3555575 -3399907 -5116196
$$ packed form
2475f826884J326459J171358J05184k37873L94289M30318j011409k442073k004552
2466i095183j39058J159613R85662m0313j265368k222802j877825L32502K767446
2457i395326K924118Q36543p88964l59588O92933P00149L90798J132496K180138
2448a686703J766386J7722j270974j292812p53940q8383Q21549J218000n619j893862
2438c168636j747969J094502L669694L035543J12310j731552r55636R01794J635322
2429B845372N74437j236560j893401j85624K610890L286421M11558l354792m357626
2420a299325k490396n36457K29446Q82887J416165n0682l426714n149786k747857
2411a3172719J319451K899230J669894O93839J345874J688856J55668j716289
$$ plain form
2403 -5116196 -6598691 -5905847 -3724235 -2442631 -3070285 -3992228 -3338168 -1892305 -2190878
2394 -2190878 -4578154 -6037851 -4219150 -1042800 -231326 -2245260 -4194523 -4413518 -4306636
2385 -4306636 -5206818 -6086226 -5480268 -3461257 -468271 3728361 8420174 11283871 11100868
2376 11100868 9531428 8386714 6771395 3064238 -1696337 -4848653 -5505968 -4529932
2368 -4529932 -2177435 1346841 3681481 2062907 -2422788 -5486811 -5318554 -4648390 -5931612
2359 -5931612 -7475364 -6499009 -3689431 -1946025 -1968448 -1949736 -1158288 -1118980 -2842166
2350 -2842166 -4943373 -5354646 -3636528 -940845 1294185 1984823 673374 -1917321 -3937896
2341 -3937896 -3705994 -1006351 2934553 6388147 7943497 7091067 4625035 2175218 732996
$$ packed form
2403e116196j482495O92844K181612J281604o27654r21943O54060J445863k98573
2394b190878k387276j459697J818701L176350Q11474k013934j949263k18995J06882
2385d306636r00182q79408O05958K019011K992986M196632M691813K863697j83003
2376A1100868j569440j144714j615319l707157m760575l152316o57315R76036
2368d529932K352497L524276K334640j618574m485695l064023J68257O70164j283222
2359e931612j543752R76355K809578J743406k2423J8712P91448L9308j723186
2350b842166k101207m11273J718118K695683K235030O90638j311449k590695k020575
2341c937896K31902K699643L940904L453594J555350q52430k466032k449817j442222
$$ plain form
2332 732996 -271417 -1980062 -4425505 -6514098 -7574649 -7980095 -7985794 -7010143 -4809892
2323 -4809892 -2495295 -1301327 -979122 -696072 -1021681 -3227416 -6528213 -7984822 -6018816
2314 -6018816 -2506683 -311424 -50243 -557333 -1284022 -2472130 -3583826 -3310744 -1121118
2305 -1121118 2275481 5685384 7761848 7433380 5371229 4131506 5009363 5541174 2516749
2296 2516749 -2879107 -5754879 -3774656 3073 1537021 446240 -1290199 -2878959
2288 -2878959 -4731034 -6569793 -7831070 -8905383 -9941609 -9455924 -6381802 -2687197
2280 -2687197 -1438322 -2621357 -3464063 -2932060 -3157468 -5654608 -8636011 -9513318 -8206663
2271 -8206663 -6405802 -5007253 -4023947 -4015977 -5713531 -8524076 -10874594 -11928145 -11885019
$$ packed form
2332G32996j004413j708645k445443k088593j060551m05446n699R75651K200251
2323d809892K314597J193968L22205K83050l25609k205735l300797j456609J966006
2314f018816L512133K195259K61181n07090p26689j188108j111696K73082K189626
2305a121118L396599L409903K076464l28468k062151j239723Q77857N31811l024425
2296B516749n395856k875772J980223L777729J533948j090781j736439j588760
2288b878959j852075j838759j261277j074313j036226M85685L074122L694605
2280b687197J248875j183035q42706N32003k25408k497140k981403q77307J306655
2271h206663J800861J398549R83306P970j697554k810545k350518j053551M3126
$$ plain form
2262 -11885019 -10902949 -8950800 -6572642 -4581635 -3081438 -2016507 -2483219 -5666112
2254 -5666112 -10005280 -11412029 -7802821 -2190428 497683 -983538 -3605970 -4724937
2246 -4724937 -5047410 -6277552 -7871617 -7911562 -6300040 -5237532 -6467884 -9348851 -11995236
2237 -11995236 -13363145 -13614834 -13014664 -11293813 -8279137 -4749935 -2104602 -884977
2229 -884977 -35876 1686763 3787480 4559928 3634112 2572250 2243849 1178536 -2004566
2220 -2004566 -5812088 -7609077 -7417414 -7565343 -8695448 -8817731 -6989176 -5291605 -5646805
2211 -5646805 -6795562 -6455551 -4981350 -4608052 -5845317 -6838260 -6206019 -4768487 -4259668
2202 -4259668 -5469644 -7627359 -8748784 -7073747 -3289466 -718704 -1775171 -4638113
$$ packed form
2262a1885019R82070J952149K378158J991007J500197J064931m66712l182893
2254e666112m339168j406749L609208N612393K688111j481221k622432j118967
2246d724937l22473j230142j594065l9945J611522J062508j230352k880967k646385
2237a1995236j367909k51689O00170J720851L014676L529202K645333J219625
2229h84977Q49101J722639K100717P72448r25816j061862l28401j065313l183102
2220b004566l807522j796989J91663j47929j130105j22283J828555J697571l55200
2211e646805j148757L40011J474201L73298j237265r92943O32241J437532N08819
2202d259668j209976k157715j121425J675037L784281K570762j056467k862942
$$ plain form
2194 -4638113 -5244820 -2583927 -146008 -1562401 -6261203 -10212962 -10062443 -6029179 -1488043
2185 -1488043 18074 -2015172 -4809766 -5787910 -5575252 -6287545 -7780487 -7964953 -6648596
2176 -6648596 -6202729 -7599163 -8485547 -6776857 -3927793 -2606454 -2779909 -2313993 -360101
2167 -360101 1935911 3335415 3276545 1484114 -1347989 -3115663 -2399024 -549342 -8893
2158 -8893 -1105413 -2247159 -2629383 -2724405 -2624296 -2135580 -2205400 -3901308 -6057768 -6303991
2148 -6303991 -4473824 -2616979 -1673785 -908625 -703929 -2430068 -4671187 -3371261 2244183
2139 2244183 7212958 7008172 3481931 1634157 2734580 4121872 4165568 3610585 2788542
2130 2788542 1173064 -428217 -527513 88922 -880850 -3303387 -4459056 -3347217 -2145100
$$ packed form
2194d638113o06707K660893K437919j416393m698802l951759J50519M033264M541136
2185a488043J506117k033246k794594r78144K12658p12293j492942j84466J316357
2176f648596M45867j396434q86384J708690K849064J321339j73455M65916J953892
2167c60101K296012J399504n8870j792431k832103j767674P16639J849682N40449
2158h893j096520j141746l82224r5022J00109M88716o9820j695908k156460k46223
2148f303991J830167J856845R43194P65160K04696j726139k241119J299926N615444
2139B244183M968775k04786l526241j847774J100423J387292M3696n54983q22043
2130B788542j615478j601281r9296O16435r69772k422537j155669J111839J202117
$$ plain form
2121 -2145100 -2542711 -3526216 -4003997 -4936445 -7278062 -10009421 -11723169 -12190846 -11106934
2112 -11106934 -7627930 -2820959 -169339 -1375527 -3595336 -3227934 -693329 1173461
2104 1173461 1795072 2680095 3639686 2761784 36482 -2328327 -3598586 -5375717 -7998656
2095 -7998656 -9290442 -8491089 -8572289 -12098512 -16669061 -17455897 -13588452 -9187332 -7748773
2086 -7748773 -7939438 -6211105 -1937065 1990445 3220436 2610271 2197694 2161592 1443322
2077 1443322 502448 1079229 2897755 3017874 -89895 -3702212 -4147957 -1670114 448003
2068 448003 791792 921362 1587218 1075337 -1384815 -3151368 -1200474 3806522 8344259
2059 8344259 9949681 8700907 5670462 1825961 -1748888 -4175864 -5560896 -6482441
$$ packed form
2121b145100l97611r83505m77781r32448k341617k731359j713748m67677J083912
2112a1106934L479004M806971K651620j206188k219809L67402K534605J866790
2104A173461O21611Q85023R59591q77902k725302k364809j270259j777131k622939
2095g998656j291786P99353q1200l526223m570549p86836L867445M401120J438559
2086g748773j90665J728333M274040L927510J229991o10165m12577l6102p18270
2077A443322r40874N76781J818526J20119l107769l612317m45745K477843K118117
2068D48003L43789J29570O65856n11881k460152j766553J950894N006996M537737
2059H344259J605422j248774l030445l844501l574849k426976j385032r21545
$$ plain form
2051 -6482441 -6765044 -5708519 -3431724 -1011118 700028 1483613 1040534 -1060696 -4398760
2042 -4398760 -7451505 -8742464 -7824132 -5091173 -1316274 2380692 4766824 5230270 4112445
2033 4112445 2211817 320301 -733156 -303453 1305966 2763005 3023950 2491235 2186094
2024 2186094 1911005 224162 -3312585 -6724957 -7500359 -5632153 -3731118 -3932974 -5666024
2015 -5666024 -6899436 -6646581 -5505729 -4542361 -4599078 -6051538 -8059898 -8468175 -5757370
2006 -5757370 -1049823 2860975 4220167 2905441 -1056580 -7419325 -13915810 -16851362
1998 -16851362 -14808548 -10350879 -6936549 -5478784 -5054254 -5382929 -6753384 -8489232
1990 -8489232 -9440669 -9583106 -9563264 -9092556 -7352868 -4700915 -2519345 -1623473 -2024679
$$ packed form
2051f482441k82603J056525K276795K420606J711146P83585m43079k101230l338064
2042d398760l052745j290959R18332K732959L774899L696966K386132M63446j117825
2033D112445j900628j891516j053457M29703J609419J457039K60945n32715l05141
2024B186094k75089j686843l536747l412372p75402J868206J901035k01856j733050
2015e666024j233412K52855J140852R63368n6717j452460k008360m08277K710805
2006e757370M707547L910798J359192j314726l962021o362745o496485k935552
1998a6851362K042814M457669L414330J457765M24530l28675j370455j735848
1990h489232r51437j42437J9842M70708J739688K651953K181570Q95872m01206
$$ plain form
1981 -2024679 -3570350 -5178703 -4283591 504560 6334606 8329335 5361741 1223454
1973 1223454 -647651 -976412 -1921836 -3279535 -3773324 -4171799 -6114667 -8612046 -8578669
1964 -8578669 -5018707 -436193 2440556 3568627 4492433 5675070 5932749 4103490 833160
1955 833160 -1288761 110347 4318191 7614546 7345365 5154650 4530398 5826647 6145458
1946 6145458 4179075 2269294 2497269 3371101 2483161 489262 -169069 671215 880036
1937 880036 -368970 -1640629 -1928124 -1796488 -1418542 90243 2477951 3683642 2594723
1928 2594723 639498 -644855 -1771857 -3471941 -4625749 -4280853 -4239630 -6829266 -10797738
1919 -10797738 -12370229 -10450669 -8018231 -7759762 -8877068 -9349505 -9103643 -9270802 -9918904
$$ packed form
1981b024679j545671j608353Q95112M788151N830046J994729k967594m138287
1973A223454j871105l28761r45424j357699m93789l98475j942868k497379L3377
1964h578669L559962M582514K876749J128071R23806J182637K57679j829259l270330
1955H33160k121921J399108M207844L296355k69181k190715o24252J296249L18811
1946F145458j966383j909781K27975Q73832q87940j993899o58331Q40284K08821
1937H80036j249006j271659k87495J31636L77946J508785K387708J205691j088919
1928B594723j955225j284353j127002j700084j153808L44896M1223k589636l968472
1919a0797738j572491J919560K432438K58469j117306m72437K45862j67159o48102
$$ plain form
1910 -9918904 -10335931 -10531719 -10796523 -10530510 -9128847 -7508412 -7120757 -7624821 -7078332
1901 -7078332 -4629928 -1783658 -645615 -1856165 -4537874 -7308607 -8794089 -7980790
1893 -7980790 -5090656 -2025517 -1092702 -2765799 -4940464 -4921527 -2201410 1205245 3293153
1884 3293153 4146210 4935689 5743927 5652536 4527526 3083743 1135103 -2377121 -6877163
1875 -6877163 -9318229 -7244583 -1894056 2871924 4224312 2225224 -1184428 -4030081
1867 -4030081 -5467053 -5744186 -4868976 -1672838 4420133 10694093 12485058 8459796 2713126
1858 2713126 52894 888731 2531495 3592735 4457580 4844608 4094939 3330646 4311396
1849 4311396 6278281 6692817 5001838 2833273 545426 -3144397 -7691833 -10327279
$$ packed form
1910i918904m17027j95788k64804K66013J401663J620435L87655n04064N46489
1901g078332K448404K846270J138043j210550k681709k770733j485482Q13299
1893g980790K890134L065139R32815j673097k174665J8937K720117L406655K087908
1884C293153Q53057P89479Q08238r1391j125010j443783j948640l512224m500042
1875f877163k441066K073646N350527M765980J352388j999088l409652k845653
1867d030081j436972k77133Q75210L196138O092971O273960J790965m025262n746670
1858B713126k660232Q35837J642764J061240Q64845L87028p49669p64293R80750
1849D311396J966885M14536j690979k168565k287847l689823m547436k635446
$$ plain form
1841 -10327279 -10116236 -9130073 -8334648 -5917378 -1773051 -33737 -3715734 -9282537 -10367155
1832 -10367155 -5747175 -199169 2026186 1437144 985131 2172933 4009083 4183475 1179202
1823 1179202 -3526259 -5936699 -3812194 279527 2153971 1493428 1632745 4175073 6648254
1814 6648254 6035585 2205555 -2954440 -7641000 -10417834 -10437916 -8692882 -7528269 -7765756
1805 -7765756 -7700447 -6033252 -4270267 -4744228 -7452583 -10434339 -12350328 -13038011 -12256634
1796 -12256634 -9867069 -7186545 -6308095 -7486650 -8474116 -7178139 -4077371 -1193538
1788 -1193538 630892 2266733 4197283 5144593 3651435 475410 -1749700 -1388901 608839
1779 608839 2334390 3044872 2921112 1871283 44328 -1201841 -768606 -123766 -2012382
$$ packed form
1841a0327279K11043R86163P95425K417270M144327J739314l681997n566803j084618
1832a0367155M619980N548006K225355n89042m52013J187802J836150J74392l004273
1823A179202m705461k410440K124505M091721J874444o60543J39317K542328K473181
1814F648254o12669l830030n159995m686560k776834k0082J745034J164613k37487
1805g765756O5309J667195J762985m73961k708355k981756j915989o87683P81377
1796a2256634K389565K680524Q78450j178555r87466J295977L100768K883833
1788a193538J824430J635841J930550R47310j493158l176025k225110L60799J997740
1779F08839J725551P10482j23760j049829j826955j246169M33235O44840j888616
$$ plain form
1770 -2012382 -6286172 -9080450 -7451861 -3202452 -326412 189799 856740 3440843 6574223
1761 6574223 8086204 7805787 6962252 6132831 5200562 4659935 5422216 7226871 8382872
1752 8382872 7546965 5099441 2385442 255299 -1054849 -1198971 63336 1957518 3047094
1743 3047094 2930572 2774943 3518134 4256899 3410787 1088575 -923251 -1589387 -1813080
1734 -1813080 -2664796 -3469559 -2681200 -184387 2369337 3557053 3588483 3316025 2582807
1725 2582807 498197 -2646491 -4734941 -4019499 -1743841 -1429870 -4907832 -9781013 -11841953
1716 -11841953 -9716643 -5970296 -3574226 -2710767 -1927284 -1281984 -2573456 -6334718 -10077136
1707 -10077136 -10557789 -7332759 -3185189 -1127183 -1805994 -3999304 -6538863 -8685472
$$ packed form
1770b012382m273790k794278J628589M249409K876040N16211O66941K584103L133380
1761F574223J511981k80417q43535q29421r32269n40627P62281J804655J156001
1752H382872q35907k447524k713999k130143j310148j44122J262307J894182J089576
1743C047094j16522j55629P43191P38765q46112k322212k011826o66136k23693
1734a813080q51716q04763P88359K496813K553724J187716L1430k72458p33218
1725B582807k084610l144688k088450P15442K275658L13971l477962m873181k060940
1716a1841953K125310L746347K396070Q63459P83483O45300j291472l761262l742418
1707a0077136m80653L225030M147570K058006o78811k193310k539559k146609
$$ plain form
1699 -8685472 -9221340 -6944785 -2708164 383274 153108 -1837383 -2055325 524225 3074187
1690 3074187 2418087 -1260642 -4888089 -5899572 -4422907 -2542035 -2099131 -3094202 -3894501
1681 -3894501 -3147312 -1469573 -704550 -1483097 -2482769 -2541423 -2399760 -3306697 -4662585
1672 -4662585 -4435467 -1754603 2078721 5162039 6527878 6128325 4512735 2855270 2229671
1663 2229671 2362508 1996259 902237 475197 1688026 3548676 4502268 4295124 3237736
1654 3237736 752118 -3413738 -7127540 -7461282 -4707230 -2605858 -3666320 -6266514
1646 -6266514 -7699330 -8006849 -8550468 -8387938 -5372439 -719816 849333 -3125512 -9239946
1637 -9239946 -12143731 -10463464 -6925440 -3830011 -1037635 1605018 2474703 296750
$$ packed form
1699h685472n35868K276555M236621L091438k30166j990491k17942K579550K549962
1690C074187o56100l678729l627447j011483J476665J880872M42904r95071q00299
1681c894501P47189J677739P65023p78547r99672n8654J41663r06937j355888
1672d662585K27118K680864L833324L083318J365839l99553j615590j657465o25599
1663B229671J32837l66249j094022m27040J212829J860650R53592k07144j057388
1654C237736k485618m165856l713802l33742K754052K101372j060462k600194
1646f266514j432816l07519n43619J62530L015499M652623J569149l974845o114434
1637i239946k903785J680267L538024L095429K792376K642653Q69685k177953
$$ plain form
1629 296750 -3202837 -4547163 -2444549 693416 1674939 201175 -1307358 -1276536 -1032380
1620 -1032380 -2650438 -5886074 -8621690 -9799691 -10161709 -10045767 -8441742 -5126240 -2071142
1611 -2071142 -1253648 -2083017 -2498588 -1935659 -1680441 -2690213 -4586936 -6696357 -8645838
1602 -8645838 -9798798 -9379917 -7529569 -5343600 -3689916 -2790516 -2885111 -4131278 -5638882
1593 -5638882 -5811968 -4210937 -2195663 -1219975 -1331495 -1921001 -3060533 -5130530 -7567284
1584 -7567284 -9033328 -8963097 -8246174 -8025231 -8254009 -8049923 -7377982 -7455907 -8822972 -9761137
1574 -9761137 -7986713 -3759174 232139 2313131 3407203 4510107 4583090 2439219 -895948
1565 -895948 -3512723 -5004910 -5747513 -5307675 -3864811 -3737665 -6554362 -9968136 -10512728
$$ packed form
1629B96750l499587j344326K102614L137965R81523j473764j508533L0822K44156
1620a032380j618058l235636k735616j178001l62018J15942J604025L315502L055098
1611b071142Q17494q29369m15571N62929K55218j009772j896723k109421j949481
1602h645838j152960M18881J850348K185969J653684Q99400r4595j246167j507604
1593e638882j73086J601031K015274R75688j11520n89506j139532k069997k436754
1584g567284j466044P0231P16923K20943k28778K04086O71941p7925j367065r38165
1574i761137J774424M227539L991313K080992J094072J102904P2983k143871l335167
1565h95948k616775j492187p42603M39838J442864J27146k816697l413774n44592
$$ plain form
1556 -10512728 -8932723 -8737726 -9698361 -7497089 -1001876 4685832 4853350 1183160 -1664851
$$ packed form
1556a0512728J580005J94997r60635K201272O495213N687708J67518l670190k848011
$$ [...]
##END NTUPLES=NMR SPECTRUM
##END=
