##TITLE=31P_DE-80H_X3
 64 sc D2O
 26.2.2025
##JCAMPDX= 6.0         $$ Bruker NMR JCAMP-DX V2.0
##DATA TYPE= NMR SPECTRUM
##DATA CLASS= NTUPLES
##ORIGIN= UXNMR, Bruker Analytische Messtechnik GmbH
##OWNER= root
$$ XWIN-NMR		Version 3.5
$$ Wed May 14 14:33:07 2025 Russian Standard Time (UT+4h)  Yarkov@DPX200
##.OBSERVE FREQUENCY= 81.013821
##.OBSERVE NUCLEUS= ^31P
##.ACQUISITION MODE= SIMULTANEOUS
##.ACQUISITION SCHEME= undefined
##.AVERAGES= 64
##.DIGITISER RES= 17
##SPECTROMETER/DATA SYSTEM= spect
##.PULSE SEQUENCE= zgpg30
##.SOLVENT NAME= DMSO
##.SHIFT REFERENCE= (INTERNAL, DMSO, 0, 198.062)
##AUDIT TRAIL= $$ (NUMBER, WHEN, WHO, WHERE, WHAT)
$$ ##TITLE= Audit trail, XWIN-NMR		Version 3.5
$$ ##JCAMPDX= 5.01
$$ ##ORIGIN= Bruker BioSpin GmbH
$$ ##OWNER= Yarkov
$$ C:/Bruker/XWIN-NMR/data/yarkov2/nmr/P31/2/pdata/1/auditp.txt
$$ ##AUDIT TRAIL=  $$ (NUMBER, WHEN, WHO, WHERE, WHAT)
(   1,<2025-05-14 14:32:18.04 +0400>,<Yarkov>,<DPX200>,
      <created by zg, POWCHK disabled, PULCHK disabled
       configuration hash MD5:
       00 E9 B6 7A A2 85 ED C7 34 08 36 98 17 FE 4E 26
       data hash MD5: 32K
       76 A2 C8 BC 1F 6A 1C DC B6 50 70 D7 B8 4B 8F F3>)
(   2,<2025-05-14 14:32:22.89 +0400>,<Yarkov>,<DPX200>,
      <Start of raw data processing
       efp BC_mod = 2 LB = 1.5 FT_mod = 6 PKNL = 1 PHC0 = 1789.996 PHC1 = 8.695429 SI = 64K 
       data hash MD5: 64K
       0F 63 05 3C 2B 42 A1 29 E2 BE 41 88 64 5E 3C 43>)
$$ ##END=
$$ 
$$ hash MD5
$$ 13 DE 81 C0 F6 30 FC DD C4 5A 41 D4 5B C2 1E 48
##$RELAX= 
##$RELAX= 
##$RELAX= 
##$RELAX= 
##$RELAX= 
##$RELAX= 
##$RELAX= 
##$RELAX= 
$$ Bruker specific parameters
$$ --------------------------
##$DU= <C:/Bruker/XWIN-NMR>
##$EXPNO= 2
##$NAME= <P31>
##$PROCNO= 1
##$TYPE= <nmr>
##$USER= <yarkov2>
##$AMP= (0..31)
100 100 100 100 100 100 100 100 100 100 100 100 100 100 100 100 100 100 
100 100 100 100 100 100 100 100 100 100 100 100 100 100 
##$AQSEQ= 0
##$AQ_mod= 1
##$AUNM= <au_zg>
##$AUTOPOS= <>
##$BF1= 81.014009
##$BF2= 200.13
##$BF3= 200.13
##$BF4= 200.13
##$BF5= 200.13
##$BF6= 200.13
##$BF7= 200.13
##$BF8= 200.13
##$BYTORDA= 1
##$CFDGTYP= 0
##$CFRGTYP= 5
##$CHEMSTR= <none>
##$CNST= (0..31)
1 1 145 1 1 1 1 1 1 1 1 1 1 1 1 1 1 1 1 1 1 1 1 1 1 1 1 1 1 1 1 1 
##$CPDPRG= <waltz16>
##$CPDPRG1= <>
##$CPDPRG2= <waltz16>
##$CPDPRG3= <>
##$CPDPRG4= <mlev>
##$CPDPRG5= <mlev>
##$CPDPRG6= <mlev>
##$CPDPRG7= <mlev>
##$CPDPRG8= <mlev>
##$CPDPRGB= <>
##$CPDPRGT= <>
##$D= (0..31)
0 1 0 0 0 0 0 0 0 0.06 0 0.03 2e-05 3e-06 0 0 0.0002 0 0 0 0 0 0 0 0 0 
0 0 0 0 0 0 
##$DATE= 1747218737
##$DBL= (0..7)
120 120 120 11 120 120 24 19 
##$DBP= (0..7)
150 150 150 150 150 150 150 150 
##$DBP07= 0
##$DBPNAM0= <>
##$DBPNAM1= <>
##$DBPNAM2= <>
##$DBPNAM3= <>
##$DBPNAM4= <>
##$DBPNAM5= <>
##$DBPNAM6= <>
##$DBPNAM7= <>
##$DBPOAL= (0..7)
0.5 0.5 0.5 0.5 0.5 0.5 0.5 0.5 
##$DBPOFFS= (0..7)
0 0 0 0 0 0 0 0 
##$DE= 6
##$DECBNUC= <off>
##$DECIM= 4
##$DECNUC= <off>
##$DECSTAT= 4
##$DIGMOD= 1
##$DIGTYP= 9
##$DL= (0..7)
0 0 52 120 120 21 21 25 
$$ [...]
##$SUBNAM2= <"">
##$SUBNAM3= <"">
##$SUBNAM4= <"">
##$SUBNAM5= <"">
##$SUBNAM6= <"">
##$SUBNAM7= <"">
##$SUBNAM8= <"">
##$SUBNAM9= <"">
##$SW= 400.765351723535
##$SWIBOX= (0..15)
0 1 3 0 0 0 0 0 0 0 0 0 0 0 0 0 
##$SW_h= 32467.5324675325
##$TD= 32768
##$TD0= 1
##$TE= 0
##$TE2= 300
##$TE3= 300
##$TEG= 300
##$TL= (0..7)
0 120 53 12 22 120 120 120 
##$TP= (0..7)
150 150 150 150 150 150 150 150 
##$TP07= 0
##$TPNAME0= <>
##$TPNAME1= <>
##$TPNAME2= <>
##$TPNAME3= <>
##$TPNAME4= <>
##$TPNAME5= <>
##$TPNAME6= <>
##$TPNAME7= <>
##$TPOAL= (0..7)
0.5 0.5 0.5 0.5 0.5 0.5 0.5 0.5 
##$TPOFFS= (0..7)
0 0 0 0 0 0 0 0 
##$TUNHIN= 0
##$TUNHOUT= 0
##$TUNXOUT= 0
##$USERA1= <user>
##$USERA2= <user>
##$USERA3= <user>
##$USERA4= <user>
##$USERA5= <user>
##$V9= 5
##$VALIST= <valist>
##$VCLIST= <CCCCCCCCCCCCCCC>
##$VD= 0
##$VDLIST= <DDDDDDDDDDDDDDD>
##$VPLIST= <PPPPPPPPPPPPPPP>
##$VTLIST= <TTTTTTTTTTTTTTT>
##$WBST= 1024
##$WBSW= 4
##$XGAIN= (0..3)
0 0 0 0 
##$XL= 0
##$YL= 0
##$YMAX_a= 3329
##$YMIN_a= -19261
##$ZGOPTNS= <>
##$ZL1= 120
##$ZL2= 120
##$ZL3= 120
##$ZL4= 120
##$ABSF1= 0
##$ABSF2= 0
##$ABSG= 0
##$ABSL= 0
##$ALPHA= 0
##$AQORDER= 0
##$ASSFAC= 0
##$ASSFACI= 0
##$ASSFACX= 0
##$ASSWID= 0
##$AUNMP= <proc_1d>
##$AZFE= 0.1
##$AZFW= 0.5
##$BCFW= 0
##$BC_mod= 2
##$BYTORDP= 0
##$COROFFS= 0
##$CY= -3
##$DATMOD= 1
##$DC= 0
##$DFILT= <>
##$DTYPP= 0
##$F1P= 0
##$F2P= 0
##$FCOR= 1
##$FTSIZE= 65536
##$FT_mod= 6
##$GAMMA= 0
##$GB= 0
##$INTBC= 1
##$INTSCL= 9.790993e-09
##$ISEN= 30
##$LB= 1.5
##$LEV0= 0
##$LPBIN= 0
##$MAXI= 10000
##$MC2= 0
##$MEAN= 0
##$ME_mod= 0
##$MI= 50
##$NCOEF= 0
##$NC_proc= -8
##$NLEV= 6
##$NOISF1= 182.463
##$NOISF2= 159.3651
##$NSP= 0
##$NTH_PI= 0
##$NZP= 0
##$OFFSET= 198.0616
##$PC= 4
##$PHC0= 1789.996
##$PHC1= 8.695429
##$PH_mod= 1
##$PKNL= yes
##$PPARMOD= 0
##$PSCAL= 0
##$PSIGN= 0
##$REVERSE= no
##$SF= 81.0140089999434
##$SI= 65536
##$SIGF1= 159.3651
##$SIGF2= -187.1042
##$SINO= 113.3802
##$SIOLD= 16384
##$SREGLST= <1H.CDCl3>
##$SSB= 0
##$STSI= 65536
##$STSR= 0
##$SW_p= 32467.5324675325
##$SYMM= 0
##$S_DEV= 0
##$TDeff= 32768
##$TDoff= 0
##$TI= <>
##$TILT= no
##$TM1= 0
##$TM2= 0
##$TOPLEV= 0
##$USERP1= <user>
##$USERP2= <user>
##$USERP3= <user>
##$USERP4= <user>
##$USERP5= <user>
##$WDW= 1
##$XDIM= 65536
##$YMAX_p= 84172691
##$YMIN_p= -349022687
$$ End of Bruker specific parameters
$$ ---------------------------------
##NTUPLES= NMR SPECTRUM
##VAR_NAME=  FREQUENCY,     SPECTRUM/REAL,   SPECTRUM/IMAG
##SYMBOL=    X,             R,               I
##VAR_TYPE=  INDEPENDENT,   DEPENDENT,       DEPENDENT
##VAR_FORM=  AFFN,          ASDF,            ASDF
##VAR_DIM=   65536,         65536,           65536
##UNITS=     HZ,            ARBITRARY UNITS, ARBITRARY UNITS
##FACTOR=    0.49542278885378, 1,            1
##FIRST=     16045.7642231865, 0,            0
##LAST=      -16421.768244346, 0,            0
##MIN=       -16421.768244346, -349022687,   0
##MAX=       16045.7642231865, 84172691,     0
$$ Real data points
##PAGE= N=1
##DATA TABLE= (X++(R..R)), XYDATA
$$ [...]
$$ plain form
7465 -4958389 -4464995 -4115857 -3227403 -1588825 19463 942705 828937 -785391 -3558373
7456 -3558373 -5612081 -5341617 -3439713 -1584266 108175 2414827 4586714 5055690 4291092
7447 4291092 4412316 5849045 6853592 6485985 5319234 2825303 -2507586 -9078724 -11669069
7438 -11669069 -7657595 -1225439 1563155 -61309 -2326065 -2988362 -2834050 -2155977 -168155
7429 -168155 1684502 -24694 -5633948 -10881032 -12346115 -11543938 -11344879 -11057942 -8380666
7420 -8380666 -4517977 -3344754 -5477583 -6750470 -3886705 824732 2376793 -845582
7412 -845582 -5661103 -8204106 -7755192 -6353199 -5923065 -6592540 -7367738 -7561155 -7180474
7403 -7180474 -6321483 -4922613 -3330926 -2432419 -2539378 -2511705 -894523 2034383 4223344
$$ packed form
7465d958389M93394L49138Q88454J638578J608288R23242j13768j614328k772982
7456c558373k053708K70464J901904J855447J692441K306652K171887M68976p64598
7447D291092J21224J436729J004547l67607j166751k493931n332889o571138k590345
7438a1669069M011474O432156K788594j624464k264756o62297J54312O78073J987822
7429a68155J852657j709196n609254n247084j465083Q02177J99059K86937K677276
7420h380666L862689J173223k132829j272887K863765M711437J552061l222375
7412h45582m815521k543003M48914J401993M30134o69475p75198j93417L80681
7403g180474Q58991J398870J591687Q98507j06959K7673J617182K928906K188961
$$ plain form
7394 4223344 4151066 2418665 625734 -535010 -1292183 -1557351 -878763 375692 866595
7385 866595 -237406 -2255240 -3872556 -4556153 -4733794 -4982196 -5404285 -5509595 -4554121
7376 -4554121 -2542886 -1041367 -1956691 -4789145 -6208656 -3826460 287891 1751017
7368 1751017 -583445 -3339037 -3349055 -1339473 427642 1883462 4029885 5540342 3743243
7359 3743243 -1005139 -4862855 -5240327 -3595192 -2385911 -1580460 -16439 1693244 2156273
7350 2156273 2095659 3507626 5982668 6433619 3325693 -777818 -2223573 -627185 1153410
7341 1153410 744627 -1447817 -3611631 -4925066 -5880614 -6747372 -6696674 -4915522 -2114394
7332 -2114394 -71329 359186 -203875 -1465758 -4406223 -9081269 -12569388 -11460630 -6511146
$$ packed form
7394D223344p2278j732401j792931j160744p57173k65168O78588J254455M90903
7385H66595j104001k017834j617316o83597j77641k48402m22089j05310R55474
7376d554121K011235J501519r15324k832454j419511K382196M114351J463126
7368A751017k334462k755592j0018K009582J767115J455820K146423J510457j797099
7359C743243m748382l857716l77472J645135J209281Q05451J564021J709683M63029
7350B156273o0614J411967K475042M50951l107926m103511j445755J596388J780595
7341A153410m08783k192444k163814j313435r55548q66758N0698J781152K801128
7332b114394K043065M30515n63061j261883k940465m675046l488119J108758M949484
$$ plain form
7323 -6511146 -2532097 -2690124 -4832127 -4886557 -2213311 472201 1308877 830419 -389769
7314 -389769 -2890688 -6360479 -8718317 -8490454 -6628094 -4684226 -2564594 243719 2265992
7305 2265992 1094780 -3140412 -7188421 -8114812 -6124509 -3535295 -2166611 -2443863 -3964059
7296 -3964059 -5739767 -6355740 -5087898 -3011481 -2243613 -3777580 -6435784 -8161374 -8045831
7287 -8045831 -6824861 -5620692 -4796107 -4369037 -4977373 -7294065 -10257184 -11227468 -9083354
7278 -9083354 -6233409 -5828212 -7444358 -7751730 -5601153 -3725006 -4147151 -4637040 -2281837
7269 -2281837 1348220 1983347 -1179174 -4607472 -5799881 -5901791 -6024986 -4675274 -1156080
7260 -1156080 1436243 -108868 -4137969 -6159675 -4946666 -3277941 -2897412 -2371263 -815597
$$ packed form
7323f511146L979049j58027k142003n4430K673246K685512Q36676m78458j220188
7314c89769k500919l469791k357838K27863J862360J943868K119632K808313K022273
7305B265992j171212m235192m048009r26391J990303K589214J368684k77252j520196
7296c964059j775708o15973J267842K076417P67868j533967k658204j725590J15543
7287h045831J220970J204169Q24585M27070o08336k316692k963119r70284K144114
7278i083354K849945M05197j616146l07372K150577J876147m22145m89889K355203
7269b281837L630057O35127l162521l428298j192409j01910j23195J349712L519194
7260a156080K592323j545111m029101k021706J213009J668725L80529N26149J555666
$$ plain form
7251 -815597 -362505 -2785063 -5940990 -6220397 -3484741 -1077085 -1112228 -1951236 -900737
7242 -900737 2220998 5203703 6139607 4903550 2457603 -101166 -1713406 -1683489 -496636
7233 -496636 316605 -102046 -752303 -116897 1706762 3339384 4331058 5474654 6703053
7224 6703053 6535166 4527097 2501381 1876612 1380208 -590687 -2696129 -2384014 -173199
7215 -173199 816069 -260077 -560500 2070500 5960663 8206289 8173289 6793038 4379924
7206 4379924 1197066 -1278867 -1866871 -1610669 -2298196 -3758804 -4464519 -4209902 -4206526
7197 -4206526 -4696242 -4308786 -2012946 1607144 5112420 7186243 7056855 5146137 3140652
7188 3140652 2256593 1672687 -63326 -2370508 -2940633 -810633 2275486 3890547 3232509
$$ packed form
7251h15597M53092k422558l155927k79407K735656K407656l5143q39008J050499
7242i00737L121735K982705R35904j236057k445947k558769j612240K9917J186853
7233d96636Q13241m18651o50257O35406J823659J632622R91674J143596J228399
7224F703053j67887k008069k025716o24769m96404j970895k105442L12115K210815
7215a73199R89268j076146l00423K631000L890163K245626l3000j380251k413114
7206D379924l182858k475933n88004K56202o87527j460608p05715K54617L376
7197d206526m89716L87456K295840L620090L505276K073823j29388j910718k005485
7188C140652q84059n83906j736013k307182n70125K130000L086119J615061o58038
$$ plain form
7179 3232509 1224286 -702680 -1773386 -2584428 -4478801 -7434718 -9236926 -8043810
7171 -8043810 -5074115 -2951877 -1939727 -130312 2744828 4442917 3849609 2907782 3526979
7162 3526979 4619162 3881685 1067354 -2067471 -3931975 -3939363 -2339156 -436830 148698
7153 148698 -463197 -406760 841717 1142777 -937362 -3274663 -3003820 -785110 404275
7144 404275 -200971 -752259 -482544 -671125 -1609217 -1635359 -228839 585503 -511274 -1664265
7134 -1664265 -711995 932348 -321693 -5347511 -10891656 -13440950 -12980525 -12047029 -12016893
7125 -12016893 -11743886 -9987201 -7831466 -7426678 -8814075 -9691834 -8672563 -7029614 -6186119
7116 -6186119 -5165398 -2346946 1453294 3909281 4547160 4815669 5129317 4553584 3729786
$$ packed form
7179C232509k008223j926966j070706q11042j894373k955917j802208J193116
7171h043810K969695K122238J012150J809415K875140J698089n93308r41827O19197
7162C526979J092183p37477k814331l134825j864504p388J600207J902326N85528
7153A48698o11895N6437J248477L01060k080139k337301K70843K218710J189385
7144D04275o05246n51288K69715j88581r38092k6142J406520Q14342j096777j152991
7134a664265R52270J644343j254041n025818n544145k549294M60425R33496L0136
7125a2016893K73007J756685K155735M04788j387397q77759J019271J642949Q43495
7116f186119J020721K818452L800240K455987O37879K68509L13648n75733q23798
$$ plain form
7107 3729786 5194689 9469709 13152097 12724526 8792213 4939098 3574542 4368240 5652508
7098 5652508 5788443 3981397 1187838 -489056 -494618 -927366 -3544841 -6774984 -7662694
7089 -7662694 -6127748 -5135847 -6739284 -9911527 -12479860 -13334944 -12237596 -9169222 -4847565
7080 -4847565 -808056 1872785 3265221 3633507 2808540 1149827 147714 965865 2728955
7071 2728955 3209538 1294253 -1842606 -4232476 -5310177 -6058320 -7001766 -6948925 -4635549
7062 -4635549 -1198684 457794 -840129 -3032851 -3618542 -2663825 -1878369 -1921380 -2262211
7053 -2262211 -2807605 -3729832 -4170339 -3112145 -1357182 -708531 -1316936 -1881486 -2330978
7044 -2330978 -3742697 -5297414 -4322962 -649961 1804037 -224131 -5138858 -9138615
$$ packed form
7107C729786J464903M275020L682388m27571l932313l853115j364556P93698J284268
7098E652508J35935j807046k793559j676894n562m32748k617475l230143q87710
7089g662694J534946R91901j603437l172243k568333q55084J097348L068374M321657
7080d847565M039509K680841J392436L68286q24967j658713j002113Q18151J763090
7071B728955M80583j915285l136859k389870j077701p48143r43446N2841K313376
7062d635549L436865J656478j297923k192722n85691R54717P85456m3011l40831
7053b262211n45394r22227m40507J058194J754963O48651o08405n64550m49492
7044b330978j411719j554717R74452L673001K453998k028168m914727l999757
$$ plain form
7036 -9138615 -11123908 -12378934 -12936621 -11510384 -8605668 -6671218 -6744316 -7243078 -6605499
7027 -6605499 -5195818 -4059603 -3560756 -3938005 -5700533 -8686172 -11814078 -14243061 -15731645
7018 -15731645 -15707227 -13468152 -9792282 -6864881 -5831020 -5594533 -4689054 -3086893 -1440467
7009 -1440467 72975 1059173 250352 -3075875 -7662340 -11381286 -13304159 -13809651 -13235347
7000 -13235347 -11403225 -8179126 -3891266 409543 2914196 2371229 -5885 -1302659
6992 -1302659 -565964 -316097 -3030112 -7492947 -10513471 -11129148 -10830006 -10429415 -9452446
6983 -9452446 -8428860 -8791944 -9839756 -8597978 -4092948 513578 1813246 408814
6975 408814 -680066 -543949 -1072373 -3666617 -7320421 -10081206 -10939811 -10012834 -7955930
$$ packed form
7036i138615j985293j255026n57687J426237K904716J934450p3098m98762O37579
7027f605499J409681J136215M98847l77249j762528k985639l127906k428983j488584
7018a5731645K4418K239075L675870K927401J033861K36487R05479J602161J646426
7009a440467J513442R86198q08821l326227m586465l718946j922873n05492N74304
7000a3235347J832122L224099M287860M300809K504653n42967k377114j296774
6992a302659P36695K49867k714015m462835l020524o15677K99142M00591R76969
6983i452446J023586l63084j047812J241778M505030M606526J299668j404432
6975D08814j088880J36117n28424k594244l653804k760785q58605R26977K056904
$$ plain form
6966 -7955930 -5619803 -3779043 -3002269 -3742010 -5919887 -8178622 -8605841 -6971949 -5235075
6957 -5235075 -4843067 -4706831 -3297953 -1576332 -1673481 -3318895 -4126541 -3455107 -3308796
6948 -3308796 -4695454 -5752893 -5071712 -4703408 -7581544 -13117439 -17534958 -18057887 -15042637
6939 -15042637 -10580986 -6943549 -6034613 -8094210 -10521577 -9925614 -6119773 -2519044
6931 -2519044 -1779762 -2689927 -2630358 -1605764 -1869879 -4251655 -6952943 -8109553 -7789067
6922 -7789067 -6929366 -5797216 -4405357 -3345961 -3075189 -2998673 -2277773 -1058014 82029
6913 82029 1350503 3067417 4058554 2477453 -1297021 -4183572 -3886442 -1716082 -625239
6904 -625239 -1267704 -1620611 -210724 1988835 3176665 2834017 1627509 294355 -662200
$$ packed form
6966g955930K336127J840760P76774p39741k177877k258735m27219J633892J736874
6957e235075L92008J36236J408878J721621r7149j645414q07646O71434J46311
6948c308796j386658j057439O81181L68304k878136n535895m417519n22929L015250
6939a5042637M461651L637437R08936k059597k427367N95963L805841L600729
6931b519044P39282r10165N9569J024594k64115k381776k701288j156610L20486
6922g789067Q59701J132150J391859J059396K70772P6516P20900J219759J140043
6913H2029J268474J716914R91137j581101l774474k886551K97130K170360J090843
6904f25239o42465l52907J409887K199559J187830l42648j206508j333154r56555
$$ plain form
6895 -662200 -1029401 -1450091 -3315464 -7236039 -11867655 -14804773 -14442785 -10857030 -5679715
6886 -5679715 -1608836 -939164 -3305576 -5425517 -4460545 -1432734 111466 -1160772 -2654835
6877 -2654835 -1525321 1487969 3248521 2289914 23892 -1814263 -3097683 -4121894
6869 -4121894 -4049703 -2004617 850572 1898667 33978 -3105704 -5478093 -7213406 -9796609
6860 -9796609 -13302729 -15895052 -16147459 -14581322 -12519759 -10639183 -9289927 -8955092 -9196844
6851 -9196844 -8149468 -4709400 -825404 99349 -2795848 -6907522 -9499432 -10421565 -10925373
6842 -10925373 -11392063 -11544230 -11825831 -12870262 -13871721 -13044266 -10102229 -7270587 -7163828
6833 -7163828 -10056206 -13741792 -15945895 -16399292 -16280119 -15911672 -13848265 -8829446 -2093777
$$ packed form
6895f62200l67201m20690j865373l920575m631616k937118L61988L585755N177315
6886e679715M070879O69672k366412k119941R64972L027811J544200j272238j494063
6877b654835J129514L013290J760552r58607k266022j838155j283420j024211
6869d121894P2191K045086K855189J048095j864689l139682k372389j735313k583203
6860i796609l506120k592323k52407J566137K061563J880576J349256L34835k41752
6851i196844J047376L440068L883996R24753k895197m111674k591910r22133n03808
6842a0925373m66690j52167k81601j044431j001459Q27455K942037K831642J06759
6833g163828k892378l685586k204103m53397J19173L68447K063407N018819O735669
$$ plain form
6824 -2093777 3320650 5541370 5085527 3167161 388990 -2228076 -2677234 -110841 3407249
6815 3407249 5082907 4776589 4400431 4414209 3327391 1015054 -41937 1753593 4330865
6806 4330865 4663336 3104982 2804905 5227936 8484074 10376365 10985200 11149439 10075524
6797 10075524 6425289 1318147 -1725322 -540760 3126719 5755460 5944613 4923877
6789 4923877 3652439 1421178 -1852605 -3758590 -1866788 2591147 5745767 5971486
6781 5971486 5580902 6841089 8438450 7596965 4141632 254135 -2924429 -6033096 -9103382
6772 -9103382 -10934533 -11301452 -11540640 -12088923 -11566239 -9612528 -8601027 -10463443 -13232020
6763 -13232020 -13270743 -10333683 -7755382 -7480563 -7605827 -5995343 -4061180 -4791880 -8068502
$$ packed form
6824b093777N414427K220720m55843j918366k778171k617066m49158K566393L518090
6815C407249J675658l06318l76158J3778j086818k312337j056991J795530K577272
6806D330865L32471j558354l00077K423031L256138J892291O08835J64239j073915
6797A0075524l650235n107142l043469J184562L667479K628741J89153j020736
6789D923877j271438k231261l273783j905985J891802M457935L154620K25719
6781E971486l90584J260187J597361q41485l455333l887497l178564l108667l070286
6772i103382j831151l66919k39188n48283N22684J953711J011501j862416k768577
6763a3232020l8723K937060K578301K74819j25264J610484J934163p30700l276622
$$ plain form
6754 -8068502 -10252849 -8619105 -4543617 -1580738 -1374559 -2399319 -2367342 -968893 89639
6745 89639 -603956 -2341023 -3034355 -1624653 702574 1917304 1373700 102682 -969307
6736 -969307 -2203095 -4047149 -5249184 -3579527 1132715 5656614 6319347 3194169 96331
6727 96331 66654 2139216 3477336 3451175 3810512 5308968 6346319 5499067 3514667
6718 3514667 1651232 -420625 -3370529 -5852597 -5491213 -2180018 1341850 2561459
6710 2561459 1458688 -634087 -2868227 -4704296 -5284694 -4447602 -3676054 -4484421 -5967491
6701 -5967491 -5425567 -1916964 1908696 2448548 -802430 -4687861 -5874810 -4205832 -2309056
6692 -2309056 -2508617 -4836546 -7780607 -9828978 -9860687 -7217163 -2750719 629274 82081
$$ packed form
6754h068502k184347J633744M075488K962879K06179j024760L1977J398449J058532
6745H9639o93595j737067o93332J409702K327227J214730n43604j271018j071989
6736i69307j233788j844054j202035J669657M712242M523899O62733l125178l097838
6727I6331k9677K072562J338120k6161L59337J498456J037351q47252j984400
6718C514667j863435k071857k949904k482068L61384L311195L521868J219609
6710B561459j102771k092775k234140j836069n80398Q37092P71548q08367j483070
6701e967491N41924L508603L825660N39852l250978l885431j186949J668978J896776
6692b309056j99561k327929k944061k048371l1709K643524M466444L379993n47193
$$ plain form
6683 82081 -4045400 -8339759 -10052414 -9628729 -8907370 -8179827 -6507349 -4148436 -2728671
6674 -2728671 -2805748 -2846876 -1371899 894548 1884955 680926 -1612652 -3243478 -3438676
6665 -3438676 -2732947 -2265854 -2997192 -5240803 -8378653 -10832855 -10857570 -8133320 -4547493
6656 -4547493 -2581353 -2728128 -3367550 -3392786 -3553456 -4353841 -4286862 -2093629 282826
6647 282826 -456587 -4368275 -8054138 -9272504 -8993066 -8083031 -5183185 -53581 3638265
6638 3638265 2132954 -3139315 -7227043 -7847370 -6739652 -5285653 -2619982 999557
6630 999557 2540830 132747 -3721346 -5274754 -4301841 -3355354 -3405832 -2882760 -833231
6621 -833231 1368870 2010579 1040339 -667585 -2883646 -5964470 -9675106 -12644947 -13079527
$$ packed form
6683H2081m127481m294359j712655M23685P21359P27543J672478K358913J419765
6674b728671p7077m1128J474977K266447R90407j204029k293578j630826j95198
6665c438676P05729M67093p31338k243611l137850k454202k4715K724250L585827
6656d547493J966140j46775o39422k5236j60670q00385O6979K193233K376455
6647B82826p39413l911688l685863j218366K79438R10035K899846N129604L691846
6638C638265j505311n272269m087728o20327J107718J453999K665671L619539
6630I99557J541273k408083l854093j553408R72913R46487n0478N23072K049529
6621h33231K202101O41709r70240j707924k216061l080824l710636k969841m34580
$$ plain form
6612 -13079527 -10267011 -5678550 -2156957 -1422449 -2642867 -3877420 -4290913 -4232504 -3947985
6603 -3947985 -3445983 -3101165 -3021356 -2245389 -102099 2050744 2369710 1605253 2269147
6594 2269147 4486285 5499402 4319769 3749074 5563160 6527584 2702105 -4030109 -7795110
6585 -7795110 -6467193 -3374023 -1018868 2297792 7758572 12100314 11792486 8492956
6577 8492956 6617661 7030942 6924178 5205548 4054780 4758686 5580270 4962601 3871769
6568 3871769 3279476 1810906 -1869626 -5974281 -7243479 -4944944 -1376011 1143151
6560 1143151 2190577 2453485 2398075 1742663 -394544 -4279603 -7968496 -8293001 -4824967
6551 -4824967 -1572236 -2641213 -6953776 -9574928 -7936373 -4254205 -1732390 -1117589
$$ packed form
6612a3079527K812516M588461L521593P34508j220418j234553m13493N8409K84519
6603c947985N02002L44818P9809P75967K143290K152843L18966p64457O63894
6594B269147K217138J013117j179633n70695J814086R64424l825479o732214l765001
6585g795110J327917L093170K355155L316660N460780M341742l07828l299530
6577H492956j875295M13281j06764j718630j150768P03906Q21584o17669j090832
6568C871769n92293j468570l680532m104655j269198K298535L568933K519162
6560A143151J047426K62908n5410o55412k137207l885059l688893l24505L468034
6551d824967L252731j068977m312563k621152J638555L682168K521815O14801
$$ plain form
6543 -1117589 -1712113 -2988811 -3615463 -1215613 4639726 10573959 12619800 10405911 6469983
6534 6469983 2618431 -799819 -2895200 -2394084 -95924 1165846 -157434 -2677039
6526 -2677039 -4349656 -4804121 -4657507 -4177255 -3800793 -4591855 -6634330 -7900344 -6466617
6517 -6466617 -3521455 -2471550 -4829078 -8359882 -9832698 -8453104 -5747362 -2995648
6509 -2995648 -192638 2573177 4164639 3624398 1619486 -298674 -1573792 -2825702
6501 -2825702 -4272288 -5175158 -5243589 -5433745 -6495615 -7603714 -7545481 -6662350 -6311522
6492 -6311522 -6731132 -6913913 -6650845 -7131802 -8891194 -10409075 -9730355 -6791805 -3374268
6483 -3374268 -1308104 -1369376 -3258112 -5694843 -6866048 -5745326 -3070585 -519998 960095
$$ packed form
6543a117589n94524j276698o26652K399850N855339N934233K045841k213889l935928
6534F469983l851552l418250k095381N01116K298160J261770j323280k519605
6526b677039j672617m54465J46614M80252L76462p91062k042475j266014J433727
6517f466617K945162J049905k357528l530804j472816J379594K705742K751714
6509b995648K803010K765815J591462n40241k004912j918160j275118j251910
6501b825702j446586r02870o8431j90156j061870j108099N8233Q83131L50828
6492f311522m19610j82781K63068m80957j759392j517881O78720K938550L417537
6483c374268K066164o1272j888736k436731j171205J120722K674741K550587J480093
$$ plain form
6474 960095 1542766 1535920 801025 -734498 -2575219 -3970366 -4506222 -4252864 -3452420 -2146305
6464 -2146305 -179760 2252461 4161301 4377853 2848906 869591 -280968 -409711 325174
6455 325174 2475850 6500936 11030016 13198794 11412242 7223222 3789061 2626590
6447 2626590 2426981 1112219 -1465473 -3393186 -3280087 -2385023 -3424151 -7176654 -11067449
6438 -11067449 -11827323 -9225213 -6283771 -5672341 -6723466 -6659636 -4347942 -1863884 -1938080
6429 -1938080 -4454817 -6403218 -5468529 -2818303 -1509900 -2564100 -3886074 -3457784 -2452471
6420 -2452471 -3988935 -9030580 -14601700 -16496380 -13349417 -7769160 -3699811 -2884804
6412 -2884804 -3807107 -3860933 -2295734 -763589 -1053060 -2843353 -4112772 -3481094 -1612158
$$ packed form
6474I60095N82671o846p34895j535523j840721j395147n35856K53358Q00444J306115
6464b146305J966545K432221J908840K16552j528947j979315j150559j28743P34885
6455C25174K150676M025086M529080K168778j786552m189020l434161j162471
6447B626590j99609j314762k577692j927713J13099Q95064j039128l752503l890795
6438a1067449p59874K602110K941442O11430j051125O3830K311694K484058p4196
6429a938080k516737j948401R34689K650226J308403j054200j321974M28290J005313
6420b452471j536464n041645n571120j894680L146963N580257M069349Q15007
6412b884804r22303n3826J565199J532145k89471j790293j269419O31678J868936
$$ plain form
6403 -1612158 -304706 -648110 -2256695 -4011766 -5156636 -5548037 -5129415 -3718128 -1561911
6394 -1561911 392764 1395552 1753287 2016680 1568144 -720447 -4156231 -5984608 -4527319
6385 -4527319 -1630828 -652129 -2401667 -4403796 -4224665 -2379541 -1453992 -2949034 -5524586
6376 -5524586 -6395267 -4447245 -1740667 -1298924 -3393934 -5116499 -4148745 -1650535 -253770
6367 -253770 -452478 -809971 -861476 -1386127 -1949470 -867837 1623923 2680984 904488
6358 904488 -864328 1018270 5849496 9157052 8157419 4576359 1686336 324632 -1065503
6349 -1065503 -3435993 -5621559 -6010135 -4861856 -4144705 -5041528 -6383625 -6128619 -3815540
6340 -3815540 -618688 2595565 5814270 8437891 9058982 7524276 5770465 5376914 5404983
$$ packed form
6403a612158J307452l43404j608585j755071j144870l91401M18622J411287K156217
6394a561911J954675J002788L57735K63393m48536k288591l435784j828377J457289
6385d527319K896491R78699j749538k002129J79131J845124R25549j495042k575552
6376e524586q70681J948022K706578M41743k095010j722565R67754K498210J396765
6367b53770j98708l57493n1505n24651n63343J081633K491760J057061j776496
6358I04488j768816J882598M831226L307556r99633l581060k890023j361704j390135
6349a065503k370490k185566l88576J148279P17151q96823j342097K55006K313079
6340c815540L196852L214253L218705K623621O21091j534706j753811l93551K8069
$$ plain form
6331 5404983 4089962 1778944 478956 916090 1720976 1450018 -89883 -2548735 -5551956
6322 -5551956 -8231639 -9512147 -9154316 -7481469 -4244000 618716 5092697 6241138
6314 6241138 4122379 2394511 3521082 5344359 4498491 1496513 -435636 -551102 -1163698
6305 -1163698 -3037908 -3814365 -2228335 -628210 -1125825 -1891184 -181993 2828913 3720126
6296 3720126 2383714 2185654 4409516 6136623 4813339 1830833 -220537 -1241766
6288 -1241766 -2263871 -2483848 -546044 2274365 2952124 518656 -3194098 -6347361 -8458634
6279 -8458634 -9079323 -7478135 -4232889 -1315197 91653 468931 323277 -672873 -2283735
6270 -2283735 -3049915 -2019880 -67143 1323931 1708651 1555655 1390841 1591315 2226163
$$ packed form
6331E404983j315021k311018j299988M37134Q04886k70958j539901k458852l003221
6322e551956k679683j280508L57831J672847L237469M862716M473981J148441
6314F241138k118759j727868J126571J823277q45868l001978j932149j15466o12596
6305a163698j874210p76457J586030J600125m97615p65359J709191L010906Q91213
6296C720126j336412j98060K223862J727107j323284k982506k051370j021229
6288a241766j022105k19977J937804K820409O77759k433468l712754l153263k111273
6279h458634o20689J601188L245246K917692J406850L77278j45654r96150j610862
6270b283735p66180J030035J952737J391074L84720j52996j64814K00474O34848
$$ plain form
6261 2226163 2809739 3047856 3744784 5678156 7693148 7728432 5905640 4427920 3860676
6252 3860676 2062839 -1897722 -5333314 -5584970 -4045774 -3876047 -5040877 -4545565 -1134054
6243 -1134054 2970741 5229664 5500799 5034678 4383767 3109111 834631 -1803584 -3207305
6234 -3207305 -2412045 -822725 -1000892 -3044573 -4071396 -2735095 -2032037 -4981469 -9283108
6225 -9283108 -9937457 -6603432 -4474175 -7227677 -12528612 -15878221 -16116061 -15270924 -14989912
6216 -14989912 -15124167 -14814067 -13533327 -11599876 -10194373 -10028157 -9954590 -8381318 -6115309
6207 -6115309 -5721338 -7529423 -8634041 -7046208 -4668549 -4490421 -6624453 -9009486 -10586626
6198 -10586626 -11697641 -12335090 -12105390 -11475779 -11342247 -11689472 -12071692 -12865390 -14450034
$$ packed form
6261B226163N83576K38117O96928J933372K014992L5284j822792j477720n67244
6252C860676j797837l960561l435592k51656J539196J69727j164830M95312L411511
6243a134054M104795K258923K71135m66121o50911j274656k274480k638215j403721
6234c207305P95260J589320j78167k043681j026823J336301P03058k949432m301639
6225i283108o54349L334025K129257k753502n300935l349609k37840Q45137K81012
6216a4989912j34255L10100J280740J933451J405503J66216P3567J573272K266009
6207f115309L93971j808085j104618J587833K377659J78128k134032k385033j577140
6198a0586626j111015o37449K29700O29611J33532l47225l82220p93698j584644
$$ plain form
6189 -14450034 -15574648 -14380421 -11170501 -8571619 -8471264 -9968814 -10873426 -10212704 -8485238
6180 -8485238 -6122462 -2887367 924390 3540882 3077099 6254 -2750247 -2963495 -1594686
6171 -1594686 -1230482 -2827742 -5343306 -7777421 -9577623 -9417494 -6136467 -1365734 1202326
6162 1202326 173502 -1960411 -2586107 -2093746 -1843911 -1345065 322247 1966947 1719032
6153 1719032 67684 -875984 -671854 -1072817 -3507171 -7718442 -12589923 -16672252 -18102264
6144 -18102264 -15640148 -10058130 -3685785 1183287 2924808 811034 -3971647 -8324992
6136 -8324992 -9840504 -9071134 -8185317 -8180432 -8664841 -9360134 -10124651 -10219989 -9223297 -8030290
6126 -8030290 -7413317 -6461998 -4251680 -2138761 -2209018 -4039252 -5269625 -5089859 -4991788
$$ packed form
6189a4450034j124614J194227L209920K598882J00355j497550r04612O60722J727466
6180h485238K362776L235095L811757K616492m63783l070845k756501k13248J368809
6171a594686L64204j597260k515564k434115j800202J60129L281027M770733K568060
6162A202326j028824k133913o25696M92361K49835M98846J667312J644700k47915
6153A719032j651348r43668K04130m00963k434354m211271m871481m082329j430012
6144a8102264K462116N582018O372345M869072J741521k113774m782681m353345
6136h324992j515512P69370Q85817M885m84409o95293p64517r5338R96692J193007
6126h030290O16973R51319K210318K112919p0257j830234j230373J79766R8071
$$ plain form
6117 -4991788 -6239682 -8638123 -11586635 -14253397 -14878568 -12100098 -7057936 -2361087
6109 -2361087 770378 2496529 2358992 22005 -2454951 -2251072 114643 1255902 -287584
6100 -287584 -2832151 -5395106 -9050642 -13353226 -15152178 -13052845 -10080676 -9586568 -10837971
6091 -10837971 -10846327 -8524229 -4990214 -1646346 115361 -871832 -3783083 -6015773 -6686365
6082 -6686365 -7704065 -9795639 -10446325 -8355707 -6939923 -9698424 -14275869 -15362592
6074 -15362592 -12277140 -9387222 -9442666 -10662038 -10705392 -9623557 -7910096 -5019002 -1257584
6065 -1257584 1485079 2336707 2667808 3515870 3755143 2099568 -781866 -3396092 -5179019
6056 -5179019 -5953157 -5092654 -2628919 -130752 900798 888323 1339319 2621124 3501864
$$ packed form
6117d991788j247894k398441k948512k666762o25171K778470N042162M696849
6109b361087L131465J726151j37537k336987k476956K03879K365715J141259j543486
6100b87584k544567k562955l655536m302584j798952K099333K972169M94108j251403
6091a0837971q356K322098L534015L343868J761707r87193k911251k232690o70592
6082f686365j017700k091574o50686K090618J415784k758501m577445j086723
6074a5362592L085452K889918n5444j219372m3354J081835J713461K891094L761418
6065a257584K742663Q51628L31101Q48062K39273j655575k881434k614226j782927
6056e179019p74138Q60503K463735K498167J031550j2475M50996J281805Q80740
$$ plain form
6047 3501864 2709434 396435 -1820456 -2197019 -657599 801439 164253 -2233203 -4225658
6038 -4225658 -4598843 -4216359 -4287114 -4828005 -5319909 -5705146 -6010695 -5856056 -5009129 -3722179
6028 -3722179 -2014401 535617 3663478 5961097 6433785 5898312 5859607 6355966 5946085
6019 5946085 3860174 1258327 -126617 -171323 -547445 -2568755 -5325223 -6597314 -5560337
6010 -5560337 -3708218 -2700729 -2241731 -1023161 979101 2563440 3399583 4472181 6069583
6001 6069583 6759053 5272190 2524675 708694 678880 1044466 -109699 -3007786 -5743159
5992 -5743159 -5973942 -3232918 336442 1701727 -471125 -4835248 -8596629 -9520505 -7267390
5983 -7267390 -3507927 -649049 181265 -17686 406493 1677697 2527664 1959173 279002
$$ packed form
6047C501864p92430k312999k216891l76563J539420J459038o37186k397456j992455
6038d225658l73185L82484p0755n40891m91904l85237l05549J54639Q46927J286950
6028c722179J707778K550018L127861K297619M72688n35473l8705M96359m09881
6019E946085k085911k601847j384944m4706l76122k021310k756468j272091J036977
6010e560337J852119J007489M58998J218570K002262J584339Q36143J072598J597402
6001F069583O89470j486863k747515j815981k9814L65586j154165k898087k735373
5992e743159k30783K741024L569360J365285k172852m364123l761381r23876K253115
5983g267390L759463K858878Q30314j98951M24179J271204Q49967n68491j680171
$$ plain form
5974 279002 -1627809 -3248062 -4379444 -4676020 -3698947 -1464214 938645 1387368 -1722761
5965 -1722761 -7287158 -11652122 -12183289 -10256058 -9310662 -10217264 -10488873 -8543109 -6618659
5956 -6618659 -7739320 -10946390 -11789205 -7729260 -1345167 2654796 2466931 102899 -1960388
5947 -1960388 -3274641 -4270082 -4330979 -2443173 985490 4402683 6857572 8088264 7342918
5938 7342918 4171687 531560 -274381 2223294 4546313 3603196 204684 -3247706 -6360466
5929 -6360466 -9630341 -11596906 -10396040 -7366439 -5791857 -6045318 -5076663 -1310512 2715007
5920 2715007 3639532 1013134 -3294160 -7442163 -10197384 -10820696 -9749602 -8476319 -7992036
5911 -7992036 -8197349 -8974432 -10347088 -11245719 -9890508 -6224822 -2549633 -953436 -1262377
$$ packed form
5974B79002j906811j620253j131382k96576R77073K234733K402859M48723l110129
5965a722761n564397m364964n31167J927231R45396r06602k71609J945764J924450
5956f618659j120661l207070q42815M059945O384093L999963j87865k364032k063287
5947a960388j314253r95441o0897J887806L428663L417193K454889J230692p45346
5938G342918l171231l640127q05941K497675K323019r43117l398512l452390l112760
5929f360466l269875j966565J200866L029601J574582k53461R68655L766151M025519
5920B715007R24525k626398m307294m148003k755221o23312J071094J273283M84283
5911g992036k05313p77083j372656q98631J355211L665686L675189J596197l08941
$$ plain form
5902 -1262377 -1934466 -1602218 515484 3933643 6155122 4592715 43168 -3638099 -4165384
5893 -4165384 -3134537 -2793846 -2862559 -2168613 -1352972 -1813039 -3341681 -4805393 -6167638
5884 -6167638 -8097630 -10345534 -11910172 -12118326 -10643923 -7589789 -4338601 -2727215
5876 -2727215 -2401382 -878267 2581319 5370934 5317033 3545188 1559236 -1645867 -6421948
5867 -6421948 -9001808 -5527738 1655189 6053757 5128730 2461710 1765887 2643732 3065218
5858 3065218 2495121 1200172 -718091 -2272574 -2016591 -679223 -959500 -3434114 -5093219
5849 -5093219 -3592326 -841492 -414435 -2990286 -6372451 -8874938 -10612032 -11929328
5841 -11929328 -12428846 -11813695 -10630854 -9715683 -9168034 -8127276 -5839267 -2991196 -1235809
$$ packed form
5902a262377o72089L32248K117702L418159K221479j562407m549547l681267n27285
5893d165384J030847L40691o8713O93946Q15641m60067j528642j463712j362245
5884f167638j929992k247904j564638k08154J474403L054134L251188J611386
5876b727215L25833J523115L459586K789615n3901j771845j985952l205103m776081
5867f421948k579860L474070P182927M398568r25027k667020o95823Q77845M21486
5858C065218n70097j294949j918263j554483K55983J337368k80277k474614j659105
5849e093219J500893K750834M27057k575851l382165k502487j737094j317296
5841a1929328m99518O15151J182841R15171N47649J040758K288009K848071J755387
$$ plain form
5832 -1235809 -893961 -238412 1816756 3568547 2942527 1004699 466578 1184566 241701
5823 241701 -3133010 -5844918 -5282148 -2702130 -781772 -168856 -276986 -1437470 -4056400
5814 -4056400 -6981824 -8698832 -9184216 -9032147 -7977943 -6069958 -5120982 -6774689 -9641726
5805 -9641726 -10391060 -7667302 -3439739 -571693 -372701 -2386016 -5170571 -7069186 -7208935
5796 -7208935 -5994851 -4101998 -1273460 3027888 7930630 11112124 10808471 7501150
5788 7501150 3455436 716030 -488304 -1410013 -2852677 -3960094 -3380967 -1160670 1399561
5779 1399561 3386004 4623649 4709205 3252828 1168878 150083 518738 983813 662126
5770 662126 -293991 -2115649 -5242334 -8234284 -8334941 -5233346 -1995471 -927807 -815440
$$ packed form
5832a235809L41848O55549K055168J751791o26020j937828n38121P17988r42865
5823B41701l374711k711908N62770K580018J920358O12916j08130j160484k618930
5814d056400k925424j717008m85384J52069J054204J907985R48976j653707k867037
5805i641726p49334K723758M227563K868046J98992k013315k784555j898615j39749
5796g208935J214084J892853K828538M301348M902742L181494l03653l307321
5788G501150m045714k739406j204334r21709j442664j107417N79127K220297K560231
5779A399561J986443J237645Q5556j456377k083950j018795L68655M65075l21687
5770F62126r56117j821658l126685k991950j00657L101595L237875J067664J12367
$$ plain form
5761 -815440 123204 997643 251355 -1186640 -1481239 -1100550 -1643306 -2543708 -1749571 904588
5751 904588 3453238 4453321 3808856 1733563 -950299 -2435903 -2171740 -2287844 -4099468
5742 -4099468 -4708869 -891657 4567568 5144371 -377933 -5754670 -5664544 -2008841 452487
5733 452487 851570 1172007 1253434 -985791 -5245318 -8243148 -7597183 -4039692 365984
5724 365984 4363370 7556728 9740132 10729396 10327509 8402788 5277340 1722622 -1622784
5715 -1622784 -4319227 -5709486 -5559653 -5212082 -6529478 -9164711 -10630016 -10005096 -9654454
5706 -9654454 -11697459 -14554058 -15241439 -13849486 -13009939 -13365927 -12470511 -8808656 -4503813
5697 -4503813 -2643360 -3432554 -4568218 -4639197 -4522003 -5323957 -6285582 -5729029 -3738629
$$ packed form
5761h15440R38644Q74439p46288j437995k94599L80689n42756r00402P94137K654159
5751I04588K548650J000083o44465k075293k683862j485604K64163j16104j811624
5742d099468o09401L817212N459225N76803n522304n376737R0126L655703K461328
5733D52487L99083L20437Q1427k239225m259527k997830O45965L557491M405676
5724C65984L997386L193358K183404R89264m01887j924721l125448l554718l345406
5715a622784k696443j390259J49833L47571j317396k635233j465305O24920L50642
5706i654454k043005k856599o87381J391953Q39547l55988Q95416L661855M304843
5697d503813J860453p89194j135664p0979J17194q01954r61625N56553J990400
$$ plain form
5688 -3738629 -2632310 -3988234 -6014900 -5440789 -2095781 155629 -1918979 -6650613
5680 -6650613 -9385108 -7867119 -3992916 -568838 1681646 3448881 4938298 5805473
5672 5805473 6052986 5805865 4544999 1550193 -2837027 -6990356 -9189332 -8824318 -6598753
5663 -6598753 -3964245 -2270779 -1900145 -1986809 -1325113 235864 1612776 1844487 1029488
5654 1029488 -552952 -3439366 -7854947 -11950358 -12946417 -10602312 -7985656 -7746638 -8935261
5645 -8935261 -8844365 -6791260 -4275171 -2278585 -610843 409227 -60205 -1476174 -2078410
5636 -2078410 -1452621 -1009279 -1364049 -1317152 -387692 -351244 -2797670 -6640170 -9467555
5627 -9467555 -10151697 -8907542 -6224136 -3330623 -2465341 -4739055 -8352111 -10541489 -10779820
$$ packed form
5688c738629J106319j355924k026666N74111L345008K251410k074608m731634
5680f650613k734495J517989L874203L424078K250484J767235J489417Q67175
5672E805473K47513k47121j260866k994806m387220m153329k198976L65014K225565
5663f598753K634508J693466L70634q6664O61696J560977J376912K31711q14999
5654A029488j582440k886414m415581m095411r96059K344105K616656K39018j188623
5645h935261R0896K053105K516089J996586J667742J020070m69432j415969o02236
5636b078410O25789M43342l54770M6897R29460L6448k446426l842500k827385
5627i467555o84142J244155K683406K893513Q65282k273714l613056k189378k38331
$$ plain form
5618 -10779820 -10619191 -10956483 -11049473 -10036308 -8136118 -6380232 -5854018 -6690081 -7235040
5609 -7235040 -5301680 -1162113 2055733 2248013 1127183 1435655 2943553 3523486 2783305
5600 2783305 1632123 -844206 -6422198 -13489377 -17314008 -15731651 -11751319 -9130912
5592 -9130912 -7878000 -5884495 -2921678 -804701 -683611 -1951461 -3226197 -3238969 -1460867
5583 -1460867 1129567 2533094 1739328 -401150 -2699978 -4929209 -7069460 -8572531
5575 -8572531 -9195023 -9372374 -8952683 -6898717 -3306992 -392691 -49110 -1378150 -2049087
5566 -2049087 -1398727 -854750 -1794835 -4141129 -6660937 -7753398 -6503732 -3844866 -2048573
5557 -2048573 -2221529 -3071474 -3054254 -2758157 -3828405 -6217258 -7969948 -7534180 -5265037
$$ packed form
5618a0779820J60629l37292r2990J013165J900190J755886N26214q36063n44959
5609g235040J933360M139567L217846J92280j120830L08472J507898N79933p40181
5600B783305j151182k476329n577992p067179l824631J582357L980332K620407
5592i130912J252912J993505K962817K116977J21090j267850j274736j2772J778102
5583a460867K590434J403527p93766k140478k298828k229231k140251j503071
5575h572531o22492j77351M19691K053966L591725K914301L43581j329040o70937
5566b049087O50360N43977r40085k346294k519808j092461J249666K658866J796293
5557b048573j72956q49945J7220K96097j070248k388853j752690M35768K269143
$$ plain form
5548 -5265037 -2954654 -2639954 -5163748 -8867891 -10426652 -8226326 -4367596 -2099408
5540 -2099408 -1888413 -1477239 604638 3205061 4204471 2689563 -616497 -4068532 -6215576
5531 -6215576 -6980319 -7553075 -8571993 -9148844 -8554074 -7785040 -7966644 -8078441 -6189538
5522 -6189538 -2516150 743660 2561764 4169814 6758128 9704467 11449753 10907718
5514 10907718 7970667 3875073 879857 117167 -7990 -1641104 -3985511 -3958486 -344253
5505 -344253 4672050 8203221 8939010 6820337 2847476 -522007 -1259092 -515621 -1092225
5496 -1092225 -2983225 -3547577 -2567854 -3146931 -6003757 -7145364 -4156243 -962897 -2215437
5487 -2215437 -5871544 -6366028 -3473616 -2583432 -6278096 -10719855 -11566757 -9299427 -6860361
$$ packed form
5548e265037K310383L14700k523794l704143j558761K200326L858730K268188
5540b099408K10995M11174K081877K600423R99410j514908l306060l452035k147044
5531f215576p64743n72756j018918n76851N94770P69034j81604j11797J888903
5522f189538L673388L259810J818104J608050K588314K946339J745286n42035
5514A0907718k937051m095594k995216p62690j25157j633114k344407K7025L614233
5505c44253N016303L531171P35789k118673l972861l369483p37085P43471n76604
5496a092225j891000n64352R79723n79077k856826j141607K989121L193346j252540
5487b215437l656107m94484K892412Q90184l694664m441759q46902K267330K439066
$$ plain form
5478 -6860361 -5334647 -4235502 -3790780 -4666101 -6527860 -8250937 -8699373 -6835229 -2534027
5469 -2534027 2180384 4401875 3522857 1581613 75381 -1470125 -3164364 -3620651 -2575006
5460 -2575006 -2187677 -3780254 -5421957 -5089243 -4290052 -5647499 -8301595 -9127265 -7957897
5451 -7957897 -7964630 -10331236 -11923017 -9822062 -5688692 -3548517 -4736500 -7009382 -7793590
5442 -7793590 -6457647 -3751862 -773373 1208126 1135035 -942284 -3748640 -5859610 -6751884
5433 -6751884 -6851640 -6787504 -6510175 -5062934 -1667560 2649971 5205449 4314957 1461179
5424 1461179 -260252 229809 1124524 646675 -668994 -1436169 -1785334 -2742195 -3957658
5415 -3957658 -3785546 -1589141 1429269 3770228 4686004 3659265 513377 -3403555 -5745083
$$ packed form
5478f860361J525714J099145M44722q75321j861759j723077m48436J864144M301202
5469b534027M714411K221491q79018j941244j506232j545506j694239m56287J045645
5460b575006L87329j592577j641703L32714P99191j357447k654096q25670J169368
5451g957897o733k366606j591781K100955M133370K140175j187983k272882p84208
5442g793590J335943K705785K978489J981499p3091k077319k806356k110970q92274
5433f751884r9756O4136K77329J447241L395374M317531K555478q90492k853778
5424A461179j721431M90061Q94715m77849j315669p67175l49165r56861j215463
5415c957658J72112K196405L018410K340959R15776j026739l145888l916932k341528
$$ plain form
5406 -5745083 -5855723 -5635542 -6612791 -7380942 -5435028 -761400 3941449 6230244 5847312
5397 5847312 4144922 2920951 3471586 5363073 6224744 4028164 -471092 -4677926 -7265525
5388 -7265525 -8935763 -10255748 -10539675 -9409499 -8016806 -7829379 -8948475 -10098287 -9649634
5379 -9649634 -6573829 -1368584 3671910 6019809 5157691 2745345 664932 -282565 -39754
5370 -39754 1007905 1878365 1744280 994797 470736 -204578 -2046232 -4520585 -5814026
5361 -5814026 -5654195 -5901998 -7529001 -8858462 -8047087 -5877417 -4719950 -5671367 -7822365
5352 -7822365 -9577139 -9824746 -8495173 -6550068 -4786950 -2639916 641415 3770495
5344 3770495 4306141 2058244 -506412 -1797662 -2669537 -3672735 -3547224 -1968485 -1058716
$$ packed form
5406e745083j10640K20181r77249p68151J945914M673628M702849K288795l82932
5397E847312j702390j223971N50635J891487Q61671k196580m499256m206834k587599
5388g265525j670238j319985k83927J130176J392693J87427j119096j149812M48653
5379i649634L075805N205245N040494K347899q62118k412346k080413r47497K42811
5370c9754J047659Q70460j34085p49483n24061o75314j841654k474353j293441
5361e814026J59831k47803j627003j329461Q11375K169670J157467r51417k150998
5352g822365j754774k47607J329573J945105J763118K147034L281331L129080
5344C770495N35646k247897k564656j291250q71875j003198J25511J578739R09769
$$ plain form
5335 -1058716 -2080944 -3113468 -2430686 -1819093 -3574532 -6165843 -6243838 -3695345 -1453443
5326 -1453443 -1145706 -1934677 -2914903 -3744079 -3589500 -2244452 -1465716 -2418540 -3065064
5317 -3065064 -1484005 -352656 -3596325 -9206981 -10621891 -5948467 -765498 -62039
5309 -62039 -2042519 -2473585 -1133167 -592708 -1485042 -2461120 -3080460 -3748864 -3920503 -2775558
5299 -2775558 -873349 644280 1650738 2531129 3125614 3202136 2794632 1473943 -966542
5290 -966542 -2629727 -935896 2959125 4106229 39511 -5618603 -8202188 -8059141 -8585116
5281 -8585116 -10390420 -11096450 -9867157 -8572323 -8491319 -8645912 -7759467 -5942367 -4115047
5272 -4115047 -2882541 -1899634 37460 3240504 5325348 3473295 -722210 -1906272
$$ packed form
5335a058716j022228j032524O82782O11593j755439k591311p7995K548493K241902
5326a453443L07737p88971r80226q29176J54579J345048P78736r52824o46524
5317c065064J581059J131349l243669n610656j414910M673424N182969P03459
5309f2039j980480m31066J340418N40459q92334r76078o19340o68404j71639J144945
5299b775558J902209J517629J006458Q80391N94485P6522m07504j320689k440485
5290i66542j663185J693831L895021J147104m066718n658114k583585J43047n25975
5281h585116j805304p06030J229293J294834Q1004j54593Q86445J817100J827320
5272d115047J232506R82907J937094L203044K084844j852053m195505j184062
$$ plain form
5264 -1906272 1587500 4460456 1835244 -3366438 -4811598 -1929376 557086 602596 437154
5255 437154 682699 -875337 -3646380 -3278201 1387906 5411056 4694996 1630225 557849
5246 557849 1248192 684017 -1419876 -2962676 -3676073 -5183003 -7589626 -9207097 -9382468
5237 -9382468 -9099432 -9043441 -9163323 -9682990 -10484627 -9985548 -6804723 -2290618 670100
5228 670100 1199372 789917 357918 -659927 -1960175 -1685880 668377 2606875 1591367
5219 1591367 -1561806 -4019512 -4936954 -6127086 -8713096 -11109385 -11288571 -9618536 -7979620
5210 -7979620 -6941911 -5652833 -4224412 -4031290 -5047659 -5006993 -2602880 155244 599586
5201 599586 -901545 -2066792 -2525680 -3894450 -6355292 -7916530 -7487841 -6246162 -5247533
$$ packed form
5264a906272L493772K872956k625212n201682j445160K882222K486462M5510j65442
5255D37154K45545j558036k771043L68179M666107M023150p16060l064771j072376
5246E57849O90343n64175k103893j542800p13397j506930k406623j617471j75371
5237i382468K83036N5991j19882n19667q01637M99079L180825M514105K960718
5228F70100N29272m09455m31999j017845j300248K74295K354257J938498j015508
5219A591367l153173k457706r17442j190132k586010k396289j79186J670035J638916
5210g979620J037709J289078J428421J93122j016369M0666K404113K758124M44342
5201E99586j501131j165247m58888j368770k460842j561238M28689J241679R98629
$$ plain form
5192 -5247533 -3987177 -2306425 -1511028 -2193378 -2779119 -1800841 -154562 416914 -184824
5183 -184824 -894401 -1277122 -1414517 -1136185 -804049 -1660508 -3747042 -4625107 -2161783
5174 -2161783 2143871 4572358 3445404 211014 -3095462 -5320258 -5431853 -2791418
5166 -2791418 1222093 3768610 3536909 1803547 1165 -2190399 -5449592 -8863097
5158 -8863097 -10588858 -9823681 -7350035 -4764314 -3690411 -4808506 -6783548 -6949197 -4168055
5149 -4168055 -579413 552296 -1514059 -4485528 -5969511 -5727423 -4843978 -3921293 -2884127
5140 -2884127 -1783019 -805250 186760 1272100 1846326 1345038 602610 1368788 3936449
5131 3936449 6101697 5322364 1541505 -2760315 -4948412 -4042995 -666962 3660781 6998925
$$ packed form
5192e247533J260356J680752P95397o82350n85741R78278J646279N71476o01738
5183a84824p09577l82721j37395K78332L32136q56459k086534q78065K463324
5174b161783M305654K428487j126954l234390l306476k224796j11595K640435
5166b791418M013511K546517k31701j733362j802382k191564l259193l413505
5158h863097j725761P65177K473646K585721J073903j118095j975042j65649K781142
5149d168055L588642J131709k066355k971469j483983K42088Q83445R22685J037166
5140b884127J101108R77769R92010J085340N74226n01288p42428P66178K567661
5131C936449K165248p79333l780859m301820k188097R05417L376033M327743L338144
$$ plain form
5122 6998925 7643067 5026119 75111 -5283309 -9057973 -10278564 -9771637 -9592645 -11050541
5113 -11050541 -13343468 -14552611 -13772460 -11802120 -9990845 -8941990 -8197660 -6789066
5105 -6789066 -4330203 -1870018 -1210932 -2987100 -5878456 -7947470 -7986648 -5457303 -646319
5096 -646319 4341984 6483735 5192713 3359080 3448929 4131087 2785601 -309866 -2978890
5087 -2978890 -4879099 -6987483 -8454829 -7765103 -6423374 -7204173 -8737898 -6686074 -1322639
5078 -1322639 1081220 -3326534 -10695688 -15441489 -17145638 -17765068 -15991098 -9591227
5070 -9591227 -1078872 4161847 4479122 2392944 -513656 -4516831 -8042753 -7980962 -4503580
5061 -4503580 -1457631 -884694 -873931 -77535 -537988 -3963546 -8373810 -10940272 -11698606
$$ packed form
5122F998925O44142k616948m951008n358420l774664j220591N06927J78992j457896
5113a1050541k292927j209143P80151J970340J811275J048855P44330J408594
5105f789066K458863K460185O59086j776168k891356k069014l9178K529345M810984
5096f46319M988303K141751j291022j833633Q9849O82158j345486l095467k669024
5087b978890j900209k108384j467346O89726J341729p80799j533725K051824N363435
5078a322639K403859m407754p369154m745801j704149o19430J773970O399871
5070i591227Q512355N240719L17275k086178k906600m003175l525922O1791L477382
5061d503580L045949N72937J0763P96396m60453l425558m410264k566462p58334
$$ plain form
5052 -11698606 -11869877 -10610539 -6527466 -1283112 1437215 536073 -1276723 -1136490 1039672
5043 1039672 3624024 5292120 4972809 1543333 -4461009 -9445618 -9255241 -3802069 2153325
5034 2153325 3827706 1119523 -2391176 -3917956 -3279923 -1162859 1915917 4650174
5026 4650174 5220695 3488113 1379343 425631 494609 1454383 3960395 7519066 9889831
5017 9889831 9931461 9184331 9057512 8461131 6206511 3714595 2739176 2099097 -194534
5008 -194534 -2659954 -1707641 2829348 6776048 6890480 4469668 2749420 2794200 3191528
4999 3191528 2461301 567461 -1400258 -2364210 -2198475 -1568627 -863801 64353 946623
4990 946623 1035860 521661 657275 1749648 2581321 2703669 3353615 4789884 4900448 2329688
$$ packed form
5052a1698606j71271J259338M083073N244354K720327r01142j812796J40233K176162
5043A039672K584352J668096l19311l429476o004342m984609J90377N453172N955394
5034B153325J674381k708183l510699j526780O38033K117064L078776K734257
5026D650174N70521j732582k108770r53712O8978R59774K506012L558671K370765
5017I889831M1630p47130j26819n96381k254620k491916r75419o40079k293631
5008a94534k465420R52313M536989L946700J14432k420812j720248M4780L97328
4999C191528p30227j893840j967719r63952J65735O29848P04826R28154Q82270
4990I46623Q9237n14199J35614J092373Q31673J22348O49946J436269J10564k570760
$$ plain form
4980 2329688 -1105341 -3320735 -5167602 -8085400 -10605182 -10453790 -8624450 -7903164 -8417161
4971 -8417161 -8096630 -6788273 -6460329 -7707887 -9160150 -9949595 -9923587 -8199446 -4618761
4962 -4618761 -1734141 -1903825 -3210225 -1936314 1607949 3657744 2842968 1326116 435291
4953 435291 -480803 -907061 547690 2346283 1066598 -3032743 -5889103 -5883846 -5705027
4944 -5705027 -6891117 -7216510 -5368024 -4026677 -5933557 -9988201 -13062421 -13119724 -9693901
4935 -9693901 -4190262 -90096 432719 43489 2557293 6258454 6000947 1859281 -476861
4926 -476861 1075061 1859517 -1364551 -5422407 -6751841 -6644264 -7188813 -7376615 -6800951
4917 -6800951 -8193630 -12431329 -15460740 -13896732 -9692196 -6100489 -3235381 -730762
$$ packed form
4980B329688l435029k215394j846867k917798k519782J51392J829340P21286n13997
4971h417161L20531J308357L27944j247558j452263p89445K6008J724141L580685
4962d618761K884620j69684j306400J273911L544263K049795q14776j516852q90825
4953D35291r16094m26258J454751J798593j279685m099341k856360N257J78819
4944e705027j186090l25393J848486J341347j906880m054644l074220n7303L425823
4935i693901N503639M100166N22815l89230K513804L701161k57507m141666k336142
4926d76861J551922P84456l224068m057856j329434J07577n44549j87802N75664
4917f800951j392679m237699l029411J564008M204536L591707K865108K504619
$$ plain form
4909 -730762 -425613 -3105178 -6440211 -8693404 -10374587 -10630716 -7406690 -2910341 -2438309
4900 -2438309 -5488706 -5200237 539303 5175369 4054477 669253 -1558103 -4871338
4892 -4871338 -9901160 -11991608 -9989448 -9235558 -10790047 -8614531 -2894266 -2979426 -10003078
4883 -10003078 -11789757 -4429053 -1647483 -10246436 -15689564 -9041573 -6753838 -20802600
4875 -20802600 -33458015 -36029493 -69528786 -174085222 -303366058 -349022687 -268390915
4868 -268390915 -139376529 -62073980 -48596227 -45286250 -25664012 -10259277 -12077971
4861 -12077971 -14688553 -7053757 -840652 -4286153 -7850618 -5066514 -4357524 -10934677
4853 -10934677 -16187785 -13930771 -10915543 -12826569 -14014256 -9336673 -3926809 -3207970
$$ packed form
4909g30762L05149k679565l335033k253193j681183k56129L224026M496349M72032
4900b438309l050397K88469N739540M636066j120892l385224k227356l313235
4892d871338n029822k090448K002160P53890j554489K175516N720265q5160p023652
4883a0003078j786679P360704K781570q598953n443128O647991K287735j4048762
4875b0802600j2655415k571478l3499293j04556436j29280836m5656629Q0631772
4868b68390915J29014386P7302549J3477753L309977J9622238J5404735j818694
4861a2077971k610582P634796O213105l445501l564465K784104P08990o577153
4853a0934677n253108K257014L015228j911026j187687M677583N409864P18839
$$ plain form
4845 -3207970 -3601705 -566624 3027741 3232472 2038211 2325868 2649249 1754292 1693200
4836 1693200 2486112 387038 -4937532 -8299938 -7379332 -6160370 -6732139 -5295139 -366126
4827 -366126 2706986 435596 -2545446 -1352037 1236952 472851 -2262954 -3014545 -2317636
4818 -2317636 -2861730 -3844245 -3112521 -1747202 -1542442 -909368 1974878 4755667 4318892
4809 4318892 2132235 1605001 2249775 982841 -2334719 -4851972 -5157861 -4148776 -2337109
4800 -2337109 524920 3695276 5840513 6767704 7182274 7613855 8574920 10166358 10676196
4791 10676196 7884186 2835231 -399807 -40516 1324426 1439514 1575854 2755749 2458923
4782 2458923 -1543473 -6799929 -9109619 -7890552 -5608667 -3795485 -2689468 -3062449
$$ packed form
4845c207970l93735L035081L594365K04731j194261K87657L23381q94957o1092
4836A693200P92912k099074n324570l362406R20606J218962n71769J437000M929013
4827c66126L073112k271390k981042J193409K588989p64101k735805p51591O96909
4818b317636n44094r82515P31724J365319K04760O33074K884246K780789m36775
4809D318892k186657n27234O44774j266934l317560k517253l05889J009085J811667
4800b337109K862029L170356K145237R27191M14570M31581R61065J591438N09838
4791A0676196k792010n048955l235038L59291J364942J15088J36340J179895k96826
4782B458923m002396n256456k309690J219067K281885J813182J106017l72981
$$ plain form
4774 -3062449 -5137151 -6832572 -5974904 -3436754 -1785138 -1840889 -2688919 -3849534 -5156701
4765 -5156701 -5524176 -4054980 -1680927 3582 714808 955284 693361 -126629 -1033967
4756 -1033967 -2101271 -3998716 -5990090 -5951690 -3714359 -2131884 -3136028 -4907817 -4832985
4747 -4832985 -3152826 -1672327 -856464 -335965 -517605 -1685142 -3095675 -4485793 -6459041
4738 -6459041 -8064521 -6835347 -3147900 -1361506 -3935644 -7457735 -7731867 -5886527
4730 -5886527 -5535601 -6398560 -5340202 -2181530 210622 902673 1554917 2304567 1220577
4721 1220577 -1618282 -3210088 -1886779 276213 355778 -2125659 -5466208 -7654368 -7525824
4712 -7525824 -5409986 -2891116 -1153822 -21793 745294 566263 -426101 -732180 -37840
$$ packed form
4774c062449k074702j695421Q57668K538150J651616n5751q48030j160615j307167
4765e156701l67475J469196K374053J684509P11226K40476k61923q19990r07338
4756a033967j067304j897445j991374L8400K237331J582475j004144j771789P4832
4747d832985J680159J480499Q15863N20499j81640j167537j410533j390118j973248
4738f459041j605480J229174L687447J786394k574138l522091k74132J845340
4730e886527L50926q62959J058358L158672K392152O92051O52244P49650j083990
4721A220577k838859j591806J323309K162992P9565k481437l340549k188160J28544
4712g525824K115838K518870J737294J132029P67087j79031r92364l06079O94340
$$ plain form
4703 -37840 -545665 -3643525 -7112970 -8162821 -7468869 -7398789 -7981329 -7890255 -7853829 -9295310
4693 -9295310 -10598701 -8740510 -4299820 -1050613 -594032 -1039116 -1135380 -1879321 -3287141
4684 -3287141 -3243760 -1025146 913808 266818 -2119700 -3863349 -3973609 -3175977 -2680418
4675 -2680418 -3218568 -4164468 -3643175 -904939 1801184 1547439 -1457055 -4422256 -5962273
4666 -5962273 -7122398 -8523215 -9061819 -7920953 -5731285 -3260746 -805093 779040
4658 779040 223111 -2488542 -5788156 -7825901 -7272296 -3937528 -101416 316901 -3738451
4649 -3738451 -8180469 -8762205 -6906463 -7115760 -9728503 -10481256 -7069852 -1927092 1966047
4640 1966047 4068502 4372841 2452308 -356276 -1316085 -192838 306523 -939003 -1853132
$$ packed form
4703c7840n07825l097860l469445j049851O93952P0080n82540R1074L6426j441481
4693i295310j303391J858191M440690L249207M56581m45084r6264p43941j407820
4684c287141M3381K218614J938954o46990k386518j743649j10260P97632M95559
4675b680418n38150r45900N21293K738236K706123k53745l004494k965201j540017
4666e962273j160125j400817n38604J140866K189668K470539K455653J584133
4658G79040n55929k711653l299614k037745N53605L334768L836112M18317m055352
4649c738451m442018n81736J855742k09297k612743p52753L411404N142760L893139
4640A966047K102455L04339j920533k808584r59809J123247M99361j245526r14129
$$ plain form
4631 -1853132 -1366750 -1706562 -4534458 -7825389 -8798198 -7610648 -6207961 -5513416 -5350587
4622 -5350587 -5287333 -4388627 -2095140 -98820 -937826 -4057089 -6122160 -6009405 -6104752
4613 -6104752 -7478620 -7610775 -4971242 -2235884 -2205873 -3564851 -3652453 -2931113 -3687119
4604 -3687119 -6249165 -9119120 -11049221 -10837741 -7341120 -2056325 771230 -667186
4596 -667186 -2842176 -2061094 34364 -273074 -2344362 -2484904 -472836 -122963 -3134193
4587 -3134193 -6229270 -5427423 -605259 4958958 7735746 6311126 2227139 -1269046
4579 -1269046 -2307232 -1923956 -1892765 -2353063 -2781171 -3605222 -5006383 -5710486 -5150642
4570 -5150642 -5326514 -7987010 -11199310 -11437693 -8228991 -4183301 -1332038 -137438 -1203638
$$ packed form
4631a853132M86382l39812k827896l290931r72809J187550J402687O94545J62829
4622e350587O3254Q98706K293487J996320q39006l119263k065071J12755r5347
4613f104752j373868j32155K639533K735358L0011j358978q7602P21340p56006
4604c687119k562046k869955j930101K11480L496621N284795K827555j438416
4596f67186k174990P81082K095458l07438k071288j40542K012068L49873l011230
4587c134193l095077Q01847M822164N564217K776788j424620m083987l496185
4579a269046j038186L83276L1191m60298m28108q24051j401161p04103N59844
4570e150642j75872k660496l212300k38383L208702M045690K851263J194600j066200
$$ plain form
4561 -1203638 -4709235 -8292593 -8568444 -5221874 -1315958 665858 968184 788908 673273
4552 673273 983875 1953501 2835561 2482437 803979 -1610208 -4684391 -7982512 -9559531
4543 -9559531 -8072669 -5503147 -5142871 -7015755 -7960733 -6385448 -4172509 -3282490 -3115785
4534 -3115785 -2341939 -1130089 -162551 939690 2767500 4707230 5568127 5139678 4400621
4525 4400621 4380964 5035027 5207022 4117030 2956259 3847279 6621941 8241158 6751000
4516 6751000 4167158 3448564 4110682 3497406 1404690 318011 1225753 2251512 2012306
4507 2012306 1732210 2973462 5151081 6426156 5994934 4822140 4671532 6342344 8376605
4498 8376605 8335531 6126907 4590580 5396853 6220633 4199603 385843 -2152363 -3057164
$$ packed form
4561a203638l505597l583358k75851L346570L905916J981816L02326j79276j15635
4552F73273L10602R69626Q82060l53124j678458k414187l074183l298121j577019
4543i559531J486862K569522L60276j872884r44978J575285K212939Q90019J66705
4534c115785P73846J211850R67538J102241J827810J939730Q60897m28449p39057
4525D400621j9657O54063J71995j089992j160771Q91020K774662J619217j490158
4516F751000k583842p18594O62118o13276k092716j086679R07742J025759k39206
4507B012306k80096J241252K177619J275075m31222j172794j50608J670812K034261
4498H376605m1074k208624j536327Q06273Q23780k021030l813760k538206r04801
$$ plain form
4489 -3057164 -3953040 -4247567 -1977513 1450414 1863759 -1607230 -5045346 -5422430 -4158857
4480 -4158857 -3784815 -4494166 -5487642 -6544119 -6706894 -4497623 -1091791 -215907 -2982065
4471 -2982065 -5744408 -5203871 -2852518 -1925108 -2469058 -2252249 -688348 926554 1858018
4462 1858018 2280365 2124046 1379767 589109 -299149 -2231717 -5006182 -6670330 -6405741
4453 -6405741 -6112196 -7380756 -8769368 -8133032 -5994433 -4373012 -3622747 -2668209 -1321039
4444 -1321039 -266371 395525 745653 63163 -1984620 -3955485 -4050990 -2264090 57051
4435 57051 1786614 2142909 721664 -1291695 -1578785 144072 1196998 -74056 -1356645
4426 -1356645 232289 3522190 4881406 3377041 1572965 1709526 3489422 5309195
$$ packed form
4489c057164q95876k94527K270054L427927M13345l470989l438116l77084J263573
4480d158857L74042p09351r93476j056477j62775K209271L405832Q75884k766158
4471b982065k762343N40537K351353R27410n43950K16809J563901J614902R31464
4462A858018M22347j56319p44279p90658q88258j932568k774465j664148K64589
4453f405741K93545j268560j388612O36336K138599J621421P50265R54538J347170
4444a321039J054668O61896L50128o82490k047783j970865r5505J786900K321141
4435E7051J729563L56295j421245k013359k87090J722857J052926j271054j282589
4426a356645J588934L289901J359216j504365j804076J36561J779896J819773
$$ plain form
4418 5309195 5656698 3737996 570998 -1146702 -27949 1966457 2286659 1454092 1719971
4409 1719971 3144068 3717397 2767181 1425860 -78060 -2800821 -6518543 -9306556 -10215562
4400 -10215562 -10216303 -9869326 -8041883 -3941816 863191 3419101 1998873 -2316782 -6338801
4391 -6338801 -7574498 -6714205 -6272634 -6416719 -4309365 1031126 5759138 5755135 2262607
4382 2262607 -146597 254386 1745192 3578258 6784826 10670240 12638486 12256537 11924768
4373 11924768 12566471 12009926 8841032 4753986 1758050 -50661 -710960 450723 2312977
4364 2312977 1898960 -931206 -1774354 2446124 8388368 10350788 7582252 4035672 2075856
4355 2075856 327280 -2326605 -4314405 -4035649 -2267126 -499053 1222441 3306696
$$ packed form
4418E309195L47503j918702l166998j717700J118753J994406L20202q32567K65879
4409A719971J424097N73329r50216j341321j503920k722761l717722k788013r09006
4400a0215562p41L46977J827443M100067M805007K555910j420228m315655m022019
4391f338801j235697Q60293M41571j44085K107354N340491M728012m003l492528
4382B262607k409204M00983J490806J833066L206568L885414J968246l81949l31769
4373A1924768O41703n56545l168894m087046k995936j808711o60299J161683J862254
4364B312977m14017k830166q43148M220478N942244J962420k768536l546580j959816
4355B075856j748576k653885j987800K78756J768523J768073J721494K084255
$$ plain form
4347 3306696 4891497 4827149 3743681 3559942 4972981 6691799 7438949 7605772 8246161
4338 8246161 9297945 9875063 9818461 9591131 8753320 6226047 2588043 403016 1080719
4329 1080719 2767590 2821193 1226988 -194518 -974874 -2138158 -3596483 -3872778 -2737517
4320 -2737517 -1924344 -2433576 -2944927 -1990215 -292297 337502 -459090 -1428633 -1733954
4311 -1733954 -2015909 -3172021 -4716483 -5114517 -3988525 -3221253 -4720962 -7415416 -8276454
4302 -8276454 -6687890 -5536935 -6670759 -7587887 -5031319 -177353 2740518 2101264 139663
4293 139663 -1097422 -1829217 -2236908 -1178056 1562042 3968089 4168283 2736844 1559162
4284 1559162 1326196 907639 -1177843 -4708491 -7078515 -5820493 -2453253 -1785797 -5705446
$$ packed form
4347C306696J584801o4348j083468j83739J413039J718818P47150J66823O40389
4338H246161J051784N77118n6602k27330q37811k527273l638004k185027O77703
4329A080719J686871N3603j594205j421506p80356j163284j458325k76295J135261
4320b737517Q13173n09232n11351R54712J697918O29799p96592r69543l05321
4311a733954k81955j156112j544462l98034J125992P67272j499709k694454q61038
4302h276454J588564J150955j133824r17128K556568M853966K917871o39254j961601
4293A39663j237085p31795m07691J058852K740098K406047K00194j431439j177682
4284A559162k32966m18557k085482l530648k370024J258022L367240O67456l919649
$$ plain form
4275 -5705446 -10031092 -10335926 -8460980 -9066178 -11546839 -10853910 -5942274 -1496090 -240761
4266 -240761 661315 3311865 4607417 1618644 -2803595 -3893821 -1494960 1074461 2283913
4257 2283913 2809749 2528496 724507 -1741584 -3371859 -4206985 -4799546 -4401361 -2533766
4248 -2533766 -877258 -1050053 -1834871 -1165969 402146 884210 428839 904196 2592089
4239 2592089 3895239 3992594 3580383 3297191 3349487 4311869 6474866 8693220 9405405
4230 9405405 8455459 6763128 4916252 3232628 2267681 2002515 1423177 -263 -1402762
4221 -1402762 -1948942 -1895266 -1494101 -488843 539258 386310 -235121 1266308 5461893
4212 5461893 9416260 10513370 9287175 7068708 3811885 124423 -1689666 -999441
$$ packed form
4275e705446m325646l04834J874946o05198k480661O92929M911636M446184J255329
4266b40761R02076K650550J295552k988773m422239j090226K398861K569421J209452
4257B283913N25836k81253j803989k466091j630275q35126n92561L98185J867595
4248b533766J656508j72795p84818O68902J568115M82064m55371M75357J687893
4239B592089J303150R7355m12211k83192N2296R62382K162997K218354P12185
4230I405405r49946j692331j846876j683624r64947k65166n79338j423440j402499
4221a402762n46180N3676M01165J005258J028101j52948o21431J501429M195585
4212E461893L954367J097110j226195k218467l256823l687462j814089O90225
$$ plain form
4204 -999441 -340844 -1160308 -1180331 1380962 4347643 5457408 6305695 8830209 11089627
4195 11089627 10523970 8466016 7318611 6196163 3748068 2384688 4844209 9050630
4187 9050630 11189544 11442883 11845502 11185759 7470196 3048690 1684881 2708333 3534704
4178 3534704 5352734 10170735 14760338 14322593 10234570 7558706 7011241 6228079 6429730
4169 6429730 10137061 14624252 15740201 15719928 18490557 20262463 15117310 7350275 6555291
4160 6555291 12190081 15557508 15676878 19184597 25233879 26219112 23908196 27541363 34466869
4151 34466869 32388570 24091887 27178398 42906662 51480186 49264779 59503341 84172691
4143 84172691 76795371 1026069 -102588766 -152473923 -124353236 -72808694 -51925933
$$ packed form
4204i99441O58597q19464k0023K561293K966681J109765Q48287K524514K259418
4195A1089627n65657k057954j147405j122448k448095j363380K459521M206421
4187I050630K138914K53339M02619o59743l715563m421506j363809J023452Q26371
4178C534704J818030M818001M589603m37745m088023k675864n47465p83162K01651
4169F429730L707331M487191J115949k0273K770629J771906n145153p767035p94984
4160F555291N634790L367427J19370L507719O049282R85233k310916L633167O925506
4151C4466869k078299q296683L086511J5728264Q573524k215407J0238562K4669350
4143H4172691p377320p5769302j03614835m9885157K8120687N1544542K0882761
$$ plain form
4136 -51925933 -56100946 -53614920 -40504401 -33691845 -35071093 -32401448 -24437900 -20606702
4128 -20606702 -21533740 -19562309 -14916658 -14698830 -18168808 -17468180 -11687414 -7788225 -8372916
4119 -8372916 -9406010 -9364388 -10747002 -12937265 -12519106 -10391152 -10580385 -12621371 -12726093
4110 -12726093 -11591556 -13240179 -16737870 -16921476 -13294271 -10626472 -10368378 -8805187
4102 -8805187 -4638341 -1567574 -2076466 -4740602 -8626330 -14162699 -18596711 -17127472
4094 -17127472 -10562574 -5914754 -7022925 -9980227 -10301764 -9213146 -9641476 -10835086
4086 -10835086 -10898867 -10980115 -12941943 -15498861 -16291209 -15906020 -16627318 -18500720 -19359823
4077 -19359823 -17939516 -14913579 -11504337 -8560971 -6426872 -4788779 -3319961 -2756702
$$ packed form
4136e1925933m175013K486026J3110519O812556j379248K669645P963548L831198
4128b0606702r27038J971431M645651K17828l469978P00628N780766L899189n84691
4119h372916j033094M1622j382614k190263M18159K127954j89233k040986j04722
4110a2726093J134537j648623l497691j83606L627205K667799K58094J563191
4102h805187M166846L070767n08892k664136l885728n536369m434012J469239
4094a7127472O564898M647820j108171k957302l21537J088618m28330j193610
4086a0835086o3781q1248j961828k556918p92348L85189p21298j873402q59103
4077a9359823J420307L025937L409242K943366K134099J638093J468818N63259
$$ plain form
4069 -2756702 -4139641 -6885777 -9285821 -11058923 -13334939 -15739544 -15961404 -13226930
4061 -13226930 -10000430 -8910900 -9780600 -10937836 -11755964 -12478651 -12914376 -12736792 -12223551
4052 -12223551 -11777684 -11495918 -11575411 -11982340 -11549900 -9091007 -5828808 -4787775 -6921273
4043 -6921273 -9605329 -9926626 -7793498 -4876286 -2387957 -1254829 -2626485 -6259379
4035 -6259379 -9493162 -9690800 -7205346 -4659696 -3873773 -4612528 -5692258 -6082478 -5281711
4026 -5281711 -3637371 -2177848 -1631976 -1996289 -3308623 -5960753 -9641863 -12777600 -13788678
4017 -13788678 -12454431 -9642291 -6356580 -3456154 -1582835 -861519 -1097370 -2279777
4009 -2279777 -4143600 -5405673 -4670905 -2225743 268783 1898927 2890398 2931653 1099534
$$ packed form
4069b756702j382939k746136k400044j773102k276016k404605k21860K734474
4061a3226930L226500J089530q69700j157236q18128p22687m35725J77584N13241
4052a2223551M45867K81766p9493m06929M32440K458893L262199J041033k133498
4043f921273k684056l21297K133128K917212K488329J133128j371656l632894
4035f259379l233783j97638K485454K545650P85923p38755j079730l90220Q00767
4026e281711J644340J459523N45872l64313j312334k652130l681110l135737j011078
4017a3788678J334247K812140L285711K900426J873319P21316k35851j182407
4009b279777j863823j262073P34768K445162K494526J630144R91471M1255j832119
$$ plain form
4000 1099534 -2045066 -4326437 -4830616 -5051816 -6149760 -7006522 -6337488 -4795920 -3247733
3991 -3247733 -708974 3852136 8909767 11738813 11527861 9307198 5883769 2028628
3983 2028628 -309109 267335 1914837 1192192 -2408203 -5848089 -6724814 -5721733 -4306987
3974 -4306987 -2421974 223109 2433637 2787105 1551692 91667 -671331 -97762 2617898
3965 2617898 6974598 9944712 8338061 2707341 -2676469 -4437645 -3560752 -3437289 -5437335
3956 -5437335 -7748650 -8278046 -7177343 -5964018 -5289302 -4628153 -3574622 -2198979 -244788
3947 -244788 2710438 5901125 7368604 6220952 4185547 3829988 5476727 6868324 5941154
3938 5941154 3048655 151144 -1385100 -1541981 -798005 399840 1269121 947678 -150534
$$ packed form
4000A099534l144600k281371n04179k21200j097944q56762O69034J541568J548187
3991c247733K538759M561110N057631K829046k10952k220663l423429l855141
3983B028628k337737N76444J647502p22645l600395l439886q76725J003081J414746
3974d306987J885013K645083K210528L53468j235413j460025p62998N73569K715660
3965B617898M356700K970114j606651n630720n383810j761176Q76893J23463k000046
3956e437335k311315n29396J100703J213325O74716O61149J053531J375643J954191
3947b44788K955226L190687J467479j147652k035405l55559J646739J391597r27170
3938E941154k892499k897511j536244j56881P43976J197845Q69281l21443j098212
$$ plain form
3929 -150534 -138766 1894143 3777944 2484189 -1379574 -3578755 -1976236 -98703 -2690298
3920 -2690298 -9100539 -13951283 -13873862 -10697830 -7940777 -7160904 -8391048 -11064473 -13101007
3911 -13101007 -11823853 -7612862 -4241125 -3642842 -2955864 576880 4330870 3796028 -197023
3902 -197023 -2337905 -881546 -277994 -4276504 -10147907 -12375478 -9719114 -5762034 -3649389
3893 -3649389 -3017149 -2041794 -422091 379183 -1064524 -4511430 -7803179 -8309760 -5200306
3884 -5200306 -374695 3184080 3926860 2352725 -487717 -4121512 -7897305 -10039979
3876 -10039979 -8879191 -5230691 -2210674 -1686596 -1887027 52293 3953449 6994400
3868 6994400 7855333 7887174 7824178 6391866 3607084 2404869 4351622 6147693 3825892
$$ packed form
3929a50534J1768K032909J883801j293755l863763k199181J602519J877533k591595
3920b690298o410241m850744P7421L176032K757053P79873j230144k673425k036534
3911a3101007J277154M210991L371737N98283O86978L532744L753990n34842l993051
3902a97023k140882J456359O03552l998510n871403k227571K656364L957080K112645
3893c649389O32240R75355J619703Q01274j443707l446906l291749n06581L109454
3884e200306M825611L558775P42780j574135k840442l633795l775793k142674
3876a0039979J160788L648500L020017N24078k00431J939320L901156L040951
3868F994400Q60933L1841o2996j432312k784782j202215J946753J796071k321801
$$ plain form
3859 3825892 -1074227 -3284300 -1064623 2177118 3543313 3962371 4870120 5150779 3193487
3850 3193487 -560935 -4718775 -8365056 -10171596 -8691219 -5234609 -3901596 -6564737
3842 -6564737 -9969572 -10098131 -7362936 -4917147 -3794433 -2897436 -2376062 -3395180 -5034415
3833 -5034415 -4887156 -2994024 -2189415 -3945906 -6456230 -7590989 -7480328 -7322243 -7679371
3824 -7679371 -8853313 -11083477 -13460524 -14376462 -13913237 -13977637 -15119274 -15239471 -12883330
3815 -12883330 -9871895 -8682247 -8748821 -7765978 -5702877 -4812976 -5755584 -6327746 -4853783
3806 -4853783 -2840760 -2958257 -5508877 -8081828 -8073956 -4703380 801762 5948367 8216388
3797 8216388 6639045 2438284 -2261281 -6193421 -9041616 -10348053 -9531871 -7143856
$$ packed form
3859C825892m900119k210073K219677L241741J366195M19058R07749K80659j957292
3850C193487l754422m157840l646281j806540J480377L456610J333013k663141
3842f564737l404835j28559K735195K445789J122714Q96997N21374j019118j639235
3833e034415J47259J893132Q04609j756491k510324j134759J10661J58085l57128
3824g679371j173942k230164k377047r15938M63225o4400j141637j20197K356141
3815a2883330L011435J189648o6574R82843K063101Q89901r42608n72162J473963
3806d853783K013023j17497k550620k572951P872L370576N505142N146605K268021
3797H216388j577343m200761m699565l932140k848195j306437Q16182K388015
$$ plain form
3789 -7143856 -4949199 -4089169 -3932206 -3466727 -3039502 -3585789 -4628463 -4497822 -2629804
3780 -2629804 -288399 1422952 2946517 4797033 5813513 4319529 750359 -2145929
3772 -2145929 -2077030 417301 2603622 2272172 -320416 -3132741 -4857709 -6336794 -8911831
3763 -8911831 -11827248 -12675990 -10727774 -8232118 -7390998 -7450184 -6437429 -4788631 -5048987
3754 -5048987 -8018197 -11147584 -11375054 -8356379 -4489526 -2682924 -4160427 -7327328
3746 -7327328 -8743586 -6471075 -2488615 -343001 -447502 240579 3395597 6603741 6882579
3737 6882579 4804460 2997878 2113660 915253 -451585 -258900 1488945 2219446 401091
3728 401091 -1956130 -1955999 174455 1314994 -726431 -4849888 -8014017 -8041883 -5165684
$$ packed form
3789g143856K194657Q60030J56963M65479M27225n46287j042674J30641J868018
3780b629804K341405J711351J523565J850516J016480j493984l569170k896288
3772b145929O8899K494331K186321l31450k592588k812325j724968j479085k575037
3763h911831k915417q48742J948216K495656Q41120n9186J012755J648798k60356
3754e048987k969210l129387k27470L018675L866853J806602j477503l166901
3746g327328j416258K272511L982460K145614j04501O88081L155018L208144K78838
3737F882579k078119j806582q84218j198407j366838J92685J747845P30501j818355
3728D01091k357221J31K130454J140539k041425m123457l164129k7866K876199
$$ plain form
3719 -5165684 -1715205 -462977 -2406309 -5581759 -6536580 -3666370 1024486 4030678
3711 4030678 4073752 3011835 3087461 4378854 5450174 5333716 3834382 944677 -2443074
3702 -2443074 -3984005 -2146781 1055423 1772421 -891825 -3978107 -5150094 -5531715 -6779713
3693 -6779713 -7952806 -7546773 -6548195 -6707259 -7371194 -7136565 -7409190 -10601980 -15188956
3684 -15188956 -16555444 -13442128 -9854295 -9224868 -10083665 -9484435 -7651423 -6512843 -5968691
3675 -5968691 -4791095 -3845627 -5223462 -8600517 -11103340 -10775752 -8139972 -4550866 -1194524
3666 -1194524 235772 -1794631 -6434380 -10391308 -11011679 -8594611 -5264890 -2504803
3658 -2504803 -334551 1750267 3669573 4624454 4157691 3221715 3317844 4207420 3721758
$$ packed form
3719e165684L450479J252228j943332l175450r54821K870210M690856L006192
3711D030678M3074j061917P5626J291393J071320j16458j499334k889705l387751
3702b443074j540931J837224L202204P16998k664246l086282j171987l81621j247998
3693f779713j173093M06033R98578j59064o63935K34629k72625l192790m586976
3684a5188956j366488L113316L587833O29427q58797N99230J833012J138580N44152
3675e968691J177596R45468j377835l377055k502823L27588K635780L589106L356342
3666a194524J430296k030403m639749l956928o20371K417068L329721K760087
3658b504803K170252K084818J919306R54881m66763r35976R6129Q89576m85662
$$ plain form
3649 3721758 835652 -2344912 -3225339 -2308787 -2199326 -3821171 -5956476 -8077267 -10810829
3640 -10810829 -13297559 -13086089 -9994586 -7619010 -9005038 -12429805 -13609267 -11183242
3632 -11183242 -7920014 -6701384 -7198670 -7140660 -5770669 -4943726 -6631771 -10025441 -12215731
3623 -12215731 -11997778 -11490761 -12640995 -13556683 -10903866 -5441743 -2004733 -3283573 -6566670
3614 -6566670 -8037220 -7554567 -7107817 -6910916 -5814061 -4099262 -3025807 -2387750 -1070692
3605 -1070692 499252 894010 314962 248050 569588 -513669 -3189888 -4942128 -3704118
3596 -3704118 -640745 1165800 18761 -2833479 -4403945 -2859728 248734 1365499
3588 1365499 -627961 -2661370 -1787907 283750 -295334 -3484749 -5451668 -4723036 -4303806
$$ packed form
3649C721758k886106l180564q80427R16552J09461j621845k135305k120791k733562
3640a0810829k486730K11470L091503K375576j386028l424767j179462K426025
3632a1183242L263228J218630m97286N8010J369991Q26943j688045l393670k190290
3623a2215731K17953N07017j150234r15688K652817N462123L437010j278840l283097
3614f566670j470550M82653M46750J96901J096855J714799J073455O38057J317058
3605a070692J569944L94758n79048o6912L21538j083257k676219j752240J238010
3596c704118L063373J806545j147039k852240j570466J544217L108462J116765
3588A365499j993460k033409Q73463K071657n79084l189415j966919P28632M19230
$$ plain form
3579 -4303806 -6412083 -8772388 -8452432 -6454148 -5553249 -5645991 -4498464 -1977107 -282486
3570 -282486 -202430 10338 1595657 3358307 3477030 1563265 -1762016 -5881181 -9873930
3561 -9873930 -12301302 -12424243 -11216469 -10311131 -10079027 -9479465 -7965484 -6803360 -7637521
3552 -7637521 -9848198 -10595915 -8403405 -5742709 -6357555 -10131174 -12485396 -9631366 -3077475
3543 -3077475 2019655 2043428 -2306422 -7351562 -9427345 -7218907 -2349257 2219879 4607447
3534 4607447 4657167 2682414 -994527 -5027286 -7237162 -6747076 -4774393 -2627580 -318837
3525 -318837 2019538 3050492 1993080 167711 -656268 -351822 335706 1219447 1871838
3516 1871838 981915 -1595781 -3572905 -3094633 -1518924 -1078537 -1265483 -340645 927910
$$ packed form
3579d303806k108277k360305L19956J998284R00899r2742J147527K521357J694621
3570b82486Q0056K12768J585319J762650J18723j913765l325281m119165l992749
3561i873930k427372j22941J207774R05338K32104N99562J513981J162124q34161
3552g637521k210677p47717K192510K660696o14846l773619k354222K854030O553891
3543c077475N097130K3773m349850n045140k075783K208438M869650M569136K387568
3534D607447M9720j974753l676941m032759k209876M90086J972683K146813K308743
3525c18837K338375J030954j057412j825369q23979L04446O87528Q83741O52391
3516A871838q89923k577696j977124M78272J575709M40387j86946R24838J268555
$$ plain form
3507 927910 514962 -703322 28584 2259053 2412603 -304433 -2218352 -1064349 235864
3498 235864 -1772570 -5580097 -6879541 -4380327 -721843 1146917 114962 -3458011
3490 -3458011 -7824687 -10104244 -8535171 -4424208 -662234 1212140 1567824 1382935 1652628
3481 1652628 2993997 4405535 3494679 -482018 -4852276 -6546155 -5915164 -5611276 -6549473
3472 -6549473 -7320873 -7210670 -7266463 -7997454 -8174260 -6860096 -5243138 -5417410 -7870165
3463 -7870165 -10666155 -10993367 -7759386 -2944366 223411 781174 623159 991344 190880
3454 190880 -3499805 -8211330 -10292264 -8979805 -6740691 -5345588 -4232859 -2816754
3446 -2816754 -1815097 -1750956 -2274704 -3354882 -5049729 -5963541 -4499384 -2056305 -2070364
$$ packed form
3507I27910m12948j218284P31906K230469J53550k717036j913919J154003J300213
3498B35864k008434l807527j299444K499214L658484J868760j031955l572973
3490c458011m366676k279557J569073M110963L761974J874374L55684j84889K69693
3481A652628J341369J411538r10856l976697m370258j693879O30991L03888r38197
3472f549473p71400J10203n5793p30991j76806J314164J616958j74272k452755
3463g870165k795990l27212L233981M815020L167777N57763j58015L68185q00464
3454A90880l690685m711525k080934J312459K239114J395103J112729J416105
3446b816754J001657O4141n23748j080178j694847r13812J464157K443079j4059
$$ plain form
3437 -2070364 -4945314 -6948999 -5626581 -3309852 -3137948 -4392325 -4599871 -4039406 -4846026
3428 -4846026 -6983394 -8346870 -8183217 -7558900 -6940683 -5954566 -5047772 -4739318 -3728319
3419 -3728319 -636521 2687023 2762815 -500160 -3510679 -4026844 -3170449 -1845304 1063797
3410 1063797 5398430 8237261 7970965 6794099 6639671 5699770 2210014 -1069194 -309144
3401 -309144 3176474 4574930 2615033 631851 791569 1665621 2152441 3470440 5722012
3392 5722012 6286020 3743160 287474 -1899531 -3669955 -5857100 -6230301 -2891429 1488529
3383 1488529 2663195 841762 5702 1761098 3557975 3220817 1823931 1137507 1000897
3374 1000897 514833 -206069 -689222 -1041979 -1404049 -1692955 -2222666 -3122010 -3066634 -525652
$$ packed form
3437b070364k874950k003685J322418K316729J71904j254377k07546N60465q06620
3428d846026k137368j363476J63653O24317O18217R86117R06794L08454J010999
3419c728319L091798L323544P5792l262975l010519n16165Q56395J325145K909101
3410A063797M334633K838831k66296j176866j54428r39901l489756l279208P60050
3401c09144L485618J398456j959897j983182J59718Q74052M86820J317999K251572
3392E722012N64008k542860l455686k187005j770424k187145l73201L338872M379958
3383A488529J174666j821433q36060J755396J796877l37158j396886o86424j36610
3374A000897m86064p20902m83153l52757l62070k88906n29711q99344N5376K540982
$$ plain form
3364 -525652 3441989 5776635 5289511 3678172 2151471 -105091 -2866488 -3347437 -23681
3355 -23681 4458874 6745097 6954467 6514616 4042686 -2509369 -10624832 -14652421 -12941893
3346 -12941893 -9690741 -8598980 -8293235 -5975864 -2508318 -917290 -1556926 -1769113 86468
3337 86468 2701111 4221755 4836496 6067669 8187866 9255644 7154371 2482843 -1418995
3328 -1418995 -2065454 -699154 -254698 -1144912 -1309031 -471201 -1403108 -5440156 -9225674
3319 -9225674 -8507215 -3837673 206895 929157 21814 190978 1816344 3665409 4799634
3310 4799634 4628151 2680580 -316503 -2244190 -1855796 -578442 -829111 -3005892 -5384065
3301 -5384065 -6735298 -7651248 -8968046 -10098074 -9823625 -8163579 -6407640 -5290658 -4129182
$$ packed form
3364e25652L967641K334646m87124j611339j526701k256562k761397m80949L323756
3355b3681M482555K286223K09370m39851k471930o552055q115463m027589J710528
3346a2941893L251152J091761L05745K317371L467546J591028o39636k12187J855581
3337H6468K614643J520644O14741J231173K120197J067778k101273m671528l901838
3328a418995o46459J366300M44456q90214j64119Q37830r31907m037048l785518
3319i225674P18459M669542M044568P22262r07343J69164J625366J849065J134225
3310D799634j71483j947571k997083j927687L88394J277354k50669k176781k378173
3301e384065j351233r15950j316798j130028K74449J660046J755939J116982J161476
$$ plain form
3292 -4129182 -2367407 -1244690 -2696365 -6521801 -9854814 -10159342 -7938611 -5660853
3284 -5660853 -4813787 -5183621 -6298376 -7802754 -8553365 -7359534 -5169574 -4677212 -6808261
3275 -6808261 -9301862 -10015375 -9854890 -10557576 -11189234 -9581158 -6407772 -4617157 -4614490
3266 -4614490 -3274479 974031 4911415 4586402 763779 -2174246 -1818571 145915 1084736
3257 1084736 477309 -520264 -930001 -639983 -90715 185831 1709 -475434 -1215381 -2235630
3247 -2235630 -2751077 -1521209 1116029 2746176 1763669 -263884 -781266 95408 162794
3238 162794 -1203487 -2358459 -2353922 -2227380 -2832838 -3405740 -2942496 -1388628 864363
3229 864363 2933611 2865675 -569448 -5124954 -6708462 -4562210 -2189195 -2132075 -2814127
$$ packed form
3292d129182J761775J122717j451675l825436l333013l04528K220731K277758
3284e660853Q47066l69834j114755j504378p50611J193831K189960M92362k131049
3275f808261k493601p13513J60485p02686o31658J608076L173386J790615K667
3266d614490J340011M248510L937384l25013l822623k938025L55675J964486R38821
3257A084736o07427r97573m09737K90018N49268K76546j84122m77143p39947j020249
3247b235630n15447J229868K637238J630147r82507k027553n17382Q76674O7386
3238A62794j366281j154972M537J26542o05458n72902M63244J553868K252991
3229H64363K069248o7936l435123m555506j583508K146252K373015N7120o82052
$$ plain form
3220 -2814127 -2144567 -1074995 -1048277 -693404 1691462 4330924 4050409 940218 -2088648
3211 -2088648 -3305903 -2860320 -832834 2101830 3252385 914600 -1946810 -1049292 2516983
3202 2516983 3364086 -83151 -3226279 -2379500 298528 1289027 1121416 2001654 2988249
3193 2988249 1364354 -2667556 -6057304 -7095681 -6885753 -6885443 -7138698 -7031893 -6307492
3184 -6307492 -5171019 -4145598 -3569136 -2867894 -1095035 1512154 3681152 5079025 6444797
3175 6444797 7228697 5335247 524284 -4058065 -5607977 -5192654 -5530784 -6813567 -7085577
3166 -7085577 -5608005 -3315243 -634417 2630800 5500158 6267341 4974256 3580783
3158 3580783 3349858 3470230 2450251 -245302 -3846770 -6523114 -6402005 -3638893 -1067210
$$ packed form
3220b814127O69560J069572K6718L54873K384866K639462k80515l110191l028866
3211b088648j217255M45583K027486K934664J150555k337785k861410Q97518L566275
3202B516983Q47103l447237l143128Q46779K678028R90499j67611Q80238R86595
3193B988249j623895m031910l389748j038377K09928L10k53255J06805P24401
3184f307492J136473J025421N76462P01242J772859K607189K168998J397873J365772
3175F444797P83900j893450m810963m582349j549912M15323l38130j282783k72010
3166g085577J477572K292762K680826L265217K869358P67183j293085j393473
3158C580783k30925J20372j019979k695553l601468k676344J21109K763112K571683
$$ plain form
3149 -1067210 -1385578 -4022382 -6192190 -6634122 -6568785 -7063756 -7343358 -6248251 -4013274
3140 -4013274 -1942594 -1169936 -2174998 -4839509 -8484905 -11998906 -14046380 -13458796 -10177830
3131 -10177830 -5896433 -2745782 -1062311 407646 1958930 2390501 1533511 1032618 1438170
3122 1438170 969272 -1048944 -2055439 -84663 2558685 2537409 443770 -960497 -1728779
3113 -1728779 -3819344 -6322428 -6153581 -3252059 -669827 626333 2522526 4876824
3105 4876824 4740913 1774183 -269403 575369 1528451 318031 -1050229 -835860 -1603558
3096 -1603558 -5658615 -9941184 -10219906 -7933802 -7883867 -10585265 -11927582 -9977756 -7370393
3087 -7370393 -6466636 -6298265 -5431089 -4394518 -3753987 -2535221 -354816 818892 -1144773
$$ packed form
3149a067210l18368k636804k169808m41932O5337m94971k79602J095107K234977
3140d013274K070680P72658j005062k664511l645396l514001k047474N87584L280966
3131a0177830M281397L150651J683471J469957J551284M31571q56990n00893M05552
3122A438170m68898k018216j006495J970776K643348k1276k093639j404267p68282
3113a728779k090565k503084J68847K901522K582232J296160J896193K354298
3105D876824j35911k966730k043586Q44772R53082j210420j368260K14369p67698
3096a603558m055057m282569k78722K286104M9935k701398j342317J949826K607363
3087g370393R03757J68371Q67176J036571O40531J218766K180405J173708j963665
$$ plain form
3078 -1144773 -5539528 -9265402 -9880902 -7729615 -5389917 -5045412 -6141929 -6248375 -4636168
3069 -4636168 -3591453 -4931822 -6856838 -6497532 -4375024 -3428709 -4187898 -4207206 -2556825
3060 -2556825 -1507032 -2565689 -3775971 -2754926 -134422 1993503 3167215 3924481
3052 3924481 3617743 1360810 -1677192 -3375414 -3787649 -4923801 -7338354 -9138370 -8979653
3043 -8979653 -8044789 -7904544 -8022639 -6984855 -5161425 -4246273 -4522114 -4565689 -3939003
3034 -3939003 -4167825 -5946780 -7017942 -4700967 214594 4028360 4432466 2499790 290178
3025 290178 -1609476 -3470531 -5012351 -5720386 -5530332 -4412952 -2400015 -688737 -1156320
3016 -1156320 -3591572 -4984455 -3326608 -865561 -1374061 -4838765 -7190891 -5337538
$$ packed form
3078a144773m394755l725874o15500K151287K339698L44505j096517j06446J612207
3069d636168J044715j340369j925016L59306K122508R46315p59189j9308J650381
3060b556825J049793j058657j210282J021045K620504K127925J173712P57266
3052C924481l06738k256933l038002j698222m12235j136152k414553j800016J58717
3043h979653R34864J40245j18095J037784J823430R15152k75841m3575O26686
3034c939003k28822j778955j071162K316975M915561L813766M04106j932676k209612
3025B90178j899654j861055j541820p08035J90054J117380K012937J711278m67583
3016a156320k435252j392883J657847K461047n08500l464704k352126J853353
$$ plain form
3008 -5337538 -487733 3775782 5024250 3308788 689473 15521 2676208 6770884
3000 6770884 8572592 6401635 2109502 -1603870 -4066964 -6213437 -8589599 -10870325
2992 -10870325 -12551380 -13079350 -11844055 -9044600 -6235930 -5060060 -5489606 -6068677 -5862497
2983 -5862497 -5365531 -5239607 -4979327 -3683616 -1870796 -1350487 -2755852 -4212625 -3675896
2974 -3675896 -1995891 -1894708 -3820525 -4906914 -3041957 -41917 1042596 425480 1063478
2965 1063478 4172459 7621681 9011319 8346410 7032883 5823286 4598965 3043074
2957 3043074 760011 -2369789 -5282530 -6043542 -3961104 -962479 -22657 -2122446 -5164755
2948 -5164755 -6242145 -5042466 -4503543 -7342673 -12272692 -15101606 -13795770 -10575476
$$ packed form
3008e337538M849805M263515J248468j715462k619315o73952K660687M094676
3000F770884J801708k170957m292133l713372k463094k146473k376162k280726
2992a0870325j681055n27970J235295K799455K808670J175870m29546n79071K06180
2983e862497M96966J25924K60280J295711J812820N20309j405365j456773N36729
2974c675896J680005J01183j925817j086389J864957L000040J084513o17116O37998
2965A063478L108981L449222J389638o64909j313527j209597j224321j555891
2957C043074k283063l129800k912741p61012K082438K998625R39822k099789l042309
2948e164755j077390J199679N38923k839130m930019k828914J305836L220294
$$ plain form
2940 -10575476 -8108456 -5856633 -2195382 1732774 3236308 2276588 1474257 2168791 3260273
2931 3260273 3911066 4485218 4543113 2945856 660788 428767 2473171 3428706 1095582
2922 1095582 -2432807 -4277886 -4910249 -6418447 -8611266 -9440990 -8128338 -5719911 -3541422
2913 -3541422 -2828422 -4558466 -7734452 -9224988 -7486605 -5163326 -5598124 -7964519 -8698360
2904 -8698360 -6995587 -5683078 -6548062 -7850236 -7371146 -5549152 -4290883 -4238801 -4471771
2895 -4471771 -4092361 -3294405 -3208222 -4748491 -7118225 -7898979 -5609900 -1779167 662862
2886 662862 608063 -880964 -2784080 -4788317 -5950110 -4871071 -1784363 1169171 2350303
2877 2350303 1958277 629156 -1579802 -3999261 -4769396 -2870996 73025 1252033 -361507
$$ packed form
2940a0575476K467020K251823L661251L928156J503534r59720q02331O94534J091482
2931C260273O50793N74152N7895j597257k285068k32021K044404R55535k333124
2922A095582l528389j845079o32363j508198k192819q29724J312652K408427K178489
2913c541422P13000j730044l175986j490536J738383K323279m34798k366395p33841
2904h698360J702773J312509q64984j302174M79090J821994J258269N2082k32970
2895d471771L79410P97956Q6183j540269k369734p80754K289079L830733K442029
2886F62862n4799j489027j903116k004237j161793J079039L086708K953534J181132
2877B350303l92026j329121k208958k419459p70135J898400K944021J179008j613540
$$ plain form
2868 -361507 -3200857 -4971204 -4826350 -3902319 -3942192 -5265465 -6330670 -5749811 -4203973
2859 -4203973 -3343851 -3210363 -2285356 -168446 1523323 1596360 1150363 1990584 4217426
2850 4217426 6408159 7378251 6815871 4928512 2480975 587208 -489375 -1691572 -3287222
2841 -3287222 -3459460 -541933 3479355 3757326 -2085527 -10624309 -15875562 -15267936 -11276717
2832 -11276717 -7728867 -6197585 -6234847 -7243778 -8667172 -9279550 -8042142 -5669635 -4137298
2823 -4137298 -4509269 -6131762 -7758821 -8304995 -6771451 -3152469 411733 1302269 -89712
2814 -89712 -345565 2628882 7065090 10197026 11557788 11824444 10596339 7794849 5591352
2805 5591352 6007145 7582313 7314844 5190687 3810688 4059386 4438068 4571776 5806365
$$ packed form
2868c61507k839350j770347J44854R24031l9873j323273j065205N80859J545838
2859d203973Q60122J33488R25007K116910J691769P3037m45997Q40221K226842
2850D217426K190733R70092n62380j887359k447537j893767j076583j202197j595650
2841c287222j72238K917527M021288K77971n842853q538782n251253O07626L991219
2832a1276717L547850J531282l7262j008931j423394o12378J237408K372507J532337
2823d137298l71971j622493j627059n46174J533544L618982L564202Q90536j391981
2814h9712k55853K974447M436208L131936J360762K66656j228105k801490k203497
2805E591352M15793J575168k67469k124157j379999K48698L78682J33708J234589
$$ plain form
2796 5806365 7769161 7824554 5075412 1772820 -490355 -2774081 -5392254 -5906067 -3010230
2787 -3010230 338728 523589 -2121338 -4937011 -6928055 -8020782 -6504357 -1270970
2779 -1270970 4498640 6103217 3630504 1610061 2090145 2060815 -1132554 -5688070 -8761512
2770 -8761512 -10741966 -13226156 -15047706 -13790135 -10209087 -7710308 -7299862 -6024410
2762 -6024410 -1436177 4685551 8635652 9242396 8157265 6651342 4447802 1809036
2754 1809036 413520 889743 1154701 -897884 -3976258 -4853613 -3050841 -1711153 -3137330
2745 -3137330 -5513067 -5395660 -2065298 2021795 4110461 3171203 -4593 -3270795 -4359894
2736 -4359894 -3076884 -1791295 -2546148 -4393138 -5017500 -4152711 -3381471 -3024956 -1684030
$$ packed form
2796E806365J962796N5393k749142l302592k263175k283726k618173n13813K895837
2787c010230L348958J84861k644927k815673j991044j092727J516425N233387
2779a270970N769610J604577k472713k020443M80084k9330l193369m555516l073442
2770h761512j980454k484190j821550J257571L581048K498779M10446J275452
2762f024410M588233O121728L950101O06744j085131j505923k203540k638766
2754A809036j395516M76223K64958k052585l078374q77355J802772J339688j426177
2745c137330k375737J17407L330362M087093K088666r39258l175796l266202j089099
2736d359894J283010J285589p54853j846990o24362Q64789P71240L56515J340926
$$ plain form
2727 -1684030 777342 2128535 771897 -1819151 -2973495 -2011890 -315696 926348
2719 926348 1612328 1646231 287429 -2917279 -7018240 -9985133 -10349976 -8424365 -5535971
2710 -5535971 -2211015 1852652 5609269 6070762 1624968 -4971899 -9185543 -10041458 -10431471
2701 -10431471 -11942398 -12398815 -9862187 -6213306 -4337689 -3811887 -2328095 -66189
2693 -66189 709075 -51756 194114 2122385 2992606 956429 -1875497 -2679910 -1999010
2684 -1999010 -2108008 -2959938 -2661805 -1162038 -434347 -1009308 -1207627 -455864 -707368
2675 -707368 -3328663 -6816661 -9207021 -10802616 -12489795 -12945759 -10175907 -5234910 -1866917
2666 -1866917 -2187377 -4579596 -6188992 -5929563 -4687676 -3980354 -4847472 -6947363 -8510439
$$ packed form
2727a684030K461372J351193j356638k591048j154344R61605J696194J242044
2719I26348O85980L3903j358802l204708m100961k966893l64843J925611K888394
2710e535971L324956M063667L756617M61493m445794o596867m213644q55915l90013
2701a0431471j510927m56417K536628L648881J875617N25802J483792K261906
2693f6189P75264p60831K45870J928271Q70221k036177k831926q04413O80900
2684a999010j08998q51930K98133J499767P27691n74961j98319P51763k51504
2675g07368k621295l487998k390360j595595j687179m55964K769852M940997L367993
2666a866917l20460k392219j609396K59429J241887P07322q67118k099891j563076
$$ plain form
2657 -8510439 -8189373 -6807745 -5994265 -5474836 -3633856 -641095 1394012 1871546 2767219
2648 2767219 5129677 6859101 5625422 2165703 -978041 -2403977 -2047160 -277824
2640 -277824 1399747 584458 -2938420 -5943498 -5750544 -3749012 -2555731 -1683998 691797
2631 691797 3344532 3393128 1231472 -127991 -340416 -1989093 -5287370 -7115708 -6453571
2622 -6453571 -6266278 -8108491 -9115444 -6969857 -4019515 -3227263 -3321387 -1719650 349122
2613 349122 -182991 -2780091 -3863032 -1904347 1575404 5247864 8602978 9949833 7678513
2604 7678513 3650397 1718098 2303181 1784197 -1882499 -6171127 -7919200 -7377497 -6702686
2595 -6702686 -6880485 -7996694 -10435676 -13626529 -15103982 -13055616 -8999207 -6059770
$$ packed form
2657h510439L21066J381628Q13480N19429J840980K992761K035107M77534Q95673
2648B767219K362458J729424j233679l459719l143744j425936L56817J769336
2640b77824J677571q15289l522878l005078J92954K001532J193281Q71733K375795
2631F91797K652735M8596k161656j359463k12425j648677l298277j828338O62137
2622f453571J87293j842213j006953K145587K950342P92252r4124J601737K068772
2613C49122n32113k597100j082941J958685L479751L672460L355114J346855k271320
2604G678513m028116j932299N85083n18984l666696m288628j748073N41703O74811
2595f702686j77799j116209k438982l190853j477453K048366M056409K939437
$$ plain form
2587 -6059770 -5089372 -4115743 -1414409 2223251 4382525 3444726 180841 -2701050 -2941397
2578 -2941397 -840885 1613909 3609699 6060260 8923436 9923387 7462204 3377432
2570 3377432 744532 -321196 -2423567 -6529790 -10153500 -10715114 -8944505 -7538806
2562 -7538806 -7497682 -7517535 -6851299 -7034999 -9810792 -14202617 -17039914 -16479941 -13857525
2553 -13857525 -11525157 -10012054 -8461067 -6937141 -6407601 -6587178 -5920288 -4308114 -3781485
2544 -3781485 -5164894 -5959570 -3635861 257234 1911305 729018 73026 1988129 3935400
2535 3935400 2414115 -2183609 -6508921 -8765822 -9763325 -9958065 -8319457 -4967221 -2562456
2526 -2562456 -3257366 -5605034 -6507951 -5545348 -5152622 -6485321 -7468006 -5993640 -3142811
$$ packed form
2587f059770R70398R73629K701334L637660K159274r37799l263885k881891k40347
2578b941397K100512K454794J995790K450561K863176R99951k461183m084772
2570C377432k632900j065728k102371m106223l623710n61614J770609J405699
2562g538806M1124j9853O66236j83700k775793m391825k837297N59973K622416
2553a3857525K332368J513103J550987J523926N29540j79577O66890J612174N26629
2544c781485j383409p94676K323709L893095J654071j182287o55992J915103J947271
2535C935400j521285m597724m325312k256901r97503j94740J638608L352236K404765
2526b562456o94910k347668r02917R62603L92726j332699r82685J474366K850829
$$ plain form
2517 -3142811 -1431626 -1031493 107816 2716303 4948005 5083438 3701614 2325188 1316026
2508 1316026 209040 -913592 -1651833 -2285180 -3320189 -4268904 -3895622 -1740416 1180337
2499 1180337 3125647 2780236 131904 -3251733 -5276084 -5238340 -4268465 -3478293 -2642562
2490 -2642562 -1570475 -1545844 -3617888 -6106111 -6012871 -3081261 -366153 -82682 -798819
2481 -798819 26476 2261831 3571769 2879641 1641289 1661458 2820103 3302037 1618039
2472 1618039 -1668323 -4080689 -3401137 125006 4120676 6464907 6474944 3980264 -837550
2463 -837550 -5926334 -7861925 -5864402 -3880042 -6161087 -11505897 -14591985 -12869664
2455 -12869664 -9233433 -7309068 -7064277 -6578333 -5598458 -5063140 -4820622 -4322951 -4534567
$$ packed form
2517c142811J711185M00133J139309K608487K231702J35433j381824j376426j009162
2508A316026j106986j122632p38241o33347j035009r48715L73282K155206K920753
2499A180337J945310l45411k648332l383637k024351L7744R69875P90172Q35731
2490b642562J072087K4631k072044k488223R3240K931610K715108K83471p16137
2481g98819Q25295K235355J309938o92128j238352K0169J158645M81934j683998
2472A618039l286362k412366O79552L526143L995670K344231J0037k494680m817814
2463h37550n088784j935591J997523J984360k281045n344810l086088J722321
2455a2869664L636231J924365K44791M85944R79875N35318K42518M97671k11616
$$ plain form
2446 -4534567 -6601208 -9134159 -9414515 -7401626 -6092369 -7262124 -9072169 -9018420 -7332113
2437 -7332113 -5891658 -5280228 -4891489 -4944184 -6015341 -6784095 -4777404 -182888 3245504
2428 3245504 2738269 485625 884192 4510513 7387721 6548346 3762324 2400291 2782756
2419 2782756 2913075 2369740 2486038 3035408 1979982 -634370 -1461975 1584428 5676087
2410 5676087 6374997 3431985 947230 2314685 7085920 12448573 15627926 14875252 10383010
2401 10383010 4878378 1562748 740301 -114818 -2479066 -4637102 -4250311 -1551871 1162788
2392 1162788 2130776 1131749 -1164840 -3756779 -5763079 -7013158 -7630751 -6928073 -4118700
2383 -4118700 -613122 316778 -2486523 -6066645 -7072805 -6062431 -5983104 -7530308 -8610268
$$ packed form
2446d534567k066641k532951k80356K012889J309257j169755j810045N3749J686307
2437g332113J440455O11430L88739n2695j071157p68754K006691M594516L428392
2428C245504n07235k252644L98567L626321K877208q39375k786022j362033L82465
2419B782756J30319n43335J16298N49370j055426k614352q27605L046403M091659
2410E676087O98910k943012k484755J367455M771235N362653L179353p52674m492242
2401A0383010n504632l315630q22447q55119k364248k158036L86791K698440K714659
2392A162788R67988r99027k296589k591939k006300j250079o17593P02678K809373
2383d118700L505578R29900k803301l580122j006160J010374P9327j547204j079960
$$ plain form
2374 -8610268 -7888597 -6194751 -4425096 -2718199 -2118282 -4331584 -8709913 -11771416 -11211037
2365 -11211037 -8605987 -6693239 -5745342 -4520666 -3315899 -3643978 -5456402 -6930242
2357 -6930242 -7043340 -6529651 -6040317 -5035360 -3146076 -1372090 -999576 -1914570 -2692580
2348 -2692580 -2200367 -811525 -66497 -1040471 -2963013 -3897426 -3128077 -2203112 -2848579
2339 -2848579 -4503387 -5124166 -4041878 -2494235 -1308362 188964 2284568 3519447
2331 3519447 2546108 381610 -632894 339278 2147904 3720430 5178145 6722978 7747093
2322 7747093 7703355 6927841 5755717 3421948 -1110070 -7247430 -12553165 -14850925 -14194506
2313 -14194506 -12405122 -10884513 -9339981 -6709618 -2888778 850327 3007235 3040372
$$ packed form
2374h610268P21671J693846J769655J706897N99917k213302m378329l061503N60379
2365a1211037K605050J912748R47897J224676J204767l28079j812424j473840
2357f930242j13098N13689M89334J004957J889284J773986L72514r14994p78010
2348b692580M92213J388842P45028r73974j922542r34413P69349R24965o45467
2339b848579j654808o20779J082288J547643J185873J497326K095604J234879
2331C519447r73339k164498j014504R72172J808626J572526J457715J544833J024115
2322G747093m3738p75514j172124k333769m532018o137360n305735k297760O56419
2313a4194506J789384J520609J544532K630363L820840L739105K156908L3137
$$ plain form
2305 3040372 1463667 -755656 -2699399 -3787445 -3936000 -3348888 -2077695 -77068 2214859
2296 2214859 3863798 4353326 4044847 3310516 1823470 -542283 -2679051 -3276540 -2703659
2287 -2703659 -2615658 -3582639 -4386921 -4033055 -3170850 -2919772 -3508932 -4794298 -6708005
$$ packed form
2305C040372j576705k219323j943743j088046j48555N87112J271193K000627K291927
2296B214859J648939M89528l08479p34331j487046k365753k136768n97489N72881
2287b703659Q8001r66981q04282L53866Q62205K51078n89160j285366j913707
$$ [...]
##END NTUPLES=NMR SPECTRUM
##END=
