##TITLE=31P_DE-80H_X3
 64 sc D2O
 26.2.2025
##JCAMPDX= 6.0         $$ Bruker NMR JCAMP-DX V2.0
##DATA TYPE= NMR SPECTRUM
##DATA CLASS= NTUPLES
##ORIGIN= UXNMR, Bruker Analytische Messtechnik GmbH
##OWNER= root
$$ XWIN-NMR		Version 3.5
$$ Tue Mar 18 15:26:49 2025 Russian Standard Time (UT+4h)  Yarkov@DPX200
##.OBSERVE FREQUENCY= 81.013821
##.OBSERVE NUCLEUS= ^31P
##.ACQUISITION MODE= SIMULTANEOUS
##.ACQUISITION SCHEME= undefined
##.AVERAGES= 64
##.DIGITISER RES= 17
##SPECTROMETER/DATA SYSTEM= spect
##.PULSE SEQUENCE= zgpg30
##.SOLVENT NAME= CDCl3
##.SHIFT REFERENCE= (INTERNAL, CDCl3, 0, 198.062)
##AUDIT TRAIL= $$ (NUMBER, WHEN, WHO, WHERE, WHAT)
$$ ##TITLE= Audit trail, XWIN-NMR		Version 3.5
$$ ##JCAMPDX= 5.01
$$ ##ORIGIN= Bruker BioSpin GmbH
$$ ##OWNER= Yarkov
$$ C:/Bruker/XWIN-NMR/data/yarkov2/nmr/P31/2/pdata/1/auditp.txt
$$ ##AUDIT TRAIL=  $$ (NUMBER, WHEN, WHO, WHERE, WHAT)
(   1,<2025-03-18 15:25:12.31 +0400>,<Yarkov>,<DPX200>,
      <created by zg, POWCHK disabled, PULCHK disabled
       configuration hash MD5:
       00 E9 B6 7A A2 85 ED C7 34 08 36 98 17 FE 4E 26
       data hash MD5: 32K
       09 FD 96 95 68 3F 0E 0D F1 A5 9A 8C BE A4 01 F3>)
(   2,<2025-03-18 15:25:43.73 +0400>,<Yarkov>,<DPX200>,
      <Start of raw data processing
       efp BC_mod = 2 LB = 1.5 FT_mod = 6 PKNL = 1 PHC0 = 1803.577 PHC1 = 7.495417 SI = 64K 
       data hash MD5: 64K
       EF E2 9A A3 EC 9E 2D 21 8A AB 16 01 2A 4D 3C 2C>)
(   3,<2025-03-18 15:26:13.60 +0400>,<Yarkov>,<DPX200>,
      <pk PHC0 = -28.65328 PHC1 = -0.5999996 
       data hash MD5: 64K
       60 DD 89 2B FD BC 13 54 ED AE CB 94 2C FA 26 03>)
$$ ##END=
$$ 
$$ hash MD5
$$ BB 27 4E AA D1 EB 67 11 08 75 42 44 5B 12 9A 86
##$RELAX= 
##$RELAX= 
##$RELAX= 
##$RELAX= 
##$RELAX= 
##$RELAX= 
##$RELAX= 
##$RELAX= 
$$ Bruker specific parameters
$$ --------------------------
##$DU= <C:/Bruker/XWIN-NMR>
##$EXPNO= 2
##$NAME= <P31>
##$PROCNO= 1
##$TYPE= <nmr>
##$USER= <yarkov2>
##$AMP= (0..31)
100 100 100 100 100 100 100 100 100 100 100 100 100 100 100 100 100 100 
100 100 100 100 100 100 100 100 100 100 100 100 100 100 
##$AQSEQ= 0
##$AQ_mod= 1
##$AUNM= <au_zg>
##$AUTOPOS= <>
##$BF1= 81.014009
##$BF2= 200.13
##$BF3= 200.13
##$BF4= 200.13
##$BF5= 200.13
##$BF6= 200.13
##$BF7= 200.13
##$BF8= 200.13
##$BYTORDA= 1
##$CFDGTYP= 0
##$CFRGTYP= 5
##$CHEMSTR= <none>
##$CNST= (0..31)
1 1 145 1 1 1 1 1 1 1 1 1 1 1 1 1 1 1 1 1 1 1 1 1 1 1 1 1 1 1 1 1 
##$CPDPRG= <waltz16>
##$CPDPRG1= <>
##$CPDPRG2= <waltz16>
##$CPDPRG3= <>
##$CPDPRG4= <mlev>
##$CPDPRG5= <mlev>
##$CPDPRG6= <mlev>
##$CPDPRG7= <mlev>
##$CPDPRG8= <mlev>
##$CPDPRGB= <>
##$CPDPRGT= <>
##$D= (0..31)
0 1 0 0 0 0 0 0 0 0.06 0 0.03 2e-05 3e-06 0 0 0.0002 0 0 0 0 0 0 0 0 0 
0 0 0 0 0 0 
##$DATE= 1742297111
##$DBL= (0..7)
120 120 120 11 120 120 24 19 
##$DBP= (0..7)
150 150 150 150 150 150 150 150 
##$DBP07= 0
##$DBPNAM0= <>
##$DBPNAM1= <>
##$DBPNAM2= <>
##$DBPNAM3= <>
##$DBPNAM4= <>
##$DBPNAM5= <>
##$DBPNAM6= <>
##$DBPNAM7= <>
##$DBPOAL= (0..7)
$$ [...]
##$SUBNAM2= <"">
##$SUBNAM3= <"">
##$SUBNAM4= <"">
##$SUBNAM5= <"">
##$SUBNAM6= <"">
##$SUBNAM7= <"">
##$SUBNAM8= <"">
##$SUBNAM9= <"">
##$SW= 400.765351723535
##$SWIBOX= (0..15)
0 1 3 0 0 0 0 0 0 0 0 0 0 0 0 0 
##$SW_h= 32467.5324675325
##$TD= 32768
##$TD0= 1
##$TE= 0
##$TE2= 300
##$TE3= 300
##$TEG= 300
##$TL= (0..7)
0 120 53 12 22 120 120 120 
##$TP= (0..7)
150 150 150 150 150 150 150 150 
##$TP07= 0
##$TPNAME0= <>
##$TPNAME1= <>
##$TPNAME2= <>
##$TPNAME3= <>
##$TPNAME4= <>
##$TPNAME5= <>
##$TPNAME6= <>
##$TPNAME7= <>
##$TPOAL= (0..7)
0.5 0.5 0.5 0.5 0.5 0.5 0.5 0.5 
##$TPOFFS= (0..7)
0 0 0 0 0 0 0 0 
##$TUNHIN= 0
##$TUNHOUT= 0
##$TUNXOUT= 0
##$USERA1= <user>
##$USERA2= <user>
##$USERA3= <user>
##$USERA4= <user>
##$USERA5= <user>
##$V9= 5
##$VALIST= <valist>
##$VCLIST= <CCCCCCCCCCCCCCC>
##$VD= 0
##$VDLIST= <DDDDDDDDDDDDDDD>
##$VPLIST= <PPPPPPPPPPPPPPP>
##$VTLIST= <TTTTTTTTTTTTTTT>
##$WBST= 1024
##$WBSW= 4
##$XGAIN= (0..3)
0 0 0 0 
##$XL= 0
##$YL= 0
##$YMAX_a= 43782
##$YMIN_a= -50339
##$ZGOPTNS= <>
##$ZL1= 120
##$ZL2= 120
##$ZL3= 120
##$ZL4= 120
##$ABSF1= 0
##$ABSF2= 0
##$ABSG= 0
##$ABSL= 0
##$ALPHA= 0
##$AQORDER= 0
##$ASSFAC= 0
##$ASSFACI= 0
##$ASSFACX= 0
##$ASSWID= 0
##$AUNMP= <proc_1d>
##$AZFE= 0.1
##$AZFW= 0.5
##$BCFW= 0
##$BC_mod= 2
##$BYTORDP= 0
##$COROFFS= 0
##$CY= -3
##$DATMOD= 1
##$DC= 0
##$DFILT= <>
##$DTYPP= 0
##$F1P= 0
##$F2P= 0
##$FCOR= 1
##$FTSIZE= 65536
##$FT_mod= 6
##$GAMMA= 0
##$GB= 0
##$INTBC= 1
##$INTSCL= 9.790993e-09
##$ISEN= 30
##$LB= 1.5
##$LEV0= 0
##$LPBIN= 0
##$MAXI= 10000
##$MC2= 0
##$MEAN= 0
##$ME_mod= 0
##$MI= 50
##$NCOEF= 0
##$NC_proc= -5
##$NLEV= 6
##$NOISF1= 182.463
##$NOISF2= 159.3651
##$NSP= 0
##$NTH_PI= 0
##$NZP= 0
##$OFFSET= 198.0616
##$PC= 4
##$PHC0= 1774.924
##$PHC1= 6.895418
##$PH_mod= 1
##$PKNL= yes
##$PPARMOD= 0
##$PSCAL= 0
##$PSIGN= 0
##$REVERSE= no
##$SF= 81.0140089999434
##$SI= 65536
##$SIGF1= 159.3651
##$SIGF2= -187.1042
##$SINO= 113.3802
##$SIOLD= 16384
##$SREGLST= <1H.CDCl3>
##$SSB= 0
##$STSI= 65536
##$STSR= 0
##$SW_p= 32467.5324675325
##$SYMM= 0
##$S_DEV= 0
##$TDeff= 32768
##$TDoff= 0
##$TI= <>
##$TILT= no
##$TM1= 0
##$TM2= 0
##$TOPLEV= 0
##$USERP1= <user>
##$USERP2= <user>
##$USERP3= <user>
##$USERP4= <user>
##$USERP5= <user>
##$WDW= 1
##$XDIM= 65536
##$YMAX_p= 325211603
##$YMIN_p= -9420677
$$ End of Bruker specific parameters
$$ ---------------------------------
##NTUPLES= NMR SPECTRUM
##VAR_NAME=  FREQUENCY,     SPECTRUM/REAL,   SPECTRUM/IMAG
##SYMBOL=    X,             R,               I
##VAR_TYPE=  INDEPENDENT,   DEPENDENT,       DEPENDENT
##VAR_FORM=  AFFN,          ASDF,            ASDF
##VAR_DIM=   65536,         65536,           65536
##UNITS=     HZ,            ARBITRARY UNITS, ARBITRARY UNITS
##FACTOR=    0.49542278885378, 1,            1
##FIRST=     16045.7642231865, 0,            0
##LAST=      -16421.768244346, 0,            0
##MIN=       -16421.768244346, -9420677,     0
##MAX=       16045.7642231865, 325211603,    0
$$ Real data points
##PAGE= N=1
##DATA TABLE= (X++(R..R)), XYDATA
$$ [...]
$$ plain form
41653 6746897 7152304 7230527 7065230 6786813 6579165 6606699 6828776 6974839 6842863 6579848
41643 6579848 6510953 6696042 6829423 6631863 6186680 5796319 5633505 5654941 5777695 6007183
41633 6007183 6389108 6883548 7290890 7358109 7063889 6743656 6731705 6883110 6719600 6124010
41623 6124010 5565934 5429743 5419212 4966980 4039586 3150024 2675089 2570948 2746482 3268298
41613 3268298 4046400 4677191 4858453 4775768 4863900 5288440 5817726 6128848 6113011 5926626
41603 5926626 5840758 6038416 6526769 7219697 8005659 8668715 8907189 8655254 8312351 8395220
41593 8395220 8974451 9703313 10370601 11066727 11715565 11829526 11009917 9493263 7964583
41584 7964583 6954207 6571125 6634447 6832769 6892071 6840921 7042845 7753600 8706199 9346866
$$ packed form
41653F746897M05407P8223j65297k78417k07648K7534K22077J46063j31976k63015
41643F579848o8895J85089J33381j97560m45183l90361j62814K1436J22754K29488
41633F007183L81925M94440M07342O7219k94220l20233j1951J51405j63510n95590
41623F124010n58076j36191j0531m52232r27394q89562m74935j04141J75534N21816
41613C268298P78102O30791J81262q2685Q8132M24540N29286L11122j5837j86385
41603E926626q5868J97658M88353O92928P85962O63056K38474k51935l42903Q2869
41593H395220N79231P28862O67288O96126O48838J13961q19609j516654j528680
41584G964583j010376l83082O3322J98322N9302n1150K01924P10755R52599O40667
$$ plain form
41574 9346866 9454887 9340370 9442957 9905598 10533354 11000253 11080596 10826900 10550778 10508301
41564 10508301 10586786 10425083 9864935 9141683 8556644 8084226 7446234 6547303 5687688
41555 5687688 5260131 5304905 5485899 5502870 5390135 5356817 5481061 5668283 5751245 5464319
41545 5464319 4513531 2994396 1640651 1234358 1685601 2057150 1646612 724474 36043
41536 36043 -80506 181461 542341 844739 991650 1007645 1062616 1192100 1151299 814931
41526 814931 532002 726776 1271410 1624050 1499496 1022734 311882 -607398 -1445698 -1715220
41516 -1715220 -1338656 -801325 -486119 -209302 330730 976559 1339489 1383487 1372519 1305591
41506 1305591 815013 -245119 -1376818 -1829216 -1349403 -394527 392009 764142 872606
$$ packed form
41574I346866J08021j14517J02587M62641O27756M66899Q0343k53696k76122m2477
41564A0508301P8485j61703n60148p23252n85039m72418o37992q98931q59615
41555E687688m27557M4774J80994J6971j12735l3318J24244J87222Q2962k86926
41545E464319r50788j519135j353745m06293M51243L71549m10538r22138o88431
41536C6043j16549K61967L60880L02398J46911J5995N4971J29484m0801l36368
41526H14931k82929J94774N44634L52640j24554m76762p10852r19280q38300k69522
41516a715220L76564N37331L15206K76817N40032O45829L62930M3998j0968o6928
41506A305591m90578j060132j131699m52398M79813R54876P86536L72133J08464
$$ plain form
41497 872606 861125 712416 473445 335570 357372 346914 200883 132525 327317 597440
41487 597440 681459 670103 743760 681879 162156 -513951 -587908 141809 988917 1256898
41477 1256898 989401 627466 384786 272054 324633 420014 188084 -510535 -1274145 -1678932
41467 -1678932 -1835792 -2048942 -2205205 -1986484 -1497550 -1167274 -1119409 -1129866 -1149575 -1354192
41457 -1354192 -1651003 -1652919 -1276707 -921212 -865688 -883066 -685474 -414995 -382073 -533147
41447 -533147 -508421 -166797 203830 250739 5625 -125445 148511 582561 627773 126736
41437 126736 -465948 -724838 -818109 -1081537 -1292159 -932569 -126188 312501 -73985 -820178
41427 -820178 -1273454 -1412641 -1581340 -1818436 -1910225 -1846356 -1769640 -1620466 -1228480 -654546
$$ packed form
41497H72606j1481j48709k38971j37875K1802j0458j46031o8358J94792K70123
41487E97440Q4019j1356P3657o1881n19723o76107p3957P29717Q47108K67981
41477A256898k67497l61935k42680j12732N2579R5381k31930o98619p63610m04787
41467a678932j56860k13150j56263K18721M88934L30276M7865j0457j9709k04617
41457a354192k96811j916L76212L55495N5524j7378J97592K70479L2922j51074
41447e33147K4726L41624L70627M6909k45114j31070K73956M34050M5212n01037
41437A26736n92684k58890r3271k63428k10622L59590Q06381M38689l86486p46193
41427h20178m53276j39187j68699k37096r1789O3869P6716J49174L91986N73934
$$ plain form
41417 -654546 -95633 429550 935393 1137651 727051 -24224 -381587 -7954 635264 897994
41407 897994 662942 273227 -25533 -320500 -781997 -1350459 -1702720 -1528368 -873155 -151999
41397 -151999 256071 319532 147377 -302165 -972738 -1329510 -762696 529450 1559533
41388 1559533 1702981 1398573 1355653 1486781 1189520 457474 26702 339349 933087 1110779
41378 1110779 802045 442193 285821 201316 -811 -361182 -824244 -1217696 -1230584 -717608
41368 -717608 -48665 151799 -264327 -749219 -743224 -362229 -150072 -291587 -416473 -208523
41358 -208523 116574 128297 -212815 -496948 -356864 163558 720981 994930 876613 480159
41348 480159 44062 -248398 -409986 -587984 -874190 -1244133 -1649611 -2018412 -2137526 -1744069
$$ packed form
41417f54546N58913N25183N05843K02258m10600p51275l57363L73633O43218K62730
41407H97994k35052l89715k98760k94967m61497n68462l52261J74352O55213P21156
41397a51999M08070O3461j72155m49542o70573l56772N66814J292146J030083
41388A559533J43448l04408m2920J31128k97261p32046m30772L12647N93738J77692
41378A110779l08734l59852j56372q4505k02127l60371m63062l93452j2888N12976
41368g17608O68943K00464m16126m84892N995L80995K12157j41515j24886K07950
41358b08523L25097J1723l41112k84133J40084N20422N57423K73949j18317l96454
41348D80159m36097k92460j61588j77998k86206l69943m05478l68801j19114L93457
$$ plain form
41338 -1744069 -888984 -68217 233050 82628 -26995 157329 360151 227143 -190250
41329 -190250 -592399 -879436 -1146999 -1311737 -1109396 -596366 -352799 -873344 -1838703 -2309266
41319 -2309266 -1744486 -631376 56497 -87990 -567344 -636489 -87352 666422 1096709
41310 1096709 1013605 623798 311703 338858 616122 758118 465787 -141496 -666093 -870415
41300 -870415 -832645 -695733 -490984 -277475 -213768 -320700 -361402 -175901 7074 -150190
41290 -150190 -587709 -893776 -829262 -547957 -309527 -250366 -443995 -861748 -1190630 -1014594
41280 -1014594 -327560 412291 873991 1169942 1401471 1305119 721554 76670 -96733 94059
41270 94059 146954 -6186 -22300 52457 -297068 -1167694 -1914681 -2032166 -1802830 -1667751
$$ packed form
41338a744069Q55085Q20767L01267j50422j09623J84324K02822j33008m17393
41329a90250m02149k87037k67563j64738K02341N13030K43567n20545r65359m70563
41319b309266N64780J113110O87873j44487m79354o9145N49137P53774M30287
41310A096709q3104l89807l12095K7155K77264J41996k92331o07283n24597k04322
41300h70415L7770J36912K04749K13509O3707j06932m0702J85501J82975j57264
41290a50190m37519l06067O4514K81305K38430N9161j93629m17753l28882J76036
41280a014594O87034P39851M61700K95951K31529r6352n83565o44884j73403J90792
41270I4059N2895j53140j6114P4757l49525q70626p46987j17485K29336J35079
$$ plain form
41260 -1667751 -1459403 -809418 58821 586622 730752 930114 1306945 1523536 1458266 1407904
41250 1407904 1467997 1283844 679671 39669 -276727 -470774 -835159 -1096858 -763705 26487
41240 26487 533149 324510 -237536 -512682 -270345 245340 676301 821333 706818 524945
41230 524945 441338 441181 452821 571260 958635 1511144 1851944 1739693 1302304 794422
41220 794422 339276 21172 -27924 121538 40957 -641026 -1701632 -2470705 -2534621 -2074595
41210 -2074595 -1492692 -972770 -529251 -250326 -249970 -445600 -571843 -434899 -72575 320923
41200 320923 563754 610654 568839 555820 505603 208671 -366746 -902506 -1054519 -899687
41190 -899687 -839115 -1026340 -1141410 -887083 -496414 -452822 -768848 -887068 -424120 259608
$$ packed form
41260a667751K08348O49985Q68239N27801J44130J99362L76831K16591o5270n0362
41250A407904O0093j84153o04173o40002l16396j94047l64385k61699L33153P90192
41240B6487N06662k08639n62046k75146K42337N15685M30961J45032j14515j81873
41230E24945q3607j57J1640J18439L87375N52509L40800j12251m37389n07882
41220G94422m55146l18104m9096J49462q0581o81983j060606p69073o3916M60026
41210b074595N81903N19922M43519K78925L56j95630j26243J36944L62324L93498
41200C20923K42831M6900m1815j3019n0217k96932n75417n35760j52013J54832
41190h99687O0572j87225j15070K54327L90669M3592l16026j18220M62948O83728
$$ plain form
41180 259608 485780 97242 -445327 -755503 -913861 -1030533 -816792 -3365 988447 1295706
41170 1295706 630260 -337326 -800368 -707259 -560970 -588856 -517329 -117440 394560 601026
41160 601026 323576 -232717 -615950 -421960 320430 1029816 1084365 538479 101740 298292
41150 298292 885280 1262593 1214681 988282 806737 640590 436549 276830 216683 147110
41140 147110 -58294 -331413 -424607 -133094 504437 1222701 1763121 2063189 2151994 1941388
41130 1941388 1342394 608185 269668 559874 1126732 1502751 1605510 1516943 1073031 135073
41120 135073 -893694 -1371001 -1253657 -1132554 -1346020 -1572793 -1491193 -1311327 -1299978 -1220933
41110 -1220933 -730471 -46328 293338 209210 152869 446449 965081 1469787 1852531 1991174
$$ packed form
41180B59608K26172l88538n42569l10176j58358j16672K13741Q13427R91812L07259
41170A295706o65446r67586m63042R3109J46289k7886P1527L99889N12000K06466
41160F01026k77450n56293l83233J93990P42390P09386N4549n45886m36739J96552
41150B98292N86988L77313m7912k26399j81545j66147k04041j59719o0147o9573
41140A47110k05404k73119r3194K91513O37531P18264N40420L00068Q8805k10606
41130A941388n98994p34209l38517K90206N66858L76019J02759q8567m43912r37958
41120A35073j028767m77307J17344J21103k13466k26773Q1600J79866J1349P9045
41110a220933M90462O84143L39666q4128n6341K93580N18632N04706L82744J38643
$$ plain form
41100 1991174 1731977 1153560 584185 246573 101136 87466 244475 497072 603700 465779
41090 465779 254556 79518 -229624 -808277 -1424645 -1707353 -1597277 -1368814 -1275506 -1334873
41080 -1334873 -1388582 -1240779 -828195 -372848 -237138 -486873 -753162 -705217 -481439 -403800
41070 -403800 -438708 -292102 48139 266167 236288 195528 283306 262868 -98857 -636737
41060 -636737 -976973 -925006 -519230 63917 494343 456744 68608 -139543 64383 223701
41050 223701 -106783 -575959 -512165 -4302 183515 -195830 -492066 -213323 220473 234910
41040 234910 57367 292250 879745 1156542 838142 332757 74199 75034 204620 415724
41030 415724 558130 389378 -63060 -494034 -782779 -1077774 -1306341 -1082712 -375543 180511
$$ packed form
41100A991174k59197n78417n69375l37612j45437j3670J57009K52597J06628j37921
41090D65779k11223j75038l09142n78653o16368k82708J10076K28463R3308n9367
41080a334873n3709J47803M12584M55347J35710k49735k66289M7945K23778P7639
41070d03800l4908J46606L40241K18028k9879m0760Q7778k0438l61725n37880
41060f36737l40236N1967M05776N83147M30426l7599l88136k08151K03926J59318
41050B23701l30484m69176O3794N07863J87817l79345k96236K78743M33796J4437
41040B34910j77543K34883N87495K76797l18400n05385k58558Q35J29586K11104
41030D15724J42406j68752m52438m30974k88745k94995k28567K23629P07169N56054
$$ plain form
41020 180511 51709 -427073 -493260 40484 668780 961397 1006247 1088266 1295421 1515504
41010 1515504 1588135 1436556 1216496 1253009 1618976 1911364 1736710 1278130 996939 882227
41000 882227 508698 -126142 -386466 136455 986022 1395229 1155710 601458 20612 -489121
40990 -489121 -740505 -498708 148286 762401 964986 690520 67339 -686769 -1213015 -1144427
40980 -1144427 -479364 307287 703623 691323 729152 1191008 1891199 2240356 1892368 1171433
40970 1171433 753945 924464 1269005 1159191 415894 -603749 -1442472 -1877679 -1894063
40961 -1894063 -1583500 -1156580 -865857 -762165 -623698 -286676 13811 -155049 -837531
40952 -837531 -1507998 -1625646 -1233426 -809032 -626194 -542363 -393906 -255859 -207938 -186387
$$ packed form
41020A80511j28802m78782o6187N33744O28296K92617M4850Q2019K07155K20083
41010A515504P2631j51579k20060L6513L65967K92388j74654m58580k81191j14712
41000H82227l73529o34840k60324N22921Q49567M09207k39519n54252n80846n09733
40990d89121k51384K41797O46994O14115K02585k74466o23181p54108n26246O8588
40980a144427O65063P86651L96336j2300L7829M61856P00191L49157l47988p20935
40970A171433m17488J70519L44541j09814p43297j019643q38723m35207j6384
40961a894063L10563M26920K90723J03692J38467L37022L00487j68860o82482
40952h37531o70467j17648L92220M24394J82838Q3831J48457J38047M7921K1551
$$ plain form
40942 -186387 -261748 -707292 -1465911 -1872998 -1385819 -389413 257428 359623 455856 780453
40932 780453 911741 685808 704248 1404364 2183355 2127189 1292529 572788 434844 470291
40922 470291 223205 -175220 -402320 -483196 -626816 -804664 -762752 -322261 470393 1362395
40912 1362395 1985415 2096529 1833344 1603170 1648326 1854330 2049315 2320986 2873542 3621908
40902 3621908 4085094 3792520 2826263 1880576 1640973 2096546 2612662 2675496 2328407 1851559
40892 1851559 1388185 1080823 1182084 1660261 1992267 1790286 1418502 1511467 2046042 2419711
40882 2419711 2357532 2176282 2143625 2125452 1950900 1643300 1228610 801831 796752 1581035
40872 1581035 2689949 3151270 2798564 2552010 3032687 3615286 3417210 2621546 2107468
$$ packed form
40942a86387p5361m45544p58619m07087M87179R96406O46841J02195R6233L24597
40932G80453J31288k25933J8440P00116P78991n6166q34660p19741j37944L5447
40922D70291k47086l98425k27100q0876j43620j77848M1912M40491P92654Q92002
40912A362395O23020J11114k63185k30174M5156K06004J94985K71671N52556P48366
40902C621908M63186k92574r66257r45687k39603M55573N16116O2834l47089m76848
40892A851559m63374l07362J01261M78177L32006k01981l71784R2965N34575L73669
40882B419711o2179j81250l2657j8173j74552l07600m14690m26779n079P84283
40872A581035J108914M61321l52706k46554M80677N82599j98076p95664n14078
$$ plain form
40863 2107468 2182752 2432713 2580420 2751216 2952761 2950312 2719555 2527933 2498591 2468352
40853 2468352 2294543 1995208 1645963 1428329 1626022 2219690 2678005 2585134 2282671 2369491
40843 2369491 2735748 2731883 2231805 1808539 1749366 1616018 1074607 541142 564621 1006401
40833 1006401 1305763 1297428 1325907 1656377 2110442 2290645 2002029 1454955 1074561 1035056
40823 1035056 1055327 841631 605768 788219 1321919 1634970 1461276 1174894 1147391 1233469
40813 1233469 1147767 926525 702612 414590 108642 168653 786922 1461993 1512884 956436
40803 956436 424748 291502 316842 159601 -148010 -316216 -123722 407251 946634 998384
40793 998384 370457 -490483 -879518 -570546 33529 458909 600004 591457 563570 663190
$$ packed form
40863B107468P5284K49961J47707J70796K01545k449k30757j91622k9342l0239
40853B468352j73809k99335l49245k17634J97693N93668M58315r2871l02463Q6820
40843B369491L66257l865n00078m23266n9173j33348n41411n33465K3479M41780
40833A006401K99362q335K8479L30470M54065J80203k88616n47074l80394l9505
40823A035056K0271k13696k35863J82451N33700L13051j73694k86382k7503Q6078
40813A233469q5702k21242k23913k88022l05948O0011O18269O75071N0891n56448
40803I56436n31688j33246K5340j57241l07611j68206J92494N30973N39383N1750
40793I98384o27927q60940l89035L08972O04075M25380J41095q547k7887R9620
$$ plain form
40783 663190 1068223 1770018 2463065 2829211 2875780 2862572 2943812 3025396 2977474 2845116
40773 2845116 2768471 2788001 2857836 3005607 3291446 3574982 3553143 3182308 2856623 2927162
40763 2927162 3214701 3304955 3166232 3050229 2877835 2294851 1432729 1015924 1416238 2105737
40753 2105737 2439310 2524148 2800327 3131667 2981002 2346642 1863877 1913725 2172838 2203999
40743 2203999 2050942 2011305 2126916 2173979 2036336 1893577 2020267 2413112 2645486 2253063
40733 2253063 1351089 644866 628166 1001272 1166895 1060032 1068340 1296967 1433393 1329619
40723 1329619 1212191 1215198 1149652 892208 620032 481770 370164 208678 168738 413694
40713 413694 880143 1466420 2165920 2844438 3162193 2932959 2350125 1690591 1037725 476844
$$ packed form
40783F63190M05033P01795O93047L66146M6569j3208Q1240Q1584m7922j32358
40773B845116p6645J9530O9835J47771K85839K83536k1839l70835l25685P0539
40763B927162K87539R0254j38723j16003j72394n82984q62122m16805M00314O89499
40753B105737L33573Q4838K76179L31340j50665o34360m82765M9848K59113L1161
40743B203999j53057l9637J15611M7063j37643j42759J26690L92845K32374l92423
40733B253063r01974p06223j6700L73106J65623j06863Q308K28627J36426j03774
40723A329619j17428L007o5546k57444k72176j38262j11606j61486l9940K44956
40713D13694M66449N86277O99500O78518L17755k29234n82834o59534o52866n60881
$$ plain form
40703 476844 272967 553240 999526 1170101 1038805 954865 1121202 1349153 1337478 1028336
40693 1028336 658082 544759 838851 1445434 2170749 2868421 3372503 3438266 2993846 2384276
40683 2384276 2059194 2008458 1830411 1401399 1088256 1148867 1319474 1270575 1146260 1296008
40673 1296008 1684295 1935541 1860199 1609737 1348250 1045165 608932 37378 -576540 -1066932
40663 -1066932 -1250375 -1068072 -655781 -228284 47429 70092 -155319 -458219 -633096 -655728
40653 -655728 -620797 -514504 -300967 -178626 -378981 -702084 -702020 -415493 -381957 -755466 -986246
40642 -986246 -729275 -476035 -750177 -1176330 -1039353 -454240 -239085 -732615 -1392245 -1566525
40632 -1566525 -1135132 -390031 234110 328061 -129470 -589771 -523806 -110527 90352 -24007
$$ packed form
40703D76844k03877K80273M46286J70575j31296q3940J66337K27951j1675l09142
40693A028336l70254j13323K94092O06583P25315O97672N04082O5763m44420o09570
40683B384276l25082n0736j78047m29012l13143O0611J70607m8899j24315J49748
40673A296008L88287K51246p5342k50462k61487l03085m36233n71554o13918m90392
40663a066932j83443J82303M12291M27497K75713K2663k25411l02900j74877k2632
40653f55728L4931J06293K13537J22341k00355l23103O4K86527L3536l73509k30780
40642i86246K56971K53240k74142m26153J36977N85113K15155m93530o59630j74280
40632a566525M31393P45101O24141R3951m57531m60301O5965M13279K00879j14359
$$ plain form
40622 -24007 -157007 -346676 -903258 -1600252 -1706338 -1030771 -256175 45383 104285 329693
40612 329693 575066 462580 15258 -438592 -657734 -471373 250832 1253046 1850847
40603 1850847 1617071 882309 275061 26906 -17011 -10216 -18841 -43055 130329 788337
40593 788337 1759392 2382097 2297038 1897682 1678207 1550653 1208047 744344 410644 109410
40583 109410 -319267 -609436 -458088 -155009 -187609 -389333 -167854 461705 744382 182125
40573 182125 -889604 -1836775 -2345025 -2372544 -1955288 -1285750 -686880 -344914 -244029 -338243
40563 -338243 -521984 -503619 -57858 626661 1166070 1444910 1509201 1200624 438109 -268497
40553 -268497 -254296 330300 642003 312184 -198650 -534988 -922257 -1380772 -1282807 -294017
$$ packed form
40622b4007j33000j89669n56582o96994j06086O75567P74596L01558N8902K25408
40612C29693K45373j12486m47322m53850k19142J86361P22205J002214N97801
40603A850847k33776p34762o07248k48155m3917O795q625k4214J73384O58008
40593G88337R71055O22705q5059l99356k19475j27554l42606m63703l33700l01234
40583A09410m28677k90169J51348L03079l2600k01724K21479O29559K82677n62257
40573A82125j071729r47171n08250k7519M17256O69538N98870L41966J00885r4214
40563c38243j83741J8365M45761O84519N39409K78840O4291l08577p62515p06606
40553b68497J4201N84596L11703l29819n10834l36338l87269m58515R7965R88790
$$ plain form
40543 -294017 847191 1166737 662894 55263 -310840 -631873 -964748 -1093914 -1038332 -1106711
40533 -1106711 -1403355 -1700242 -1790786 -1618140 -1151816 -528879 -193353 -443528 -929078 -1059491
40523 -1059491 -817926 -648519 -614669 -317878 271324 582800 319075 -16735 153327 673077
40513 673077 990199 964313 888047 915291 890562 639821 102525 -710576 -1580064 -2023774
40503 -2023774 -1736842 -1034004 -523564 -371982 -224807 163754 629732 1013429 1437120
40494 1437120 1899034 1938896 1149714 -97432 -892057 -833642 -492396 -634780 -1263355 -1721712
40484 -1721712 -1600957 -1175954 -928042 -984457 -1181529 -1389734 -1507202 -1324199 -748916 -130264
40474 -130264 -9789 -457232 -922113 -899700 -535971 -375202 -662992 -1153358 -1545669 -1818379
$$ packed form
40543b94017J141208L19546n03843o07631l66103l21033l32875j29166N5582o8379
40533a106711k96644k96887r0544J72646M66324O22937L35526k50175m85550j30413
40523a059491K41565J69407L3850K96791N89202L11476k63725l35810J70062N19750
40513F73077L17122k5886p6266K7244k4729k50741n37296q13101q69488m43710
40503b023774K86932P02838N10440J51582J47175L88561M65978L83697M23691
40494A437120M61914L9862p89182j247146p94625N8415L41246j42384o28575m58357
40484a721712J20755M25003K47912n6415j97072k08205j17468J83003N75283O18652
40474a30264J20475m47443m64881K2413L63729J60769k87790m90366l92311k72710
$$ plain form
40464 -1818379 -2024109 -1975919 -1399092 -399968 440882 627265 339419 258514 737270 1336083
40454 1336083 1352615 687176 -54430 -293550 -78889 99905 -83971 -459325 -515151 111801
40444 111801 1147528 1701258 1055454 -468079 -1699290 -1833012 -1199212 -645384 -481519
40435 -481519 -402825 -213675 -99562 -177188 -237992 -81586 225611 557111 888292 1104403
40425 1104403 955761 430983 -65586 -158215 64853 307551 575286 1101302 1835246 2335984
40415 2335984 2243916 1660516 993491 551579 324695 71855 -383461 -903467 -1151757 -1007721
40405 -1007721 -698751 -388442 127822 1003049 1777862 1701804 674514 -529326 -1123893
40396 -1123893 -1068194 -789899 -527171 -281221 -167356 -372091 -804228 -1155555 -1359470 -1679461
$$ packed form
40464a818379k05730M8190N76827R99124Q40850J86383k87846q0905M78756N98813
40454A336083J6532o65439p41606k39120K14661J78794j83876l75354n5826O26952
40444A11801J035727N53730o45804j523533j231211j33722O33800N53828J63865
40435d81519P8694J89150J14113p7626o0804J56406L07197L31500L31181K16111
40425A104403j48642n24778m96569r2629K23068K42698K67735N26016P33944N00738
40415B335984r2068n83400o67025m41912k26884k52840m55316n20006k48290J44036
40405a007721L08970L10309N16264Q75227P74813p6058j027290j203840n94567
40396a123893N5699K78295K62728K45950J13865k04735m32137l51327k03915l19991
$$ plain form
40386 -1679461 -2206842 -2513691 -2054866 -866993 341787 894354 842253 810105 1147988
40377 1147988 1468413 1209305 462590 -131737 -291590 -437952 -954813 -1528292 -1589737 -1131671
40367 -1131671 -648220 -436409 -418976 -563325 -943680 -1327809 -1221127 -543128 138544 316491
40357 316491 169517 190869 458928 629682 500251 231689 62429 89112 322964 710576
40347 710576 1061022 1154447 1001283 882265 1076136 1585580 2104529 2210962 1687115 771544
40337 771544 26661 -199456 -166460 -464263 -1325493 -2309519 -2697017 -2159868 -1062476 -143433
40327 -143433 133359 -60683 -245952 -273329 -434241 -874681 -1183201 -840500 53492 818209
40317 818209 959138 641605 357711 349676 467535 445094 191329 -146844 -360077 -414120
$$ packed form
40386a679461n27381l06849M58825J187873J208780N52567n2101l2148L37883
40377A147988L20425k59108p46715n94327j59853j46362n16861n73479o1445M58066
40367a131671M83451K11811J7433j44349l80355l84129J06682O77999O81672J77947
40357C16491j46974K1352K68059J70754j29431k68562j69260K6683K33852L87612
40347G10576L50446R3425j53164j19018J93871N09444N18949J06433n23847r15571
40337G71544p44883k26117L2996k97803q61230r84026l87498N37149J097392R19043
40327a43433K76792j94042j85269k7377j60912m40440l08520L42701Q93992P64717
40317H18209J40929l17533k83894q035J17859k2441k53765l38173k13233n4043
$$ plain form
40307 -414120 -454983 -543764 -534602 -354160 -231753 -388298 -604726 -444622 97368 527114
40297 527114 508697 241481 38390 -115297 -333268 -470799 -354997 -182922 -295287 -614298
40287 -614298 -681520 -306835 124464 111233 -399888 -1015090 -1294902 -1058099 -440484 206613
40277 206613 558340 582356 529397 581558 573126 185232 -592771 -1333613 -1575843 -1278018
40267 -1278018 -776194 -351617 -7666 302693 449523 321535 132697 261424 756716
40258 756716 1239649 1389727 1321801 1324571 1388528 1219064 679243 34007 -297019 -167441
40248 -167441 137494 191982 -62925 -164960 338506 1234908 1819551 1805293 1685854 1936380
40238 1936380 2219263 1858118 912681 233834 431929 1248596 2015533 2298663 1994811
$$ packed form
40307d14120m0863q8781R162J80442J22407j56545k16428J60104N41990M29746
40297E27114j8417k67216k03091j53687k17971j37531J15802J72075j12365l19011
40287f14298o7222L74685M31299j3231n11121o15202k79812K36803O17615O47097
40277B06613L51727K4016n2959N2161q432l87894p78003p40842k42230K97825
40267a278018N01824M24577L43951L10359J46830j27988j88838J28727M95292
40258G56716M82933J50078o7926K770O3957j69464n39821o45236l31026J29578
40248a67441L04935N4488k54907j02035N03466Q96402N84643j4258j19439K50526
40238A936380K82883l61145r45437o78847J98095Q16667P66937K83130l03852
$$ plain form
40229 1994811 1269695 610326 505616 800533 755572 46742 -705435 -805627 -486954 -492858
40219 -492858 -928886 -1185086 -921917 -495521 -336658 -470210 -776416 -1195521 -1486473 -1299498
40209 -1299498 -760797 -519854 -882960 -1314156 -1179280 -612542 -197742 -100232 -24412 182236
40199 182236 411869 648411 908534 900219 276807 -752944 -1565056 -1905366 -2034022 -2043337
40189 -2043337 -1630391 -752327 61621 392776 474361 691298 954112 986226 872030 839210
40179 839210 766043 403560 -100358 -386062 -454477 -581335 -770685 -781344 -625312 -538125
40169 -538125 -491947 -274552 -67931 -358402 -1128841 -1702256 -1631904 -1251335 -1055519 -1022130
40159 -1022130 -939856 -992808 -1499964 -2290522 -2820408 -2837211 -2566338 -2290037 -2056146 -1792735
$$ packed form
40229A994811p25116o59369j04710K94917m4961p08830p52177j00192L18673n904
40219d92858m36028k56200K63169M26396J58863j33552l06206m19105k90952J86975
40209a299498N38701K40943l63106m31196J34876N66738M14800R7510P5820K06648
40199A82236K29633K36542K60123q315o23412j029751q12112l40310j28656r315
40189b043337M12946Q78064Q13948L31155Q1585K16937K62814L2114j14196l2820
40179H39210p3167l62483n03918k85704o8415j26858j89350j0659J56032Q7187
40169e38125M6178K17395K06621k90471p70439n73415P0352L80569J95816L3389
40159a022130Q2274n2952n07156p90558n29886j6803K70873K76301K33891K63411
$$ plain form
40149 -1792735 -1472108 -1149727 -951907 -938939 -910566 -560559 42436 399741 218603 -173967
40139 -173967 -306528 -150966 69695 306554 485509 234234 -586771 -1306064 -1089278 -97087
40129 -97087 688763 795683 683010 738729 678259 286022 9854 273078 740806 849913
40119 849913 654312 568548 619902 564002 478067 600736 744306 497567 -62938 -464723
40109 -464723 -598359 -764942 -957495 -780820 -243511 55435 -136721 -199300 474726 1506036
40099 1506036 2000760 1732344 1288042 1140845 1120334 879407 440859 62529 -178703 -412342
40089 -412342 -654568 -660055 -191053 584921 1092897 898196 220682 -311167 -437482 -503830
40079 -503830 -804043 -1062407 -908380 -573245 -600562 -960064 -1010670 -444321 253512 532991
$$ packed form
40149a792735L20627L22381J97820J2968K8373L50007O02995L57305j81138l92570
40139a73967j32561J55562K20661K36859J78955k51275q21005p19293K16786R92191
40129i7087P85850J06920j12673N5719o0470l92237k76168K63224M67728J09107
40119H49913j95601q5764N1354n5900q5935J22669J43570k46739n60505m01785
40109d64723j33636j66583j92553J76675N37309K98946j92156o2579O74026J031310
40099A506036M94724k68416m44302j47197k0511k40927m38548l78330k41232k33639
40089d12342k42226n487M69002P75974N07976j94701o77514n31849j26315o6348
40079e03830l00213k58364J54027L35135k7317l59502n0606N66349O97833K79479
$$ plain form
40069 532991 512224 581281 614672 143249 -754114 -1273578 -794658 362692 1319314 1570294
40059 1570294 1303689 931307 618521 337210 147857 226912 650381 1282769 1886082 2239876
40049 2239876 2172307 1665190 1032186 806284 1214873 1843860 2078373 1844713 1608683 1612717
40039 1612717 1516517 999759 347814 68589 175470 289616 317092 540249 1042663 1510455
40029 1510455 1698641 1684695 1547016 1223983 874571 932209 1502345 2092404 2289364 2334170
40019 2334170 2580366 2727626 2209920 1189227 499870 553405 880691 911734 678858 494161
40009 494161 391649 246423 117760 86087 -43269 -497729 -1101109 -1407800 -1252380 -916220
39999 -916220 -736289 -729183 -625965 -177741 557477 1176427 1263533 834929 336359 114991
$$ packed form
40069E32991k0767O9057L3391m71423q97363n19464M78920J157350R56622K50980
40059A570294k66605l72382l12786k81311j89353P9055M23469O32388O03313L53794
40049B239876o7569n07117o33004k25902M08589O28987K34513k33660k36030M034
40039A612717r6200n16758o51945k79225J06881J14146K7476K23157N02414M67792
40029A510455J88186j3946j37679l23033l49412N7638N70136N90059J96960M4806
40019B334170K46196J47260n17706j020693o89357N3535L27286L1043k32876j84697
40009D94161j02512j45226j28663l1673j29356m54460o03380l06691J55420L36160
39999i16220J79931P106J03218M48224P35218O18950Q7106m28604m98570k21368
$$ plain form
39989 114991 44341 -204170 -689196 -1183402 -1487735 -1549081 -1372433 -1043580 -769357 -674463
39979 -674463 -603092 -321558 136822 533985 766456 900963 919185 708269 321805 -12937
39969 -12937 -190333 -280310 -247630 87373 683553 1144470 1152442 862112 662330 659977 582618
39958 582618 143642 -610844 -1279729 -1400924 -885056 -187761 119581 -3844 -79573 157384
39948 157384 375901 240318 44905 305873 894204 1120538 713218 177988 -17552 -134598
39938 -134598 -653483 -1406300 -1733391 -1423347 -1026478 -1135467 -1696262 -2185455 -2211871 -1758442
39928 -1758442 -1032262 -315902 122674 196464 90160 67989 198611 348794 401309 377792
39918 377792 380469 499967 735242 926922 854977 514966 196916 132822 164676 -29011
$$ packed form
39989A14991p0650k48511m85026m94206l04333o1346J76648L28853K74223R4894
39979f74463P1371K81534M58380L97163K32471J34507J8222k10916l86464l34742
39969a2937j77396q9977L2680L35003N96180M60917P972k90330j99782k353p7359
39958E82618m38976p54486o68885j21195N15868O97295L07342j23425p5729K36957
39948A57384K18517j35583j95413K60968N88331K26334m07320n35230j95540j17046
39938a34598n18885p52817l27091L10044L96869j08989n60795m89193k6416M53429
39928a758442P26180P16360M38576P3790j06304k2171J30622J50183N2515k3517
39918C77792K677J19498K35275J91680p1945l40011l18050o4094L1854j93687
$$ plain form
39908 -29011 -449547 -765736 -748189 -463428 -76861 230651 183503 -333206 -862196 -681519
39898 -681519 266130 1189956 1485719 1500046 1838630 2350630 2429794 2047220 1730145 1569306
39888 1569306 1032223 -41177 -944027 -994767 -454210 -131238 -383440 -894155 -1218596
39879 -1218596 -1185509 -890185 -595836 -557079 -702858 -583362 152663 1298204 2270446 2658962
39869 2658962 2451541 1871779 1225552 829692 843895 1118224 1308270 1177667 799894 518997
39859 518997 662315 1150847 1454933 1165531 566011 330624 673154 1183077 1519041 1746389
39849 1746389 1856041 1568647 948286 602562 773281 787909 69243 -798612 -844298 -227380
39839 -227380 -43651 -721676 -1557153 -1895735 -1834236 -1541255 -837422 112532 524012 5929
$$ packed form
39908b9011m20536l16189J7547K84761L86567L07512m7148n16709n28990J80677
39898f81519R47649R23826K95763J4327L38584N12000P9164l82574l17075j60839
39888A569306n37083j073400r02850n0740N40557L22972k52202n10715l24441
39879a218596L3087K95324K94349L8757j45779J19496P36025J145541R72242L88516
39869B658962k07421n79762o46227l95860J4203K74329J90046j30603l77773k80897
39859E18997J43318M88532L04086k89402n99520k35387L42530N09923L35964K27348
39849A746389J09652k87394o20361l45724J70719J4628p18666q67855m5686O16918
39839b27380J83729o78025q35477l38582O1499K92981P03833R49954M11480n18083
$$ plain form
39829 5929 -780531 -1068040 -1020124 -1168942 -1330294 -899023 38994 699597 663694 289309
39819 289309 36657 -47776 -95312 -150435 -259428 -446493 -515941 -200823 436456 1028022
39809 1028022 1311152 1237289 784162 75062 -384469 -118907 590569 907831 542734 151891
39799 151891 366390 888061 976193 502153 9462 -145797 -228956 -640082 -1329476 -1838829
39789 -1838829 -1767009 -1126312 -356872 -28444 -397648 -1151284 -1614421 -1306597 -369816 543461
39779 543461 870680 664920 453791 549354 669799 396158 -174149 -522631 -391548 -51317
39769 -51317 124390 33370 -258516 -654608 -927964 -799543 -309672 135144 253356 172873
39759 172873 78143 -91541 -356874 -469647 -314279 -218176 -436069 -613531 -302043 197328
$$ packed form
39829E929p86460k87509M7916j48818j61352M31271R38017O60603l5903l74385
39819B89309k52652q4433m7536n5123j08993j87065o9448L15118O37279N91566
39809A028022K83130p3863m53127p09100m59531K65562P09476L17262l65097l90843
39799A51891K14499N21671Q8132m74040m92691j55259q3159m11126o89394n09353
39789a838829P1820O40697P69440L28428l69204p53636m63137L07824R36781R13277
39779E43461L27219k05760k11129R5563J20445k73641n70307l48482J31083L40231
39769e1317J75707r1020k91886l96092k73356J28421M89871M44816J18212q0483
39759A72873r4730j69684k65333j12773J55368R6103k17893j77462L11488M99371
$$ plain form
39749 197328 154706 -470189 -915802 -745442 -412913 -417230 -520023 -280596 117506 189903
39739 189903 19144 137474 608557 854008 527201 44096 -22097 296020 534554 503141
39729 503141 444950 566633 753889 817807 750517 588164 235358 -326534 -768593 -677065
39719 -677065 -134599 272953 195077 -33970 27109 176229 -109836 -710939 -862551 -306826
39709 -306826 156635 -281070 -1268644 -1770881 -1491443 -1154550 -1369508 -1873257 -2124415 -2092083
39699 -2092083 -2055605 -2004720 -1726145 -1299475 -1032383 -945541 -751960 -401703 -239006 -441323
39689 -441323 -652336 -485478 -175126 -320630 -995649 -1493253 -1125532 -29305 1043336
39680 1043336 1569040 1624802 1518283 1389657 1253693 1159715 1136137 1126960 1113643 1158414 1209350
$$ packed form
39749A97328m2622o24895m45613J70360L32529m317j02793K39427L98102P2397
39739A89903j70759J18330M71083K45451l26807m83105o6193L18117K38534l1413
39729E03141n8191J21683J87256O3918o7290j62353l52806n61892m42059R1528
39719f77065N42466M07552p7876k29047O1079J49120k86065o01103j51612N55725
39709c06826M63461m37705r87574n02237K79438L36893k14958n03749k51158L2332
39699b092083L6478N0885K78575M26670K67092Q6842J93581L50257J62697k02317
39689d41323k11013J66858L10352j45504o75019m97604L67721J096227J072641
39680A043336N25704N5762j06519j28626j35964r3978k3578r177j3317M4771N0936
$$ plain form
39669 1209350 1039746 557750 19234 -281334 -391473 -510919 -537632 -155553 600006 1181012
39659 1181012 1062143 264681 -711810 -1311733 -1266116 -747759 -256037 -149431 -243533 -89248
39649 -89248 327240 481520 38458 -639243 -954570 -806914 -571435 -513328 -538193 -472562
39639 -472562 -322496 -215855 -232239 -306382 -249246 64466 499256 801035 978835 1302758
39629 1302758 1812061 2131228 1993364 1629170 1312471 842820 -20488 -815425 -708785
39620 -708785 373590 1505673 1843983 1506454 1123512 905313 535831 -184605 -936124
39611 -936124 -1137860 -502191 618508 1426033 1382156 763266 316883 337972 383822 26262
39601 26262 -475939 -580223 -305129 -243174 -734250 -1383953 -1554986 -1130868 -583614 -324949
$$ packed form
39669A209350j69604m81996n38516l00568j10139j19446k6713L82079P55559N81006
39659A181012j18869p97462r76491n99923M5617N18357M91722J06606r4102J54285
39649h9248M16488J54280m43062o77701l15327J47656K35479N8107k4865O5631
39639d72562J50066J06641j6384p4143N7136L13712M34790L01779J77800L23923
39629A302758N09303L19167j37864l64194l16699m69651q63308p94937J06640
39620g08785J082375J132083L38310l37529l82942k18199l69482p20436p51519
39611i36124k01736O35669J120699Q07525m3877o18890m46383K1089M5850l57560
39601B6262n02201j04284K75094O1955m91076o49703j71033M24118N47254K58665
$$ plain form
39591 -324949 -181821 351773 1398649 2445989 2931956 2921361 2953194 3277022 3538670 3290001
39581 3290001 2550572 1721810 1129561 802332 569041 238034 -228461 -621479 -658391 -313096
39571 -313096 138988 454720 655107 856413 1030026 1031665 747871 152460 -625356 -1222459
39561 -1222459 -1234791 -638515 111747 533795 569500 508399 591813 797172 930677 868228
39551 868228 745435 848486 1205402 1439333 1283119 1072727 1316214 1874544 2106076 1821374
39541 1821374 1467906 1264481 889593 322236 207909 839075 1445005 1202955 423294
39532 423294 -53102 -189340 -585461 -1272988 -1646035 -1505225 -1255516 -1054425 -647417 -127052
39522 -127052 44011 -49732 277335 1164147 1864240 1940303 1948908 2403338 2841769 2626398
$$ packed form
39591c24949J43128N33594J046876J047340M85967j0595L1833L23828K61648k48669
39581C290001p39429q28762n92249l27229k33291l31007m66495l93018l6912L45295
39571c13096M52084L15732K00387K01306J73613J639k83794n95411p77816n97103
39561a222459j2332N96276P50262M22048L5705o1101Q3414K05359J33505o2449
39551H68228j22793J03051L56916K33931j56214k10392K43487N58330K31532k84702
39541A821374l53468k03425l74888n67357j14327O31166O05930k42050p79661
39532D23294m76396j36238l96121o87527l73047J40810K49709K01091M07008N20365
39522a27052J71063r3743L27067Q86812P00093P6063Q605M54430M38431k15371
$$ plain form
39512 2626398 2037871 1774557 1800487 1516293 840093 355843 459589 970751 1543925 1938287
39502 1938287 1934652 1500502 1030681 969731 1191093 1153792 662319 86130 -152631 69415
39492 69415 698606 1566124 2321596 2689903 2807661 2946859 2958801 2468185 1635568 1156580
39482 1156580 1298563 1452378 989709 176940 -185771 211912 961766 1596328 2021951
39473 2021951 2270455 2246802 1957968 1753339 2018052 2635994 3007866 2724051 2054928 1575972
39463 1575972 1413132 1179443 707856 456113 868855 1581502 1727709 1042977 226786
39454 226786 37087 391447 684128 739598 974872 1615201 2230006 2316274 2017627 1844647
39444 1844647 1824979 1443890 508301 -437007 -829509 -789216 -692708 -442763 228202 961509
$$ packed form
39512B626398n88527k63314K5930k84194o76200m84250J03746N11162N73174L94362
39502A938287l635m34150m69821o0950K21362l7301m91473n76189k38761K22046
39492F9415O29191Q67518P55472L68307J17758J39198J1942m90616q32617m78988
39482A156580J41983J53815m62669q12769l62711L97683P49854O34562M25623
39473B021951K48504k3653k88834k04629K64713O17942L71872k83815o69123m78956
39463A575972j62840k33689m71587k51743M12742P12647J46207o84732q16191
39454B26786j89699L54360K92681N5470K35274O40329O14805Q6268k98647j72980
39444A844647j9668l81089r35589r45308l92502M0293R6508K49945O70965P33307
$$ plain form
39434 961509 1033102 430644 -51646 46772 323851 391932 528723 958715 1171053 689086
39424 689086 61018 247515 1219961 1949563 1757838 989933 305228 -48924 -103499 123044
39414 123044 515032 818759 911585 876221 760238 537520 299434 164697 34084 -208793
39404 -208793 -325752 606 570373 871214 884668 1088843 1558209 1724314 1305837 864101
39394 864101 1017905 1581350 1927007 1828022 1499766 1132975 852531 895273 1362352 1934316
39384 1934316 2208743 2183624 2081535 1887218 1444667 862074 411200 111428 -194967 -405589
39374 -405589 -191628 502454 1319511 1901408 2178080 2219345 2065853 1782013 1479155 1223839
39364 1223839 1058846 1094565 1381150 1679805 1588227 1006242 353050 201092 702374 1413121
$$ packed form
39434I61509P1593o02458m82290R8418K77079O8081J36791M29992K12338m81967
39424F89086o28068J86497R72446P29602j91725p67905o84705l54152n4575K26543
39414A23044L91988L03727R2826l5364j15983k22718k38086j34737j30613k42877
39404b08793j16959L26358N69767L00841J3454K04175M69366J66105m18477m41736
39394H64101J53804N63445L45657r8985l28256l66791k80444M2742M67079N71964
39384A934316K74427k5119j02089j94317m42551n82593m50874k99772l06395k10622
39374d05589K13961O94082Q17057N81897K76672M1265j53492k83840l02858k55316
39364A223839j64993L5719K86585K98655r1578n81985o53192j51958N01282P10747
$$ plain form
39354 1413121 1712954 1436859 1060741 1160520 1722639 2174550 2098305 1646612 1166274 733692
39344 733692 302259 43351 182371 596556 884838 807951 430850 -100944 -651733 -977406
39334 -977406 -806658 -160784 539991 785794 393176 -333368 -822292 -737052 -342457 -241106
39324 -241106 -649555 -1105695 -1037730 -438305 231232 641689 839133 985716 1126747 1200802
39314 1200802 1083452 630135 -170697 -1086733 -1759907 -1905234 -1435517 -603507 -22288
39305 -22288 -179354 -776051 -937807 -338065 299923 204574 -353607 -528578 -151039 170234
39295 170234 80819 -92581 -18763 154955 180923 89685 6955 -12805 155664 616564 1107515
39284 1107515 1167542 778223 403476 254373 12296 -480469 -760110 -360622 462706 1030679
$$ packed form
39354A413121K99833k76095l76118R9779N62119M51911p6245m51693m80338m32582
39344G33692m31433k58908J39020M14185K88282p6887l77101n31794n50789l25673
39334i77406J70748O45874P00775K45803l92618p26544m88924Q5240L94595J01351
39324b41106m08449m56140O7965N99425O69537M10457J97444J46583J41031P4055
39314A200802j17350m53317q00832r16036o73174j45327M69717Q32010N81219
39305b2288j57066n96697j61756N99742O37988r5349n58181j74971L77539L21273
39295A70234q9415j73400P3818J73718K5968r1238q2730j9760J68469M60900M90951
39284A107515O0027l89319l74747j49103k42077m92765k79641L99488Q23328N67973
$$ plain form
39274 1030679 1027693 662014 253462 -17075 -105089 -125508 -257616 -443116 -357970 145999
39264 145999 800988 1310061 1702930 2071329 2241215 2032084 1618035 1294012 1066454 812539
39254 812539 670949 883298 1332312 1608408 1526919 1289709 1150673 1180249 1336674 1518389
39244 1518389 1551632 1344330 1047341 890313 905536 986864 1138591 1453410 1898216 2316419
39234 2316419 2593616 2671346 2508317 2196177 1952827 1788811 1385667 604178 -99700 -182591
39224 -182591 207202 458631 462047 770658 1665029 2608545 2961504 2836724 2833007 3149245
39214 3149245 3384752 3156144 2561798 1971800 1573457 1226011 690932 -37867 -631181
39205 -631181 -702837 -228600 371186 614092 377060 -72832 -370223 -318686 44950 547784
$$ packed form
39274A030679k986l65679m08552k70537q8014k0419j32108j85500Q5146N03969
39264A45999O54989N09073L92869L68399J69886k09131m14049l24023k27558k53915
39254H12539j41590K12349M49014K76096q1489k37210j39036K9576J56425J81715
39244A518389L3243k07302k96989j57028J5223Q1328J51727L14819M44806M18203
39234B316419K77197P7730j63029l12140k43350j64016m03144p81489p03878q2891
39224a82591L89793K51429L416L08611Q94371R43516L52959j24780l717L16238
39214C149245K35507k28608n94346n89998l98343l47446n35079p28799n93314
39205f31181p1656M74237N99786K42906k37032m49892k97391N1537L63636N02834
$$ plain form
39195 547784 1031778 1429090 1697482 1743889 1499365 1057222 655009 516509 746835 1294258
39185 1294258 1886203 2082918 1624247 771896 135177 83373 458481 908976 1320530 1784062
39175 1784062 2274563 2563326 2460756 2045026 1619438 1467650 1640028 1956123 2205236
39166 2205236 2310279 2280737 2102634 1791718 1491108 1332864 1188818 751728 -40946 -810964
39156 -810964 -1100156 -837276 -310362 252245 877358 1591668 2165559 2301188 2039457 1775018
39146 1775018 1775995 1861069 1739562 1526679 1585393 1862057 1802387 1140193 403476 264133
39136 264133 628202 826111 582340 290305 317114 560646 852133 1302495 1935173 2355038
39126 2355038 2197392 1705607 1477988 1733238 2142467 2317716 2158742 1748258 1217995
$$ packed form
39195E47784M83994L97312K68392M6407k44524m42143m02213j38500K30326N47423
39185A294258N91945J96715m58671q52351o36719n1804L75108M50495M11554M63532
39175A784062M90501K88763j02570m15730m25588j51788J72378L16095K49113
39166B205236J05043k9542j78103l10916l00610j58244j44046m37090p92674p70018
39156h10964k89192K62880N26914N62607O25113P14310N73891J35629k61731k64439
39146A775018R77Q5074j21507k12883N8714K76664n9670o62194p36717j39343
39136B64133L64069J97909k43771k92035K6809K43532K91487M50362O32678M19865
39126B355038j57646m91785k27619K55250M09229J75249j58974m10484n30263
$$ plain form
39117 1217995 770373 577048 561475 465036 215960 82886 367614 1048805 1805522 2308983
39107 2308983 2428176 2239035 1943176 1764404 1827883 2065189 2235110 2114896 1754203 1497996
39097 1497996 1618360 1914795 1867446 1289647 653742 582048 1121174 1732131 1941955 1778610
39087 1778610 1573825 1588421 1907820 2482819 3110161 3495953 3505028 3311584 3196543 3226825
39077 3226825 3231397 3082318 2899810 2927088 3235857 3625351 3857166 3944019 4089098 4326451
39067 4326451 4405929 4174115 3890377 3881280 3966647 3626803 2838887 2337101 2724739 3592266
39057 3592266 3939304 3390536 2578981 2272533 2499551 2717925 2568506 2206530 2019352
39048 2019352 2220528 2658601 2910157 2670747 2165933 2014221 2509967 3213019 3502893
$$ packed form
39117A217995m47622j93325j5573r6439k49076j33074K84728O81191P56717N03461
39107B308983J19193j89141k95859j78772O3479K37306J69921j20214l60693k56207
39097A497996J20364K96435m7349n77799o35905p1694N39126O10957K09824j63345
39087A778610k04785J4596L19399N74999O27342L85792R075j93444j15041L0282
39077C226825M572j49079j82508K7278L08769L89494K31815Q6853J45079K37353
39067D326451P9478k31814k83738r097Q5367l39844p87916n01786L87638Q67527
39057C592266L47038n48768q11555l06448K27018K18374j49419l61976j87178
39048B019352K01176M38073K51556k39410n04814j51712M95746P03052K89874
$$ plain form
39039 3502893 3391608 3421844 3801189 4085998 3884348 3478208 3413381 3706263 3869614 3681423
39029 3681423 3526298 3810236 4283967 4213817 3213776 1748436 729189 644224 1152742
39020 1152742 1558832 1613081 1730435 2409121 3582341 4668873 5198421 5231173 5136624 5097167
39010 5097167 4957931 4547648 4007574 3677115 3679628 3788988 3798231 3865198 4274536 4909910
39000 4909910 5240460 4932920 4277360 3849349 3864150 4009756 3858125 3336817 2831743 2862025
38990 2862025 3564987 4468464 4894977 4634943 4087306 3731108 3696814 3922739 4403858 5045142
38980 5045142 5507875 5499525 5098978 4599819 4217646 4150161 4625441 5521803 6180420 6060473
38970 6060473 5448947 5069905 5130559 5293494 5490201 6057567 6934642 7397865 6935370 5914123
$$ packed form
39039C502893j11285L0236L79345K84809k01650m06140o4827K92882J63351j88191
39029C681423j55125K83938M73731p0150j000041j465340j019247q4965N08518
39020A152742M06090N4249J17354O78686J173220J086532N29548L2752r4549l9457
39010E097167j39236m10283n40074l30459K513J09360R243O6967M09338O35374
39000D909910L30550l07540o55560m28011J4801J45606j51631n21308n05074L0282
38990B862025P02962R03477M26513k60034n47637l56198l4294K25925M81119O41284
38980E045142M62733q350m00547m99159l82173o7485M75280Q96362O58617j19947
38970F060473o11526l79042O0654J62935J96707N67366Q77075M63223m62495j021247
$$ plain form
38960 5914123 5074258 4783580 5057621 5809321 6669125 7005588 6633370 6172367 6205458 6401771
38950 6401771 6067757 5320078 5000885 5476800 6216992 6680723 6990175 7453258 7931236
38941 7931236 8067668 7844069 7569561 7512351 7799428 8473438 9340800 9901229 9777130 9220398
38931 9220398 8920247 9243885 9891719 10407296 10789259 11330843 11968632 12203995 11846162
38922 11846162 11495036 11884063 12874805 13578168 13530003 13273619 13559745 14392704 15212985
38913 15212985 15674977 15795603 15586475 15086715 14679593 14839330 15500417 16119638 16445598
38904 16445598 16788790 17382952 17913535 17956657 17583194 17233269 17179272 17351264 17540187 17559591
38894 17559591 17325642 16959202 16714778 16683325 16692175 16609703 16572381 16749635 17055475 17299702
$$ packed form
38960E914123q39865k90678K74041P51700Q59804L36463l72218m61003L3091J96313
38950F401771l34014p47679l19193M75915P40192M63731L09452M63083M77978
38941G931236J36432k23599k74508n7210K87077O74010Q67362N60429j24099n56732
38931I220398l00151L23638O47834N15577L81963N41584O37789K35363l57833
38922A1846162l51126L89027R90742P03363m8165k56384K86126Q32959Q20281
38913A5212985M61992J20626k09128m99760m07122J59737O61087O19221L25960
38904A6445598L43192N94162N30583M3122l73463l49925n3997J71992J88923J9404
38894A7559591k33949l66440k44424l1453Q850q2472l7322J77254L05840K44227
$$ plain form
38884 17299702 17491100 17757736 18043434 18115102 17867123 17459681 17168729 17218425 17704470 18525848
38874 18525848 19410905 20135506 20687892 21124603 21372736 21371567 21340628 21628178 22231927 22717163
38864 22717163 22763142 22612071 22767054 23343790 23971267 24341857 24607128 25100685 25867829
38855 25867829 26698691 27529332 28524912 29731022 30902375 31804755 32501490 33218752 34122519
38846 34122519 35376294 37175342 39448521 41697983 43465114 44870543 46391630 48220412
38838 48220412 50221423 52422993 55025764 57875145 60503295 62927789 65866448 69762612
38830 69762612 74044695 77885437 81405575 85526903 90746682 96649654 102679292 108850087
38822 108850087 115489387 122674816 130223286 138048382 146319574 155360663 165468412 176691686
$$ packed form
38884A7299702J91398K66636K85698P1668k47979m07442k90952M9696M86045Q21378
38874A8525848Q85057P24601N52386M36711K48133j169l0939K87550O03749M85236
38864B2717163M5979j51071J54983N76736O27477L70590K65271M93557P67144
38855B5867829Q30862Q30641R95580J206110J171353R02380O96735P17262R03767
38846C4122519J253775J799048K273179K249462J767131J405429J521087J828782
38838D8220412K001011K201570K602771K849381K628150K424494K938659L896164
38830F9762612M282083L840742L520138M121328N219779N902972O029638O170795
38822A08850087O639300P185429P548470P825096Q271192R041089J0107749J1223274
$$ plain form
38814 176691686 188730565 201204223 214042622 227394996 241083643 254412660 266705730
38807 266705730 277856162 288135413 297581530 305826540 312515617 317671392 321532997 324137546
38799 324137546 325211603 324515942 322184516 318565729 313762043 307599105 300193606 292257422
38791 292257422 284472541 276718015 268395485 259536622 251064125 243744289 237346226 231179772
38783 231179772 225060085 219246297 213685495 207906957 201632350 194996723 188144611 181085489
38775 181085489 174022852 167316771 160911810 154257361 147101678 139987706 133592335 127882095
38767 127882095 122354407 116877814 111767312 107104283 102524281 97789536 93133578 88838140
38759 88838140 84807323 80813155 76916065 73342041 70053540 66716310 63110478 59422725
$$ packed form
38814A76691686J2038879J2473658J2838399J3352374J3688647J3329017J2293070
38807B66705730J1150432J0279251R446117Q245010O689077N155775L861605K604549
38799C24137546J074057o95661k331426l618787m803686o162938p405499p936184
38791B92257422p784881p754526q322530q858863q472497p319836o398063o166454
38783B31179772o119687n813788n560802n778538o274607o635627o852112p059122
38775A81085489p062637o706081o404961o654449p155683p113972o395371n710240
38767A27882095n527688n476593n110502m663029m580002m734745m655958m295438
38759H8838140m030817l994168l897090l574024l288501l337230l605832l687753
$$ plain form
38751 59422725 56097868 53454740 51416375 49558248 47462227 45091128 42795312 40906459
38743 40906459 39355719 37755190 35867627 33942887 32492965 31671677 30981476 29794032
38735 29794032 28124068 26566037 25379439 24082406 22295989 20574595 19777519 19814962
38727 19814962 19749861 19150136 18548142 18333991 18011200 17083386 16032332 15677974 15931391
38718 15931391 15930193 15266729 14419883 13986106 14037068 14278420 14390927 14169211 13684253 13295541
38708 13295541 13184204 12996527 12337340 11441421 10849188 10563212 10135852 9519512 9132493
38699 9132493 9027879 8723351 8054030 7520560 7504081 7731637 7816105 7740159 7489726 6839921
38689 6839921 5930822 5446147 5684894 5991143 5701249 5169067 5165712 5664468 5993220 5928409
$$ packed form
38751E9422725l324857k643128k038365j858127k096021k371099k295816j888853
38743D0906459j550740j600529j887563j924740j449922q21288o90201j187444
38735B9794032j669964j558031j186598j297033j786417j721394p97076L7443
38727A9814962o5101n99725o01994k14151l22791r27814j051054l54358K53417
38718A5931391j198o63464q46846m33777N0962K41352J12507k21716m84958l88712
38708A3295541j11337j87677o59187q95919n92233k85976m27360o16340l87019
38699I132493j04614l04528o69321n33470j6479K27556Q4468p5946k50433o49805
38689F839921r09099m84675K38747L06249k89894n32182l355M98756L28752o4811
$$ plain form
38679 5928409 5833374 5829462 5624896 5202452 4964776 5061059 5163682 5056455 4902524 4778996
38669 4778996 4480303 3990020 3653002 3620173 3566869 3275215 3113088 3543013 4391549 4989655
38659 4989655 4943032 4461083 3944665 3494805 2923059 2162538 1547713 1556905 2229837 3001172
38649 3001172 3287004 3129898 3056792 3398294 4009098 4593136 4989350 5114033 4909787 4442343
38639 4442343 3871349 3311489 2882926 2801297 3123839 3458738 3299537 2711400 2346165 2655814
38629 2655814 3379419 3946738 4128798 4111642 4111103 4093250 3812213 3082284 2091949 1382993
38619 1382993 1334026 1713620 1953188 1803784 1502231 1396326 1691202 2425128 3304743 3682485
38609 3682485 3193028 2372250 2101012 2426670 2564351 2165873 1853860 2182341 2764186
$$ packed form
38679E928409r5035l912k04566m22444k37676R6283J02623j07227j53931j23528
38669D778996k98693m90283l37018l2829n3304k91654j62127M29925Q48536N98106
38659D989655m6623m81949n16418m49860n71746p60521o14825R192O72932P71335
38649C001172K85832j57106p3106L41502O10804N84038L96214J24683k04246m67444
38639D442343n70994n59860m28563q1629L22542L34899j59201n88137l65235L09649
38629B655814P23605N67319J82060j7156n39j7853k81037p29929r90335p08956
38619A382993m8967L79594K39568j49404l01553j05905K94876P33926Q79615L77742
38609C682485m89457q20778k71238L25658J37681l98478l12013L28481N81845
$$ plain form
38600 2764186 2934464 2719566 2553352 2466721 2219786 1958883 2081857 2581076 3093904 3519982
38590 3519982 4055197 4666691 5058696 5170904 5235811 5307497 5188729 4895780 4760877 4952810
38580 4952810 5279329 5598419 6053318 6706747 7262135 7406679 7240981 7148166 7349345 7744250
38570 7744250 8101070 8279832 8324461 8405388 8626986 8886408 9006404 8985975 8974895 8984837
38560 8984837 8795645 8236882 7440018 6681532 6021465 5241501 4211228 3227270 2804663
38551 2804663 3067111 3538446 3734571 3784645 4121150 4662235 4818303 4408958 4012011 4086649
38541 4086649 4261142 3996907 3568584 3714379 4472283 5050129 4901344 4333146 3884729
38532 3884729 3620318 3306593 2895318 2505885 2171836 1893960 1798517 1994685 2325541 2421445
$$ packed form
38600B764186J70278k14898j66214q6631k46935k60903J22974M99219N12828M26078
38590C519982N35215O11494L92005J12208O4907P1686j18768k92949j34903J91933
38580D952810L26519L19090M54899O53429N55388J44544j65698r2815K01179L94905
38570G744250L56820J78762M4629Q0927K21598K59422J19996k0429j1080R942
38560H984837j89192n58763p96864p58486o60067p79964j030273r83958m22607
38551B804663K62448M71335J96125N0074L36505N41085J56068m09345l96947P4638
38541D086649J74493k64235m28323J45795P57904N77846j48785n68198m48417
38532C884729k64411l13725m11275l89433l34049k77876r5443J96168L30856R5904
$$ plain form
38522 2421445 2019632 1232064 548679 493816 1109006 1816665 1986140 1597525 1148797 1003810
38512 1003810 1147802 1528419 2185165 2903376 3155085 2687930 1942746 1603809 1861377
38503 1861377 2330560 2575000 2490186 2248007 2087935 2177111 2523494 2956825 3227383 3162428
38493 3162428 2783480 2324793 2088470 2191373 2477689 2732816 2895268 2990461 3029727 3123190
38483 3123190 3462381 3922988 3936343 3194582 2308625 2174082 2694155 2808647 2002158 1126625
38473 1126625 1287115 2419242 3540838 4076263 4277305 4451870 4441728 4036125 3457259
38464 3457259 3157148 3313955 3701670 3968870 3950658 3746743 3533171 3317660 2957155 2433713
38454 2433713 1975978 1828712 2023958 2438182 2889660 3081250 2698795 1795068 893535
$$ packed form
38522B421445m01813p87568o83385n4863O15190P07659J69475l88615m48728j44987
38512A003810J43992L80617O56746P18211K51709m67155p45184l38937K57568
38503A861377M69183K44440q4814k42179j60072Q9176L46383M33331K70558o4955
38493C162428l78948m58687k36323J02903K86316K55127J62452R5193L9266R3463
38483C123190L39191M60607J3355p41761q85957j34543N20073J14492q06489q75533
38473A126625J60490J132127J121596N35425K01042J74565j0142m05603n78866
38464C457259l00111J56807L87715K67200j8212k03915k13572k15511l60505n23442
38454B433713m57735j47266J95246M14224M51478J91590l82455r03727r01533
$$ plain form
38445 893535 449326 344696 192348 1288 173716 862040 1705603 2311510 2689510 3033291
38435 3033291 3311777 3338228 3139218 2981467 2998411 3019454 2918124 2951920 3443284 4120443
38425 4120443 4177252 3268505 2150631 1878386 2501980 3105343 3132372 3011576 3227234 3460642
38415 3460642 3216710 2810648 2970198 3646379 3988294 3569255 2978787 2959968 3463103 3871215
38405 3871215 3811624 3409026 2951107 2617493 2455891 2411447 2407308 2489032 2805991 3375397
38395 3375397 3974865 4356110 4471295 4416872 4253186 3969152 3579134 3213896 3130369 3550820
38385 3550820 4361071 5042631 5138054 4811991 4726754 5271713 6099525 6536108 6295208 5663151
38375 5663151 5108249 4862038 4818390 4693582 4265742 3536330 2731276 2197185 2258946 2991761
$$ packed form
38445H93535m44209j04630j52348j91060J72428O88324Q43563O05907L78000L43781
38435C033291K78486K6451j99010j57751J6944K1043j01330L3796M91364O77159
38425D120443N6809r08747j117874k72245O23594O03363K7029j20796K15658K33408
38415C460642k43932m06062J59550O76181L41915m19039n90468j8819N03135M08112
38405C871215n9591m02598m57919l33614j61602m4444m139Q1724L16959N69406
38395C375397N99468L81245J15185n4423j63686k84034l90018l65238q3527M20451
38385C550820Q10251O81560R5423l26063q5237N44959Q27812M36583k40900o32057
38375E663151n54902k46211m3648j24808m27840p29412q05054n34091O1761P32815
$$ plain form
38365 2991761 4002995 4607595 4474634 4033912 3978425 4404738 4760996 4656105 4329303
38356 4329303 4160943 4087162 3814978 3398646 3241488 3567138 4155979 4634126 4855093 4957096
38346 4957096 5133808 5380116 5472320 5255803 4909515 4756755 4815359 4790082 4601345 4626347
38336 4626347 5193584 6078681 6800943 7254877 7709667 8276724 8752063 9005336 9186746
38327 9186746 9449814 9736707 9958138 10159551 10366069 10444250 10276176 9949015 9642774 9439865
38317 9439865 9362310 9467822 9728972 9873645 9533495 8603781 7387618 6368509 5865305
38308 5865305 5854655 6034921 6057541 5766271 5251093 4680360 4127375 3603395 3207978 3130112
38298 3130112 3441270 3927216 4199163 4013191 3477335 2929449 2628475 2602223 2766276 3064567
$$ packed form
38365B991761J011234O04600j32961m40722n5487M26313L56258j04891l26802
38356D329303j68360p3781k72184m16332j57158L25650N88841M78147K20967J02003
38346D957096J76712K46308R2204k16517l46288j52760N8604k5277j88737K5002
38336D626347N67237Q85097P22262M53934M54790N67057M75339K53273J81410
38327I186746K63068K86893K21431K01413K06518P8181j68074l27161l06241k02909
38317I439865p7555J05512K61150J44673l40150r29714j216163j019109n03204
38308E865305j0650J80266K2620k91270n15178n70733n52985n23980l95417p7866
38298C130112L11158M85946K71947j85972n35856n47886l00974k6252J64053K98291
$$ plain form
38288 3064567 3416638 3639895 3594306 3378280 3205928 3078378 2780378 2271212 1843506 1724027
38278 1724027 1736990 1641102 1627301 2063713 2761679 2978096 2350692 1427345 936397 866678
38268 866678 740714 572250 906147 1850831 2696416 2797615 2363150 1964384 1649990 1104821
38258 1104821 468056 323094 815048 1369842 1515145 1483618 1665616 1899543 1811958 1592662
38248 1592662 1810440 2485488 2953193 2825087 2536302 2579546 2655330 2160409 1287878 942041
38238 942041 1480855 2186224 2299574 2059480 2208410 2829698 3332209 3475140 3697274 4263924
38228 4263924 4709712 4512915 3896856 3509005 3573928 3812958 4005522 4133058 4059090 3608832
38218 3608832 3042580 2959629 3518401 4118813 4113024 3558347 3012403 2822388 2926191 3200882
$$ packed form
38288C064567L52071K23257m5589k16026j72352j27550k98000n09166m27706j19479
38278A724027J2963r5888j3801M36412O97966K16417o27404r23347m90948o9719
38268H66678j25964j68464L33897R44684Q45585J01199m34465l98766l14394n45169
38258A104821o36765j44962M91954N54794J45303l1527J81998K33927q7585k19296
38248A592662K17778O75048M67705j28106k88785M3244P5784m94921q72531l45837
38238I42041N38814P05369J13350k40094J48930O21288N02511J42931K22134N66650
38228D263924M45788j96797o16059l87851O4923K39030J92564J27536p3968m50258
38218C608832n66252q2951N58772O00412n789n54677n45944j90015J03803K74691
$$ plain form
38208 3200882 3648512 4215855 4679884 4809739 4556119 4068652 3591059 3312027 3256477 3359746
38198 3359746 3668471 4337173 5327038 6239915 6627881 6427990 5971677 5634121 5611560 5953207
38188 5953207 6588209 7307141 7903516 8394666 8982501 9766184 10623258 11415025 12173426
38179 12173426 13009727 13950719 14963289 16060366 17262048 18467092 19450691 20007166 20060543
38170 20060543 19650134 18876685 17903558 16968254 16283544 15836947 15317680 14374854 13016874
38161 13016874 11662002 10685004 9973226 9074880 7784230 6432380 5536493 5265358 5336214
38152 5336214 5367839 5222905 5007356 4832633 4653924 4344992 3884247 3409298 3081092 2960180
38142 2960180 3055998 3403221 3953633 4421183 4417854 3837868 3011934 2394376 2170241 2239999
$$ packed form
38208C200882M47630N67343M64029J29855k53620m87467m77593k79032n5550J03269
38198C359746L08725O68702R89865R12877L87966j99891m56313l37556k2561L41647
38188E953207O35002P18932N96375M91150N87835P83683Q57074P91767P58401
38179A2173426Q36301R40992J012570J097077J201682J205044R83599N56475N3377
38170B0060543m10409p73449r73127r35304o84710m46597n19267r42826j357980
38161A3016874j354872r76998p11778q98346j290650j351850q95887k71135P0856
38152E336214L1625j44934k15549j74723j78709l08932m60745m74949l28206j20912
38142B960180R5818L47223N50412M67550l329n79986q25934o17558k24135O9758
$$ plain form
38132 2239999 2468140 2773083 3013426 2993420 2666912 2230623 1935327 1854463 1868267 1800583
38122 1800583 1539827 1123632 764430 687442 844491 877910 508008 -89643 -448075 -352002
38112 -352002 -65269 38742 -57428 -44252 255538 582374 482704 -146291 -852433 -1083477
38102 -1083477 -817718 -566748 -701262 -996038 -1021142 -790515 -723514 -1038055 -1492937 -1735737
38092 -1735737 -1621543 -1172239 -534387 -34781 61726 -32282 205985 860951 1349401 1176017
38082 1176017 573743 73833 -246646 -670247 -1204364 -1498089 -1329902 -825736 -245320
38073 -245320 164957 215328 -42459 -305109 -448451 -715297 -1139142 -1166613 -444441 339452
38063 339452 209768 -635189 -1025388 -529185 26242 13956 -45235 419248 887633 568163
$$ packed form
38132B239999K28141L04943K40343k0006l26508m36289k95296q0864J3804o7684
38122A800583k60756m16195l59202p6988J57049L3419l69902n97651l58432R6073
38112c52002K86733J04011r6170J3176K99790L26836r9670o28995p06142k31044
38102a083477K65759K50970j34514k94776k5104K30627O7001l14541m54882k42800
38092a735737J14194M49304O37852M99606R6507r4008K38267O54966M88450j73384
38082A176017o02274m99910l20479m23601n34117k93725J68187N04166N80416
38073b45320M10277N0371k57787k62650j43342k66846m23845k7471P22172P83893
38063C39452j29684q44957l90199M96203N55427j2286n9191M64483M68385l19470
$$ plain form
38053 568163 -262938 -679129 -488018 -271268 -246381 -29332 453316 685689 414724 93951
38043 93951 179126 506837 690522 735937 940809 1432636 2041370 2446921 2323427 1572570
38033 1572570 575883 19992 290288 1119499 1897524 2218555 2103886 1831548 1592642
38024 1592642 1244854 467761 -724040 -1754939 -1996138 -1427357 -593636 -13369 140811
38015 140811 -68531 -421588 -576185 -365864 -31670 134183 256513 600579 952820 812594
38005 812594 212666 -217925 -147751 38323 -62340 -269421 -258161 -171854 -368419 -826132
37995 -826132 -1208642 -1361724 -1399520 -1399411 -1312193 -1142062 -1000913 -974204 -1012223 -916682 -465825
37984 -465825 283404 860010 816673 312789 -43557 49619 357062 649910 989263 1322156
$$ packed form
38053E68163q31101m16191J91111K16750K4887K17049M82648K32373k70965l20773
38043I3951Q5175L27711J83685M5415K04872M91827O08734M05551j23494p50857
38033A572570r96687n55891K70296Q29211P78025L21031j14669k72338k38906
38024A592642l47788p77093j191801j030899k41199N68781Q33721N80267J54180
38015A40811k09342l53057j54597K10321L34194J65853J22330L44066L52241j40226
38005H12594n99928m30591P0174J86074j00663k07081J1260Q6307j96565m57713
37995h26132l82510j53082l7796J09Q7218J70131J41149K6709l8019R5541M50857
37984d65825P49229N76606m3337n03884l56346R3176L07443K92848L39353L32893
$$ plain form
37974 1322156 1328509 970570 728216 917891 1180021 1040133 612765 323378 262170 254640
37964 254640 270615 323252 269877 161527 429707 1187005 1710060 1280624 236763 -551829
37954 -551829 -976031 -1555159 -2172563 -2036435 -1081296 -358996 -563393 -1023380 -783418 -21540
37944 -21540 317961 -139691 -933987 -1580186 -2006431 -2283002 -2426491 -2447823 -2243145 -1529850
37934 -1529850 -229530 1180620 2031620 2132060 1836544 1559574 1466660 1512574 1519266 1326662
37924 1326662 1074913 1141317 1557733 1779193 1410885 891810 939308 1494489 1829611 1650543
37914 1650543 1420923 1473801 1481114 1139230 820023 1049176 1688546 2138114 2147271 1954103
37904 1954103 1729973 1360718 813673 330848 127769 155736 270864 427320 592185 659238
$$ packed form
37974A322156O353l57939k42354J89675K62130j39888m27368k89387o1208p530
37964B54640J5975N2637n3375j08350K68180P57298N23055m29436j043861p88592
37954e51829m24202n79128o17404J36128R55139P22300k04397m59987K39962P61878
37944b1540L39501m57652p94296o46199m26245k76571j43489k1332K04678P13295
37934a529850J300320J410150Q51000J00440k95516k76970r2914M5914O692j92604
37924A326662k51749O6404M16416K21460l68308n19075M7498N55181L35122j79068
37914A650543k29620N2878P313l41884l19207K29153O39370M49568R157j93168
37904A954103k24130l69255n47045m82825k03079K7967J15128J56456J64865O7053
$$ plain form
37894 659238 608214 646624 1038951 1807211 2676056 3309563 3581628 3655180 3830004 4276604
37884 4276604 4871886 5295718 5316024 5011996 4741439 4857546 5385922 5992687 6385755 6758006
37874 6758006 7641973 9207823 10904131 12036311 12574700 13074335 13836641 14533271 14760384
37865 14760384 14586258 14295740 13884055 13173027 12295617 11674017 11472951 11349434 10839737
37856 10839737 9833811 8623184 7631019 7125852 7038357 6993505 6644012 6029463 5513596
37847 5513596 5344788 5392480 5344109 5032249 4510991 3932427 3453333 3211629 3288887 3638463
37837 3638463 4035697 4163816 3898109 3541753 3585389 4085995 4459827 4119465 3197326 2387466
37827 2387466 2164105 2427071 2831139 3138075 3267939 3311520 3472011 3714644 3601922 2892225
$$ packed form
37894F59238n1024L8410L92327P68260Q68845O33507K72065P3552J74824M46600
37884D276604N95282M23832K0306l04028k70557J16107N28376O06765L93068L72251
37874F758006Q83967J565850J696308J132180N38389M99635P62306O96630K27113
37865A4760384j74126k90518m11685p11028q77410o21600k01066j23517n09697
37856A0839737j005926j210627r92165n05167q7495m4852l49493o14549n15867
37847E513596j68808M7692m8371l11860n21258n78564m79094k41704P7258L49576
37837C638463L97234J28119k65707l56356M3636N00606L73832l40362r22139q09860
37827B387466k23361K62966M04068L06936J29864M3581J60491K42633j12722p09697
$$ plain form
37817 2892225 2162860 2232428 2974825 3422421 3183477 2944524 3215383 3431026 2947776 2204425
37807 2204425 2020733 2249208 2109075 1577728 1416816 1853284 2214615 2038829 1700618
37798 1700618 1668559 1856269 2012711 2142188 2239835 2163645 2043254 2269895 2794187 2970586
37788 2970586 2409610 1480040 687284 116134 -200580 -19390 532803 733146 221025
37779 221025 -329950 -139673 545591 962012 1050247 1320447 1756011 1778402 1296495 966978
37769 966978 1267483 1953716 2555182 2828398 2631886 1953847 1206402 941051 1131038 1250057
37759 1250057 1128009 1100168 1192226 915637 193613 -238490 137237 773569 808716 208242
37749 208242 -414065 -713485 -731922 -423227 257179 961130 1272699 1311852 1435238 1473064
$$ packed form
37817B892225p29365O9568P42397M47596k38944k38953K70859K15643m83250p43351
37807B204425j83692K28475j40133n31347j60912M36468L61331j75786l38211
37798A700618l2059J87710J56442J29477R7647p6190j20391K26641N24292J76399
37788B970586n60976r29570p92756n71150l16714J81190N52193K00343n12121
37779B21025n50975J90277O85264M16421Q8235K70200M35564K2391m81907l29517
37769I66978L00505O86233O01466K73216j96512o78039p47445k65351J89987J19019
37759A250057j22048k7841R2058k76589p22024m32103L75727O36332L5147o00474
37749B08242o22307k99420j8437L08695O80406P03951L11569L9153J23386L7826
$$ plain form
37739 1473064 937947 -37917 -689673 -659715 -385480 -258328 -70394 361970 647059 394656
37729 394656 -117035 -408275 -587449 -1054066 -1612751 -1568066 -761634 41952 14042 -834636
37719 -834636 -1768581 -2080953 -1626397 -875008 -558443 -999984 -1653199 -1565793 -483753 756614
37709 756614 1172833 739473 231010 147092 250447 194197 130700 398778 869197 1001417
37699 1001417 553662 -67662 -302826 -103431 77083 -129321 -627197 -1060456 -1189555
37690 -1189555 -1000580 -639796 -384017 -496389 -888045 -1054029 -628221 76608 415620
37681 415620 263745 100438 178444 121932 -375086 -941009 -1091558 -1034165 -1297522 -1774763
37671 -1774763 -1854783 -1498482 -1429220 -2021554 -2684900 -2776493 -2562220 -2678090 -3019679 -2885062
$$ packed form
37739A473064n35117r75864o51756K9958K74235J27152J87934M32364K85089k52403
37729C94656n11691k91240j79174m66617n58685M4685Q06432Q03586k7910q48678
37719h34636r33945l12372M54556P51389L16565m41541o53215Q7406J082040J240367
37709G56614M16219m33360n08463q3918J03355n6250o3497K68078M70419J32220
37699A001417m47755o21324k35164J99395J80514k06404m97876m33259j29099
37690a189555J88975L60784K55779j12372l91656j65984M25808P04829L39012
37681D15620j51875j63307P8006n6512m97018n65923j50549N7393k63357m77241
37671a774763q0020L56301O9262n92334o63346r1593K14273j15870l41589J34617
$$ plain form
37661 -2885062 -2114758 -1392096 -1256783 -1362732 -1030798 -214169 437400 363027 -319179 -999106
37651 -999106 -1190382 -916064 -546654 -325397 -131443 249424 728258 953080 739990 293368
37641 293368 -80812 -356821 -756462 -1378378 -1992472 -2256145 -2075568 -1679022 -1344467 -1143501
37631 -1143501 -988896 -828226 -675413 -512650 -306973 -101200 59488 268875 645070
37622 645070 1079296 1320682 1340388 1352154 1396444 1208464 662558 44382 -362926 -680111
37612 -680111 -1102947 -1434924 -1373317 -1090586 -1036513 -1208385 -1126683 -605814 -56898 153446
37602 153446 196646 362684 534971 455675 236930 167675 144886 -238543 -985468 -1450912
37592 -1450912 -1005259 234457 1489890 2042198 1767086 1060237 406871 49710 -42051
$$ packed form
37661b885062P70304P22662J35313j05949L31934Q16629O51569p4373o82206o79927
37651i99106j91276K74318L69410K21257J93954L80867M78834K24822k13090m46622
37641B93368l74180k76009l99641o21916o14094k63673J80577L96546L34555K00966
37631a143501J54605J60670J52813J62763K05677K05773J60688K09387L76195
37622F45070M34226K41386J9706J1766M4290j87980n45906o18176m07308l17185
37612f80111m22836l31977O1607K82731N4073j71872Q1702N20869N48916K10344
37602A53446M3200J66038J72287p9296k18745o9255k2789l83429p46925m65444
37592a450912M45653J239716J255433N52308k75112p06849o53366l57161r1761
$$ plain form
37583 -42051 -6237 64043 140603 190062 128376 -128944 -555096 -958806 -1086175 -826775 -350433
37572 -350433 -42178 -243692 -943271 -1678967 -1883026 -1462458 -943355 -860747 -1110488 -1182108
37562 -1182108 -952077 -813985 -946555 -959965 -569432 -176757 -301691 -720758 -729090 -143011
37552 -143011 498181 727148 643797 533382 435675 258539 2295 -256689 -372414 -125870
37542 -125870 476564 963484 893496 567246 700985 1323031 1634601 1194373 570910 403822
37532 403822 449929 182275 -160985 74245 795289 1176690 874622 515231 750414 1370209
37522 1370209 1681663 1433573 1036405 1009054 1431187 1896689 1917599 1422637 864892 748534
37512 748534 1068970 1347458 1215092 824837 640436 892692 1299081 1353469 923209 466946
$$ packed form
37583d2051L5814P0280P6560M9459o1686k57320m26152m03710j27369K59400M76342
37572c50433L08255k01514o99579p35696k04059M20568N19103Q2608k49741p1620
37562a182108K30031J38092j32570j3410L90533L92675j24934m19067q332N86079
37552a43011O41192K28967q3351j10415r7707j77136k56244k58984j15725K46544
37542a25870O02434M86920o9988l26250J33739O22046L11570m40228o23463j67088
37532D03822M6107k67654l43260K35230P21044L81401l02068l59391K35183O19795
37522A370209L11454k48090l97168k7351M22133M65502K0910m94962n57745j16358
37512G48534L20436K78488j32366l90255j84401K52256M06389N4388m30260m56263
$$ plain form
37502 466946 508468 993900 1450911 1702829 1961733 2165673 1845590 968063 303933 399372
37492 399372 653874 127635 -1053204 -1883919 -1894305 -1534385 -1196323 -774454 -374084 -536124
37482 -536124 -1317801 -1906760 -1714898 -1256544 -1312517 -1712525 -1679323 -1081402 -584531 -655369
37472 -655369 -1109326 -1683980 -2408050 -3187551 -3546580 -3134191 -2212274 -1343684 -771358 -369163
37462 -369163 -79273 -70209 -401782 -791927 -933915 -949047 -1252081 -1912624 -2434145 -2374792
37452 -2374792 -1944554 -1647918 -1514924 -1172144 -639267 -465963 -882805 -1352581 -1315930 -941023
37442 -941023 -694253 -546635 -173245 293864 344415 -129856 -715260 -1176941 -1706965 -2311820
37432 -2311820 -2500816 -1928618 -982420 -365794 -340630 -707975 -1297209 -2028254 -2580288 -2502410
$$ packed form
37502D66946M1522M85432M57011K51918K58904K03940l20083q77527o64130R5439
37492C99372K54502n26239j180839q30715j0386L59920L38062M21869M00370j62040
37482e36124p81677n88959J91862M58354n5973m00008L3202N97921M96871p0838
37472f55369m53957n74654p24070p79501l59029M12389R21917Q68590N72326M02195
37462c69163K89890R064l31573l90145j41988j5132l03034o60543n21521N9353
37452b374792M30238K96636J32994L42780N32877J73304m16842m69776L6651L74907
37442i41023K46770J47618L73390M67109N0551m74271n85404m61681n30024o04855
37432b311820j88996N72198R46198O16626K5164l67345n89234p31045n52034P7878
$$ plain form
37422 -2502410 -1815588 -1146815 -991587 -1061448 -699448 150445 796423 724772 289417 178351
37412 178351 466580 644992 478495 301706 364239 397064 109666 -293710 -467132 -477628
37402 -477628 -587238 -720911 -612531 -312368 -57006 249029 858253 1491823 1433923 493168
37392 493168 -642341 -1261247 -1398483 -1461960 -1517946 -1361677 -1013433 -710145 -555983 -543287
37382 -543287 -781720 -1329711 -1876869 -1972833 -1587784 -1146649 -985562 -1041862 -1101890 -1074125
37372 -1074125 -939908 -678832 -365212 -168268 -149598 -187074 -171385 -147736 -191267 -271606
37362 -271606 -330034 -385914 -477628 -586429 -708783 -925919 -1290619 -1679326 -1863565 -1746433
37352 -1746433 -1463303 -1210762 -1012078 -722221 -286780 94171 179923 26042 -81716 -64297
$$ packed form
37422b502410O86822O68773J55228o9861L62000Q49893O45978p1651m35355j11066
37412A78351K88229J78412j66497j76789O2533L2825k87398m03376j73422j0496
37402d77628j09610j33673J08380L00163K55362L06035O09224O33570n7900r40755
37392D93168j135509o18906j37236o3477n5986J56269L48244L03288J54162J2696
37382e43287k38433n47991n47158r5964L85049M41135J61087n6300o0028K7765
37372a074125J34217K61076L13620J96944J8670l7476J5689K3649m3531q0339
37362b71606n8428n5880r1714j08801j22354k17136l64700l88707j84239J17132
37352a746433K83130K52541J98684K89857M35441L80951Q5752j53881j07758J7419
$$ plain form
37342 -64297 -169141 -490705 -640885 -261678 265737 113665 -886235 -1878143 -2004762 -1452114
37332 -1452114 -1070081 -1170191 -1232613 -832236 -330631 -356457 -925215 -1469239 -1621463 -1578521
37322 -1578521 -1643478 -1759730 -1706534 -1535563 -1515089 -1689694 -1772497 -1544015 -1140972 -820073
37312 -820073 -616288 -436308 -365270 -591912 -1013581 -1195046 -864359 -263803 168061 325953
37302 325953 437220 624003 744953 706760 666166 759894 803151 482065 -184298 -750554
37292 -750554 -755784 -147438 699276 1289294 1339887 934339 408017 24025 -250484 -570503
37282 -570503 -856055 -814771 -394390 24914 98643 -15339 22700 74236 -347005 -1203771
37272 -1203771 -1702015 -1276137 -451745 -236734 -822350 -1431648 -1464008 -1230319 -1334286 -1792324
$$ packed form
37342f4297j04844l21564j50180L79207N27415j52072r99900r91908j26619N52648
37332a452114L82033j00110o2422M00377N01605k5826n68758n44024j52224M2942
37322a578521o4957j16252N3196J70971K0474j74605q2803K28482M03043L20899
37312h20073K03785J79980P1038k26642m21669j81465L30687O00556M31864J57892
37302C25953J11267J86783J20950l8193m0594R3728M3257l21086o66363n66256
37292g50554n230O08346Q46714N90018N0593m05548n26322l83992k74509l20019
37282e70503k85552M1284M20381M19304P3729j13982L8039N1536m21241q56766
37272a203771m98244M25878Q24392K15011n85616o09298l2360K33689j03967m58038
$$ plain form
37262 -1792324 -2152678 -2198102 -2089604 -1932580 -1630842 -1213668 -972945 -1139100 -1607603 -2081420
37252 -2081420 -2341082 -2306208 -1977534 -1429901 -798773 -211269 233423 424766 285868 -99511
37242 -99511 -473589 -573415 -325094 87697 335717 231609 -20644 7376 429171 826214
37232 826214 765855 367561 50420 -139814 -504592 -1007398 -1153106 -758647 -369527 -550292
37222 -550292 -1113923 -1480787 -1540488 -1659621 -1964103 -2147854 -2043087 -1916630 -2014962 -2134640
37212 -2134640 -1874537 -1157888 -341047 128827 104262 -158309 -297906 -288173 -425863 -762710
37202 -762710 -831682 -294512 362160 327014 -383616 -900884 -781779 -674648 -1333761 -2493561
37192 -2493561 -3246040 -3183217 -2608228 -1869278 -1112105 -586651 -541450 -724887 -556841 20924
$$ packed form
37262a792324l60354m5424J08498J57024L01738M17174K40723j66155m68503m73817
37252b081420k59662L4874L28674N47633O31128N87504M44692J91343j38898l85379
37242i9511l74078r9826K48321M12791K48020j04108k52253K8020M21795L97043
37232H26214o0359l98294l17141j90234l64778n02806j45708L94459L89120j80765
37222e50292n63631l66864n9701j19133l04482j83751J04767J26457r8332j19678
37212b134640K60103P16649Q16841M69874k4565k62571j39597R733j37690l36847
37202g62710o8972N37170O56672l5146p10630n17268J19105J07131o59113j159800
37192b493561p52479O2823N74989P38950P57173N25454M5201j83437J68046N77765
$$ plain form
37182 20924 359271 17606 -580101 -762925 -540018 -458583 -727158 -975991 -901852 -720619
37172 -720619 -805314 -1168061 -1556699 -1910891 -2412659 -3051909 -3415010 -3127754 -2408680 -1910517
37162 -1910517 -1955428 -2173421 -2063616 -1699524 -1587887 -1934987 -2407768 -2646674 -2657708 -2558090
37152 -2558090 -2276986 -1793566 -1434746 -1550189 -1941632 -1967003 -1298440 -331926 279358 319612
37142 319612 86597 -106700 -299655 -716926 -1357998 -1882847 -1948147 -1594803 -1200157 -1046427
37132 -1046427 -1065912 -1066613 -1043118 -1095407 -1150860 -1008398 -652572 -306983 -155076 -231047 -610127
37121 -610127 -1380059 -2254610 -2556604 -1966165 -1112216 -961678 -1610452 -2119693 -1699125 -653969
37111 -653969 118003 235369 22597 -210173 -536442 -991182 -1255088 -1052895 -603958 -354038
$$ packed form
37182B0924L38347l41665n97707j82824K22907Q1435k68575k48833P4139J81233
37172g20619q4695l62747l88638l54192n01768o39250l63101K87256P19074M98163
37162a910517m4911k17993J09805L64092J11637l47100m72781k38906j1034R9618
37152b558090K81104M83420L58820j15443l91443k5371O68563R66514O11284M0254
37142C19612k33015j93297j92955m17271o41072n24849o5300L53344L94646J53730
37132a046427j9485p01K3495n2289n5453J42462L55826L45589J51907p5971l79080
37121f10127p69932q74551l01994N90439Q53949J50538o48774n09241M20568J045156
37111f53969P71972J17366k12772k32770l26269m54740k63906K02193M48937K49920
$$ plain form
37101 -354038 -381180 -377308 -185988 -35050 -132959 -305219 -260229 -64452 -47724 -223124 -114447
37090 -114447 618179 1545970 1781440 964791 -300868 -1124823 -1250693 -1122933 -1188841 -1425499
37080 -1425499 -1559857 -1477367 -1266666 -1017777 -758254 -557156 -557223 -844655 -1303164 -1651000
37070 -1651000 -1711462 -1659943 -1841103 -2216329 -2195566 -1341820 -166824 210162 -666881 -2030474
37060 -2030474 -2817432 -2800845 -2468798 -2124585 -1670242 -1176605 -1041229 -1380066 -1698774 -1466525
37050 -1466525 -770253 -152194 13282 -247168 -727231 -1234343 -1641186 -1957650 -2301918
37041 -2301918 -2645809 -2704063 -2300722 -1748016 -1551972 -1731099 -1740829 -1183241 -315238 320504
37031 320504 514710 387376 -8319 -675490 -1330111 -1525826 -1268922 -1137496 -1535954 -2129371
$$ packed form
37101c54038k7142L872J91320J50938r7909j72260M4990J95777J6728j75400J08677
37090a14447P32626R27791K35470q16649j265659q23955j25870J27760o5908k36658
37080a425499j34358Q2490K10701K48889K59523K01098o7k87432m58509l47836
37070a651000o0462N1519j81160l75226K0763Q53746J174996L76986q77043j363593
37060b030474p86958J6587L32047L44213M54343M93637J35376l38837l18708K32249
37050a466525O96272O18059J65476k60450m80063n07112m06843l16464l44268
37041b301918l43891n8254M03341N52706J96044j79127r730N57588Q68003O35742
37031C20504J94206j27334l95695o67171o54621j95715K56904J31426l98458n93417
$$ plain form
37021 -2129371 -2347338 -2191474 -2074130 -1987603 -1435984 -325364 635458 779880 350804
37012 350804 98482 263544 440323 338685 167220 176664 240730 95386 -259334 -590745
37002 -590745 -718354 -631990 -433062 -246900 -108605 97106 484560 963490 1313145 1420372
36992 1420372 1277745 834778 148295 -350218 -147633 652127 1292981 1255636 852477 655941
36982 655941 669984 493870 73532 -246234 -363148 -567678 -939693 -1085947 -748081 -305731
36972 -305731 -314401 -757473 -1128406 -1148486 -1019127 -950931 -824970 -495150 -147732 -84502
36962 -84502 -270427 -360771 -148983 243112 624449 929071 1067245 834644 175352 -603620
36952 -603620 -1087914 -1151886 -934098 -529517 43823 604453 812030 513861 -57970 -497870
$$ packed form
37021b129371k17967J55864J17344Q6527N51619J110620R60822J44422m29076
37012C50804k52322J65062J76779j01638j71465R444O4066j45344l54720l31411
37002e90745j27609Q6364J98928J86162J38295K05711L87454M78930L49655J07227
36992A420372j42627m42967o86483m98513K02585P99760O40854l7345m03159j96536
36982F55941J4043j76114m20338l19766j16914k04530l72015j46254L37866M42350
36972c05731q670m43072l70933k0080J29359O8196J25961L29820L47418O3230
36962h4502j85925r0344K11788L92095L81337L04622J38174k32601o59292p78972
36952f03620m84294o3972K17788M04581N73340N60630K07577k98169n71831m39900
$$ plain form
36942 -497870 -542433 -199983 272962 519310 369148 1491 -308622 -559341 -950899 -1497057
36932 -1497057 -1958514 -2151675 -2059505 -1655643 -952611 -248131 68803 59102 179359 541777
36922 541777 678809 295362 -199994 -286024 -56780 81563 98882 207952 299867 83330
36912 83330 -342774 -582661 -521237 -325659 -4113 474984 735349 348651 -331736 -406895
36902 -406895 316223 983341 889416 380348 160644 280942 350573 313300 388794 497870
36892 497870 354107 38418 -28391 317236 804716 1139366 1245019 1107197 701701 118926
36882 118926 -470048 -957376 -1225708 -1068043 -481479 72825 103152 -213779 -159444 596793
36872 596793 1521555 1817443 1240021 178899 -817072 -1396573 -1486324 -1264798 -1002413 -785592
$$ packed form
36942d97870m4563L42450M72945K46348j50162l67657l10113k50719l91558n46158
36932a497057m61457j93161R2170M03862P03032P04480L16934r701J20257L62418
36922E41777J37032l83447m95356q6030K29244J38343J7319J09070R1915k16537
36912H3330m26104k39887O1424J95578L21546M79097K60365l86698o80387p5159
36902d06895P23118O67118r3925n09068k19704J20298O9631l7273P5494J09076
36892D97870j43763l15689o6809L45627M87480L34650J05653j37822m05496n82775
36882A18926n88974m87328k68332J57665N86564N54304L0327l16931N4335P56237
36872E96793R24762K95888n77422j061122r95971n79501q9751K21526K62385K16821
$$ plain form
36862 -785592 -457717 67288 537427 573879 129173 -400354 -556163 -252666 182255 346815
36852 346815 107329 -365978 -810754 -1047753 -1013062 -791665 -662772 -916993 -1471087 -1812050
36842 -1812050 -1558021 -1003220 -830946 -1264689 -1782304 -1791648 -1352875 -1022464 -1121034 -1397882
36832 -1397882 -1397637 -958819 -304421 218185 406903 301089 106809 17492 56969 86036
36822 86036 -40271 -353417 -809830 -1366106 -1931875 -2293767 -2232275 -1776207 -1254828 -1024970
36812 -1024970 -1190930 -1604893 -2013073 -2144136 -1855507 -1378072 -1238588 -1649996 -2094150
36803 -2094150 -1881930 -1096464 -531754 -598059 -786558 -509053 -16192 8667 -500183 -914877
36793 -914877 -829921 -532664 -467577 -653334 -807727 -747667 -483995 -148521 4701 -283164
$$ packed form
36862g85592L27875N25005M70139L6452m44706n29527j55809L03497M34921J64560
36852C46815k39486m73307m44776k36999L4691K21397J28893k54221n54094l40963
36842a812050K54029N54801J72274m33743n17615r344M38773L30411r8570k76848
36832a397882K45M38818O54398N22606J88718j05814j94280q9317L9477K9067
36822H6036j26307l13146m56413n56276n65769l61892O1492M56068N21379K29858
36812a024970j65960m13963m08180j31063K88629M77435J39484m11408m44154
36803b094150K12220P85466N64710o6305j88499K77505M92861K4859n08850m14694
36793i14877Q4956K97257O5087j85757j54393O0060K63672L35474J53222k87865
$$ plain form
36783 -283164 -972092 -1646472 -1880474 -1616454 -1125087 -712620 -554275 -698492 -1084531 -1536731
36773 -1536731 -1786148 -1568651 -845498 -488 363223 45111 -432898 -391325 169306 586057
36763 586057 386968 -197747 -654655 -790586 -733599 -573133 -243761 302502 926812 1273693
36753 1273693 958790 -36711 -1194280 -1917702 -2129745 -2118134 -1877299 -1121223 -37510
36744 -37510 594989 398430 -12935 74965 427427 344482 -99286 -92432 624690 1255058
36734 1255058 1012348 163320 -389532 -266169 37191 -147448 -886505 -1602163 -1667992 -994440
36724 -994440 -43780 663958 928922 771518 247931 -429161 -834270 -734414 -422540 -313648
36714 -313648 -334676 -116394 301468 465545 260454 159948 547181 1212027 1750613 2080686
$$ packed form
36783b83164o88928o74380k34002K64020M91367M12467J58345j44217l86039m52200
36773a536731k49417K17497P23153Q45010L63711l18112m78009M1573N60631M16751
36763E86057j99089n84715m56908j35931N6987J60466L29372N46263O24310L46881
36753A273693l14903r95501j157569p23422k12043J1611K40835P56076J083713
36744c7510O32499j96559m11365Q7900L52462q2945m43768O854P17122O30368
36734A255058k42710q49028n52852J23363L03360j84639p39057p15658o5829O73552
36724i94440R50660P07738K64964j57404n23587o77092m05109R9856L11874J08892
36714c13648k1028K18282M17862J64077k05091j00506L87233O64846N38586L30073
$$ plain form
36704 2080686 2291858 2331504 2168602 2008317 2011710 1997060 1727809 1331084 1124837 1152834
36694 1152834 1173818 1018081 708250 320171 -50495 -283341 -400842 -613637 -991353 -1254923
36684 -1254923 -1146044 -820760 -570577 -343011 51875 380280 129332 -738410 -1609896
36675 -1609896 -1931287 -1743323 -1382225 -1006280 -638009 -401262 -447476 -761941 -1181263 -1473409
36665 -1473409 -1350064 -658877 291570 866414 801654 562705 740203 1263623 1555874 1381621
36655 1381621 1137959 1212530 1399307 1199992 532512 -137154 -354633 -151855 106052 184465
36645 184465 142163 103664 55027 -81336 -288899 -467459 -553603 -565736 -549930 -501510 -313831
36634 -313831 147213 799373 1221528 1008149 300355 -297329 -460566 -521965 -886959 -1376354
$$ packed form
36704B080686K11172L9646j62902j60285L393j4650k69251l96725k06247K7997
36694A152834K0984j55737l09831l88079l70666k32846j17501k12795l77716k63570
36684a254923J08879L25284K50183K27566L94886L28405k50948q67742q71486
36675a609896l21391J87964L61098L75945L68271K36747m6214l14465m19322k92146
36665a473409J23345O91187R50447N74844o4760k38949J77498N23420K92251j74253
36655A381621k43662P4571J86777j99315o67480o69666k17479K02778K57907P8413
36645A84465m2302l8499m8637j36363k07563j78560q6144j2133J5806M8420J87679
36634c13831M61044O52160M22155k13379p07794n97684j63237o1399l64994m89395
$$ plain form
36624 -1376354 -1513524 -1239969 -893691 -609235 -245768 127448 222004 79174 83440 273748
36614 273748 205255 -234711 -451206 -30864 477963 272826 -524782 -1054888 -945353 -688188
36604 -688188 -749563 -926633 -831092 -554683 -509165 -837807 -1272175 -1465756 -1274641 -778341
36594 -778341 -189537 242851 316795 -69311 -855665 -1765435 -2414376 -2596866 -2415938 -2067950
36584 -2067950 -1631807 -1182112 -912192 -899534 -877680 -531207 35584 392553 307408 -83693
36574 -83693 -565385 -977414 -1087587 -737360 -228283 -194943 -862153 -1663470 -1822819 -1173923
36564 -1173923 -246633 319061 301384 -26449 -197025 -5342 246012 45121 -739873 -1691739
36554 -1691739 -2295723 -2393934 -2141687 -1726475 -1275799 -911634 -748923 -863144 -1249825 -1706140
$$ packed form
36624a376354j37170K73555L46278K84456L63467L73216R4556j42830M266J90308
36614B73748o8493m39966k16495M20342N08827k05137p97608n30106J09535K57165
36604f88188o1375j77070R5541K76409M5518l28642m34368j93581J91115M96300
36594g78341N88804M32388P3944l86106p86354r09770o48941j82490J80928L47988
36584b067950M36143M49695K69920J2658K1854L46473N66791L56969q5145l91101
36574h3693m81692m12029j10173L50227N09077L3340o67210q01317j59349O48896
36564a173923R27290N65694j7677l27833j70576J91683K51354k00891p84994r51866
36554a691739o03984r8211K52247M15212M50676L64165J62711j14221l86681m56315
$$ plain form
36544 -1706140 -1818077 -1315805 -470995 109428 133615 -190930 -636427 -1213342 -1793715 -1925987
36534 -1925987 -1401177 -709565 -500085 -743914 -859348 -594534 -349734 -550114 -1045510
36525 -1045510 -1308744 -1059243 -555585 -324809 -632037 -1187181 -1427036 -1120084 -560340
36516 -560340 -98216 285857 735622 1074598 969447 478219 92666 181652 631529 1063128
36506 1063128 1166824 796247 1456 -921173 -1611704 -1982085 -2207713 -2335771 -2156593
36497 -2156593 -1629678 -1199599 -1364393 -1974790 -2279981 -1794135 -896774 -351012 -346758 -343685
36487 -343685 82100 582379 496554 -256095 -1114851 -1604481 -1698387 -1465385 -870113 -119278
36477 -119278 263632 64137 -254751 -189232 75809 7335 -410644 -651053 -420223 4320
$$ packed form
36544a706140j11937N02272Q44810N80423K4187l24545m45497n76915n80373j32272
36534a925987N24810O91612K09480k43829j15434K64814K44800k00380m95396
36525a045510k63234K49501N03658K30776l07228n55144k39855L06952N59744
36516e60340M62124L84073M49765L38976j05151m91228l85553Q8986M49877M31599
36506A063128J03696l70577p94791r22629o90531l70381k25628j28058J79178
36497b156593N26915M30079j64794o10397l05191M85846Q97361N45762M254L073
36487c43685M25785N00279q5825p52649q58756m89630r3906K33002N95272P50835
36477a19278L82910j99495l18888O5519K65041o8474m17979k40409K30830M24543
$$ plain form
36467 4320 245025 231569 55311 -229092 -510380 -583335 -367767 -45955 90045 -125292
36457 -125292 -580121 -874439 -615930 91047 629950 588200 288239 285951 559003 644124
36447 644124 438880 324851 489698 642565 500921 123539 -332152 -762605 -947034 -678131
36437 -678131 -195255 -51455 -397091 -814579 -1000984 -1142857 -1418099 -1610808 -1495785 -1175041
36427 -1175041 -754098 -116853 665864 1136571 1035008 712716 601584 633708 561663 461640
36417 461640 465989 351631 -87957 -535346 -539824 -207288 8205 27709 152361 467455
36407 467455 728584 771356 619895 288305 -131757 -329484 -141217 96483 -4691 -270461
36397 -270461 -286018 -116541 -98902 -72978 454682 1371768 1893258 1570237 758642 -47729
$$ packed form
36467D320K40705j3456j76258k84403k81288p2955K15568L21812J36000k15337
36457a25292m54829k94318K58509P06977N38903m1750k99961k288K73052Q5121
36447F44124k05244j14029J64847J52867j41644l77382m55691m30453j84429K68903
36437f78131M82876J43800l45636m17488j86405j41873k75242j92709J15023L20744
36427a175041M20943O37245P82717M70707j01563l22292j11132L2124p2045j00023
36417D61640M349j14358m39588m47389m478L32536K15493J9504J24652L15094
36407D67455K61129M2772j51461l31590m20062j97727J88267K37700j01174k65770
36397b70461j5557J69477J7639K5924N27660R17086N21490l23021q11595q06371
$$ plain form
36387 -47729 -730404 -1215148 -1275174 -979355 -800826 -943378 -1022860 -738837 -404522 -435892
36377 -435892 -709481 -824052 -691255 -511214 -434754 -558046 -968765 -1499496 -1721398 -1465070
36367 -1465070 -1042286 -693630 -221997 470990 927377 717241 125773 -302697 -592223
36358 -592223 -1053387 -1426887 -1131915 -367837 -134756 -882353 -1804375 -1886252 -1165682 -491648
36348 -491648 -378285 -607381 -796679 -856624 -852604 -798936 -734766 -779778 -969740 -1169346 -1267309
36337 -1267309 -1344045 -1487970 -1515772 -1112397 -331233 249327 83145 -703294 -1438809 -1646093
36327 -1646093 -1421429 -1082378 -758857 -489067 -448497 -803712 -1445628 -2082922 -2526359 -2718295
36317 -2718295 -2601551 -2177777 -1618919 -1104568 -612243 -91186 234432 52972 -506320
$$ packed form
36387d7729o82675m84744o0026K95819J78529j42552p9482K84023L34315l1370
36377d35892k73589j14571J32797J80041P6460j23292m10719n30731k21902K56328
36367a465070M22784L48656M71633O92987M56387k10136n91468m28470k89526
36358e92223m61164l73500K94972P64078K33081p47597r22022q1877P20570O74034
36348d91648J13363k29096j89298n9945M020N3668O4170m5012j89962j99606r7963
36337a267309p6736j43925k7802M03375P81164N80560j66182p86439p35515k07284
36327a646093K24664L39051L23521K69790M0570l55215o41916o37294m43437j91936
36317b718295J16744M23774N58858N14351M92325N21057L25618j81460n59292
$$ plain form
36308 -506320 -852890 -626684 -206324 -285102 -1010770 -1783348 -1961864 -1582289 -1201306 -1126166
36298 -1126166 -1094103 -812911 -501443 -550808 -822812 -770818 -291549 47079 -168660 -610032
36288 -610032 -772351 -713395 -774355 -906529 -851315 -779771 -1102080 -1688058 -1926945 -1644040
36278 -1644040 -1333843 -1304290 -1213167 -776591 -372897 -475128 -900168 -1128028 -1061913 -964327
36268 -964327 -895897 -780828 -849462 -1369852 -1955607 -1793087 -729024 404945 783539 424071
36258 424071 -236060 -1074049 -2099410 -2897480 -2902176 -2182470 -1440659 -1154071 -1119602 -935586
36248 -935586 -547438 -162605 36322 -92155 -604435 -1228326 -1475748 -1266034 -1111546 -1320261
36238 -1320261 -1358532 -582148 603623 1062073 476560 -166144 27945 644040 689138 41033
$$ packed form
36308e06320l46570K26206M20360p8778p25668p72578j78516L79575L80983P5140
36298a126166L2063K81192L11468m9365k72004N1994M79269L38628k15739m41372
36288f10032j62319N8956o0960j32174N5214P1544l22309n85978k38887K82905
36278a644040L10197K9553R1123M36576M03694j02231m25040k27860O6115R7586
36268i64327O8430J15069o8634n20390n85755J62520J064063J133969L78594l59468
36258D24071o60131q37989j025361p98070m696P19706P41811K86588L4469J84016
36248i35586L88148L84833J98927j28477n12280o23891k47422K09714J54488k08715
36238a320261l8271P76384J185771M58450n85513o42704J94089O16095M5098o48105
$$ plain form
36228 41033 -555119 -690244 -708079 -895515 -975590 -666593 -220319 -72417 -324454 -878042
36218 -878042 -1742660 -2824860 -3646441 -3715906 -3135488 -2502456 -2204684 -2090823 -1859898 -1501124
36208 -1501124 -1223794 -1119688 -1052653 -865509 -630456 -638262 -1056765 -1603562 -1734433 -1274562
36198 -1274562 -697299 -584312 -959125 -1426729 -1839000 -2390629 -3017843 -3203742 -2690235
36189 -2690235 -2025144 -1942238 -2352630 -2439705 -1766264 -806474 -207210 35854 309538 604243
36179 604243 515571 -25223 -498579 -422166 95872 597796 786793 586518 -28241 -915026
36169 -915026 -1625815 -1770212 -1513947 -1395782 -1621024 -1863176 -1840605 -1713393 -1686395 -1549594
36159 -1549594 -993048 -226199 121598 -251759 -961585 -1388651 -1276259 -827659 -421298
$$ packed form
36228D1033n96152j35125j7835j87436q0075L08997M46274J47902k52037n53588
36218h78042q64618j082200q21581o9465N80418O33032K97772J13861K30925L58774
36208a501124K77330J04106O7035J87144K35053p806m18503n46797j30871M59871
36198a274562N77263J12987l74813m67604m12271n51629o27214j85899N13507
36189b690235O65091Q2906m10392q7075O73441R59790N99264K43064K73684K94705
36179F04243q8672n40794m73356P6413N18038N01924J88997k00275o14759q86785
36169i15026p10789j44397K56265J18165k25242k42152K2571J27212K6998J36801
36159a549594N56546P66849L47797l73357p09826m27066J12392M48600M06361
$$ plain form
36150 -421298 -308029 -412460 -360905 123137 792731 1055972 677256 72923 -234781 -206233
36140 -206233 -103991 14030 246336 432633 233530 -340056 -858305 -1031616 -996475 -915732
36130 -915732 -665271 -172978 237991 205896 -130281 -303101 -169943 -73993 -338634 -883111
36120 -883111 -1436714 -1939811 -2579355 -3454267 -4275002 -4481296 -3783039 -2567736 -1566711
36111 -1566711 -1085425 -849426 -683252 -870607 -1513489 -2016748 -1833931 -1438982 -1785490
36102 -1785490 -2857817 -3571509 -3262048 -2474398 -1944073 -1571019 -971407 -413602 -447218
36093 -447218 -968291 -1408265 -1654734 -2052838 -2565298 -2668802 -2204430 -1707392 -1657766 -1874552
36083 -1874552 -1901783 -1618673 -1203601 -777590 -353449 17761 244265 272581 132478 7396
$$ packed form
36150d21298J13269j04431N1555M84042O69594K63241l78716o04333l07704K8548
36140b06233J02242J18021K32306J86297j99103n73586n18249j73311L5141Q0743
36130i15732K50461M92293M10969l2095l36177j72820J33158R5950k64641n44477
36120h83111n53603n03097o39544q74912q20735k06294O98257J215303J001025
36111a566711M81286K35999J66174j87355o42882n03259J82817L94949l46508
36102a785490j072327p13692L09461P87650N30325L73054N99612N57805l3616
36093d47218n21073m39974k46469l98104n12460j03504M64372M97038M9626k16786
36083a874552k7231K83110M15072M26011M24141L71210K26504K8316j40103j25082
$$ plain form
36073 7396 179085 664149 986917 670002 -53626 -429621 -165189 210644 145593 -214970
36063 -214970 -409812 -395979 -487302 -776440 -1041071 -1154112 -1245764 -1463768 -1815349 -2224594
36053 -2224594 -2550293 -2606791 -2373142 -2118232 -2100944 -2200233 -2068106 -1605250 -1046839 -612288
36043 -612288 -341651 -273866 -461122 -713592 -655285 -240711 46103 -200186 -672308 -689442
36033 -689442 -141080 281301 -70177 -999830 -1717338 -1693808 -1040648 -194943 449744 623668
36023 623668 225751 -564137 -1372480 -1917723 -2110175 -1910838 -1337158 -641480 -191097 -48503
36013 -48503 63670 251896 233241 -152305 -560781 -641832 -649145 -1091169 -1903028 -2433878
36003 -2433878 -2246258 -1531411 -724865 -93189 261202 364091 440660 721475 1091476 1187317
$$ packed form
36073G396J71689M85064L22768l16915p23628l75995K64432L75833o5051l60563
36063b14970j94842J3833r1323k89138k64631j13041r1652k18004l51581m09245
36053b224594l25699n6498K33649K54910J7288r9289J32127M62856N58411M34551
36043f12288K70637O7785j87256k52470N8307M14574K86814k46289m72122j7134
36033f89442N48362M22381l51478r29653p17508K3530O53160Q45705O44687J73924
36023F23668l97917p89888q08343n45243j92452J99337N73680O95678M50383J42594
36013d8503J12173J88226j8655l85546m08476q1051p313m42024q11859n30850
36003b433878J87620P14847Q06546O31676L54391J02889P6569K80815L70001R5841
$$ plain form
35993 1187317 881150 408132 13288 -241546 -347748 -364403 -527554 -952508 -1262715 -1000478
35983 -1000478 -430696 -368276 -1059640 -1809896 -1970739 -1734931 -1584858 -1465420 -1004392 -220322
35973 -220322 470447 763020 644406 283553 11132 119917 407440 261133 -484895 -1167227
35963 -1167227 -1151122 -662510 -300507 -149868 15873 24715 -431805 -1020583 -1061307 -601737
35953 -601737 -452785 -1017383 -1739825 -1936589 -1613463 -1188478 -870744 -622151 -391627 -107775
$$ packed form
35993A187317l06167m73018l94844k54834j06202j6655j63151m24954l10207K62237
35983a000478N69782O2420o91364p50256j60843K35808J50073J19438M61028P84070
35973b20322O90769K92573j18614l60853k72421J08785K87523j46307p46028o82332
35963a167227J6105M88612L62003J50639J65741Q842m56520n88778m0724M59570
35953f01737J48952n64598p22442j96764L23126M24985L17734K48593K30524K83852
$$ [...]
##END NTUPLES=NMR SPECTRUM
##END=
