##TITLE=31P_DE-80H_X3
 64 sc D2O
 26.2.2025
##JCAMPDX= 6.0         $$ Bruker NMR JCAMP-DX V2.0
##DATA TYPE= NMR SPECTRUM
##DATA CLASS= NTUPLES
##ORIGIN= UXNMR, Bruker Analytische Messtechnik GmbH
##OWNER= root
$$ XWIN-NMR		Version 3.5
$$ Tue Mar 18 15:35:52 2025 Russian Standard Time (UT+4h)  Yarkov@DPX200
##.OBSERVE FREQUENCY= 81.013821
##.OBSERVE NUCLEUS= ^31P
##.ACQUISITION MODE= SIMULTANEOUS
##.ACQUISITION SCHEME= undefined
##.AVERAGES= 64
##.DIGITISER RES= 17
##SPECTROMETER/DATA SYSTEM= spect
##.PULSE SEQUENCE= zgpg30
##.SOLVENT NAME= CDCl3
##.SHIFT REFERENCE= (INTERNAL, CDCl3, 0, 198.062)
##AUDIT TRAIL= $$ (NUMBER, WHEN, WHO, WHERE, WHAT)
$$ ##TITLE= Audit trail, XWIN-NMR		Version 3.5
$$ ##JCAMPDX= 5.01
$$ ##ORIGIN= Bruker BioSpin GmbH
$$ ##OWNER= Yarkov
$$ C:/Bruker/XWIN-NMR/data/yarkov2/nmr/P31/2/pdata/1/auditp.txt
$$ ##AUDIT TRAIL=  $$ (NUMBER, WHEN, WHO, WHERE, WHAT)
(   1,<2025-03-18 15:34:40.39 +0400>,<Yarkov>,<DPX200>,
      <created by zg, POWCHK disabled, PULCHK disabled
       configuration hash MD5:
       00 E9 B6 7A A2 85 ED C7 34 08 36 98 17 FE 4E 26
       data hash MD5: 32K
       6B 60 64 23 29 CE 58 E8 9C 84 55 79 94 8C 03 17>)
(   2,<2025-03-18 15:34:49.17 +0400>,<Yarkov>,<DPX200>,
      <Start of raw data processing
       efp BC_mod = 2 LB = 1.5 FT_mod = 6 PKNL = 1 PHC0 = 1774.924 PHC1 = 6.895418 SI = 64K 
       data hash MD5: 64K
       09 D2 87 45 3D 24 D6 29 2C 9F A1 6C A9 89 62 77>)
(   3,<2025-03-18 15:35:14.67 +0400>,<Yarkov>,<DPX200>,
      <pk PHC0 = 0.7629235 PHC1 = 0 
       data hash MD5: 64K
       8C A3 28 A2 61 D9 7E 6D A2 EF 88 C3 F8 1F 59 CA>)
$$ ##END=
$$ 
$$ hash MD5
$$ 80 E3 15 5F 98 3D A5 6F CF 4A E4 AD 2B 39 29 8D
##$RELAX= 
##$RELAX= 
##$RELAX= 
##$RELAX= 
##$RELAX= 
##$RELAX= 
##$RELAX= 
##$RELAX= 
$$ Bruker specific parameters
$$ --------------------------
##$DU= <C:/Bruker/XWIN-NMR>
##$EXPNO= 2
##$NAME= <P31>
##$PROCNO= 1
##$TYPE= <nmr>
##$USER= <yarkov2>
##$AMP= (0..31)
100 100 100 100 100 100 100 100 100 100 100 100 100 100 100 100 100 100 
100 100 100 100 100 100 100 100 100 100 100 100 100 100 
##$AQSEQ= 0
##$AQ_mod= 1
##$AUNM= <au_zg>
##$AUTOPOS= <>
##$BF1= 81.014009
##$BF2= 200.13
##$BF3= 200.13
##$BF4= 200.13
##$BF5= 200.13
##$BF6= 200.13
##$BF7= 200.13
##$BF8= 200.13
##$BYTORDA= 1
##$CFDGTYP= 0
##$CFRGTYP= 5
##$CHEMSTR= <none>
##$CNST= (0..31)
1 1 145 1 1 1 1 1 1 1 1 1 1 1 1 1 1 1 1 1 1 1 1 1 1 1 1 1 1 1 1 1 
##$CPDPRG= <waltz16>
##$CPDPRG1= <>
##$CPDPRG2= <waltz16>
##$CPDPRG3= <>
##$CPDPRG4= <mlev>
##$CPDPRG5= <mlev>
##$CPDPRG6= <mlev>
##$CPDPRG7= <mlev>
##$CPDPRG8= <mlev>
##$CPDPRGB= <>
##$CPDPRGT= <>
##$D= (0..31)
0 1 0 0 0 0 0 0 0 0.06 0 0.03 2e-05 3e-06 0 0 0.0002 0 0 0 0 0 0 0 0 0 
0 0 0 0 0 0 
##$DATE= 1742297680
##$DBL= (0..7)
120 120 120 11 120 120 24 19 
##$DBP= (0..7)
150 150 150 150 150 150 150 150 
##$DBP07= 0
##$DBPNAM0= <>
##$DBPNAM1= <>
##$DBPNAM2= <>
##$DBPNAM3= <>
##$DBPNAM4= <>
##$DBPNAM5= <>
##$DBPNAM6= <>
##$DBPNAM7= <>
##$DBPOAL= (0..7)
$$ [...]
##$SUBNAM2= <"">
##$SUBNAM3= <"">
##$SUBNAM4= <"">
##$SUBNAM5= <"">
##$SUBNAM6= <"">
##$SUBNAM7= <"">
##$SUBNAM8= <"">
##$SUBNAM9= <"">
##$SW= 400.765351723535
##$SWIBOX= (0..15)
0 1 3 0 0 0 0 0 0 0 0 0 0 0 0 0 
##$SW_h= 32467.5324675325
##$TD= 32768
##$TD0= 1
##$TE= 0
##$TE2= 300
##$TE3= 300
##$TEG= 300
##$TL= (0..7)
0 120 53 12 22 120 120 120 
##$TP= (0..7)
150 150 150 150 150 150 150 150 
##$TP07= 0
##$TPNAME0= <>
##$TPNAME1= <>
##$TPNAME2= <>
##$TPNAME3= <>
##$TPNAME4= <>
##$TPNAME5= <>
##$TPNAME6= <>
##$TPNAME7= <>
##$TPOAL= (0..7)
0.5 0.5 0.5 0.5 0.5 0.5 0.5 0.5 
##$TPOFFS= (0..7)
0 0 0 0 0 0 0 0 
##$TUNHIN= 0
##$TUNHOUT= 0
##$TUNXOUT= 0
##$USERA1= <user>
##$USERA2= <user>
##$USERA3= <user>
##$USERA4= <user>
##$USERA5= <user>
##$V9= 5
##$VALIST= <valist>
##$VCLIST= <CCCCCCCCCCCCCCC>
##$VD= 0
##$VDLIST= <DDDDDDDDDDDDDDD>
##$VPLIST= <PPPPPPPPPPPPPPP>
##$VTLIST= <TTTTTTTTTTTTTTT>
##$WBST= 1024
##$WBSW= 4
##$XGAIN= (0..3)
0 0 0 0 
##$XL= 0
##$YL= 0
##$YMAX_a= 49239
##$YMIN_a= -54776
##$ZGOPTNS= <>
##$ZL1= 120
##$ZL2= 120
##$ZL3= 120
##$ZL4= 120
##$ABSF1= 0
##$ABSF2= 0
##$ABSG= 0
##$ABSL= 0
##$ALPHA= 0
##$AQORDER= 0
##$ASSFAC= 0
##$ASSFACI= 0
##$ASSFACX= 0
##$ASSWID= 0
##$AUNMP= <proc_1d>
##$AZFE= 0.1
##$AZFW= 0.5
##$BCFW= 0
##$BC_mod= 2
##$BYTORDP= 0
##$COROFFS= 0
##$CY= -3
##$DATMOD= 1
##$DC= 0
##$DFILT= <>
##$DTYPP= 0
##$F1P= 0
##$F2P= 0
##$FCOR= 1
##$FTSIZE= 65536
##$FT_mod= 6
##$GAMMA= 0
##$GB= 0
##$INTBC= 1
##$INTSCL= 9.790993e-09
##$ISEN= 30
##$LB= 1.5
##$LEV0= 0
##$LPBIN= 0
##$MAXI= 10000
##$MC2= 0
##$MEAN= 0
##$ME_mod= 0
##$MI= 50
##$NCOEF= 0
##$NC_proc= -3
##$NLEV= 6
##$NOISF1= 182.463
##$NOISF2= 159.3651
##$NSP= 0
##$NTH_PI= 0
##$NZP= 0
##$OFFSET= 198.0616
##$PC= 4
##$PHC0= 1775.687
##$PHC1= 6.895418
##$PH_mod= 1
##$PKNL= yes
##$PPARMOD= 0
##$PSCAL= 0
##$PSIGN= 0
##$REVERSE= no
##$SF= 81.0140089999434
##$SI= 65536
##$SIGF1= 159.3651
##$SIGF2= -187.1042
##$SINO= 113.3802
##$SIOLD= 16384
##$SREGLST= <1H.CDCl3>
##$SSB= 0
##$STSI= 65536
##$STSR= 0
##$SW_p= 32467.5324675325
##$SYMM= 0
##$S_DEV= 0
##$TDeff= 32768
##$TDoff= 0
##$TI= <>
##$TILT= no
##$TM1= 0
##$TM2= 0
##$TOPLEV= 0
##$USERP1= <user>
##$USERP2= <user>
##$USERP3= <user>
##$USERP4= <user>
##$USERP5= <user>
##$WDW= 1
##$XDIM= 65536
##$YMAX_p= 280646125
##$YMIN_p= -6592097
$$ End of Bruker specific parameters
$$ ---------------------------------
##NTUPLES= NMR SPECTRUM
##VAR_NAME=  FREQUENCY,     SPECTRUM/REAL,   SPECTRUM/IMAG
##SYMBOL=    X,             R,               I
##VAR_TYPE=  INDEPENDENT,   DEPENDENT,       DEPENDENT
##VAR_FORM=  AFFN,          ASDF,            ASDF
##VAR_DIM=   65536,         65536,           65536
##UNITS=     HZ,            ARBITRARY UNITS, ARBITRARY UNITS
##FACTOR=    0.49542278885378, 1,            1
##FIRST=     16045.7642231865, 0,            0
##LAST=      -16421.768244346, 0,            0
##MIN=       -16421.768244346, -6592097,     0
##MAX=       16045.7642231865, 280646125,    0
$$ Real data points
##PAGE= N=1
##DATA TABLE= (X++(R..R)), XYDATA
$$ [...]
41903B8344o7654k0301J1962L2754L9102M4139N9646N8037J7491j4636J1701M4248
$$ 28344 -39310 -59611 -47649 -14895 24207 68346 127992 186029 203520 188884 200585 244833
41891B44833k868r4488j16041o3157m3626p8137o3263K5087O4878L267l0718N3846
$$ 244833 241965 147477 31436 -31721 -75347 -153484 -216747 -191660 -126782 -123515 -154233 -100387
41879a00387J27551L2011j57600k29059j24214K3643R8797J00914O0489j224l0491
$$ -100387 27164 59175 -98425 -327484 -451698 -428055 -329258 -228344 -167855 -169079 -199570
41868a99570K0811J08615J40014R5481K5160m8042j22920j48460p7051K2324K4852
$$ -199570 -178759 -70144 69870 165351 190511 142469 19549 -128911 -205962 -183638 -158786
41857a58786p0659j35555r5791j3524L2980M3769M4761L9945M5753Q1194R8963
$$ -158786 -229445 -365000 -460791 -474315 -441335 -397566 -352805 -312860 -267107 -185913 -86950
41846h6950K5096j03236j47642o2203L2003L1407J743M9761J31077J14449J132
$$ -86950 -61854 -165090 -312732 -374935 -342932 -311525 -309782 -260021 -128944 -14495 -13363
41835a3363n1108N3547J98132J78492n0197l01522l49689j76329J4549M3662l8283
$$ -13363 -64471 -10924 187208 365700 315503 13981 -335708 -512037 -497488 -453826 -492109
41824d92109n6249K7854P9897K3301l5852J6427J16476J25933N0036K0240P9686
$$ -492109 -548358 -520504 -440607 -417306 -453158 -436731 -320255 -194322 -144286 -124046 -44360
41813d4360J16243L7646q7853j23579l8588O8922R5294L1491n0754p5842k3993
$$ -44360 71883 109529 21676 -101903 -140491 -71569 23725 55216 4462 -71380 -95373
41802i5373O0673J07430P2784k6699j25302j55306r7896J350O9744O8236J8882
$$ -95373 -34700 72730 145514 118815 -6487 -161793 -259689 -258339 -188595 -120359 -101477
41791a01477k6307l9086l2943k9677k1225J6036O6699O7608j2726j04443j00897
$$ -101477 -127784 -166870 -199813 -229490 -250715 -234679 -167980 -100372 -113098 -217541 -318438
41780c18438N07Q1400N4866k3192m4775j613K5979M103j2894K3268Q7797J23867
$$ -318438 -317931 -236531 -181665 -204857 -249632 -251245 -225266 -221163 -234057 -210789 -122992 875
41768H75R8686J0971j05642j78752j50289m8386L7722O0926M6636K2096j6621
$$ 875 99561 110532 4890 -173862 -324151 -372537 -334815 -273889 -227253 -205157 -221778
41757b21778n4043m7862o445l990o8897j17555o3463N0667J02018M9342k2404
$$ -221778 -275821 -323683 -330128 -334118 -403015 -520570 -584033 -533366 -431348 -382006 -404410
41746d04410k0781M4593Q7394M7984m4330r8874m9001P9350J83856J79935Q0990
$$ -404410 -425191 -380598 -293204 -245220 -289550 -388424 -437425 -358075 -174219 5716 86706
41735H6706j8594m0166K889L1569N313k2990J3649Q3152Q7523J5482k6759J9810
$$ 86706 68112 27946 30835 62404 67717 44727 58376 141528 229051 244533 217774 237584
41723B37584O7515K8577l2560j6816J7666n1702j69063j49857J5143J14079L6216
$$ 237584 305099 333676 301116 284300 301966 250264 81201 -68656 -53513 60566 96782
41712I6782o0769j7213P6466N1776n6808r1161l6856j4285m6748k6415Q5248J78051
$$ 96782 36013 18800 95266 147042 90234 -927 -37783 -52068 -98816 -125231 -39983 138068
41700A38068J41291j4416j91232k74289j90018P896J42760J12701L7876P7082
$$ 138068 279359 264943 73711 -200578 -390596 -382700 -239940 -127239 -89363 -12281
41690a2281J56020P2134j47550k30137n9216J32629J01647o3661j12088q158O6280
$$ -12281 143739 215873 68323 -161814 -221030 -88401 13246 -50415 -162503 -170661 -104381
41679a04381K5869j1233N7492J60318J70913P8040l2245j01661j43027j79693
$$ -104381 -78512 -89745 -32253 128065 298978 377018 344773 243112 100085 -79608
41669g9608j88075j18249K8735J65215J98298J46604J16236J39766J17636j9235
$$ -79608 -267683 -385932 -357197 -191982 6316 152920 269156 408922 526558 507323
41659E07323j62741j49258N423J12493O0565n3619q9202n6464o2681j21023j22150
$$ 507323 344582 195324 200747 313240 373805 320186 230984 174520 111839 -9184 -131334
41648a31334k294J47640J91909J27329Q5711J53837K47623K12535K6888j58735
$$ -131334 -133628 14012 205921 333250 418961 572798 820421 1032956 1059844 901109
41638I01109k00466j21333m7900l2758j5692M8752J11386J10068O6339M2630M0202
$$ 901109 700643 579310 531410 498652 482960 531712 643098 753166 819505 862135 902337
41627I02337O384o6362j12997q3894j5577J1276l9242j25291j63763r8356L9332
$$ 902337 908721 842359 729362 645468 629891 641167 601925 476634 312871 214515 253847
41616B53847J39431J28400P1343R1477J76113J64415j1635j81544j51729Q395
$$ 253847 393278 521678 593021 684498 860611 1025026 1013391 831847 680118 688513
41606F88513N6730p2702j93100j61757o7673m2391n2859j1764L9765J8300k7153
$$ 688513 745243 672541 479441 317684 250011 207620 154761 142997 182762 201062 173909
41595A73909K481N8939R494j26635j78673p0023R0882J84801K01050J59037O4623
$$ 173909 176390 235329 244823 118188 -60485 -130508 -39626 145175 346225 505262 569885
41584E69885j0039M3319J87530K29374P9058j08224j51150p8267k1126J1380Q6201
$$ 569885 559846 603165 790695 1020069 1099127 990903 839753 761486 740360 751740 837941
41573H37941J49799P0211j33216k71004k27518r3672j5075k1134n9845j04174
$$ 837941 987740 1057951 924735 653731 426213 332541 317466 296332 236487 132313
41563A32313j47191j54478r8132n632Q3074J75829K84482L47226K78061J06021
$$ 132313 -14878 -169356 -267488 -273120 -190046 -14217 270265 617491 895552 1001573
41553A001573j4565J5800J07724J05248P619m0473J1720K5388j06450k61619k53144
$$ 1001573 987008 1002808 1110532 1215780 1223399 1182926 1194646 1220034 1113584 851965 598821
41542E98821j15348m6817r2997r1665K6693R6924r899j54518j35017M764O2939
$$ 598821 483473 436656 343659 251994 278687 375611 365712 211194 76177 80941 143880
41531A43880o413o8037n4647l7481m5768j2915N7081N2223m7012r5478j2297O4218
$$ 143880 137467 69430 14783 -22698 -68466 -81381 -24300 27923 -19089 -114567 -126864 -62646
41519f2646j4319j55193j48687J5730J33034Q2973j5245l896Q6166J09704L4815
$$ -62646 -76965 -232158 -380845 -365115 -232081 -149108 -164353 -168249 -82083 27621 62436
41508F2436k4526O479N6474K8977m8886p3707k0905L4531M3557L8119M1323J4065
$$ 62436 37910 44389 100863 129840 80954 7247 -13658 20873 64430 102549 143872 157937
41496A57937n7113r6123l5846P2573J26253J04037N3533j4066j16604k09367k08333
$$ 157937 100824 4701 -31145 41428 167681 271718 325251 311185 194581 -14786 -223119
41485b23119j11524m541O5890J33481K12479K51280K16936J39719L8779j07123
$$ -223119 -334643 -339184 -273294 -139813 72666 323946 540882 680601 719380 612257
41475F12257k66594l23079k10476j9472J06215J32482J21618J00565L5491o8964
$$ 612257 345663 22584 -187892 -207364 -101149 31333 152951 253516 289007 220043
41465B20043j30671q4734K3943P9468K0728r2496j49283j11128l6706J5369N3468
$$ 220043 89372 4638 28581 108049 128777 36281 -113002 -224130 -260836 -245467 -191999
41454a91999R2742R4632L6190j4666J2208O5691M9838j0244j6856N762o1907j96327
$$ -191999 -99257 -4625 31565 16899 29107 94798 144636 134392 117536 123298 61391 -134936
41442a34936k14570o4873O0715J9515n8195J891J24021J18781r84o2868k4736
$$ -134936 -349506 -414379 -353664 -334149 -392344 -390453 -266432 -147651 -148635 -211503 -236239
41431b36239J332k0835j9343k478n4898j27433n9375J32871K12012O3806j14015
$$ -236239 -234907 -255742 -275085 -277563 -332461 -459894 -519269 -386398 -174386 -110580 -224595
41420b24595r7866N4721J37727R9654M0032k563p5585j65535j86623j14343j3824
$$ -224595 -322461 -267740 -130013 -30359 9673 7110 -68475 -234010 -420633 -534976 -548800
41409e48800O0946J02420J00875N4750J5486L1786O1617K6862n8383j04802q2077
$$ -548800 -487854 -385434 -284559 -229809 -214323 -182537 -120920 -94058 -152441 -257243 -339320
41398c39320m0714m275N7477J36165J66217J25185O3134N623p6794j64517j61142
$$ -339320 -380034 -384309 -326832 -190667 -24450 100735 163869 169492 92698 -71819 -232961
41387b32961m2177O0038K0503r2485j10483q892P1404N0095K0043P6757J49020
$$ -232961 -275138 -215100 -194597 -287082 -397565 -406457 -335053 -284958 -264915 -188158 -39138
41376c9138J05284l6006j28760j16462r7992j46041j83026j19031j7645k846n1579
$$ -39138 66146 30140 -98620 -215082 -313074 -459115 -642141 -761172 -778817 -781663 -833242
41365h33242k0958J17698K12998J49545J2438m1201J3833Q3911J05191Q1465K1656
$$ -833242 -854200 -736502 -523504 -373959 -361521 -402722 -388889 -304978 -199787 -118322 -96666
41354i6666n8926j03234p4117k9631m2541o9408j2648J00098J33534N9461J0848
$$ -96666 -155592 -258826 -332943 -362574 -405115 -474523 -487171 -387073 -253539 -194078 -183230
41343a83230O6467J18911N0598p4068j12627n4208Q047M9694J09294J47167P8794
$$ -183230 -116763 2148 52746 -21322 -133949 -188157 -180110 -130416 -21122 126045 204839
41332B04839m5644o6679L2506O6118o9864k04741j30487P5559J50713K6470q8318
$$ 204839 159195 92516 125022 191140 121276 -83465 -213952 -138393 12320 38790 -49528
41321d9528k8004J06676J30289L7228l8806m1519l0043l7492k4658J7650K8781
$$ -49528 -77532 29144 159433 196661 157855 116336 86293 48801 24143 41793 70574
41310G0574k5812r4987j12660p2045n052N7000P7723K8499o0139j09919q9148
$$ 70574 44762 -50225 -162885 -234930 -239982 -182982 -105259 -76760 -136899 -246818 -335966
41299c35966m6689k4953k769L4023L7546j8546o2412j6782P7516J25122J24763
$$ -335966 -382655 -407608 -410377 -376354 -338808 -357354 -419766 -436548 -359032 -233910 -109147
41288a09147J41364J51037N2157j44273k68222k01247l3498O6135N4395L572l9103
$$ -109147 32217 183254 235411 91138 -177084 -378331 -411829 -345694 -291299 -287727 -326830
41277c26830p3375p1003J087Q5530P0765m8203j28445m6673J41388K55658J82806
$$ -326830 -400205 -471208 -470121 -384591 -313826 -362029 -490474 -537147 -395759 -140101 42705
41266D2705j7475j81299j91764o8162P7540J59364J75902J53689Q2397m6119j65747
$$ 42705 25230 -156069 -347833 -415995 -338455 -179091 -3189 150500 232897 186778 21031
41255B1031j81610r9632l9616p8248j33743p3347Q6846J70376N9227j31470j67147
$$ 21031 -160579 -260211 -299827 -378075 -511818 -585165 -498319 -327943 -268716 -400186 -567333
41244e67333K0591K36020K56381J12446L4212J23016K07145R6342j29441k25177
$$ -567333 -546742 -310722 -54341 58105 92317 215333 422478 518820 389379 164202
41234A64202j24858j1221k3043o2847J3616J51047J79420P2374l1608m6259l3232
$$ 164202 39344 28123 5080 -57767 -44151 106896 286316 358690 327082 280823 247591
41223B47591o3675j11555j32877j46797j70257j50966m3752R7504J76346J65569
$$ 247591 183916 72361 -60516 -207313 -377570 -528536 -572288 -474784 -298438 -132869
41213a32869J01851J1699q4531j31732r1141j6281P484r916J3088Q1266J03872
$$ -132869 -31018 -19319 -103850 -235582 -326723 -343004 -335520 -345436 -332348 -251082 -147210
41202a47210M6244q979J170K6363J3284Q357N7619R4628M7137j6636R303O8719
$$ -147210 -100966 -109945 -108775 -82412 -69128 -60771 -3152 91476 138613 121977 131280 199999
41190A99999J2547j43258k10415j15142j5480m8889j19665o5062Q2955J52325
$$ 199999 212546 69288 -141127 -256269 -271749 -320638 -440303 -505365 -422410 -270085
41180b70085P9919l9015j14236j35457r6212K2547J68912K27299J52486K9111
$$ -270085 -190166 -229181 -343417 -478874 -575086 -552539 -383627 -156328 -3842 25269
41170B5269l3517j5788K1887K0120k2432m8951j1720M0299j0000j77459k90869
$$ 25269 -8248 -24036 -2149 17971 -4461 -53412 -65132 -24833 -34833 -212292 -503161
41159e03161j77008J00324K92081K51027O9256p1588q5600n100Q1776Q4998j9197
$$ -503161 -680169 -579845 -287764 -36737 32519 -39069 -124669 -129769 -47993 37005 17808
41148A7808j50100k07998j85502j24984j3825J55508K64903J84863M747m6042
$$ 17808 -132292 -340290 -525792 -650776 -664601 -509093 -244190 -59327 -54580 -100622
41138a00622O6043J33499N5808n793O4041J16114R268j12648n2821R6986J12260
$$ -100622 -34579 98920 154728 148935 212976 329090 338358 225710 172889 269875 382135
41127C82135J1115q749O9949P7154k7703j15279j49888k08087k31588p4445J57421
$$ 382135 393250 384501 454450 531604 503901 388622 238734 30647 -200941 -275386 -117965
41116a17965J48471j29609k89569q1760K17836K18866k6330j71094j05151j3136
$$ -117965 30506 -99103 -388672 -470432 -252596 -33730 -60060 -231154 -336305 -349441
41106c49441L389L6577J14520J21694K6931l9715o225L4296O893k3230L811K1735
$$ -349441 -346052 -309475 -194955 -73261 -46330 -86045 -92270 -57974 -51081 -74311 -70500 -48765
41094d8765l5090r7782o7446K2145N4270J543m5647j3290O5071J04477P4335K3093
$$ -48765 -83855 -181637 -249083 -226938 -172668 -171125 -216772 -230062 -164991 -60514 13821 36914
41082C6914O498J7491J1661j2345j1491J3132j774o9788r9786k5031P9328J04753
$$ 36914 43412 60903 72564 60219 48728 61860 60086 -9702 -109488 -134519 -55191 49562
41070D9562Q1356J17943J98159J81087K3619j33616j57963r3618o4897r3669j02885
$$ 49562 130918 248861 447020 628107 651726 518110 360147 266529 201632 107963 5078
41059E078n6837q957j2776m7202n2445j6253K558m9767j36357j62021r9734k6447
$$ 5078 -51759 -60716 -73492 -120694 -173139 -189392 -186834 -236601 -372958 -534979 -634713 -661160
41047f61160r41K0894Q4273J25159O5602l6565n9474m694K4779J4177M7962J25738
$$ -661160 -662101 -641207 -556934 -431775 -366173 -402738 -462212 -466906 -442127 -427950 -379988 -254250
41035b54250J35588M9259k0063j1453k344k7412J0209J34342J78554L2828j40910
$$ -254250 -118662 -69403 -89466 -100919 -103263 -130675 -120466 13876 192430 225258 84348
41024H4348j28982J6123Q6168N1108M6168Q2510L4837q0197q0239O6939J52182
$$ 84348 -44634 -28511 57657 108765 154933 237443 272280 192083 111844 178783 330965
41013C30965N6807n0794k019Q6545J4565j62541k27577j49454r2667j03482l5341
$$ 330965 387772 336978 334959 421504 436069 273528 45951 -103503 -196170 -299652 -334993
41002c34993J61176K95043K02772L298o7866J0771M1875r0891k61746k73987r8559
$$ -334993 -173817 121226 323998 327296 259430 270201 312076 221185 -40561 -314548 -413107
40991d13107J10265J91471J26372K8524J2197P4576J12135N5002m4373q4473m6075
$$ -413107 -302842 -111371 15001 43525 55722 130298 242433 297435 253062 168589 122514
40980A22514K583J6131J8293L0660K7797o305m1216o1047j01303j69506j87782
$$ 122514 125097 141228 159521 190181 217978 211673 170457 109410 8107 -161399 -349181
40969c49181r2340N0964J19933J01140Q6346J14281J24887Q7111N7482N9783J1156
$$ -349181 -441521 -390557 -270624 -169484 -83138 31143 156030 243141 300623 360406 371562
40958C71562j42427k87945k54819m5440J39423J24353n3030k03772j98134q2259
$$ 371562 229135 -58810 -313629 -359069 -219646 -95293 -148323 -352095 -550229 -632488
40948f32488N102K171j9526K4275R7871R4132L809m5863M4738K07206K78449J78410
$$ -632488 -627386 -625215 -644741 -620466 -522595 -428463 -424654 -470517 -425779 -218573 59876 238286
40936B38286k1598j73714j71140l8104O9358R896j61393k29556q9490J05206J47106
$$ 238286 216688 42974 -128166 -166270 -96912 -87016 -248409 -477965 -567455 -462249 -315143
40925c15143M9313o112N6685J29712J14805N3197K3477K3736J3252r649k7899
$$ -315143 -265830 -271942 -215257 -85545 29260 82457 105934 129670 142922 133273 105374
40914A05374m3337m7195p582O7174J00316L3116q8472j54685j05875J4484J03914
$$ 105374 62037 14842 7260 74434 174750 207866 119394 -35291 -141166 -126682 -22768
40903b2768Q9955l825q0061p4919k3245J5342N2271J20333J66653J07736j3018
$$ -22768 67187 63362 -16699 -91618 -114863 -99521 -47250 73083 239736 347472 334454
40892C34454n2315J5800M2364o4279j70108r5016J19947K57667K02548M9556n9130
$$ 334454 282139 297939 340303 276024 105916 10900 130847 388514 591062 640618 581488
40881E81488r3494j04517j19685j20542q8101l6259o969l2282r0798j19336q7211
$$ 581488 487994 383477 263792 143250 55149 18890 11921 -20361 -111159 -230495 -317706
40870c17706l3412l822J4696N7444J11528J35267J25571J08816P8729N686r1739
$$ -317706 -351118 -354940 -340244 -282800 -171272 -36005 89566 198382 277111 282797 191058
40859A91058j42438j04586j1865P2101J11343J03548O3241J2981k7284m7512l7695
$$ 191058 48620 -55966 -67831 4270 115613 219161 282402 295383 268099 220587 182892
40848A82892J0452P2524R0175L8209k7979l4364J9779P6387J04327J12085Q7347
$$ 182892 193344 265868 356043 394252 366273 331909 351688 428075 532402 644487 731834
40837G31834l151j38584k29659k08998j01139J1978O1902K7782n2499r4675m1895
$$ 731834 728683 590099 360440 151442 50303 62281 124183 151965 99466 4791 -37104
40826c7104N5965Q5130R804p9526q4428r382Q0017J47255J76096J28170l424j22955
$$ -37104 18861 103991 113795 34269 -50159 -59541 20476 167731 343827 471997 468573 345618
40814C45618j10940J3743R3976L0275r3224j29399n8145J6640K8756K0093M0596
$$ 345618 234678 248421 342397 372672 279448 150049 91904 108544 137300 157393 197989
40803A97989O0419L0284k2817k5453L3741Q4447O8022M636m6531n8734n0751n3332
$$ 197989 258408 288692 265875 240422 274163 358610 426632 431268 384737 326003 275252 221920
40791B21920q0130j15801j22510p5159J780M9749L5532j9842p1527q9121o6142
$$ 221920 141790 25989 -96521 -171680 -169900 -120151 -84619 -104461 -175988 -265109 -331251
40780c31251j8493K3835M6314O4653Q3921O7353q87m5494K1143J47449J71679
$$ -331251 -349744 -325909 -279595 -214942 -131021 -63668 -64555 -110049 -88906 58543 230222
40769B30222L6823j21932j60561j02026n1745k8049J6198O8481P4803M9094N1954
$$ 230222 267045 145113 -15448 -117474 -169219 -197268 -181070 -112589 -37786 11308 63262
40758F3262Q0393Q1048N2292L0362j535p4530j25748o3116O4748J08818M5964
$$ 63262 143655 224703 276995 307357 305822 231292 105544 42428 107176 215994 261958
40747B61958J0978O4695R7387M1027J1069J05957J99892J07905j18583k41088
$$ 261958 272936 337631 435018 476045 487114 593071 792963 900868 782285 541197
40737E41197j58562j9625R933m7348o3885L647Q3818R9209L9905n4342j35120
$$ 541197 382635 363010 372943 325595 261710 265357 349175 448384 488289 433947 298827
40726B98827j62841j17968k4821M0875Q456r5283j43133n0212R8251J30837J744
$$ 298827 135986 18018 -6803 34072 42528 -52755 -195888 -246100 -147849 -17012 -15268
40715a5268j55684j99637j23518l903J05032J71675J59824P6064j566n472M0860
$$ -15268 -170952 -370589 -494107 -498010 -392978 -221303 -61479 14585 13019 7547 48407
40704D8407O3581K3910n9829j24219q5466O7514J94642J35735n0824j28348k1511
$$ 48407 111988 135898 76069 -48150 -133616 -66102 128540 264275 213451 85103 63592
40693F3592O3840k3230j17592r965J82935J83152j1127j41831j05944n4853o5892
$$ 63592 127432 104202 -13390 -23355 159580 342732 331605 189774 83830 28977 -36915
40682c6915k3771R1249R3724q4012k14702j07030R5542J50973P7697M9987P3025
$$ -36915 -60686 30563 124287 40275 -174427 -281457 -185915 -34942 42755 92742 165767
40671A65767J7889r4474r8422L7634J53485J39659O1783J2289j1265m0083o7746
$$ 165767 183656 89182 -9240 28394 181879 321538 383321 395610 384345 344262 276516
40660B76516q7849j07374j07392p0081l2759k6616L949J06918J91054J38534J6191
$$ 276516 188667 81293 -26099 -96180 -128939 -155555 -151606 -44688 146366 284900 301091
40649C01091j0467L5740l1280k07359k25877K9188K71405J88384r3139j79661
$$ 301091 290624 326364 295084 87725 -138152 -108964 162441 350825 257686 78025
40639G8025L0156K29987J57566q1901k21257j69675l0074Q7612J38323J03398
$$ 78025 108181 338168 495734 413833 192576 22901 -7173 80439 218762 322160
40629C22160N415o6538m1505L2664M4238l3866j13927j12389m1523K8371M8275
$$ 322160 327575 261037 219532 252196 296434 262568 148641 36252 -5271 23100 71375
40618G1375J1746n9743j17483r8949J1026J31304J42806K4578r8625r2349J4314
$$ 71375 83121 23378 -94105 -193054 -182028 -50724 92082 116660 18035 -74314 -60000
40607f0000N5567n0819j81338j68135k9606N9791J6227n2169k2748P1712J23673
$$ -60000 -4433 -55252 -236590 -404725 -434331 -374540 -358313 -410482 -433230 -361518 -237845
40596b37845J16851J11923J19839J00286O1216M6089K6221p4171k21821k62744
$$ -237845 -120994 -9071 110768 211054 272270 318359 344580 270409 48588 -214156
40586b14156j24958O4892J42712J06654P0596Q1596Q5221M1046k4934p8115j09033
$$ -214156 -339114 -274222 -131510 -24856 45740 127336 212557 253603 228669 150554 41521
40575D1521j09048p4438l5242l0921o2398j04529j40455j44788q1641K1852O3108
$$ 41521 -67527 -141965 -177207 -208128 -270526 -375055 -515510 -660298 -741939 -720087 -656979
40564f56979J2896P765J64540L55439L38684J02408j08494j36483q5656q2196
$$ -656979 -644083 -636318 -471778 -116339 222345 324753 216259 79776 -5880 -88076
40554h8076o5173M6820J50773J05684k6016p0973p872M3012M0325M2117L3163
$$ -88076 -153249 -106429 44344 150028 124012 53039 45167 88179 128504 170621 203784
40543B03784o6319k03852k04338m0220P7630k0558k17934k60889q0464J41919
$$ 203784 137465 -66387 -270725 -310945 -233315 -253873 -471807 -732696 -813160 -671241
40533f71241J97867O5063r2466r6915O2136K13327J96040N0199m4534l080P9702
$$ -671241 -473374 -408311 -500777 -597692 -535556 -322229 -126189 -75990 -120524 -123604 -43902
40522d3902Q3459K408r9733j78085j98193j22330K9314J59229J88699J30067L3792
$$ -43902 39557 41965 -57768 -235853 -434046 -556376 -527062 -367833 -179134 -49067 -15275
40511a5275p0420j42128j18941j394J08699J18556N1223n448q908K3214N6693
$$ -15275 -85695 -227823 -346764 -348158 -239459 -120903 -69680 -75128 -84036 -60822 -4129
40500d129N6191R554k9312J2298J04166J26306M7214j8527J626J3506p4178j69734
$$ -4129 52062 61616 32304 44602 148768 275074 322288 303761 305387 318893 244715 74981
40488G4981j32902o344M8442n268o0697n8776l5494L805Q9847J64977J17353l5108
$$ 74981 -57921 -64265 -15823 -21091 -81788 -140564 -176058 -172253 -82406 82571 199924 164816
40476A64816j43031j35142q5899n0967L745O8149N5272k6434l2905Q9143J87767
$$ 164816 21785 -113357 -199256 -250223 -246478 -178329 -123057 -149491 -182396 -93253 94514
40465I4514J26756k1410j23398j81346k33561j97600o421J93391J93462L2989
$$ 94514 221270 199860 76462 -104884 -338445 -536045 -542466 -349075 -155613 -122624
40455a22624m5124O0322J93160J85426M9810j04483j96818j78116m9508P8696
$$ -122624 -167748 -107426 85734 271160 320970 216487 19669 -158447 -207955 -129259
40445a29259P7938q220j802J35578K20589J16732o6915j53867j38955j13444p3926
$$ -129259 -51321 -59541 -61343 74235 294824 411556 344641 190774 51819 -61625 -135551
40434a35551K2655R7277L6723q9036q9901N2364J37226M3123r2169q4161L3132
$$ -135551 -112896 -15619 21104 -67932 -157833 -105469 31757 74880 -17289 -101450 -68318
40423f8318Q2665J0698o0792l3796L2289K2232p2410j46145j12728m490O9694
$$ -68318 14347 25045 -35747 -69543 -37254 -15022 -87432 -233577 -346305 -350795 -281101
40412b81101M7377k7658o9787m7849O054N8757J00993J17460Q7869L3488J2874
$$ -281101 -233724 -261382 -331169 -379018 -372964 -314207 -213214 -95754 -7885 25603 38477
40401C8477M1341N4753q011j14926j76607j57632j08427q4875p4310k4021P0096
$$ 38477 79818 134571 126560 11634 -164973 -322605 -431032 -515907 -590217 -614238 -544142
40390e44142J32264Q6412l9083j24957j00589k6816P588K3760R5932J83020J51425
$$ -544142 -411878 -325466 -364549 -489506 -590095 -616911 -609323 -585563 -489631 -306611 -155186
40379a55186k213r1457O855J56901J52020J4464n5075J1851P0217N987j09195
$$ -155186 -157399 -248856 -242001 -85100 66920 81384 26309 38160 108377 114364 5169
40368E169j69351j91504k21365j96297l5218J89651K97889K13675M5168n4589
$$ 5169 -164182 -355686 -577051 -773348 -808566 -618915 -321026 -107351 -62183 -116772
40358a16772l8692L2321Q3112Q7541O3774L4663O758j2886q219R603j1411q7691
$$ -116772 -155464 -123143 -40031 47510 111284 145947 152705 139819 131600 141203 129792 42101
40346D2101j37549p6037M2050Q0103K7765K1405J13365J63258N4787j02850j24758
$$ 42101 -95448 -171485 -129435 -49332 -21567 -162 113203 276461 331248 228398 103640
40335A03640j5762O0332K2653o2077j24594j56866j41464n6182M3817P1010L9943
$$ 103640 87878 148210 170863 108786 -15808 -172674 -314138 -370320 -326503 -255493 -215550
40324b15550M1800Q6308R5880O0275N5999R2332Q3820J1369l4862j8088r490k5828
$$ -215550 -173750 -87442 8438 68713 124712 217044 300864 312233 277371 259283 249793 223965
40312B23965K0483J26730J31908l1814j84855j59498o7076j04229k06596j42295
$$ 223965 244448 371178 503086 471272 286417 126919 59843 -44386 -250982 -393277
40302c93277R4469K39418J40441l5547o0148N9434J44586R4160l0021j03273n8287
$$ -393277 -298808 -59390 81051 45504 -14644 44790 189376 283536 253515 150242 91955
40291I1955N0797Q1107m2492k02278k10155o0603N9096L9902r442L4438J06422
$$ 91955 142752 223859 181367 -20911 -231066 -291669 -232573 -192671 -202113 -167675 -61253
40280f1253P5511l1056p4385k1471K8068J3457k2587m4666p5648j09007q0827
$$ -61253 14258 -16798 -91183 -112654 -84586 -71129 -93716 -138382 -214030 -323037 -403864
40269d03864J8967R3506O1771k3219m2938L5595J33583J62344J01007j3472j23869
$$ -403864 -384897 -291391 -229620 -252839 -295777 -260182 -126599 35745 136752 123280 -589
40258e89j76828j48445o6019N626J1088n2215j24721j26224l5706O8493Q8169
$$ -589 -177417 -325862 -391881 -386255 -375167 -427382 -552103 -678327 -714033 -645540 -557371
40247e57371L7080L9143J57498K81830K56864Q7034p5773j33781j30277j25014
$$ -557371 -520291 -481148 -323650 -41820 215044 302078 226305 92524 -37753 -162767
40237a62767r8303l1828J6913L281j7229K0002P4419P4525M6228M9845L9656o7018
$$ -162767 -261070 -292898 -275985 -272704 -289933 -269931 -195512 -120987 -74759 -24914 14742 -52276
40225e2276k00617j85190K72J62543J54649N7776K6902P9184J29131J28090O9687
$$ -52276 -252893 -438083 -437811 -275268 -120619 -62843 -35941 43243 172374 300464 370151
40214C70151m7759j60887j38232M4200K09427J90222N3963k4380l1352p6943j45799
$$ 370151 322392 161505 23273 67473 276900 467122 521085 496705 465353 388410 242611
40203B42611j07248K2704N3440q0343j85242q3836J27791K22833J35311j6214
$$ 242611 135363 158067 211507 131164 -54078 -137914 -10123 212710 348021 331807
40193C31807j16717j42328j09361m9637j5965k7386k7920L3554J12987J31357
$$ 331807 215090 72762 -36599 -86236 -102201 -129587 -157507 -123953 -10966 120391
40183A20391R5174P7910R9106J04824O9409L7113L7615K3103o5107j97816k72731
$$ 120391 215565 293475 392581 497405 566814 603927 641542 664645 599538 401722 128991
40172A28991k27368j02546K0589J12140J80383J94091J03079m5241j09479l9797
$$ 128991 -98377 -200923 -180334 -68194 112189 306280 409359 364118 254639 214842
40162B14842L4564L495l5820N3314J67834Q0677j68444k57329m4650J91541J40294
$$ 214842 249406 252901 217081 270395 438229 518906 350462 93133 48483 240024 380318
40151C80318j13815k59018k05898j19997q9593l1745P3151J03566J5379o0182
$$ 380318 266503 7485 -198413 -318410 -408003 -439748 -366597 -263031 -247652 -307834
40141c07834k0375O5788J03009J15245J46051J38949L9757p0922p6722m503J6772
$$ -307834 -328209 -262421 -159412 -44167 101884 240833 280590 209668 132946 128443 145215
40130A45215m8377r9633n8650K4345N1726M111n5646p4115o2639n6791m6145J7711
$$ 145215 96838 -2795 -61445 -37100 14626 18737 -36909 -111024 -173663 -230454 -276599 -258888
40118b58888J27682J78985Q2719r0906j64055p0656N3197N1592m4799p8749L412
$$ -258888 -131206 47779 130498 39592 -124463 -195119 -141922 -90330 -135129 -213878 -210466
40107b10466Q5881O0585k2144l6603L8592R8496O1491k5044n6785j1019L3079
$$ -210466 -124585 -64000 -86144 -122747 -84155 14341 75832 50788 -5997 -17016 16063
40096A6063O958n8205p8585l1172J7010J63n5138o2017N151N9712P995j10919
$$ 16063 23021 -35184 -113769 -144941 -127931 -127768 -182906 -244923 -239772 -180060 -172065 -282984
40084b82984j46403j8470J68102K37148J41192l639o6966k9818L8780P3158O1153
$$ -282984 -429387 -447857 -279755 -42607 98585 94946 27980 -1838 36942 110100 171253
40073A71253L9823N0822P7795N0478m5294j03635l2132Q0157N5470j04318j89478
$$ 171253 211076 261898 339693 390171 344877 241242 209110 289267 344737 240419 50941
40062E0941p8385Q1029Q6022m1655j18373n8431O2748J50814J67051R5027m2432
$$ 50941 -27444 53585 139607 97952 -20421 -78852 -16104 134710 301761 396788 354356
40051C54356j48412j41149o6087k9694m9407o1599l9310L395Q1518J92267K38623
$$ 354356 205944 64795 -1292 -30986 -80393 -141992 -181302 -177907 -96389 95878 334501
40040C34501J38747j6399o3692p019M488p2881j27792j06480q2040p1059J7692
$$ 334501 473248 456849 393157 386138 390626 317745 189953 83473 1433 -69626 -51934
40029e1934J73046K15329O0636j14952j17895p255L4072j1377j0447P5775J29831
$$ -51934 121112 336441 397077 282125 164230 156975 191047 179670 169223 244998 374829
40018C74829N7828q5265j65220j06526L1361R6555J1366j01635n8622J10450J78022
$$ 374829 432657 347392 182172 75646 107007 203562 214928 113293 54671 165121 343143
40007C43143O1591l7747M2746J55721Q3819r8179j42445k4415L8265n2241j35180
$$ 343143 404734 366987 409733 565454 649273 551094 408649 384234 422499 370258 235078
39996B35078n8573J08275J98494J45650M395j16903j13261K3552J52848J27042
$$ 235078 176505 284780 483274 628924 633319 516416 403155 426707 579555 706597
39986G06597j6451j15226j13162r1527q5615m4568J0795k2188j27768j42229p720
$$ 706597 690146 574920 461758 370231 284616 240048 250843 228655 100887 -41342 -49062
39975d9062J08347N3582q9695j41540o4826M8062J27070J44349O9521p4541j76606
$$ -49062 59285 112867 23172 -118368 -183194 -135132 -8062 136287 205808 131267 -45339
39964d5339j61601q9297m4481j1976M3817P2739L6492K3173J17571K28663K08599
$$ -45339 -206940 -296237 -340718 -352694 -308877 -236138 -199646 -176473 -58902 169761 378360
39953C78360R0130K7694L3727k6501j67195k17272r1080N7867O2934j8154k4543
$$ 378360 468490 496184 529911 503410 336215 118943 27863 85730 148664 130510 105967
39942A05967N0831P5543O40p4695o5787j8923k8298r9671j38458n8816J07560
$$ 105967 156798 232341 232981 158286 92499 73576 45278 -54393 -192851 -251667 -144107
39931a44107K16690J53710k2669j26424o7044L4209J7757p7308o1579J22403K88979
$$ -144107 72583 226293 203624 77200 10156 44365 62122 -15186 -76765 45638 334617
39920C34617K38582R601j85908k25685j73445j25471p5224K0420J18476J19712
$$ 334617 573199 582800 396892 171207 -2238 -127709 -202933 -182513 -64037 55675
39910E5675N208j27092j77207j45410r2814m1591K9409R7590P5730p4028k42808
$$ 55675 60883 -66209 -243416 -388826 -481640 -523231 -493822 -396232 -320502 -394530 -637338
39899f37338k65427j14441O4600J39806J40849J58011J66747P5578p1310r0136
$$ -637338 -902765 -1017206 -952606 -812800 -671951 -513940 -347193 -271615 -342925 -433061
39889d33061Q7401K78010K67923Q8187n3455o5819n2019r2096j03594M434J48441
$$ -433061 -345660 -67650 200273 288460 235005 169186 117167 25071 -78523 -74089 74352
39878G4352J60215J8243j24152j46974j01263r5723j24635r5355K302N9760J4379
$$ 74352 234567 252810 128658 -18316 -119579 -215302 -339937 -435292 -432990 -373230 -358851
39867c58851l8888K0296J47225J79954O7583o0404q0578k6417O588J5430N7738
$$ -358851 -397739 -377443 -230218 -50264 17319 -43085 -123663 -150080 -143492 -128062 -70324
39856g0324J22092J31352N9198l3764p5348m3204K7439N3512l5318j88620k44112
$$ -70324 51768 183120 242318 208554 133206 90002 117441 170953 135635 -52985 -297097
39845b97097j24241L4565N4073l8657p2555n234L6367k769q851Q7460J66391J05693
$$ -297097 -421338 -386773 -332700 -371357 -443912 -449146 -412779 -415548 -424399 -336939 -170548 -64855
39833f4855r114l998J23171K03997J38970J0467n8489o1823q1512j49642j91347
$$ -64855 -73969 -77967 45204 249201 388171 398638 340149 278326 196814 47172 -144175
39822a44175j15159N6374J82703J59915M6321k3155k1214l7422j04627j26938
$$ -144175 -259334 -202960 -20257 139658 185979 162824 141610 104188 -439 -127377
39812a27377k6521J27224J99431J40907O653j19034j70068j30966o7925o9623
$$ -127377 -153898 -26674 172757 313664 320317 201283 31215 -99751 -167676 -237299
39802b37299j20139j04097J9730J39907J49974R4197P6305J08305J42105J68843
$$ -237299 -357438 -461535 -441805 -301898 -151924 -57727 18578 126883 268988 437831
39792D37831J79296J03799p9352k36289k20152q2060L506p543j0099K7144N167
$$ 437831 617127 720926 641574 405285 185133 103073 106579 99036 88937 116081 121248
39781A21248r8931j47763n8552M2363O594r6631p9022P4157J65756O1893j19793
$$ 121248 22317 -125446 -183998 -141635 -135041 -231672 -310694 -236537 -70781 -8888 -128681
39770a28681j66193l8222J04702J21862L8292m0859p0917o1162j06J12441J93885
$$ -128681 -294874 -333096 -228394 -106532 -68240 -109099 -180016 -241178 -241284 -128843 65042
39759F5042J55214M6133O978O1450Q3637N286q3866j04033j05083j23626p3491
$$ 65042 220256 266389 273367 334817 418454 423740 339874 235841 130758 7132 -66359
39748f6359Q0071J74351O2778j24276j39642J9447J24675O2930m8624r4975r1677
$$ -66359 13712 188063 250841 126565 -13077 6370 131045 193975 145351 50376 -41301
39737d1301n0033O8078J94647J59675n1280k20348j85838m7282L0614N5644J05698
$$ -41301 -91334 -23256 171391 331066 279786 59438 -126400 -173682 -143068 -87424 18274
39726A8274J36144P1493j2187R595Q0705L0361j45519k48777j55155K3403J11292
$$ 18274 154418 225911 213724 223319 304024 334385 188866 -59911 -215066 -191663 -80371
39715h0371Q8239N4255N2396K8404m7118j05260p0675J7068M3128k0624p0631
$$ -80371 7868 62123 114519 142923 95805 -9455 -80130 -63062 -19934 -40558 -111189
39704a11189k8576L6313K3290l1417k4555K1812l531p8096l9787J46414K87919
$$ -111189 -139765 -103452 -80162 -111579 -136134 -114322 -117853 -195949 -235736 -89322 198597
39693A98597K25183M9240n6873p1661r2888j34322j19009l4850L4010K1582n9131
$$ 198597 423780 473020 416147 344486 251598 117276 -1733 -36583 -2573 19009 -40122
39682d0122j47179j63699n9452J01850J67620P6314n0612o9303Q972P8947R0496
$$ -40122 -187301 -351000 -410452 -308602 -140982 -64668 -115280 -184583 -175611 -96664 -6168
39671f168M3073o8906j87616j70489J7916J83812J38063k8927r0589k9821k1455
$$ -6168 36905 -32001 -219617 -390106 -372190 -188378 -50315 -79242 -169831 -199652 -221107
39660b21107j07153j32249k6872Q0295Q8144O1175O6543N3389j9402r0640j11333
$$ -221107 -328260 -460509 -487381 -407086 -318942 -257767 -191224 -137835 -157237 -247877 -359210
39649c59210j07920o9883O1636K23544K35364P6007l1545N4981J70948J11483
$$ -359210 -467130 -537013 -475377 -251833 -16469 59538 27993 82974 253922 365405
39639C65405m5384r1481k9340k0723q2019q3709j7804j7256r6653j02475K8836
$$ 365405 320021 228540 199200 178477 96458 12749 -5055 -22311 -118964 -221439 -192603
39628a92603J61061J73057J10932N1581k4456j30201j82633j26461m2093k6591
$$ -192603 -31542 141515 252447 304028 279572 149371 -33262 -159723 -201816 -228407
39618b28407n4023m7948q268K9691Q0008J44637J42879K2562j15594j30982m0191
$$ -228407 -282430 -330378 -338646 -308955 -228947 -84310 58569 81131 -34463 -165445 -205636
39607b05636K7034L7186P3207J50185J66306P5853k6048n4435n2152p8752q7927
$$ -205636 -178602 -141416 -68209 81976 248282 324135 298087 243652 191500 112748 24821
39596B4821j8227P3050Q2265J8445k2691j5488k1735n8689o2713m728N5611O6333
$$ 24821 6594 79644 161909 180354 157663 142175 120440 61751 -962 -5690 49921 116254
39584A16254N3157N2482M5791J1109j8574n781K3051J6155k0711k9719J8918Q4054
$$ 116254 169411 221893 267684 278793 260219 254438 277489 293644 272933 243214 262132 346186
39572C46186Q8119j0786j60193k31705j45533J7894R1889K6018n7646m1759L8905
$$ 346186 434305 423519 263326 31621 -113912 -96018 -4129 21889 -35757 -77516 -38611
39561c8611Q6687R2425J05913J19786R2041M5100L1000K2938m2389j27622j26851
$$ -38611 48076 140501 246414 366200 458241 503341 534341 557279 514890 387268 260417
39550B60417m3367m219o3162j17237p9749j6299j9351m7139j730R7962J44218
$$ 260417 217050 212831 149669 32432 -47317 -63616 -82967 -130106 -131836 -33874 110344
39539A10344J10359P4203P5388O1018q81n0394l1749P473j6671q9729j02700L204
$$ 110344 220703 294906 370294 431312 430431 380037 348288 355761 339090 249361 146661 149865
39527A49865J48289J98646J09914m5517j75534k44228k48138j76229l7297J05307
$$ 149865 298154 496800 606714 561197 385663 141435 -106703 -282932 -320229 -214922
39517b14922J79334J74953J31973P3355M39o1306p6576o1517o5816q2998m6310
$$ -214922 -35588 139365 271338 344693 345132 283826 207250 145733 79917 -3081 -49391
39506d9391O2470J65469J85148J32027N9380j2265p8840j13206r8850o6889n0518
$$ -49391 13079 178548 363696 495723 555103 542838 463998 350792 251942 185053 134535
39495A34535l7946j3161M353J2145N7911J44549J60104J2169j96836k54568j06836
$$ 134535 96589 83428 87781 99926 157837 302386 462490 474659 277823 23255 -83581
39484h3581P8484J44004J17499R6117P7631J5633m2274j2618N7197K2861j35614
$$ -83581 -5097 138907 256406 352523 430154 445787 403513 390895 448092 470953 335339
39473C35339k50926j85065j3421Q9314Q0646O5861J09124J38957O9499o2272j35419
$$ 335339 84413 -100652 -114073 -24759 55887 121748 230872 369829 439328 377056 241637
39462B41637q9040J6762P7699N9173K7312O2282J42272J51203L6961q3691o0927
$$ 241637 152597 169359 247058 306231 333543 395825 538097 689300 726261 642570 581643
39451E81643O8324J14169J0029q1334k0153Q0435K4841j44798j89804l1034J26856
$$ 581643 649967 764136 774165 692831 672678 753113 777954 633156 443352 412318 539174
39440E39174R2140m9719q2787L1488J30670R5256j3044p2441o5680p0135j22593
$$ 539174 631314 581595 498808 530296 660966 756222 743178 670737 605057 534922 412329
39429D12329j53867p9966O6998J52515J06626K3456L2949J13829J28748L4958
$$ 412329 258462 178496 245494 398009 504635 528091 561040 674869 803617 838575
39419H38575n3204m1551J1359O78p0339j19528j10159p0093k8668j839m902k2094
$$ 838575 785371 743820 755179 755857 685518 565990 455831 385738 357070 355231 350329 328235
39407C28235l560N0229N2058m8227j48637j01351Q0678K17756J76063J3689j05013
$$ 328235 324675 374904 426962 378735 230098 128747 209425 427181 603244 616933 511920
39396E11920q6879J7567Q0754K2635j08532j79790j14766K4674J17840J15860
$$ 511920 425041 442608 523362 545997 437465 257675 142909 167583 285423 401283
39386D01283O0983J1897r14K8211P3742Q3680L5686k7611n8133o9805j00446j36785
$$ 401283 462266 474163 473249 501460 575202 658882 694568 666957 608824 539019 438573 301788
39374C01788j33405q1998o453Q3818J74167K05288J26118k4288j47416j83187
$$ 301788 168383 86385 79932 163750 337917 543205 669323 645035 497619 314432
39364C14432j28409j5J43551J87790P6459p7417j07042j4129M4277L89l3338K9681
$$ 314432 186023 186008 329559 517349 593808 516391 409349 395220 439497 439886 406548 436229
39352D36229Q7708lj85609k75164j71209K3977J45671J31075L3216o5060j08900
$$ 436229 523937 523934 338325 63161 -108048 -84071 61600 192675 225891 160831 51931
39341E1931p3841K9706J33509J38979K7409p7303m2560P0273N6485j24650k34844
$$ 51931 -21910 7796 141305 280284 307693 230390 187830 258103 314588 189938 -44906
39330d4906q0372J69922J93964j4794j34166O693J84714J32678p8767j86199j19868
$$ -44906 -125278 44644 238608 223814 89648 96341 281055 413733 334966 148767 28899
39319B8899m0843n7584j02427r1348m6612j7220J4254Q8857J91101K51610K09475
$$ 28899 -11944 -69528 -171955 -263303 -309915 -327135 -312881 -224024 -32923 218687 428162
39308D28162O7808r2632j69208j35070o6408m8758q0872r9098o7789j0125K9974
$$ 428162 495970 403338 234130 99060 32652 -16106 -96978 -196076 -263865 -273990 -244016
39297b44016K7653k892j2365L3687J02179J27381R7996N5482J1901m9073q7636
$$ -244016 -216363 -219255 -231620 -197933 -95754 31627 129623 185105 197006 147933 60297
39286F0297l5785O1964O2875o0478j54115j17668o5425j22025j87291q5302J39649
$$ 60297 24512 86476 149351 88873 -65242 -182910 -248335 -370360 -557651 -642953 -503304
39275e03304K77778K57485J88086J20342p379j53439j37395P6692K50675J69342
$$ -503304 -225526 31959 220045 340387 333008 179569 42174 118866 369541 538883
39265E38883o4228j79024r0701M4758P9246K5672l2454o2702q2044j03576j18592
$$ 538883 474655 295631 204930 249688 328934 354606 322152 259450 177406 73830 -44762
39254d4762j06383n6722M902L4302K7144K6682M9704N0655M22m4623j3118O9437
$$ -44762 -151145 -207867 -202965 -168663 -141519 -114837 -65133 -14478 -14056 -58679 -71797 -2360
39242b360J06477O1499K490M904N7189Q4675M2361l5662p4793m4620r79k3659
$$ -2360 104117 165616 168106 173010 230199 314874 357235 321573 246780 202160 201181 177522
39230A77522j06343j44246o2035P5372J29988N9907l4540m7205L667J9913l7409
$$ 177522 71179 -73067 -135102 -59730 70258 130165 95625 48420 52087 72000 34591
39219C4591j09931j34763j13571p1294q658N5206M7815o2314j61297r3684J07458
$$ 34591 -75340 -210103 -323674 -394968 -403626 -348420 -300605 -362919 -524216 -617900 -510442
39208e10442K12463Q6953j10247j30425L6497J75399J55956P5854P4471J43045
$$ -510442 -297979 -211026 -321273 -451698 -415201 -239802 -83846 -7992 66479 209524
39198B09524J81819J45713O5065q295k4115K8636O6479k0664j93028k51158q7588
$$ 209524 391343 537056 602121 593826 569711 598347 664826 644162 451134 199976 112388
39187A12388J39945J96538O2839q4401j31315j18329r2104k9589N5442P1897j2129
$$ 112388 252333 448871 511710 427309 295994 177665 85561 55972 111414 183311 171182
39176A71182r5133p7655R064P7347J05009J03463M2174q6782j78029j08596Q4402
$$ 171182 76049 -1606 7458 84805 189814 293277 335451 248669 70640 -37956 46446
39165D6446K27245K18284J21283M1375O838J684J6784J7720n0723j61912j84808
$$ 46446 273691 491975 613258 654633 661471 663155 679939 697659 646936 485024 300216
39154C00216m3498J58928K55598K02123O9949p5885j83163j67728j8983Q8591
$$ 300216 256718 415646 671244 873367 943316 867431 684268 516540 497557 586148
39144E86148k2324k35780k41409J6081K15657J14206r8759j04692O6081J34514
$$ 586148 563824 328044 86635 102716 318373 432579 333820 229128 295209 429723
39134D29723M2908M214R3748J19189j4857j05011K3007K11675K01675M109j69121
$$ 429723 472631 476845 570593 689782 674925 569914 592921 804596 1006271 1010380 841259
39123H41259k27481k30049j73050K404K03215K23898M6093r7179m0284R2010Q5363
$$ 841259 613778 383729 210679 213083 416298 640196 686289 589110 548826 640836 726199
39112G26199o7478j96408j96200j10397j9649L0669O890r2844j77587j22005O7678
$$ 726199 658721 462313 266113 155716 136067 166736 173626 80782 -96805 -218810 -151132
39101a51132K17451J78107J0623r2060m8726K8374J2982n7511n0095O6400J79209
$$ -151132 66319 244426 255049 162989 114263 142637 155619 98108 48013 114413 293622
39090B93622J80189P6670n8106j67135k09312j48624k221J39521J88815J32774
$$ 293622 473811 550481 492375 325240 115928 -32696 -34917 104604 293419 426193
39080D26193J1591j23434k02924j62601k9537P6334Q7513P0892R8120J17746N8213
$$ 426193 437784 314350 111426 -51175 -80712 -4378 83135 154027 252147 369893 428106
39069D28106k1160j9395K3668n117p6828n6784M6904P4564p295l3566O7555J25315
$$ 428106 406946 387551 411219 406102 329274 272490 319394 393958 386663 353097 420652 545967
39057E45967J5059r8165j1979J61524J46685o7199k11204j44984k6063j4464l6548
$$ 545967 561026 462861 450882 612406 759091 691892 480688 335704 309641 295177 258629
39046B58629L9016J61973J84827Q2649m4745j24031j48339j15358l0165N8467
$$ 258629 297645 459618 644445 727094 682349 558318 409979 294621 264456 322923
39036C22923J08071J42068J88059J93286Q7392q8845k00105j63464k3395J07716
$$ 322923 430994 573062 761121 954407 1041799 952954 752849 589385 565990 673706
39026F73706J32087J9521j48499k08719p7074J23148J80194M8019j06173j22756
$$ 673706 805793 825314 676815 468096 391022 514170 694364 742383 636210 513454
39016E13454j8617J00131J83884K18637J52145l5903k28574k63617j39598k5248
$$ 513454 494837 594968 778852 997489 1149634 1113731 885157 621540 481942 456694
39006D56694l4749q9998o0600M2614J00352O2914l786l9009n5256o4570l0057
$$ 456694 421945 331947 271347 313961 414313 477227 473441 434432 379176 314606 284549
38995B84549N2031R4048K4922q5587j08898n0623m8537j48477j96644m3582K17502
$$ 284549 336580 430628 455550 369963 261065 210442 161905 13428 -183216 -226798 -9296
38984i296L35414K09600M077p1293K09P8551P4057K9269P371j4307r2906j99896
$$ -9296 326118 535718 539795 468502 468711 547262 621319 650588 657959 643652 550746 350850
38972C50850k19869r3743P7847J31192L7647n7304k2831Q8523J24989N2266k653
$$ 350850 130981 37238 115085 246277 283924 226620 203789 292312 417301 469567 466914
38961D66914O7423K03531K58264J77690N9968L8440J27028J92844J03854r0455
$$ 466914 534337 737868 996132 1173822 1233790 1272230 1399258 1592102 1695956 1605501
38951A605501j79797m4133J71577K27468R9045j1819K1368R0624N7019l2444m8395
$$ 1605501 1425704 1381571 1553148 1780616 1879661 1867842 1889210 1979834 2036853 2004409 1956014
38940A956014M533J7955l0841o3018m9683m5447o6304n3204J8003Q6280R2989
$$ 1956014 1960547 1978502 1947661 1884643 1834960 1789513 1723209 1670005 1688008 1774288 1867277
38929A867277M2068m5097j53994k33033k04757n7363J31345K78592L44095K92371
$$ 1867277 1909345 1864248 1710254 1477221 1272464 1215101 1346446 1625038 1969133 2261504
38919B261504J03996j42552k93077k77494j77085q8061m953R5274J48175R1602
$$ 2261504 2365500 2222948 1929871 1652377 1475292 1387231 1382278 1477552 1625727 1717329
38909A717329Q60M806Q4131Q1057o8900k29108k39772j16074N577N6693P7769
$$ 1717329 1718189 1722995 1807126 1888183 1819283 1590175 1350403 1234329 1239906 1296599 1374368
38898A374368R7227P6628J873n8482m3913Q387L3473M9689J06755J53140Q0661
$$ 1374368 1471595 1548223 1550096 1491614 1447701 1456088 1489561 1539250 1646005 1799145 1879806
38887A879806q2482j56745n4170Q2489Q4227j40Q52J07583J67515R0215m1478
$$ 1879806 1797324 1640579 1586409 1668898 1753125 1752985 1753837 1861420 2028935 2119150 2077672
38876B077672j08163p9226J5487J26087J76880J30163P3631J34016K90136L91994
$$ 2077672 1969509 1890283 1905770 2031857 2208737 2338900 2412531 2546547 2836683 3228677
38866C228677L78044L34226L18048K90564K66038L35957M53804L93931P2262k61898
$$ 3228677 3606721 3940947 4258995 4549559 4815597 5151554 5605358 5999289 6071551 5809653
38856E809653l36804k24535j92481k97018l59524k92058k03866j75842j43003
$$ 5809653 5472849 5248314 5055833 4758815 4399291 4107233 3903367 3727525 3584522
38847C584522m8712N4291J12406J45034J63278J33278N8912q480p2689j94625
$$ 3584522 3535810 3590101 3702507 3847541 4010819 4144097 4203009 4194529 4121840 3927215
38837C927215l61977m65806m40527l27347j76783j120J46990J72158O9465l8061
$$ 3927215 3565238 3099432 2658905 2331558 2154775 2153655 2300645 2472803 2542268 2504207
38827B504207m8705J2371P1226R8783R3761O5314O2884J26181J83092J14715m6635
$$ 2504207 2455502 2467873 2539099 2637882 2731643 2796957 2859841 2986022 3169114 3283829 3237194
38816C237194j18995k3958R9261J06560L9900J1685K7300L8630O4153J29631J79494
$$ 3237194 3118199 3094241 3193502 3300062 3339962 3351647 3378947 3417577 3481730 3611361 3790855
38805C790855J70343J68832K31830K72560J84387K8209m5849m735P9159J80122
$$ 3790855 3961198 4130030 4361860 4634420 4818807 4847016 4801167 4796432 4875591 5055713
38795E055713K99195L49470K50317J13122J38265L18986M39018L94062L20186
$$ 5055713 5354908 5704378 5954695 6067817 6206082 6525068 6964086 7358148 7678334
38786G678334L41979L89426L73678L74484N02655O93800P97093P98027Q07404
$$ 7678334 8020313 8409739 8783417 9157901 9660556 10354356 11151449 11949476 12756880
38777A2756880Q74177R47955J008961J107721J265490J435647J586070J749906
$$ 12756880 13631057 14579012 15587973 16695694 17961184 19396831 20982901 22732807
38769B2732807J980720K311855K759818L312775L923119M573100N339417O321780
$$ 22732807 24713527 27025382 29785200 33097975 37021094 41594194 46933611 53255391
38761E3255391P512993Q831781J0311210J2169031J4627503J7686827K1067721
$$ 53255391 60768384 69600165 79911375 92080406 106707909 124394736 145462457
38754A45462457K4262586K6552128K7044732K4885782J9607078J1433038J398324
$$ 145462457 169725043 196277171 223321903 248207685 267814763 279247801 280646125
38747B80646125q812972j7369741k2998355k5451394k5372835k3720059k1278145
$$ 280646125 271833153 254463412 231465057 206013663 180640828 156920769 135642624
38740A35642624j8556496j5887267j3476400j1410656r698923q298891p104052
$$ 135642624 117086128 101198861 87722461 76311805 66612882 58313991 51209939
38733E1209939n999593m994072m219599l725642l349491k896143k386507j997910
$$ 51209939 45210346 40216274 35996675 32271033 28921542 26025399 23638892 21640982
38725B1640982j793047j657033j505112j390744j349181j274298j057990p67502
$$ 21640982 19847935 18190902 16685790 15295046 13945865 12671567 11613577 10846075
38717A0846075n71018n24696n30573m94563m41181m49051n22316n65179m86462
$$ 10846075 10275057 9750361 9219788 8725225 8284044 7834993 7312677 6747498 6261036
38708F261036l14893j83155j80684k51923k74678k03937q4087L9086J30882J24852
$$ 6261036 5946143 5762988 5582304 5330381 5055703 4851766 4767679 4806765 4937647 5062499
38698E062499r293j51320j17263J00500L03038L47237L10742L17920L31513K40173
$$ 5062499 5053206 4901886 4784623 4885123 5188161 5535398 5846140 6164060 6495573 6735746
38688F735746N9931r0100j62926k14265k92023l96323n13564n96709n57313l79511
$$ 6735746 6795677 6705577 6542651 6328386 6036363 5640040 5126476 4529767 3972454 3592943
38678C592943j97835j52067k05883k25453j93134k01010k56453k54464j60017
$$ 3592943 3395108 3243041 3037158 2811705 2618571 2417561 2161108 1906644 1746627
38669A746627p1865o3479q1747n1111K3855J03024J65068J80892J25863N4310
$$ 1746627 1674762 1611283 1529536 1478425 1502280 1605304 1770372 1951264 2077127 2131437
38659B131437O4538J46353J63180M5156r1238r2403K8999J13906M0107j66751
$$ 2131437 2195975 2342328 2505508 2550664 2459426 2367023 2396022 2509928 2550035 2383284
38649B383284l70288m36253l44996k11423j52614j41872o8327O6612J29122N7699
$$ 2383284 2012996 1576743 1231747 1020324 867710 725838 657511 724123 853245 910944
38639I10944l8821n2597k8091n0875q9217o3963k520K509n3987r3761q6294p2126
$$ 910944 872123 819526 791435 740560 651343 587380 584860 587369 533382 439621 353327 281201
38627B81201p3381p5351p9870q4896l1395J23138K82662K78701Q7132j13993j45292
$$ 281201 207820 132469 52599 -32297 -63692 59446 342108 620809 707941 593948 448656
38616D48656j7444J13882J26370K9603o6207m8343R0756K19563J83513j8714k14696
$$ 448656 431212 545094 671464 701067 634860 586517 677273 896836 1080349 1061635 846939
38605H46939k41354j11335L1843Q4999O7627N4441P2822P7548J4745r2881j38375
$$ 846939 605585 494250 526093 611092 678719 733160 805982 883530 898275 805394 667019
38594F67019l9623J42676K42099J66023p90j04807r6342m4597j4868n447k880
$$ 667019 627396 770072 1012171 1178194 1177404 1072597 976255 931658 916790 911343 908463
38583I08463k1888o2129q2628n3940O401P3258J32448J33210O834j98845k88777
$$ 908463 886575 824446 741818 687878 694279 767537 899985 1033195 1040029 841184 552407
38572E52407j42020Q9048J42878r510j45349j18039k0092L3192Q1750J63239J63796
$$ 552407 410387 499435 642313 632803 487454 369415 349323 382515 464265 627504 791300
38561G91300J0437j28765o2744R2899N5367j86037l29485j92181N9320J88094
$$ 791300 801737 672972 610228 703127 758494 572457 242972 50791 110111 298205
38551B98205J76156J19330K9832r6621j63123r8438q687l5422j23269q9517J02580
$$ 298205 474361 593691 623523 526902 363779 265341 256654 221232 97963 8446 111026
38540A11026K85836L08333J95227P1614R797j2006l9048n6559N740J56867K65445
$$ 111026 396862 705195 900422 972036 981833 969827 930779 874220 879960 1036827 1302272
38529A302272J94361J5826l9591J08620K79413L08020K78187L41447M46854M40693
$$ 1302272 1496633 1512459 1472868 1581488 1860901 2168921 2447108 2788555 3235409 3676102
38519C676102L39263K83833K65347J19644j83697m47371n01841m02008l03948
$$ 3676102 4015365 4299198 4564545 4684189 4500492 4053121 3551280 3149272 2845324
38510B845324k71300k72718k72257k55597k30415k32276k68522k60847j38488
$$ 2845324 2574024 2301306 2029049 1773452 1543037 1310761 1042239 781392 642904
38501F42904J7792N0192m4208r7405k5692M8602M538r0443j10919p5506q4614
$$ 642904 660696 710888 666680 569275 543583 592185 596723 506280 395361 319855 235241
38490B35241j33925j30957n8935N612K6156M1848O6001N4495k09l4678j6881r398
$$ 235241 101316 -29641 -88576 -82964 -56808 -14960 51041 105536 105327 70649 53768 44370
38478D4370o8553j31106q6358M6387J04629n135j51072j25556P2611K21369J67340
$$ 44370 -24183 -155289 -241647 -195260 -90631 -95766 -246838 -372394 -299783 -78414 88926
38467H8926J6886l7684K3275P8853Q0233Q0456Q4649L0293p2923j30325j20427
$$ 88926 105812 68128 91403 170256 250489 330945 415594 445887 372964 242639 122212
38456A22212j26618j64184j20620M6495J81050J23118m9384j10363J4345J61417
$$ 122212 -4406 -168590 -289210 -242715 -61665 61453 12069 -98294 -83949 77468
38446G7468J56736K9961m7171J1865J10128J10415K3221k3990K148k1207j58667
$$ 77468 234204 264165 216994 228859 338987 449402 472623 448633 450781 429574 270907
38435B70907k62329j72139J5686O6754m6852j32036j01649p6399j08628n8856
$$ 270907 8578 -163561 -147875 -81121 -127973 -260009 -361658 -438057 -546685 -605541
38425f05541J28499K59489J81407M6880P1499J79185J35419o4120j96410j61601
$$ -605541 -477042 -217553 -36146 10734 82233 261418 396837 332717 136307 -25294
38415b5294q4090n7547j5036R5489J88790J71261P0424k0894m4436n09M9093J2045
$$ -25294 -109384 -166931 -181967 -86478 102312 273573 343997 323103 278667 278158 327251 339296
38403C39296j14124j87617r7676N2606P7748j8635o9640j3898M8611O2619P8447
$$ 339296 225172 37555 -60121 -7515 70233 51598 -18042 -31940 16671 79290 157737
38392A57737R0526K4137p8008p1768K6239K0654j26627j81137M13K15623K16268
$$ 157737 248263 272400 194392 122624 148863 169517 42890 -138247 -137834 77789 294057
38381B94057P0479J40J2312m7450j72023j94348q1089J9265K9063L0005P4401
$$ 294057 364536 364676 376988 329538 157515 -36833 -117922 -98657 -69594 -39589 34812
38370C4812R8432O4912K8238J2728k7964q9174r1659k1629L7117M9818P5431J23887
$$ 34812 133244 198156 226394 239122 211158 121984 30325 8696 45813 95631 171062 294949
38358B94949J13962L3060q352L5534M5859o3459j73674j23742M5014J50309J16679
$$ 294949 408911 441971 433619 469153 515012 451553 277879 154137 199151 349460 466139
38347D66139K2982n8862j28051j62279r7450O1362K01372K20522J31573K1756
$$ 466139 489121 430259 302208 139929 42479 103841 305213 525735 657308 679064
38337F79064m6779p2688q1792p8738l4190O0737J28207N6289j39108k74558k05421
$$ 679064 632285 559597 477805 399067 364877 425614 553821 610110 471002 196444 -8977
38326h977k1442P1555L4078K0986J18620K07336J61152N9274P2095K00660K67960
$$ -8977 -30419 41136 75214 96200 214820 422156 583308 642582 714677 915337 1183297
38315A183297J67357K546n9843M087P9002P7167L1904K1618N3192N7275j5640
$$ 1183297 1350654 1353200 1293357 1297444 1376446 1453613 1485517 1507135 1560327 1617602 1601962
38304A601962j33395k26954k64568k53941j97804r8706l971J5694m0625q3165
$$ 1601962 1468567 1241613 977045 723104 525300 426594 422623 438317 397692 314527
38294C14527m9095o27l7115j25726j11457O5754K40145J95923m6802k23493j38571
$$ 314527 265432 264805 227690 101964 -9493 56261 296406 492329 445527 222034 83463
38283H3463R6723K16022J28924j1931n7345l5827l5130m1259l236K9434l0312
$$ 83463 180186 396208 525132 513201 455856 420029 384899 343640 340404 369838 339526
38272C39526j46433j93772j38349n8350N719Q0008J26136M4779j33594k17464
$$ 339526 193093 -679 -139028 -197378 -191659 -111651 14485 59264 -74330 -291794
38262b91794j05822O2888J18128Q2360O0074L3597n3426j09698r693J53814J58470
$$ -291794 -397616 -334728 -216600 -134240 -74166 -40569 -93995 -203693 -213386 -59572 98898
38251I8898k656q9665K0823J55003J21226j8548r3749r1588j11191j49695j12248
$$ 98898 96242 6577 27400 182403 303629 285081 191332 99744 -11447 -161142 -273390
38240b73390L227Q7501Q3903M5882K1357r474n1708m4230N3428J72381J90612
$$ -273390 -270163 -182662 -98759 -52877 -31520 -40994 -92702 -136932 -83504 88877 279489
38229B79489P5039o3351p9265L7547J32001O0899j20714k16530j31731K1216Q0664
$$ 279489 354528 291177 211912 249459 381460 442359 321645 105115 -26616 -5400 75264
38218G5264J5512r2259j58944j34472o404J56248K27683J68734Q4725O9071O8128
$$ 75264 90776 -1483 -160427 -294899 -301303 -145055 82628 251362 336087 405158 473286
38207D73286j701q4646p0392M126n050j17786j91722j36373k9045K3869K2653
$$ 473286 471585 386939 316547 320673 315623 197837 6115 -130258 -159303 -135434 -112781
38196a12781J8257K1579L0167O5297J21301J39296Q4826M400l3947j3964L6252
$$ -112781 -94524 -72945 -42778 22519 143820 283116 367942 372342 338395 324431 360683
38185C60683P4599N6291k3016q7390n9852J1105M75r8980j48232p3390K1105L2021
$$ 360683 435282 491573 468557 381167 321315 332420 332895 233915 85683 12293 33398 65419
38173F5419K9018J24745K63932K90509J82066P3963N9284R3483J10309J17814
$$ 65419 94437 219182 483114 773623 955689 1029652 1088936 1182419 1292728 1410542
38163A410542J44466J75797J82492J52629P7098l7568j30002j25987m1986J5433
$$ 1410542 1555008 1730805 1913297 2065926 2143024 2105456 1975454 1849467 1807481 1822914
38153A822914k1016j07741j71822k01840k21490k29417k14083j90364j76427j59727
$$ 1822914 1801898 1694157 1522335 1320495 1099005 869588 655505 465141 288714 128987
38143A28987j18149m8586M6015J55302K22046J66214L214j18474p8397N2573J00601
$$ 128987 10838 -37748 8267 163569 385615 551829 555043 436569 358172 410745 511346
38132E11346K0141o8159p2639m3619n0463o2376l3170j0173m8654q3609j5812
$$ 511346 531487 463328 390689 347070 296607 234231 201061 190888 142234 58625 42813
38121D2813J08587J41946N2992m1143p9760j40250k52125k82353j25326J04984
$$ 42813 151400 293346 346338 305195 225435 85185 -166940 -449293 -574619 -469635
38111d69635K14923J87791J52143J48714R9403o075p0228o5681q9698j76267j99880
$$ -469635 -254712 -66921 85222 233936 333339 327264 257036 191355 101657 -74610 -274490
38100b74490o5371J19769J79504R8217k23m5948p1831r3415o3637L2157J23146
$$ -274490 -339861 -220092 -40588 57629 57406 11458 -60373 -153788 -217425 -185268 -62122
38089f2122J30015M9541n2766r9499n0575O4676J60687J72459J19962P4428P3496
$$ -62122 67893 117434 64668 -34831 -85406 -20730 139957 312416 432378 506806 580302
38078E80302R4507R0590K3881j06767k31265k38705j02555N2403P9688j0707q3229
$$ 580302 674809 765399 789280 682513 451248 212543 109988 162391 242079 231372 148143
38067A48143p2281m4537n2463m2292K9580Q4994K7617r6061j44925p3373K5538
$$ 148143 75862 31325 -21138 -63430 -33850 51144 78761 -17300 -162225 -235598 -210060
38056b10060O9777Q2746J06415J09547M9402l2617o0162m4957p7120j80730k51045
$$ -210060 -140283 -57537 48878 158425 207827 175210 115048 70091 -7029 -187759 -438804
38045d38804j79015J954J44394J51236O9753J2400J5303Q278p0397j62563j42123
$$ -438804 -617819 -615865 -471471 -320235 -250482 -238082 -222779 -214501 -284898 -447461 -589584
38034e89584J3335J62945J69531Q2978O6779J54376J96846R2589m8566o4577J9148
$$ -589584 -576249 -413304 -243773 -160795 -94016 60360 257206 349795 301229 236652 255800
38023B55800L4182q2613k10176k16243j04846K8955J06851J05280N5120K5180
$$ 255800 289982 207369 -2807 -219050 -323896 -294941 -188090 -82810 -27690 -2510
38013b510N0698P5234K6936n7088p0977o619K3770m3991j37138j65508j34205
$$ -2510 48188 123422 150358 93270 22293 15674 39444 -4547 -141685 -307193 -441398
38002d41398q7180k8682L8991P7001O8034M5582K2488k7860p7265l4317J04031
$$ -441398 -528578 -557260 -518269 -441268 -373234 -327652 -305164 -333024 -410289 -444606 -340575
37991c40575J97827J44675J6696p0851j19349j65135j49829k0473J22919J40427
$$ -340575 -142748 1927 18623 -52228 -171577 -336712 -486541 -507014 -384095 -243668
37981b43668N9002J3149K7174J6412l2302n0827l9462n7362p5481j3241Q1620
$$ -243668 -184666 -171517 -144343 -127931 -160233 -211060 -250522 -307884 -383365 -396606 -314986
37970c14986P6249j1826j9790Q4785J38800N8938k3986l073L0162k1749p7184
$$ -314986 -238737 -250563 -270353 -185568 -46768 12170 -11816 -14889 15273 -6476 -83660
37959h3660m1379Q59n8736j32638p6217M9489O5489l4827r6923p7529q7812j52452
$$ -83660 -125039 -124180 -182916 -315554 -391771 -342282 -276793 -311620 -408543 -486072 -573884 -726336
37947g26336j35708L2256K26331K98305K38881J01167r2378k71042k78955o0661
$$ -726336 -862044 -829788 -603457 -305152 -66271 34896 -57482 -328524 -607479 -668140
37937f68140J91539K22006K3062j57206j22529N5479J55743O9027j01394j64571
$$ -668140 -476601 -254595 -231533 -388739 -511268 -455789 -300046 -231019 -332413 -496984
37927d96984l6168J77700K81204J87274R581p0056j2881N2408K3618l4092k138
$$ -496984 -533152 -355452 -74248 113026 122607 52551 39670 92078 115696 81604 79466
37916G9466R4028J09031J27q7230j5406J46330K09152J08355l5324q3177j7449
$$ 79466 173494 282525 282652 195422 180016 326346 535498 643853 608529 525352 507903
37905E07903Q6900J39585P0360j21232l15564l51214k00507o800Q6085O9430K101
$$ 507903 594803 734388 804748 683516 367952 16738 -183769 -190569 -104484 -35054 -32953
37894c2953r0733j77244j73918n6485M6018j884j30925j37234L5567K15571K35943
$$ -32953 -123686 -300930 -474848 -531333 -485315 -487199 -618124 -755358 -719791 -504220 -268277
37883b68277J31797M5476K9704K5505j9493q8562j30212j04776j4176Q1213J00588
$$ -268277 -136480 -91004 -61300 -35795 -55288 -143850 -274062 -378838 -393014 -311801 -211213
37872b11213L1664m0647k6101O8623J53557J50302N4159o9027j24904o2999O3473
$$ -211213 -179549 -220196 -246297 -177674 -24117 126185 180344 111317 -13587 -76586 -13113
37861a3113J42401J36968J33195K11411L18193L36941K57306J92050K31508L59922
$$ -13113 129288 266256 399451 610862 929055 1265996 1523302 1715352 1946860 2306782
37851B306782N13694O27201O02444L48359p6397m44236n76258n25587m55092l96727
$$ 2306782 2820476 3447677 4050121 4398480 4322083 3877847 3301589 2776002 2320910 1924183
37841A924183k66893q9574k7291j37652k48722j81612K234R4404J7054j13897
$$ 1924183 1657290 1567716 1540425 1402773 1154051 972439 974673 1069077 1086131 972234
37831I72234j68598j26582l0820O5406R2164O904j26342j87575j55678j23777
$$ 972234 803636 677054 646234 711640 803804 810708 684366 496791 341113 217336
37821B17336j31776r3166M4111J65474J29442j6918q4169J0119J48241J86290
$$ 217336 85560 -7606 36505 201979 331421 314503 230334 240453 388694 574984
37811E74984J26187O8548O2989P0454M4126j2665o6844q9938o4463O578P5981
$$ 574984 701171 769719 832708 903162 947288 934623 867779 777841 713378 719956 795937
37800G95937O8456m0208j67985j93830r2929K9407N7886j1931r7792j37351j26883
$$ 795937 864393 824185 656200 462370 369441 398848 456734 444803 347011 209660 82777
37789H2777q1870j5204N2179J02881J37212J41911P6639m9512j24009m8902R4369
$$ 82777 907 -14297 37882 140763 277975 419886 496525 447013 323004 274102 368471
37778C68471J08695o1942k44118k57682j33524l2009k2036m4053m8185n2155n6784
$$ 368471 477166 415224 171106 -86576 -220100 -252109 -274145 -318198 -366383 -418538 -475322
37767d75322m043J32661K69367K80248J41053l2483j08236q1295n6172q5497r1728
$$ -475322 -479365 -346704 -77337 202911 343964 311481 203245 121950 65778 -19719 -111447
37756a11447J856J22871J28329R532q8293o1449L5787R2975O8304j4593r8172
$$ -111447 -109591 13280 141609 151141 62848 1399 37186 130161 198465 183872 85700
37745H5700r1096N3706K21889K22331M8697p8049j4548J00835P5978l8800n9369
$$ 85700 -5396 48310 270199 492530 541227 463178 448630 549465 625443 586643 527274
37734E27274K4231N4656k1071r2025r4575r1667j13154r4605k7944j0079o5147
$$ 527274 551505 606161 585090 493065 398490 306823 193669 99064 71120 61041 -4106
37723d106o4828O9841K03750J53546m8497j83873j23646K9649R3096K1544p3693
$$ -4106 -68934 907 204657 358203 309706 125833 2187 31836 124932 146476 72783
37712G2783r5066q1064j19280j80388j35750L7997J77491J34186k2054j02891
$$ 72783 -22283 -103347 -222627 -403015 -538765 -500768 -323277 -189091 -211145 -314036
37702c14036m6567N0448J00237R3934L5381n8583j03262k8369Q9266J14759O8944
$$ -314036 -360603 -310155 -209918 -115984 -80603 -139186 -242448 -270817 -181551 -66792 2152
37691B152Q7451J60421J17046p0645j80733o3355J10824R6314o2157j06417O0809
$$ 2152 89603 250024 367070 296425 115692 52337 163161 259475 197318 90901 151710
37680A51710K67189L19789K01623Q071j74050k82887k79672j90094r8288n9741
$$ 151710 418899 738688 940311 948382 774332 491445 211773 21679 -76609 -136350
37670a36350m3312J9965J39260K23568J56992n6385k43732k29714n5094N9374
$$ -136350 -179662 -159697 -20437 203131 360123 303738 60006 -169708 -224802 -165428
37660a65428m533j17240r9510L3956J28294J13876N7259J7277l3074j29096k37504
$$ -165428 -169961 -287201 -386711 -352755 -224461 -110585 -53326 -36049 -69123 -198219 -435723
37649d35723k79332j97144j0538J68458K13554J20576K3088K5037P3619O3282
$$ -435723 -715055 -912199 -922737 -754279 -540725 -420149 -397061 -372024 -298405 -235123
37639b35123L191j5290K3378M4068J1816k6467l6261l6500k8281L0952J46127
$$ -235123 -231932 -247222 -223844 -179776 -167960 -194427 -230688 -267188 -295469 -264517 -118390
37628a18390K40111K29848J13470l5908j34172j41709q9745n0918n3860m3240
$$ -118390 121721 351569 465039 429131 294959 153250 63505 12587 -41273 -84513
37618h4513L4242J29059J38410M7507m8726p3441n2245m9706p7596r8279q3866
$$ -84513 -50271 78788 217198 264705 215979 142538 90293 40587 -37009 -135288 -219154
37607b19154m3458p914J195k131J6694N2401M1877m9411j46784j38254k4827P0728
$$ -219154 -262612 -270526 -269331 -271462 -254768 -202367 -160490 -209901 -356685 -494939 -519766 -449038
37595d49038O2588N054L509P4520J41425J38888P6641J2054n759L0068P9172Q4119
$$ -449038 -386450 -381396 -377887 -303367 -161942 -23054 53587 65641 59882 89950 169122 253241
37583B53241K3131o8595j38234j61534j35089m8839Q8481K02284J93617O0632
$$ 253241 276372 207777 69543 -91991 -227080 -275919 -187438 14846 208463 269095
37573B69095p2605j03055q0884j14449j76481j28337M8481J84649J54766M8764
$$ 269095 196490 93435 12551 -101898 -278379 -406716 -358235 -173586 -18820 29944
37563B9944P160M697n3660j18780p1320M3207O5013m630J82J09932J46712K9633
$$ 29944 37104 41801 -11859 -130639 -201959 -158752 -93739 -98369 -98187 11745 158457 188090
37551A88090o9862o508J00733P4575l6328o8471k0194j7307p7673j04205p3651
$$ 188090 118228 111720 212453 287028 250700 182229 162035 144728 67055 -37150 -110801
37540a10801n7008o7918m5654J1617K8198k7304j02594j40585j17496k7558R3797
$$ -110801 -167809 -235727 -281381 -269764 -241566 -268870 -371464 -512049 -629545 -657103 -563306
37529e63306J71391J85338K00558K29118J64976l4000k10446k03329q0881q465
$$ -563306 -391915 -206577 -6019 223099 388075 354075 143629 -59700 -140581 -149046
37519a49046K0145J14924K29073K05742N8160l3180p412J7027j5436k4581J333
$$ -149046 -128901 -13977 215096 420838 478998 445818 438406 455433 439997 415416 416749
37508D16749l8030j28592r8349R9939K63755K17914M7791o3095p6962o0304l1258
$$ 416749 378719 250127 151778 251717 515472 733386 781177 718082 641120 580816 549558
37497E49558K2004O4964O2707K7529l6946j38646k03145j14718Q8027K04471J34513
$$ 549558 571562 636526 699233 726762 689816 551170 348025 233307 321334 525805 660318
37486F60318O16o7981j02206j42337j04092N2956J77954J25247j7981p0575k4708
$$ 660318 660934 592953 490747 348410 244318 297274 475228 600475 582494 511919 487211
37475D87211m741m3449p1581o8581o2819l3466L7182O4860l1582j70327k01882
$$ 487211 482470 439021 367440 298859 236040 202574 239756 304616 273034 102707 -99175
37464i9175j25868o1549l6369L0832J43873J91630J22396J7487m7596r7688j64051
$$ -99175 -225043 -286592 -322961 -292129 -148256 43374 165770 183257 135661 37973 -126078
37453a26078j94036j24110R515R7494Q6083L9877N2109J02413O5104r2848j97631
$$ -126078 -320114 -444224 -434709 -337215 -251132 -211255 -159146 -56733 8371 -84477 -282108
37442b82108p8014J52062K00548L950j73731j20062N1255J25614R2845N8371J6598
$$ -282108 -360122 -208060 -7512 -3562 -177293 -297355 -246100 -120486 -27641 30730 47328
37431D7328q1096j56266j15503m0778n8821j02332k2139J27452J54673N3643K1980
$$ 47328 -33768 -190034 -305537 -346315 -405136 -507468 -529607 -402155 -247482 -193839 -171859
37420a71859J41462K57004K15458M8695j18379j92254j27874K7652J03018k7170
$$ -171859 -30397 226607 442065 490760 372381 180127 52253 79905 182923 155753
37410A55753k35831k71929j00636O1324O4866n326k1152J7877O5635J17447J49022
$$ 155753 -80078 -352007 -452643 -391319 -326453 -331779 -352931 -335054 -269419 -151972 -2950
37399b950J09080L0408J3708N5961L7616p3325j53322j13255j2937O6205J17673
$$ -2950 106130 136538 150246 206207 243823 170498 17176 -96079 -109016 -42811 74862
37388G4862J29411O1874l4605l8332M2246M7520p9305j85988j47509l7323M1938
$$ 74862 204273 266147 231542 193210 235456 282976 203671 17683 -129826 -167149 -125211
37377a25211J21437K24153K28214M8453j68270k11620r2063M950j3595p6043r5641
$$ -125211 -3774 220379 448593 497046 328776 117156 25093 30043 16448 -59595 -155236
37366a55236o0269k383K2701k8891j01305o1785J00315J96257Q2719j05874j22468
$$ -155236 -215505 -217888 -195187 -224078 -325383 -387168 -286853 -90596 -7877 -113751 -236219
37355b36219N2157J94081J42065k6499j35352j09150p781O2441M9744J821k737
$$ -236219 -184062 10019 152084 125585 -9767 -118917 -126698 -64257 -14513 -12692 -15429
37344a5429K1705j9515j31684j75435o1361R2985J08301k3262j58927j98630j46999
$$ -15429 6276 -13239 -144923 -320358 -381719 -288734 -180433 -203695 -362622 -561252 -708251
37333g08251l9310P5461J22120Q5418O6674J40086K04191J14573p3645j55201
$$ -708251 -747561 -672100 -549980 -464562 -397888 -257802 -53611 60962 -12683 -167884
37323a67884o2345N4955O2938R589j905K1324J2479k0098o544O7124J34594J45770
$$ -167884 -230229 -175274 -112336 -102747 -104652 -83328 -70849 -90947 -97491 -30367 104227 249997
37311B49997J32399J45851J55254O8780j14971k40256j66956J9205Q9437k6292
$$ 249997 382396 528247 683501 752281 637310 397054 230098 249303 338740 312448
37301C12448j56594j53008q9356j02762j67904j63968p2948K8431J05149J57758
$$ 312448 155854 2846 -86510 -189272 -357176 -521144 -594092 -565661 -460512 -302754
37291c02754J44062M8218k6208J9773J07119Q3060l6027r2729m2561j603k7918
$$ -302754 -158692 -110474 -136682 -116909 -9790 73270 37243 -55486 -98047 -99650 -127568
37280a27568l5152K6468O5335M176q7947j08730o9861m3306l6388r403L2051M6236
$$ -127568 -162720 -136252 -70917 -66741 -154688 -263418 -333279 -376585 -412973 -422376 -390325 -344089
37268c44089L5324M9112J07005J58388J36211L6548p1918j24438j26341j14535
$$ -344089 -308765 -259653 -152648 5740 141951 178499 106581 -17857 -144198 -258733
37258b58733q0366K840Q7799Q6167Q472l7493j8567j9406o4707n2527M5429Q2502
$$ -258733 -339099 -336259 -248460 -162293 -153821 -191314 -209881 -229287 -293994 -346521 -301092 -218590
37246b18590k6606j25349m9337R7033J08220P119k9211J5871J6583k3229P780
$$ -218590 -245196 -370545 -419882 -322849 -214629 -207510 -236721 -220850 -204267 -227496 -219716
37235b19716O4051q885j58206j56779O078P4479m8311j30849p483J46181J19362
$$ -219716 -155665 -164550 -322756 -479535 -473457 -398978 -447289 -578138 -585621 -439440 -320078
37224c20078O24j4260N0157N0869N266K5557P3841J5451j31042j95942r6997P2386
$$ -320078 -319454 -333714 -283557 -232688 -227422 -201865 -128024 -112573 -243615 -439557 -536554 -464168
37212d64168J81788J81137J03723L6744N2186J09431R3701l828n5186p687J4170
$$ -464168 -282380 -101243 2480 39224 91410 200841 294542 290714 235528 227841 242011
37201B42011q1772j90120j84849j23180j12671r8345K6976J86682J95606L2965
$$ 242011 160239 -29881 -214730 -337910 -450581 -548926 -521950 -335268 -139662 -106697
37191a06697j31958j67748r5445j087M3313J663p9284q9913r711M2678K023k3732
$$ -106697 -238655 -406403 -501848 -502935 -459622 -457959 -537243 -627156 -636867 -594189 -592166 -615898
37179f15898M7783J00271K1385o3339J3702J47983J09831o8878j39465l5137O4609
$$ -615898 -568115 -467844 -446459 -509798 -496096 -348113 -238282 -307160 -446625 -481762 -417153
37168d17153P0345Q9001J51288J22049k9243j28566p6964K262O191J1574O4869
$$ -417153 -346808 -257807 -106519 15530 -13713 -142279 -219243 -216981 -210790 -199216 -134347
37157a34347M4402j03550j98105q4888J06155J61306R5789O2578P6735N2466K0045
$$ -134347 -89945 -193495 -391600 -476488 -370333 -209027 -113238 -50660 26075 78541 98586
37146I8586P2468J48208R6125n6149j13852j7018O3869j0287j51251j87990q7692
$$ 98586 171054 319262 415387 359238 245386 228368 292237 281950 130699 -57291 -144983
37135a44983M9342J29871J24990M5830o3420j33220j22542o0776j3028j2665m1412
$$ -144983 -95641 34230 159220 205050 141630 8410 -114132 -174908 -187936 -200601 -242013
37124b42013o4833p0565o6399m9092j736N9360P0088M027n2811L677J29190J63630
$$ -242013 -306846 -377411 -443810 -492902 -494638 -435278 -365190 -361163 -413974 -410297 -281107 -117477
37112a17477N8873m0855j0930P3767P3143k78l6093l4005q9410j83044j59187
$$ -117477 -58604 -99459 -110389 -36622 36521 36243 150 -33855 -123265 -306309 -465496
37101d65496L3712K20663K09969L6786r9751q9873n746L9974L2915K8112M5993
$$ -465496 -431784 -211121 -1152 35634 -64117 -153990 -159736 -119762 -86847 -58735 -12742
37090a2742M9781J0589m8964q7964r6858r0849p0339k2504L8897P2865O4102M5627
$$ -12742 37039 47628 -1336 -89300 -186158 -277007 -347346 -369850 -330953 -258088 -193986 -148359
37078a48359N0746P1026Q1260P3889M1760l6853j50567k17213j55447N5J06013
$$ -148359 -97613 -26587 54673 128562 170322 133469 -17098 -234311 -389758 -389703 -283690
37067b83690N9423q6557j79606j28941J0062J06715R2163J9441l239P2727J87595
$$ -283690 -224267 -310824 -490430 -619371 -609309 -502594 -410431 -390990 -394229 -321502 -133907
37056a33907K30792J47901k103j03031j06995q3714j10743j43519p6428O4891
$$ -133907 96885 244786 242683 139652 32657 -51057 -161800 -305319 -381747 -316856
37046c16856J08369k6571j86950j91047q3333l6636o6721l6555P0897J00972j658
$$ -316856 -208487 -235058 -422008 -613055 -696388 -733024 -799745 -836300 -765403 -664431 -666089
37035f66089p6468l887J02683J00097N4185J00933J89758J68787N5898J2447O7122
$$ -666089 -742557 -746444 -643761 -543664 -489479 -388546 -198788 -30001 25897 38344 105466
37024A05466P0869m6899j57851j31500j2266O9889N9185j6390j01986j25229l3857
$$ 105466 176335 129436 -28415 -159915 -172181 -102292 -43107 -59497 -161483 -286712 -320569
37013c20569J16198J82286J00552l1660q6253n4666k0147l9792j03730j60809
$$ -320569 -204371 -22085 78467 46807 -39446 -94112 -114259 -154051 -257781 -418590
37003d18590j45786l7472P7472P3125l9964r7453p859J00841O9712l9203l2914
$$ -418590 -564376 -601848 -524376 -451251 -491215 -588668 -596527 -495686 -425974 -465177 -498091
36992d98091J07191J88072J01223j4325K883Q2991M0350j27117k19245j19727
$$ -498091 -390900 -202828 -101605 -115930 -113047 -30056 10294 -116823 -336068 -455795
36982d55795M4622R2131K6770o429N3451J16021R2589J6502k3867l797L4657N6174
$$ -455795 -411173 -319042 -292272 -298701 -245250 -129229 -36640 -20138 -44005 -47802 -13145 43029
36970D3029N8500M5294J5556k4002o0614q3760p9622l5501L4598Q9706J03115
$$ 43029 101529 146823 162379 138377 77763 -5997 -85619 -121120 -86522 3184 106299
36959A06299Q0673K8311n7129j41537j49825n7470N1020O9272j1442j16498j83603
$$ 106299 186972 215283 158154 16617 -133208 -190678 -139658 -70386 -81828 -198326 -381929
36948c81929j83195q6418R5245K54445K68719J44492j098j01600j85520k48759
$$ -381929 -565124 -651542 -556297 -301852 -33133 111359 110261 8661 -176859 -425618
36938d25618k07564l9010J35920J96083J71405J59844J58488Q9348l9321j15390
$$ -425618 -633182 -672192 -536272 -340189 -168784 -8940 149548 238896 199575 84185
36928H4185p5740J4028N5037K3411l5952o6483l4728L7957O5583j9562j52902
$$ 84185 8445 22473 77510 100921 64969 -1514 -36242 1715 67298 47736 -105166
36917a05166j73480j6782J83759K43871J35223j7524j11064j49174j58959j18868
$$ -105166 -278646 -295428 -111669 132202 267425 249901 138837 -10337 -169296 -288164
36907b88164j8230P6132Q4061K0111k4981p653K0439J054m4014m8136O614O7642
$$ -288164 -306394 -230262 -146201 -126090 -151071 -158724 -138285 -137231 -181245 -229381 -222767 -155125
36895a55125P5566K5086l4116m0614K7976J29488J86189J56393P7076K1732J6376
$$ -155125 -79559 -54473 -88589 -129203 -101227 28261 214450 370843 447919 469651 486027
36884D86027J1475n7675j90963l10437l27182k20221n0715R4208J60982J42146
$$ 486027 497502 439827 248864 -61573 -388755 -608976 -659691 -565483 -404501 -262355
36874b62355O5221j1376k4674K9244P5407M7055k3577n3793l4098l2011p3374
$$ -262355 -197134 -208510 -233184 -203940 -128533 -81478 -105055 -158848 -192946 -224957 -298331
36863b98331j02365p7615k4302L6308J14679J68663J04428n6181j18701M3816
$$ -298331 -400696 -478311 -502613 -466305 -351626 -182963 -78535 -134716 -253417 -209601
36853b09601K66119K59934j6439l04010l64050k15818k4378J15276K05019K40987
$$ -209601 56518 316452 300013 -3997 -368047 -583865 -608243 -492967 -287948 -46961
36843d6961J83099K3058j59454k33002j39192J2026M0860o5992j13113J9277J60938
$$ -46961 136138 159196 -258 -233260 -372452 -360426 -319566 -385558 -498671 -479394 -318456
36832c18456Q5172j28362j90612l8327Q5845L3203l7085L6460J42287J11583J3092
$$ -318456 -233284 -361646 -552258 -590585 -504740 -471537 -508622 -472162 -329875 -218292 -205200
36821b05200M985L4457n9679k23410k28908l0159J56686J62595N8241j4690k8179
$$ -205200 -200215 -165758 -225437 -448847 -677755 -707914 -551228 -388633 -330392 -345082 -373261
36810c73261r827M6465J14096R7114k9690j27885n9737R9232J29674m3920k30544
$$ -373261 -383088 -336623 -222527 -125413 -155103 -282988 -342725 -243493 -113819 -157739 -388283
36799c88283j90978O6719K84669K58187O7142n7663l7864K759k6089n7851l2617
$$ -388283 -579261 -512542 -227873 30314 97456 39793 1929 4688 -21401 -79252 -111869
36788a11869j9975o6639o5910O1415J70904P8693j29055j93063o4164M1217o441
$$ -111869 -131844 -198483 -264393 -202978 -32074 46619 -82436 -275499 -339663 -298446 -304887
36777c04887p3553k0603P4288Q1606M6449Q4754J59132J28320k4398j57466j61401
$$ -304887 -378440 -399043 -324755 -243149 -196700 -111946 47186 175506 151108 -6358 -167759
36766a67759p4539L600L4420M5977O0345N5682J1051k9879O404R8967J14919q339
$$ -167759 -242298 -238698 -204278 -158301 -97956 -42274 -31223 -61102 -54698 44269 159188 150849
36754A50849j33182r6700L5069N1261q0530j66071r0637K7287O6457Q9624J71934
$$ 150849 17667 -79033 -43964 7297 -73233 -239304 -329941 -302654 -236197 -146573 25361
36743B5361K15884J07004p2281j60884j55203j52182j39897l8940R7473J24973
$$ 25361 241245 348249 275968 115084 -40119 -192301 -332198 -371138 -273665 -148692
36733a48692M0629p105M7227J06551Q9832L5150j3226p5168j38296j23710j9296
$$ -148692 -108063 -115168 -67941 38610 128442 163592 150366 75198 -63098 -186808 -206104
36722b06104O2232L7371k3555o780P7069J18537O2826l4680q9090p0785j5669
$$ -206104 -143872 -106501 -130056 -136836 -59767 58770 121596 86916 -2174 -72959 -88628
36711h8628J7760J688m1662p4917q3224o0624P266J02966J50737R6318r48k5790
$$ -88628 -70868 -69180 -110842 -185759 -268983 -329607 -322341 -219375 -68638 27680 26732 942
36699I42M4196J14638J06070M6271J6091N3360J22851J44795N8771r9573k03261
$$ 942 45138 159776 265846 312117 328208 381568 504419 649214 707985 608412 405151
36688D05151j66550n0136K2996K0709o649m5060j14240j65003j10166K5559J06268
$$ 405151 238601 188465 211461 232170 225521 180461 66221 -98782 -208948 -183389 -77121
36677g7121O7267r349l1320p82M9682J09303J33565N6701q1048j36720o4641O414
$$ -77121 -9854 -19203 -50523 -51305 -1623 107680 241245 297946 216898 80178 15537 21951
36665B1951k1883o2088j510J00124J14590N4470K3025K2868j9422q0413o4530
$$ 21951 68 -62020 -63530 36594 151184 205654 228679 251547 232125 151712 87182
36654H7182J1589L0172k0743k0165O6222J02622l753j44024j64447p7398l273
$$ 87182 98771 128943 108200 88035 154257 256879 253126 109102 -55345 -132743 -136016
36643a36016K0805N0368R3965Q9857K2794l8358m2780j9693q829L547L5136M8196
$$ -136016 -115211 -64843 29122 118979 141773 103415 60635 40942 32113 35660 70796 118992
36631A18992K672n8851n1159K6062P1545K5041l5857m551Q9268J10675J1574j02146
$$ 118992 121664 62813 11654 37716 109261 134302 98445 93894 183162 293837 305411 203265
36619B03265j27414j00212j07266j27683o4121Q4312J80896J15908n0286j54568
$$ 203265 75851 -24361 -131627 -259310 -323431 -239119 -58223 57685 7399 -147169
36609a47169j12595N917P3357M1550k8538n5242k4906J6774L2519J8120k3362
$$ -147169 -259764 -253847 -180490 -138940 -167478 -222720 -247626 -230852 -198333 -180213 -203575
36598b03575q0844j08651n9311L9382R6890P5017L0897J3200r603n8554n9319
$$ -203575 -284419 -393070 -452381 -412999 -316109 -241092 -210195 -196995 -206598 -265152 -324471
36587c24471N2895J90619J94333M9120q7067r0160j2309J5984m8425j33652j39778
$$ -324471 -271576 -80957 113376 162496 75429 -14731 -27040 -11056 -59481 -193133 -332911
36576c32911k7425J34233J97905P9050j18240j87915o0806J16821J75188J05100
$$ -332911 -360336 -226103 -28198 50852 -67388 -255303 -316109 -199288 -24100 81000
36566H1000j195r5878j67196j60029l4261J21573J59247O3574k9095k4378K3652
$$ 81000 79805 -16073 -183269 -343298 -377559 -255986 -96739 -33165 -62260 -86638 -62986
36555f2986L7619L9069O9012P5043j2307j37759j74397j08081n2992o3825m8078
$$ -62986 -25367 13702 82714 157757 145450 7691 -166706 -274787 -327779 -391604 -439682
36544d39682P2996K09851K08289N9542r3488j44771j25787j08948r9384o1625
$$ -439682 -366686 -156835 51454 110996 17508 -127263 -253050 -361998 -461382 -523007
36534e23007Q610Q6419J51893J82855J49242N8600j9986k7409J405k4568j22855
$$ -523007 -514397 -427978 -276085 -93230 56012 114612 94626 67217 68622 44054 -78801
36523g8801j90405j21062M4932J36415M5353j24564j65783k5150J29502J43853
$$ -78801 -269206 -390268 -345336 -208921 -163568 -288132 -453915 -479065 -349563 -205710
36513b05710Q0739Q5063J26022M6586j44769k32226j07796N2116M5375o7612q9653
$$ -205710 -124971 -39908 86114 132700 -12069 -244295 -352091 -299975 -254600 -322212 -411865
36502d11865J0451J01392J23159J22968R4757j0618j12319n2340J24999J55557
$$ -411865 -401414 -300022 -176863 -53895 40862 30244 -82075 -134415 -9416 146141
36492A46141p2544l08941k60949P151J80390J20820j3010n5805l8893m7630m8253
$$ 146141 73597 -235344 -496293 -489142 -308752 -187932 -200942 -256747 -295640 -343270 -391523
36481c91523K4708J15200J17717N2736L4316P4516O0850m0129r9073k9469M8236
$$ -391523 -366815 -251615 -133898 -81162 -46846 27670 88520 48391 -50682 -80151 -31915
36470c1915j1172j19931p1678J14648J82788J7669j74548j75399n9374l0502r9323
$$ -31915 -43087 -163018 -234696 -120048 62740 80409 -94139 -269538 -328912 -359414 -458737
36459d58737j17653l9052N8132J45149K35905K48240R0016j24948j64633l695
$$ -458737 -576390 -615442 -557310 -412161 -176256 71984 162000 37052 -127581 -131276
36449a31276J44472J48734R8768P6549K1617q4739j22994m8238O05n7385r0244
$$ -131276 13196 161930 260698 337247 358864 274125 151131 102893 103498 46113 -44131
36438d4131j494O3333l6334j57649r1799P1218P3348r1288j73620o9358N4866
$$ -44131 -45625 17708 -18626 -176275 -268074 -196856 -123508 -214796 -388416 -457774 -402908
36427d02908O7081M5995P3722P4483k1455j17297q1282O5186J90494K07746J19451
$$ -402908 -335827 -289832 -216110 -141627 -163082 -280379 -361661 -296475 -105981 101765 221216
36416B21216j8006j20510j34596j03757j06295j20381n6346O2161Q6695l2062
$$ 221216 203210 82700 -51896 -155653 -261948 -382329 -438675 -376514 -289819 -321881
36406c21881j41276r3343N0666J22053O5657l6045r3476p4007R537R1982Q7056
$$ -321881 -463157 -556500 -505834 -383781 -318124 -354169 -447645 -521652 -512115 -420133 -333077
36395c33077k141n9367j1031O6361Q1569Q8043J76665K66240J71103j11194l33988
$$ -333077 -335218 -394585 -405616 -339255 -257686 -169643 7022 273262 444365 333171 -817
36384h17k85371l2236J85738K22545J13522l3213j35564j52163q7693J36M8204
$$ -817 -286188 -318424 -132686 89859 203381 170168 34604 -117559 -205252 -205116 -156912
36373a56912N4981O6903R7260J01214M6182k8599m8361J6973J21181J76013J19152
$$ -156912 -101931 -35028 62232 163446 209628 181029 132668 149641 270822 446835 565987
36362E65987j9888j21481r2753P103K6673o3676j10405l278J34318J13768k9985
$$ 565987 546099 424618 331865 338968 365641 301965 191560 188282 322600 436368 406383
36351D06383r7921n0687n5900j69924k04413l6703J49164J22528m1081r2766j345
$$ 406383 308462 257775 201875 31951 -172462 -209165 -60001 62527 21446 -71320 -72665
36340g2665L7194n0838j10761m0434M5316J9309n9580n9192L4360J34991J79029
$$ -72665 -35471 -86309 -197070 -237504 -192188 -172879 -232459 -291651 -257291 -122300 56729
36329E6729J49876N2283o9780j42292j31807o3119L6817J38699J64621N5348j04108
$$ 56729 206605 258888 189108 46816 -84991 -148110 -111293 27406 192027 247375 143267
36318A43267j51486o8234m193m5525j01959q1939k7979N159N6521J36166J41068
$$ 143267 -8219 -76453 -80646 -126171 -228130 -310069 -338048 -332889 -276368 -140202 866
36307H66K6017p3074l9557K0900m0998j37039o0697J57653K50059R2484j16891
$$ 866 26883 -46191 -85748 -64848 -105846 -242885 -303582 -145929 104130 196614 79723
36296G9723j34945K6742J73046J82882R2664r178p0637p9045m9356k2724m2843
$$ 79723 -55222 -28480 144566 327448 420112 410934 340297 261252 211896 189172 146329
36285A46329j10392j60299j07755N0084J90365J80864M6126n6004m4152n842l3738
$$ 146329 35937 -124362 -232117 -182033 8332 189196 235322 179318 135166 129324 95586
36274I5586p8203n2583J0116K3990m57n166k0730j01566j67057q4555Q9962J37435
$$ 95586 17383 -35200 -25084 -1094 -1551 -6717 -27447 -129013 -296070 -380625 -290663 -153228
36262a53228j2085j60786j23256J4346L8392p8795j51024m3074J52642K35853
$$ -153228 -165313 -326099 -449355 -435009 -396617 -475412 -626436 -669510 -516868 -281015
36252b81015J32833l5437j07533o2505j2811l2739o2466j5787Q2743J37528J16506
$$ -281015 -148182 -183619 -291152 -353657 -366468 -399207 -461673 -477460 -394717 -257189 -140683
36241a40683O8701L5488K2272L4634O0921M2053m9005j16854m2120J27725J99159
$$ -140683 -71982 -36494 -14222 20412 81333 123386 74381 -42473 -84593 43132 242291
36230B42291P2725j32533k29285j57139O50J17487J10230k283r9798q3966j0996
$$ 242291 315016 182483 -46802 -203941 -203291 -85804 24426 22143 -77655 -161621 -172617
36219a72617j8391j09662j23584L5930K44041L04999J84672J5131q1937r8857
$$ -172617 -191008 -300670 -424254 -388324 -144283 160716 345388 360519 278582 179725
36209A79725r1648q8775o0533L0094J44878J73548O6387p4979j18523p7662n8855
$$ 179725 88077 -698 -61231 -31137 113741 287289 353676 278697 160174 82512 23657
36198B3657o8165k4125M1083j0458j54712j50415J15365L93059L62671N1363k30435
$$ 23657 -44508 -68633 -27550 -38008 -192720 -343135 -227770 165289 527960 579323 348888
36187C48888l00790k53605k17427j72051n4933J01531K16070K51772K08429R4294
$$ 348888 48098 -205507 -422934 -594985 -649918 -548387 -332317 -80545 127884 222178
36177B22178m6607j37970j49109j30417j36178j44371q8578M3522J70319J86680
$$ 222178 175571 37601 -111508 -241925 -378103 -522474 -611052 -567530 -397211 -210531
36167b10531Q0103l5419l4831O8508J37726Q7582k2227r8998j39240j72556j59901
$$ -210531 -130428 -165847 -200678 -132170 5556 93138 70911 -28087 -167327 -339883 -499784
36156d99784n1588R3326J54906J11366N7604O5245J09186J37375J29297P1238
$$ -499784 -551372 -458046 -303140 -191774 -134170 -68925 40261 177636 306933 378171
36146C78171m6356j80952k54240k43620k00962j59652q6525L9469J58152J88455
$$ 378171 331815 150863 -103377 -346997 -547959 -707611 -794136 -754667 -596515 -408060
36136d08060J27195M4663l0k452J8098N3483R4322J03479L9124p7969j50901j08193
$$ -408060 -280865 -236202 -236232 -238684 -220586 -167103 -72781 30698 69822 -8147 -159048 -267241
36124b67241p241K7761k2941m5610L3103J30656J30205L9811n2226j10921j42103
$$ -267241 -274482 -246721 -269662 -315272 -282169 -151513 -21308 18503 -33723 -144644 -286747
36113b86747j09368Q534J15472R4248q232l7604K4077L4111n6603j00672M909
$$ -286747 -396115 -387581 -272109 -177861 -186093 -223697 -199620 -165509 -222112 -322784 -317875
36102c17875J30439J02713k7553o6907L1985J23536R7848R676m5759o4942r0770
$$ -317875 -187436 -84723 -112276 -179183 -147198 -23662 74186 83862 38103 -26839 -117609
36091a17609j17969j06489m6904L3519J05165J46787J43372R8378L6073k0674
$$ -117609 -235578 -342067 -388971 -355452 -250287 -103500 39872 138250 174323 153649
36081A53649o1884p5492m4161K7277R2886Q9701j1861j69774k78308k42058p4964
$$ 153649 91765 16273 -27888 -611 92275 181976 170115 341 -277967 -520025 -594989
36070e94989Q9399J29644P5070O0853J36298J86268R2807p9938j49258n2594P0299
$$ -594989 -505590 -375946 -300876 -240023 -103725 82543 175350 95412 -53846 -106440 -36141
36059c6141O9005k0615m4153M7943J37631J07966p151q7295q6080o1691o5175
$$ -36141 32864 12249 -31904 16039 153670 261636 254485 167190 81110 19419 -45756
36048d5756o9035l0822K1096J6992m7968q7553k9697Q2725J38292R5547K7593
$$ -45756 -114791 -145613 -124517 -107525 -155493 -243046 -272743 -190018 -51726 43821 71414
36037G1414J8233O3038J02428J05993P5707M605r9032j65638j21246L285Q9419
$$ 71414 89647 152685 255113 361106 436813 441418 342386 176748 55502 58787 148206
36026A48206P2589K037n6502j00668j36219j18276j6742J04072J41552P2998l1440
$$ 148206 220795 222832 166330 65662 -70557 -188833 -205575 -101503 40049 113047 81607
36015H1607r4659q8373k7106M2215N7348m440q8882j14274n5559M1817J17045
$$ 81607 -13052 -101425 -128531 -86316 -28968 -33408 -122290 -236564 -292123 -250306 -133261
36004a33261J38231J07266M8165j4237p3503j26746j46733j06930l5486O782J0506
$$ -133261 4970 112236 160401 146164 72661 -54085 -200818 -307748 -343234 -336452 -325946
35993c25946K0405M3771L4401q053j6445J9589J0807p3623j06757K4819K26964
$$ -325946 -305541 -261770 -227369 -235422 -251867 -232278 -221471 -295094 -401851 -377032 -150068
35982a50068L05429K17966Q7175k716p7361j49115j68318j23805p2539l8551J0520
$$ -150068 155361 373327 460502 457786 380425 231310 62992 -60813 -133352 -171903 -161383
35971a61383N8799K9095p7514j36117o3182N4478P6458L73m5586J9379J28836
$$ -161383 -102584 -73489 -151003 -287120 -350302 -295824 -219366 -218993 -264579 -245200 -116364
35960a16364J60741R0535J7014K6072O4245J1932j21014j74708o5274P4101P6650
$$ -116364 44377 134912 151926 177998 242243 254175 133161 -41547 -106821 -32720 43930
35949D3930k2683o6297j7830L0381M7679Q3088J06022K0617j34971j88504q8402
$$ 43930 21247 -45050 -62880 -32499 15180 98268 204290 224907 89936 -98568 -186970
35938a86970J1154q034o1169k6389O6452J19956J23206J14113Q5801K7431k8834
$$ -186970 -175816 -183850 -245019 -271408 -204956 -85000 38206 152319 238120 265551 236717
35927B36717p9319j69517k73141k70273j31872K442L2449M5527J29757J80917
$$ 236717 157398 -12119 -285260 -555533 -687405 -684963 -652514 -606987 -477230 -296313
35917b96313O9293j08955j41700Q11J57705K19448K02313J21456k2323j39141
$$ -296313 -227020 -335975 -477675 -476864 -319159 -99711 102602 224058 201735 62594
35907F2594j14691M349M6700m0310j30640j27508q3837o9132m9832K8502J35772
$$ 62594 -52097 -47748 -1048 -41358 -171998 -299506 -383343 -452475 -502307 -473805 -338033
35896c38033J99349J90045J27664N0495n792m3728j05015j83484j83434n3970
$$ -338033 -138684 51361 179025 229520 223728 180000 74985 -108499 -291933 -345903
35886c45903Q6229Q4668j8149m4488N2004J35661J16266N5644J1232n0571j18060
$$ -345903 -259674 -175006 -193155 -237643 -185639 -49978 66288 121932 133164 82593 -35467
35875c5467q4058O5401J63362Q8680m5928p1648k0616m2383j40022j73688j05261
$$ -35467 -119525 -54124 109238 197918 151990 80342 59726 17343 -122679 -296367 -401628
35864d01628n9961j10713j51092o1355R7901J57053O1731o6188r6930m6078j3322
$$ -401628 -461589 -572302 -723394 -784749 -686848 -529795 -468064 -534252 -631182 -677260 -690582
35853f90582j8482J3631J04142J59125J13748M5644M8091O6245o006j17763j19963
$$ -690582 -709064 -695433 -591291 -432166 -318418 -272774 -224683 -158438 -164444 -282207 -402170
35842d02170k0273J3695n9751p2821N9162J61453O6677j07968j42432m8563k782
$$ -402170 -422443 -408748 -468499 -541320 -482158 -320705 -254028 -361996 -504428 -552991 -555773
35831e55773k5155K5845J54130J72588M769j71563j76582n4759N6149J32278K08585
$$ -555773 -580928 -555083 -400953 -228365 -223596 -395159 -571741 -626500 -570351 -438073 -229488
35820b29488K35118J44781K669n5243p556M2675K5024l3881q9158j21841j09004
$$ -229488 5630 150411 153080 97837 90281 132956 157980 124099 34941 -86900 -195904
35809a95904m2333K3036K4834m799J1898N2528J5654r2930j27578j5322J21370
$$ -195904 -238237 -215201 -190367 -195166 -183268 -130740 -115086 -208016 -335594 -350916 -229546
35798b29546J41794P8994M4587L7243j3412p9606p4350k4194l2498p5394j9454
$$ -229546 -87752 -8758 35829 73072 59660 -19946 -94296 -118490 -150988 -226382 -245836
35787b45836J23071J52479j2160j61776p9404J37130K11413O7600j14558j91234
$$ -245836 -122765 29714 17554 -144222 -223626 -86496 124917 192517 77959 -113275
35777a13275k08041k34556k17541q7477R3408J87423J44230M4996N119O6133J63968
$$ -113275 -321316 -555872 -773413 -860890 -767482 -580059 -435829 -390833 -385714 -319581 -155613
35766a55613J87480Q9956n3597j26813j02715n5623n2469q6572j20776j34647
$$ -155613 31867 121823 68226 -58587 -161302 -216925 -269394 -355966 -476742 -611389
35756f11389j10076k6266R6045J82343J73188R0819J6097P308M8917P2385K9720
$$ -611389 -721465 -747731 -651686 -469343 -296155 -205336 -189239 -181931 -133014 -60629 -30909
35745c0909m6508p2998k0830L6912J6056o3386r9481l8952N8033R0490K8374n4464
$$ -30909 -77417 -150415 -171245 -134333 -118277 -181663 -281144 -320096 -262063 -171573 -143199 -197663
35733a97663n3979M6597J39350J08458k0032j07186q6351l3466k4943l0620q604
$$ -197663 -251642 -205045 -65695 42763 22731 -84455 -170806 -204272 -229215 -259835 -268439
35722b68439K413k4042k0754M8123P8595j8696j42956j42560n5899l1166o3952
$$ -268439 -266026 -290068 -310822 -262699 -184104 -202800 -345756 -488316 -544215 -575381 -639333
35711f39333k1973R7462J55557J19258R7578J08066L8201j08636j62661o5270
$$ -639333 -661306 -563844 -408287 -289029 -191451 -83385 -45184 -153820 -316481 -381751
35701c81751K8778K6747M3132J37118J41220n9451k78447k78611j13137P188M6811
$$ -381751 -352973 -326226 -283094 -145976 -4756 -64207 -342654 -621265 -734402 -727214 -680403
35690f80403J03413J52110J03021M2105J32972L01985K98656R0992o6563k5290
$$ -680403 -576990 -424880 -321859 -279754 -146782 155203 453859 544851 478288 452998
35680D52998M6957l8228j94330k18644r8451J2078L5014K8130L6741K7461j5351
$$ 452998 499955 461727 267397 48753 -49698 -37620 -2606 25524 62265 89726 74375
35669G4375k9350L9735J37669J43158J6000j34309j67571q3296r081j5973l6359
$$ 74375 45025 84760 222429 365587 381587 247278 79707 -3589 -12670 -28643 -65002
35658f5002p506O823o6543j51547j12136L5696J33122R5698J671m8012m4247j5638
$$ -65002 -72508 -65685 -132228 -283775 -395911 -360215 -227093 -131395 -129724 -177736 -221983 -237621
35646b37621L5695R2957R7099K0767p2138q6156N203J35740K04488J56221K7096
$$ -237621 -201926 -108969 -11870 8897 -63241 -149397 -144194 -8454 196034 352255 379351
35635C79351r2564j51991j70840j66747j12552o944P8616Q9722O6670N7669K1438
$$ 379351 286787 134796 -36044 -202791 -315343 -322287 -243671 -153949 -87279 -29610 -8172
35624h172q3673j74431j34772J871R6110J08067J15933J33899P5129o4575j42073
$$ -8172 -91845 -266276 -401048 -399177 -303067 -195000 -79067 54832 129961 65386 -76687
35613g6687o8208M6588M7894m7876j02631o7822l2590o5971j07640n8317O9064
$$ -76687 -144895 -98307 -50413 -98289 -200920 -268742 -301332 -367303 -474943 -533260 -464196
$$ [...]
##END NTUPLES=NMR SPECTRUM
##END=
