##TITLE=31P_DE-80H_X3
 64 sc D2O
 26.2.2025
##JCAMPDX= 6.0         $$ Bruker NMR JCAMP-DX V2.0
##DATA TYPE= NMR SPECTRUM
##DATA CLASS= NTUPLES
##ORIGIN= UXNMR, Bruker Analytische Messtechnik GmbH
##OWNER= root
$$ XWIN-NMR		Version 3.5
$$ Wed Jul 23 15:15:50 2025 Russian Standard Time (UT+4h)  Yarkov@DPX200
##.OBSERVE FREQUENCY= 81.013821
##.OBSERVE NUCLEUS= ^31P
##.ACQUISITION MODE= SIMULTANEOUS
##.ACQUISITION SCHEME= undefined
##.AVERAGES= 64
##.DIGITISER RES= 17
##SPECTROMETER/DATA SYSTEM= spect
##.PULSE SEQUENCE= zgpg30
##.SOLVENT NAME= MeOD
##.SHIFT REFERENCE= (INTERNAL, MeOD, 0, 198.062)
##AUDIT TRAIL= $$ (NUMBER, WHEN, WHO, WHERE, WHAT)
$$ ##TITLE= Audit trail, XWIN-NMR		Version 3.5
$$ ##JCAMPDX= 5.01
$$ ##ORIGIN= Bruker BioSpin GmbH
$$ ##OWNER= Yarkov
$$ C:/Bruker/XWIN-NMR/data/yarkov2/nmr/P31/2/pdata/1/auditp.txt
$$ ##AUDIT TRAIL=  $$ (NUMBER, WHEN, WHO, WHERE, WHAT)
(   1,<2025-07-23 15:15:11.60 +0400>,<Yarkov>,<DPX200>,
      <created by zg, POWCHK disabled, PULCHK disabled
       configuration hash MD5:
       00 E9 B6 7A A2 85 ED C7 34 08 36 98 17 FE 4E 26
       data hash MD5: 32K
       EF F9 F5 5A D7 58 E9 26 F7 C8 64 0C 96 18 F2 B5>)
(   2,<2025-07-23 15:15:17.73 +0400>,<Yarkov>,<DPX200>,
      <Start of raw data processing
       efp BC_mod = 2 LB = 1.5 FT_mod = 6 PKNL = 1 PHC0 = 1662.243 PHC1 = 49.15953 SI = 64K 
       data hash MD5: 64K
       84 D3 0A D0 AD 87 D9 02 2E A7 BB 74 0F 94 E0 1C>)
$$ ##END=
$$ 
$$ hash MD5
$$ 6F D9 EF BA 68 1C 67 47 B0 44 B5 69 AE 49 28 B1
##$RELAX= 
##$RELAX= 
##$RELAX= 
##$RELAX= 
##$RELAX= 
##$RELAX= 
##$RELAX= 
##$RELAX= 
$$ Bruker specific parameters
$$ --------------------------
##$DU= <C:/Bruker/XWIN-NMR>
##$EXPNO= 2
##$NAME= <P31>
##$PROCNO= 1
##$TYPE= <nmr>
##$USER= <yarkov2>
##$AMP= (0..31)
100 100 100 100 100 100 100 100 100 100 100 100 100 100 100 100 100 100 
100 100 100 100 100 100 100 100 100 100 100 100 100 100 
##$AQSEQ= 0
##$AQ_mod= 1
##$AUNM= <au_zg>
##$AUTOPOS= <>
##$BF1= 81.014009
##$BF2= 200.13
##$BF3= 200.13
##$BF4= 200.13
##$BF5= 200.13
##$BF6= 200.13
##$BF7= 200.13
##$BF8= 200.13
##$BYTORDA= 1
##$CFDGTYP= 0
##$CFRGTYP= 5
##$CHEMSTR= <none>
##$CNST= (0..31)
1 1 145 1 1 1 1 1 1 1 1 1 1 1 1 1 1 1 1 1 1 1 1 1 1 1 1 1 1 1 1 1 
##$CPDPRG= <waltz16>
##$CPDPRG1= <>
##$CPDPRG2= <waltz16>
##$CPDPRG3= <>
##$CPDPRG4= <mlev>
##$CPDPRG5= <mlev>
##$CPDPRG6= <mlev>
##$CPDPRG7= <mlev>
##$CPDPRG8= <mlev>
##$CPDPRGB= <>
##$CPDPRGT= <>
##$D= (0..31)
0 1 0 0 0 0 0 0 0 0.06 0 0.03 2e-05 3e-06 0 0 0.0002 0 0 0 0 0 0 0 0 0 
0 0 0 0 0 0 
##$DATE= 1753269311
##$DBL= (0..7)
120 120 120 11 120 120 24 19 
##$DBP= (0..7)
150 150 150 150 150 150 150 150 
##$DBP07= 0
##$DBPNAM0= <>
##$DBPNAM1= <>
##$DBPNAM2= <>
##$DBPNAM3= <>
##$DBPNAM4= <>
##$DBPNAM5= <>
##$DBPNAM6= <>
##$DBPNAM7= <>
##$DBPOAL= (0..7)
0.5 0.5 0.5 0.5 0.5 0.5 0.5 0.5 
##$DBPOFFS= (0..7)
0 0 0 0 0 0 0 0 
##$DE= 6
##$DECBNUC= <off>
##$DECIM= 4
##$DECNUC= <off>
##$DECSTAT= 4
##$DIGMOD= 1
##$DIGTYP= 9
##$DL= (0..7)
0 0 52 120 120 21 21 25 
$$ [...]
##$SUBNAM2= <"">
##$SUBNAM3= <"">
##$SUBNAM4= <"">
##$SUBNAM5= <"">
##$SUBNAM6= <"">
##$SUBNAM7= <"">
##$SUBNAM8= <"">
##$SUBNAM9= <"">
##$SW= 400.765351723535
##$SWIBOX= (0..15)
0 1 3 0 0 0 0 0 0 0 0 0 0 0 0 0 
##$SW_h= 32467.5324675325
##$TD= 32768
##$TD0= 1
##$TE= 0
##$TE2= 300
##$TE3= 300
##$TEG= 300
##$TL= (0..7)
0 120 53 12 22 120 120 120 
##$TP= (0..7)
150 150 150 150 150 150 150 150 
##$TP07= 0
##$TPNAME0= <>
##$TPNAME1= <>
##$TPNAME2= <>
##$TPNAME3= <>
##$TPNAME4= <>
##$TPNAME5= <>
##$TPNAME6= <>
##$TPNAME7= <>
##$TPOAL= (0..7)
0.5 0.5 0.5 0.5 0.5 0.5 0.5 0.5 
##$TPOFFS= (0..7)
0 0 0 0 0 0 0 0 
##$TUNHIN= 0
##$TUNHOUT= 0
##$TUNXOUT= 0
##$USERA1= <user>
##$USERA2= <user>
##$USERA3= <user>
##$USERA4= <user>
##$USERA5= <user>
##$V9= 5
##$VALIST= <valist>
##$VCLIST= <CCCCCCCCCCCCCCC>
##$VD= 0
##$VDLIST= <DDDDDDDDDDDDDDD>
##$VPLIST= <PPPPPPPPPPPPPPP>
##$VTLIST= <TTTTTTTTTTTTTTT>
##$WBST= 1024
##$WBSW= 4
##$XGAIN= (0..3)
0 0 0 0 
##$XL= 0
##$YL= 0
##$YMAX_a= 156
##$YMIN_a= -690
##$ZGOPTNS= <>
##$ZL1= 120
##$ZL2= 120
##$ZL3= 120
##$ZL4= 120
##$ABSF1= 0
##$ABSF2= 0
##$ABSG= 0
##$ABSL= 0
##$ALPHA= 0
##$AQORDER= 0
##$ASSFAC= 0
##$ASSFACI= 0
##$ASSFACX= 0
##$ASSWID= 0
##$AUNMP= <proc_1d>
##$AZFE= 0.1
##$AZFW= 0.5
##$BCFW= 0
##$BC_mod= 2
##$BYTORDP= 0
##$COROFFS= 0
##$CY= -3
##$DATMOD= 1
##$DC= 0
##$DFILT= <>
##$DTYPP= 0
##$F1P= 0
##$F2P= 0
##$FCOR= 1
##$FTSIZE= 65536
##$FT_mod= 6
##$GAMMA= 0
##$GB= 0
##$INTBC= 1
##$INTSCL= 9.790993e-09
##$ISEN= 30
##$LB= 1.5
##$LEV0= 0
##$LPBIN= 0
##$MAXI= 10000
##$MC2= 0
##$MEAN= 0
##$ME_mod= 0
##$MI= 50
##$NCOEF= 0
##$NC_proc= -13
##$NLEV= 6
##$NOISF1= 182.463
##$NOISF2= 159.3651
##$NSP= 0
##$NTH_PI= 0
##$NZP= 0
##$OFFSET= 198.0616
##$PC= 4
##$PHC0= 1662.243
##$PHC1= 49.15953
##$PH_mod= 1
##$PKNL= yes
##$PPARMOD= 0
##$PSCAL= 0
##$PSIGN= 0
##$REVERSE= no
##$SF= 81.0140089999434
##$SI= 65536
##$SIGF1= 159.3651
##$SIGF2= -187.1042
##$SINO= 113.3802
##$SIOLD= 16384
##$SREGLST= <1H.CDCl3>
##$SSB= 0
##$STSI= 65536
##$STSR= 0
##$SW_p= 32467.5324675325
##$SYMM= 0
##$S_DEV= 0
##$TDeff= 32768
##$TDoff= 0
##$TI= <>
##$TILT= no
##$TM1= 0
##$TM2= 0
##$TOPLEV= 0
##$USERP1= <user>
##$USERP2= <user>
##$USERP3= <user>
##$USERP4= <user>
##$USERP5= <user>
##$WDW= 1
##$XDIM= 65536
##$YMAX_p= 314097363
##$YMIN_p= -234583642
$$ End of Bruker specific parameters
$$ ---------------------------------
##NTUPLES= NMR SPECTRUM
##VAR_NAME=  FREQUENCY,     SPECTRUM/REAL,   SPECTRUM/IMAG
##SYMBOL=    X,             R,               I
##VAR_TYPE=  INDEPENDENT,   DEPENDENT,       DEPENDENT
##VAR_FORM=  AFFN,          ASDF,            ASDF
##VAR_DIM=   65536,         65536,           65536
##UNITS=     HZ,            ARBITRARY UNITS, ARBITRARY UNITS
##FACTOR=    0.49542278885378, 1,            1
##FIRST=     16045.7642231865, 0,            0
##LAST=      -16421.768244346, 0,            0
##MIN=       -16421.768244346, -234583642,   0
##MAX=       16045.7642231865, 314097363,    0
$$ Real data points
##PAGE= N=1
##DATA TABLE= (X++(R..R)), XYDATA
$$ [...]
##PAGE= N=2
##DATA TABLE= (X++(I..I)), XYDATA
35506b33989l64870J589120J531718L5949k33603J320023K458372J544943m38812
35497G208851j835923k379827k461504j919712p46051R9689j76237r20908j014468
35488d146090o84554j211073k902257m318655l773593j140668J960036L529600
35480a2687254K844920J040597j04064j54622l18131j258397j402652J094971
35472a0944632M792165N443749J353714l371489l264538J441122N034113L952667
35464D436871R13339k90896p10501l200544n688532k945778M553777Q891726M423635
35455A0383097m598701r388095o804943p56792M118453N965878M439855N89027
35447C947779k171578j116410J512404J159386j859882k313749J668431N056359
$$ plain form
35506 -233989 -598859 990261 2521979 2557928 2324325 3644348 6102720 7647663 7208851
35497 7208851 5372928 2993101 531597 -1388115 -2134166 -2034477 -2210714 -3131622 -4146090
35488 -4146090 -4830644 -6041717 -8943974 -13262629 -17036222 -18176890 -16216854 -12687254
35480 -12687254 -9842334 -8801737 -8905801 -9060423 -9378554 -10636951 -12039603 -10944632
35472 -10944632 -6152467 -708718 644996 -2726493 -5991031 -4549909 484204 4436871
35464 4436871 5350210 5059314 4348813 1148269 -4540263 -7486041 -2932264 5959462 10383097
35455 10383097 5784396 -3603699 -10408642 -11165434 -7046981 -1081103 3358752 3947779
35447 3947779 1776201 659791 2172195 3331581 1471699 -842050 826381 5882740
35439E882740L259468j074024k213269O31794L392698L384745J619000j19526
35431A4763626j090343j028683n81464j637948m564054o134787l401189J253885
35423b420957K676851K46249j550129l35532Q26621q59323k935992j582120K181280
35414c753052L773220J370659k201663l625910k562976o31542J104688K652482
35406c874094L945742M151970K483861l29712k113344j666475n66178j102264
35398I29506k731475k601853J83520L109887L817404K810587J426356m57875k793878
35389C692179l623464j508412J732159L179774K581725J626556P57258m68268
35381G969507q78617J051809L669529L267524o94251m375934m356388j200647
$$ plain form
35439 5882740 9142208 8068184 5854915 6486709 9879407 13264152 14883152 14763626
35431 14763626 13673283 12644600 12063136 10425188 5861134 -273653 -3674842 -2420957
35423 -2420957 255894 502143 -1047986 -1383518 -556897 -1416220 -4352212 -5934332 -3753052
35414 -3753052 20168 1390827 -810836 -4436746 -6999722 -7631264 -6526576 -3874094
35406 -3874094 71648 4223618 6707479 6377767 4264423 2597948 2031770 929506
35398 929506 -1801969 -4403822 -4220302 -1110415 2706989 5517576 6943932 6486057 3692179
35389 3692179 68715 -1439697 292462 3472236 6053961 7680517 8437775 7969507
35381 7969507 7090890 8142699 11812228 15079752 14385501 10009567 5653179 4452532
35373D452532K353320M180257L043110j031224n317842n914637k347122J487147
35365I05541K437184J810994K193077L031007K007707q88359l363638l877704
35357D255809k521787M4205K405990K408383k44715k513365j655325P52741J199115
35348D131051m25694j214132l36419O7740p24938o43893J126133K308740J407797
35339E696385K49869N72251Q68397p71239k863938k531930L7946J972403J874946
35330E105090J050502P71532N96768k44572j409130j878655j039673O53609J551003
35321E156474J9584l252716m960571k623839K080625M888389L737224O81971r66843
35312D760298j25919J689726K366494J025240j508810l534561l853752k443382
$$ plain form
35373 4452532 6805852 10986109 14029219 12997995 7680153 1765516 -581606 905541
35365 905541 3342725 5153719 7346796 10377803 12385510 11497151 8133513 4255809
35357 4255809 1734022 1778227 4184217 6592600 6347885 3834520 2179195 2931936 4131051
35348 4131051 3705357 2491225 2154806 2222546 1497608 853715 1979848 4288588 5696385
35339 5696385 5946254 6518505 7386902 6615663 3751725 1219795 1257741 3230144 5105090
35330 5105090 6155592 6927124 7523892 7279320 5870190 3991535 2951862 3605471 5156474
35321 5156474 5176058 1923342 -3037229 -5661068 -3580443 1307946 5045170 5727141 4760298
35312 4760298 4634379 6324105 8690599 9715839 8207029 4672468 818716 -1624666
35304a624666P035K599221M150062L623391J425388m21605l69033P51581P80505
35295A0921879j017577l032126l148423j051032J356312J808122J85234j125590
35287D896799q4373K202785K848780J122787q33523j439820j618581k495361l401761
35278A197732l455510l008670k044410N60960M245058N676356L136489j69610
35270F138395l83045J283014Q50079j810554l108273j963243j143258j778038
35262a914923j190281K026659M714485L537914j03391k212208j417839K65729
35254C706145O72219m77228k052776k713646k065220j037125l88508P03716K817101
35245h35322L699312O03082m530241n923035j541305L561740L803619O3506k710076
$$ plain form
35304 -1624666 -1617631 981590 5131652 8755043 10180431 9758826 9389793 10141374 10921879
35295 10921879 9904302 6872176 3723753 2672721 4029033 5837155 6022389 4896799
35287 4896799 4812426 7015211 9863991 10986778 10153255 8713435 7094854 4599493 1197732
35278 1197732 -2257778 -5266448 -7310858 -6749898 -2504840 3171516 6308005 6138395
35270 6138395 5755350 7038364 7888443 6077889 2969616 1006373 -136885 -1914923
35262 -1914923 -3105204 -1078545 3635940 7173854 7070463 4858255 3440416 3706145
35254 3706145 4378364 3901136 1848360 -865286 -2930506 -3967631 -4356139 -3652423 -835322
35245 -835322 2863990 3467072 -1063169 -6986204 -8527509 -4965769 -1162150 -1098644 -3808720
35236c808720k391012p35063P53985K187477L037180K036704k16447j272073k34833
35227f42802Q97494K50810j148412q86851J289641K766113J252340j997710l265907
35218a485284r85083K036020K279708K44161o57459P56513K215753K028944J269056
35209G702329J007160K38990j890852m115358m874371m209583k654510l28196
35201i124391J820431K265026J452809J393717J740515j94190l997847m964174
35193i608104j018171L298078L316236Q65100J97647R99433O19771J42002K164833
35184I76825M591338L047190j466181l565023j795758J28231M21359J198879K576803
35175F113663J306066k782753m969896k926073m01367n82601q83020J761246M771363
$$ plain form
35236 -3808720 -6199732 -6934795 -6180810 -3993333 -956153 1080551 864104 -407969 -642802
35227 -642802 254692 505502 -642910 -1529761 -240120 2525993 3778333 1780623 -1485284
35218 -1485284 -2470367 -434347 1845361 2089522 1432063 2188576 4404329 6433273 7702329
35209 7702329 8709489 8948479 7057627 2942269 -1932102 -6141685 -8796195 -9124391
35201 -9124391 -7303960 -5038934 -3586125 -2192408 -451893 -646083 -4643930 -9608104
35193 -9608104 -10626275 -7328197 -4011961 -3146861 -2949214 -1949781 -1330010 -1188008 976825
35184 976825 5568163 8615353 7149172 3584149 1788391 1916622 2337981 3536860 6113663
35175 6113663 7419729 4636976 -332920 -3258993 -3660360 -4242961 -5125981 -3364735 1406628
35166A406628L744210n48135l425328k737195k99652J675358K291535J257954
35158C365375n83922r02622J388518L768360K745522j643694n760456o331798
35150c954717l270901P03784K263181K44582k925721l601204j057310K236036
35142i362270M461868O048152O954707N566242J762050j807830l295848l797015
35134F530056m176191k915939M20358K703726J485309p74709k94266K172403K789916
35125G940663N39208k061420l203336l177869k118684J33530K049840J503502
35117A605434r76670k716703k635870j884187r62702Q18345K793419K890924R75485
35108i2525l42499O21537K224889J974722k36099k518704l285601k070588Q16266
$$ plain form
35166 1406628 5150838 4602703 1177375 -1559820 -1859472 -184114 2107421 3365375
35158 3365375 2781453 1878831 3267349 7035709 9781231 8137537 2377081 -3954717
35150 -3954717 -7225618 -6521834 -4258653 -4014071 -6939792 -10540996 -11598306 -9362270
35142 -9362270 -4900402 1147750 8102457 13668699 15430749 13622919 10327071 6530056
35134 6530056 2353865 -562074 -141716 2562010 4047319 3272610 2978344 5150747 7940663
35125 7940663 8479871 6418451 3215115 37246 -2081438 -1947908 101932 1605434
35117 1605434 628764 -2087939 -4723809 -6607996 -7570698 -6752353 -3958934 -1068010 -92525
35108 -92525 -435024 186513 2411402 4386124 4150025 1631321 -1654280 -3724868 -2908602
35099b908602M161931N909108M548699P32237k923393m029000k609847r48779
35091A932354r64609k073350k268622q58020J000154K139646K280069J293730
35083B481352o22785k110307k016740j539720k554032l887964k528990J043345
35075a1735841K680798J017748j58679J752514L758468K522919J13052K86981
35067B37960K182352K339276O13552o08992j121169k095970k303908j9338K673203
35058A896966K427488L18683m3110J110051P13483p00157K52398K851935K596824
35049A1424561q55920k612342q49382K67917j779500l547217j999659M79785R82121
35040A510364P90037J368151N63983k769782m728872j827486L001361M689851
$$ plain form
35099 -2908602 1253329 7162437 11711136 12443373 9519980 5490980 2881133 1932354
35091 1932354 967745 -1105605 -3374227 -4232247 -3232093 -1092447 1187622 2481352
35083 2481352 1858567 -251740 -2268480 -3808200 -6362232 -10250196 -12779186 -11735841
35075 -11735841 -9055043 -8037295 -8195974 -6443460 -2684992 -162073 -49021 237960
35067 237960 2420312 4759588 5373140 4764148 3642979 1547009 -756899 -776237 1896966
35058 1896966 4324454 4643137 4600027 5710078 6423561 5723404 5975802 8827737 11424561
35049 11424561 10568641 7956299 7106917 7374834 5595334 2048117 48458 528243 1510364
35040 1510364 2300401 3668552 4232535 1462753 -3266119 -5093605 -2092244 2597607
35032B597607L225540J767340N76765j812663l695669k189007J175096K281117
35024C926126J111141J314379L342093L360831j94744l727035l668057r10199
35016D554535J435529J746063J64997k126834k880543n41427L027460L996456
35008I376236J527040j237863j889616j552362j712958j332711O37248K284387
35000F099401J105642k033797l982016l568109k340761j497300n96706N40728
34992f272918J081810J057945J823840L433650L573840J017834j514692o88296
34984C513013K144373K367656r83174l546815k385709n10676j523771l078016
34976d003119m88260M937773O842569L125027j260209k197247j753535k891094
$$ plain form
35032 2597607 5823147 7590487 8167252 6354589 2658920 469913 1645009 3926126
35024 3926126 5037267 6351646 9693739 13054570 12859826 9132791 5464734 4554535
35016 4554535 5990064 7736127 7901124 5774290 2893747 2352320 5379780 9376236
35008 9376236 10903276 9665413 7775797 6223435 4510477 3177766 3815014 6099401
35000 6099401 7205043 5171246 1189230 -2378879 -4719640 -6216940 -6813646 -6272918
34992 -6272918 -5191108 -4133163 -2309323 1124327 4698167 5716001 4201309 3513013
34984 3513013 5657386 8025042 7041868 3495053 1109344 598668 -925103 -4003119
34976 -4003119 -4491379 446394 7288963 10413990 9153781 6956534 5202999 2311905
34968B311905l730648j454816J535129O79820l044162l705413J066933O427053
34960H5801O543574J554812l403832m348612j944234M42517Q16598K32874O79345
34951F58843K158831K871625J893478J15144j463769k492647k150928K90673L054329
34942D935579K736974r40283l885672l026428m21908K69435j034161j946868j704311
34933e017643j020041L19203K377348L067944P02697k567755l268202j554135
34925f960584j88556L66998J806348L482157K499025j199198l800206k749395
34917f743411K72605K387330K616570J227898j057359k356144r18403K031935
34909b538979L356711K410703J443513J123220p08103m489032o751298m710686
$$ plain form
34968 2311905 -1418743 -2873559 -1338430 -658610 -3702772 -7408185 -6341252 85801
34960 85801 6629375 8184187 4780355 431743 -1512491 -1069974 -253376 -20502 658843
34951 658843 2817674 5689299 7582777 7697921 6234152 3741505 1590577 1881250 4935579
34942 4935579 7672553 6732270 2846598 -179830 -601738 -332303 -1366464 -3313332 -5017643
34933 -5017643 -6037684 -5718481 -3341133 -273189 429508 -2138247 -5406449 -6960584
34925 -6960584 -7149140 -6782142 -4975794 -1493637 1005388 -193810 -3994016 -6743411
34917 -6743411 -6470806 -4083476 -1466906 -239008 -1296367 -3652511 -4570914 -2538979
34909 -2538979 817732 3228435 4671948 5795168 5087065 598033 -6153265 -10863951
34901a0863951k84770K768933L455198L053088K106484M61353r93497r70372L73463
34892h94071J710892K082579J262072m85295k193871k693577j896652o54927P15733
34883c047117K329422L285673K398642M99870l16241j0591n23908j973903k066826
34874E75021k71444P94287j85209o76385J431857L871206L195762j46690k775256
34865E813149k857363j124535J147107K723516K220799l08377k502674k308603
34857B803019m77262J055155J779759J951641J115902o37425j606650q49178m5489
34848E089472p98681j743389q10905J139785J588822Q6281j675362k409929j804164
34839a338070L9216J798878J471834l42949l59569J795125J535185l300692o937079
$$ plain form
34901 -10863951 -11148721 -8379788 -4924590 -1871502 234982 696335 -297162 -1267534 -894071
34892 -894071 816821 2899400 4161472 3676177 1482306 -1211271 -3107923 -3762850 -3047117
34883 -3047117 -717695 2567978 4966620 5466490 5150249 5139658 4615750 2641847 575021
34874 575021 303577 1097864 912655 236270 1668127 5539333 8735095 8588405 5813149
34865 5813149 2955786 1831251 2978358 5701874 7922673 7614296 5111622 2803019
34857 2803019 2325757 3380912 5160671 7112312 8228214 7590789 5984139 5134961 5089472
34848 5089472 4290791 2547402 1736497 2876282 4465104 4551385 2876023 466094 -1338070
34839 -1338070 -1298854 500024 1971858 1628909 1269340 3064465 4599650 1298958 -5638121
34830e638121l316057L722390N169520L45862k439782P58890L850055J157611
34822C610368l846927m798218j797486O23090Q93598P05383O79871L41506N00920
34813c087895J785654K486429J214879j88995L27607J262467M07812p34243L98314
34804C872029K203313J143976j926386k811130j030742n03383k526875l446783
34796e025981j163596R92947j21639k078378r54214K157731L073765J265294J99071
34787a655000J370945K280847J115562l08570k4255O93810o2154j004547L63063
34778B769701K973535K997063k96943k955906k100040j15493m38296j714590j56169
34769I62862L525355M399297J111238j475350K38090K766404J135757k853982
$$ plain form
34830 -5638121 -8954178 -5231788 -62268 283594 -2156188 -1397298 2452757 3610368
34822 3610368 -236559 -5034777 -6832263 -6209173 -5315575 -4610192 -3930321 -3588815 -3087895
34813 -3087895 -1302241 1184188 2399067 2210072 2537679 3800146 4207958 3473715 3872029
34804 3872029 6075342 7219318 5292932 2481802 1451060 947677 -1579198 -5025981
34796 -5025981 -6189577 -5196630 -5318269 -7396647 -8350861 -6193130 -3119365 -1854071 -1655000
34787 -1655000 -284055 1996792 3112354 2803784 2779529 3473339 3411185 2406638 2769701
34778 2769701 5743236 8740299 8443356 5487450 3387410 3271917 2833621 1119031 962862
34769 962862 4488217 8887514 9998752 8523402 8761492 11527896 12663653 9809671
34761I809671l212801O65817K731479n73973n026396n002552j250760J210933
34753f48582M19433j278711k129664l025930m256172l740985k92349L563003M281478
34744g108479J977274L45632J800150M347150M290775J172657j535925r95437
34736D293797J114422P06036l134913o548096n625684j236825K361660K827117
34728e242486J693050J216038J506470J687514J987171K851790L058863J005695
34720I764105k187711l154257p55219J823882J127656j702451k429328K30422
34712B717099K639168J236102k604051m489119k524850J162732L845357M871069
34704F853507M693971L358880J040560j240582k576064l043845k909423j984852
$$ plain form
34761 9809671 6596870 7262687 9994166 9420193 4393797 -608755 -1859515 -648582
34753 -648582 -229149 -1507860 -3637524 -6663454 -10919626 -14660611 -14952960 -11389957 -7108479
34744 -7108479 -5131205 -4785573 -2985423 1361727 5652502 6825159 5289234 4293797
34736 4293797 5408219 6114255 2979342 -3568754 -9194438 -10431263 -8069603 -5242486
34728 -5242486 -3549436 -2333398 -826928 860586 2847757 5699547 8758410 9764105
34720 9764105 7576394 4422137 3666918 5490800 6618456 4916005 2486677 2717099
34712 2717099 5356267 6592369 3988318 -500801 -3025651 -1862919 1982438 6853507
34704 6853507 11547478 14906358 15946918 14706336 12130272 9086427 6177004 4192152
34696D192152o30250k10789j316184k524632k334116j348132q84473m43831J154892
34687d345363K813226K229222J0084m27586K002781M028683K711213o29463l215823
34678E176974m686026n332060l301856K194684O721474M928959j181205l733204
34670G87740Q1131L881453J610389l729204n200305k190938l9381j173844k432905
34661h405864j276413O75179J650175K595726L764714K525628k077252n649765
34653f197872l481839K374021N269018K694809j243498k488706j992942k223087
34645g290096k357945k70865K821682L546839J669066N76992J932473L174168
34637C802314J963463K49800J142008L505073L164033p66727m162911l552128
$$ plain form
34696 4192152 3561902 3351113 2034929 -489703 -2823819 -4171951 -5056424 -5500255 -4345363
34687 -4345363 -1532137 697085 707169 279583 2282364 6311047 9022260 8392797 5176974
34678 5176974 490948 -4841112 -8142968 -5948284 773190 5702149 4520944 787740
34670 787740 868871 4750324 6360713 2631509 -2568796 -4759734 -4799115 -5972959 -8405864
34661 -8405864 -9682277 -9007098 -7356923 -4761197 -996483 1529145 -548107 -6197872
34653 -6197872 -9679711 -7305690 -2036672 658137 -585361 -3074067 -5067009 -7290096
34645 -7290096 -9648041 -9918906 -7097224 -3550385 -1881319 -1304327 628146 3802314
34637 3802314 5765777 6015577 7157585 10662658 13826691 13059964 8897053 5344925
34629E344925p07024L87133q68975j824683j328867j154469k186189k140667R11876
34620c566940M559957M374030j04022m390163m806766k711803j264512k36783
34612h147002K682755O323721O011671M17588n192348n342393j491434O97817
34604d039625l36477p27890J928447M690458L889452L97303k049971j756473p8987
34595A916237J120265J044132j76890j576032j816971o00945R75267J906684J962866
34586D754613O53806k436745n504940n215300j133795K843565L421149J920077
34578f97570J101094O16193j117919k755754j784929R13640K367880K381824K823150
34569C847609K902982J97398l664193l857230m9587K214844j4313k449308o28932
$$ plain form
34629 5344925 4637901 5025034 4156059 2331376 1002509 -151960 -2338149 -4478816 -3566940
34620 -3566940 993017 5367047 5263025 872862 -3933904 -6645707 -7910219 -8147002
34612 -8147002 -5464247 859474 6871145 7288733 2096385 -3246008 -4737442 -4039625
34604 -4039625 -4376102 -5103992 -3175545 1514913 5404365 5801668 3751697 1995224 1916237
34595 1916237 3036502 4080634 3903744 2327712 510741 -90204 885063 2791747 4754613
34586 4754613 5408419 2971674 -2533266 -7748566 -8882361 -6038796 -2617647 -697570
34578 -697570 403524 1019717 -98202 -2853956 -4638885 -3725245 -1357365 1024459 3847609
34569 3847609 6750591 6947989 3283796 -573434 -623021 1591823 1577510 -871798 -1500730
34560a500730L028235L524119J026940n72742m20329q79674k131013j549104J404931
34551A930633L765411L295021J034128j107509k636151l441888k661148J75194
34543C53691L863835O012848M548338n45169o222504q355565o009719k388461
34535h742706j47046K037283N768009Q259310N542292p55147m459316k901877
34527D600802K81702J112237j05411j394564k282940k309516K7311M186681O383848
34518A0500150M280836M89164j297091j297240j784080k505806j675122n6970
34510F653841j34313j779617k419480j405451p62267j337987j572285p65630l76023
34501c899212r95580j033394J61767O75659o35354j722115n37046J471792J683603
$$ plain form
34560 -1500730 1527505 5051624 6078564 5505822 5085493 4205819 2074806 525702 1930633
34551 1930633 5696044 8991065 10025193 8917684 6281533 2839645 178497 353691
34543 353691 4217526 10230374 14778712 14233543 8011039 -344526 -6354245 -8742706
34535 -8742706 -8889752 -6852469 -1084460 7174850 12717142 11961995 7502679 4600802
34527 4600802 4882504 5994741 5889330 4494766 2211826 -97690 -70379 4116302 10500150
34518 10500150 14780986 15270150 13973059 12675819 10891739 8385933 6710811 6653841
34510 6653841 6519528 4739911 2320431 914980 152713 -1185274 -2757559 -3523189 -3899212
34501 -3899212 -4894792 -5928186 -5766419 -5090760 -5726114 -7448229 -7985275 -6513483 -4829880
34492d829880M55324L8662N46984K77334m37429P75611L979855N841880M203500
34483A0851841J015677r83362k016560l370696l876521j538023K234968L446666
34475E763990Q97281k098905k274234l29362R16519K81711j374512k847954k998747
34466d064213q41233K857603N078656L672180L09570j645536j512100j161826
34458B693101r90708Q40093M438173O514020M577464O68484j377750j009270q81952
34449A5471655k443384m117680m024831k358723l61565J415912K764234K802830
34441I148448O60023k935656n584205n186261k070579R78585J295947p64778k033060
34432f491536k18902L139076M412185K243790j096370k717657j969792J73071
$$ plain form
34492 -4829880 -4374556 -4335894 -3788910 -3511576 -3949005 -3173394 806461 6648341 10851841
34483 10851841 11867518 10884156 8867596 5496900 1620379 82356 2317324 5763990
34475 5763990 6661271 4562366 2288132 1958770 2875289 3157000 1782488 -1065466 -4064213
34466 -4064213 -4905446 -2047843 3030813 6702993 7012563 5367027 3854927 2693101
34458 2693101 1702393 2542486 6980659 13494679 18072143 18740627 17362877 16353607 15471655
34449 15471655 13028271 8910591 4885760 2527037 2165472 3581384 6345618 9148448
34441 9148448 9808471 6872815 1288610 -3897651 -5968230 -4989645 -3693698 -4458476 -6491536
34432 -6491536 -6710438 -3571362 840823 3084613 1988243 -729414 -2699206 -2526135
34424b526135K896106N303319N577711K559598j803663l584087j390002J633964
34416H666811J660523r44860k463617j244973Q0337j179262l417868k869899Q41357
34407h71451M030060M007730K122777P05034l53085j837303k300144k17093K086553
34398G373078O23863l874045n764956k267719K220589K381587m28514q40939J987926
34389A410870L314521M02865l433609m083321k197526q87186o89440r8967O84432
34380e577361J59267j024473n20567J663114K820573J969645J441769K593148
34372C525115K940709N7315l959851n094384l156771j428411j047399L30620L445721
34363d387336M908789K211419j602895j713874J502195K983431K47671l452188
$$ plain form
34424 -2526135 369971 5673290 11251001 13810599 12006936 8422849 7032847 8666811
34416 8666811 10327334 9382474 6918857 5673884 5754221 4574959 1157091 -1712808 -871451
34407 -871451 3158609 7166339 9289116 9994150 9641065 7803762 5503618 5286525 7373078
34398 7373078 7996941 4122896 -1642060 -3909779 -1689190 692397 263883 -577056 1410870
34389 1410870 4725391 5128256 1694647 -2388674 -4586200 -5473386 -6162826 -6261793 -5577361
34380 -5577361 -5418094 -6442567 -6963134 -5300020 -2479447 -509802 931967 3525115
34372 3525115 6465824 6523139 2563288 -2531096 -5687867 -7116278 -8163677 -7833057 -4387336
34363 -4387336 521453 2732872 1129977 -583897 918298 3901729 4149400 697212
34355F97212m141820k133186j95195Q05029J894747L097918L259257K275488J209962
34346F769412L50371p76321j568996q09012Q08594J032766k97064m69200J763559
34337F804109L408218J141636l622737o386471n458249l186765j436098P73594
34329g962763L886666N162571K173671k609487l968949p25023K474702J323773
34321b44839k463078l833637j412428J205646J268730O76784K162588M345564
34313A705330L847503R90515n22183M01145O85459j203627k066471P78429M384799
34304I000899M141566O29665j753957j698252j814739k891867k322549N97901
34296C888667K334336L13038l050393m038348k517637o40641P20901J468752N56178
$$ plain form
34355 697212 -3444608 -5577794 -5772989 -4967960 -3073213 24705 3283962 5559450 6769412
34346 6769412 7119783 6343462 4774466 3965454 4774048 5806814 5509750 5040550 6804109
34337 6804109 10212327 11353963 7731226 1344755 -4113494 -7300259 -8736357 -7962763
34329 -7962763 -4076097 1086474 3260145 650658 -3318291 -4043314 -1568612 -244839
34321 -244839 -2707917 -6541554 -7953982 -6748336 -5479606 -4802822 -2640234 1705330
34313 1705330 5552833 6543348 6021165 6422310 7107769 5904142 3837671 4616100 9000899
34304 9000899 13142465 13772130 12018173 10319921 8505182 5613315 3290766 3888667
34296 3888667 6223003 6536041 3485648 -552700 -3070337 -3710978 -2990077 -1521325 -965147
34287i65147k043196l464441j392583K000836K964558J815043J814797L103482
34279C833349K259971j500440m120851k582642O29282J576610N83756O62731K033348
34270C375114J954854l07603j859275n65099J543312J150456j530426l098694
34262F62639j789282L07390O12548k72068n2432J249633J315109m34465j508345
34253I0727k19243J414351O37721j798890k820626j521563J38386Q05388J206333
34244b067416J817951J636361K92372p02819j94212P47695O89810K65971R66470
34235C452183K255375J840615j076145m328093n162411l195650l15396J770311
34227d759211K903556L434059K996353J260865p42093j452911r10022n63444o97929
$$ plain form
34287 -965147 -3008343 -6472784 -7865367 -5864531 -2899973 -1084930 729867 3833349
34279 3833349 6093320 4592880 472029 -2110613 -1481331 95279 679035 1341766 3375114
34270 3375114 5329968 5022365 3163090 2597991 4141303 5291759 3761333 662639
34262 662639 -1126643 -819253 -206705 -478773 -531205 718428 2033537 1599072 90727
34253 90727 -128516 1285835 1923556 124666 -2695960 -4217523 -4079137 -3273749 -2067416
34244 -2067416 -249465 1386896 1679268 976449 782237 1529932 2219742 2485713 3452183
34235 3452183 5707558 7548173 6472028 2143935 -3018476 -6214126 -6529522 -4759211
34227 -4759211 -1855655 1578404 4574757 5835622 5093529 3640618 2730596 2167152 1469223
34218A469223J17390K116174K899172P23416k384916l192279j847369j159888
34210a259077j832478j512952J032333L702581M120200K645444J080457J87156
34202H163664k28408k56274j50588n14016j280859j596921j337389j428469k067539
34193f96799k147722j145632K9908P48927J335045J264269q75395m138179m526161
34184a0151739j13675N011488N086598J03895m193457l681494l45432J335665
34176f948151J59737j149548M5345L092211M953608L760576R44586n62284J42333
34167D438413J259546J085472o0346j138610j858608j910236n65858J511782J826942
34158D588497o45580l210350k805965m13806N48158n34674q92365R17234K725732
$$ plain form
34218 1469223 1586613 3702787 6601959 7325375 4940459 1748180 -99189 -1259077
34210 -1259077 -3091555 -4604507 -3572174 130407 4250607 6896051 7976508 8163664
34202 8163664 7935256 7678982 7528394 7014378 5733519 4136598 2799209 1370740 -696799
34193 -696799 -2844521 -3990153 -3960245 -3211318 -1876273 -612004 -1487399 -5625578 -10151739
34184 -10151739 -10265414 -5253926 -167328 -63433 -4256890 -7938384 -8283816 -6948151
34176 -6948151 -6788414 -7937962 -7892617 -4800406 153202 3913778 4858364 4296080 4438413
34167 4438413 5697959 6783431 6723085 5584475 3725867 1815631 1249773 2761555 4588497
34158 4588497 3942917 732567 -2073398 -2487204 -1939046 -2473720 -3366085 -2448851 276881
34149B76881K186129J77291o92014M21795K003714K430304J749778J213489J388294
34140A1155661J096699j032227l901383m375382j402768J906792K184830M13599
34132F045821O8378J535850J668644q36571k904119j434615K119102L530923J070955
34123A0864368k592571l460183m37431L329050L456593p47758m958826m697334
34115G55908q80461J456177k75665l360083l908755j439814J664763L202414K415724
34106c69792j2284j892675r59850K319305M665875L876111J397998k04179q06541
34097H013968j994709l874914m610252k928464K27678K565216K466729O28866
34089D94118k09792J669845M079857L064440j441604m670762l386959n25423o13539
$$ plain form
34149 276881 2463010 2640301 1948287 2370082 4373796 6804100 8553878 9767367 11155661
34140 11155661 12252360 11220133 7318750 2943368 1540600 3447392 5632222 6045821
34132 6045821 6114199 7650049 9318693 8482122 5578003 4143388 6262490 9793413 10864368
34123 10864368 8271797 4811614 4374183 7703233 11159826 10412068 5453242 755908
34115 755908 -124553 1331624 1055959 -2304124 -6212879 -7652693 -5987930 -2785516 -369792
34106 -369792 -382076 -2274751 -3234601 -915296 3750579 7626690 9024688 8820509 8013968
34097 8013968 6019259 2144345 -2465907 -5394371 -5166693 -2601477 -134748 494118
34089 494118 284326 1954171 6034028 9098468 7656864 2986102 -400857 -926280 -1539819
34080a539819k694754j901518K590995N671767L503025j078267k715855o33138
34072A202436J313173N39239j275893j408287J3518P12063k22035j203585o55074
34063i84445P47537J277972P68231N30638Q68680N03539q55810j190624R71011
34054B636729L579509L139565m65319l360006k495966N69991J812702l41015l462212
34045A613978m150646j582746K068588M013314L208789P01819j689445k673270
34037A510381j861280K99145K588689L539193K587253P07167n54030p59122r19578
34028G137818j928768l020037k466635m588K243093K182653O03873Q7459J010205
34019E845073P91153j775455l769339k198285R08188J011108j898049k890670
$$ plain form
34080 -1539819 -4234573 -6136091 -3545096 2126671 5629696 4551429 1835574 1202436
34072 1202436 2515609 3054848 1778955 370668 384186 1096249 874214 -329371 -984445
34063 -984445 -236908 1041064 1809295 2339933 3208613 3712152 2856342 1665718 2636729
34054 2636729 6216238 9355803 8890484 5530478 3034512 3604503 5417205 5076190 1613978
34045 1613978 -2536668 -4119414 -2050826 1962488 5171277 5873096 4183651 1510381
34037 1510381 -350899 -51754 2536935 6076128 8663381 9370548 8816518 8057396 7137818
34028 7137818 5209050 2189013 -277622 -282210 1960883 4143536 4747409 4834868 5845073
34019 5845073 6636226 4860771 1091432 -1106853 -198665 812443 -1085606 -3976276
34011c976276M25607M108639L791958R56010l9244J173082J082852j597268l878733
34002B046627l059265l34016J293790P07815q90978j943011j815143p45437P02623
33993d036995K084044K984325K701873Q80986j321996j999649j099321p36308
33985e43041j787731j992015O15055L955493M258612J288145j561754k048625
33977B184139j197350n71552j36476N72074J357629K038326K428365J572406r20565
33968G326996k950360k073262L27443L70425k108321k585011R85452L984568J644670
33959D922600l180373l475873J800921N912819L443399k823416o168922m253772
33951c822617l80676K006696K781015K914295J895822o16446k330824n31080L294182
$$ plain form
34011 -3976276 -3550669 557970 4349928 5305938 5266694 6439776 7522628 5925360 2046627
34002 2046627 -1012638 -1346654 -52864 654951 -236027 -2179038 -3994181 -4739618 -4036995
33993 -4036995 -1952951 1031374 3733247 4614233 3292237 1292588 193267 -543041
33985 -543041 -2330772 -4322787 -3707732 247761 4506373 5794518 4232764 2184139
33977 2184139 986789 415237 278761 850835 2208464 4246790 6675155 8247561 7326996
33968 7326996 4376636 2303374 2630817 3001242 892921 -1692090 -706638 3277930 4922600
33959 4922600 1742227 -1733646 67275 5980094 9423493 6600077 431155 -3822617
33951 -3822617 -4203293 -2196597 584418 3498713 5394535 4778089 2447265 1916185 5210367
33942E210367M051432l95827n732874o384642k289257K055997L625565K745628
33934B886389K94885k899999m291676j691373K371705K842199k83090j458303
33926b229263J453546L214328j61094m019544j946092L674017M794178k66229
33918D513847m900108m388140j389415K60831J222503L153615M357313K849470
33910E679916N73887N45269J750471P44514k588648m418445k288489J642180L452263
33901E092918J811266j367179l482430l437244j671105R30213L492203M862859
33893F231501M080039J784560J56712K75341L72337j663563m639010n077293j991432
33884d70808J626421K950194K987785M505429P365760P836528K962342n164407
$$ plain form
33942 5210367 9261799 8865972 3133098 -3251544 -5540801 -3484804 140761 2886389
33934 2886389 3181274 281275 -4010401 -5701774 -3330069 -487870 -770960 -2229263
33926 -2229263 -775717 2438611 2277517 -1742027 -3688119 -14102 4780076 4513847
33918 4513847 -386261 -4774401 -6163816 -5902985 -4680482 -1526867 2830446 5679916
33910 5679916 6253803 6799072 8549543 9294057 6705409 2286964 -1525 1640655 5092918
33901 5092918 6904184 5537005 2054575 -1382669 -3053774 -2123561 1368642 6231501
33893 6231501 10311540 12096100 12252812 12528153 12900490 11236927 6597917 1520624 -470808
33884 -470808 1155613 4105807 7093592 11599021 18964781 26801309 29763651 24599244
33876B4599244j0466725q929793l194784M27034k95806j262726J053069L622731
33868E552244J422106m131184o324380k505805K649472M148982K320209j94164
33860B937480k537376m122263k974039J057263M332918L851373J220169n31972
33852C233553j326267k144193j760748P20196K545455R16251j876036j378018
33844a069807K263813M917061M831547L800424K586038L4034l075768l857849
33836A0429493j807039K82683M64782o37664k234393l821952l537155l04397K660775
33827A495133J408549j799801r56531L714026N076663M15888l724065j804438
33819C825424K312680K484120k4562m13458P04763m36123k603944j290340K876745
$$ plain form
33876 24599244 14132519 5202726 2007942 2434976 2139170 876444 1929513 5552244
33868 5552244 6974350 2843166 -3481214 -5987019 -3337547 811435 3131644 2937480
33860 2937480 400104 -3722159 -6696198 -5638935 -1306017 2545356 3765525 3233553
33852 3233553 1907286 -236907 -1997655 -1277459 1267996 2184247 308211 -1069807
33844 -1069807 1194006 6111067 10942614 14743038 17329076 17363110 14287342 10429493
33836 10429493 8622454 8905137 9369919 8732255 6497862 2675910 -861245 -1165642 1495133
33827 1495133 2903682 1103881 147350 3861376 8938039 9353927 5629862 3825424
33819 3825424 6138104 8622224 8597662 8184204 8888967 8452844 5848900 4558560 7435305
33810G435305M633726K551011L40564l39315j736210l848724l094801P83104K507485
33801I232145r05895n027445m358576J4260K867139K080950k46336j902578k287109
33792e33445j231636R10531K569768K519614J527241Q07536j20293k075949l605581
33783G67786k133848K114212N232066L665656j482507n064813l266402J863814
33775A695964M352662J299514l573331m862217k357081k34830m07481n23644R63672
33766c646772J733093l82959l241107k891934J296873O038459P586919M577142
33758A1069714j130921n262239m412595K12805L876283L949946K281583R94123
33750A1578699q18133l867260n290479k269776K754437M488320J773682j379879
$$ plain form
33810 7435305 12069031 14620042 14960606 14621291 12885081 9036357 5941556 6724660 9232145
33801 9232145 8326250 3298805 -1059771 -1045511 1821628 3902578 3656242 1753664 -533445
33792 -533445 -1765081 -854550 1715218 4234832 5762073 6569609 6449316 4373367 767786
33783 767786 -1366062 748150 5980216 9645872 8163365 3098552 -167850 1695964
33775 1695964 6048626 7348140 3774809 -1087408 -3444489 -3679319 -4086800 -4610444 -3646772
33766 -3646772 -1913679 -2296638 -5537745 -8429679 -7132806 -1094347 6492572 11069714
33758 11069714 9938793 4676554 263959 476764 4353047 8302993 10584576 11578699
33750 11578699 10760566 6893306 1602827 -666949 2087488 6575808 8349490 6969611
33742F969611j633397R8426J301669J169218K67204r84589k368177l505690l945022
33733b630747l063602n04037K327643K525659o10508l350015j730740K670891
33725d365456M296248R92730l317707m092625j349520J879691L658971L883052
33717A585384K836920J115644J4757L67617J447777J924739J308630p0197j563464
33708H967807k153463j059029Q84272J569379J68183j661685j898484m83224J227661
33699E561417K200206J964855K85273k097628l243834k043906r1633j23382k555914
33690a44546m670544l536997Q11194N203181O033883K481036k424149m313790
33682e60732j893344J331720P50234l702785o670759l139057N361541J1587110
$$ plain form
33742 6969611 5336214 5434640 6736309 7905527 8172731 7188142 4819965 1314275 -2630747
33733 -2630747 -5694349 -6198386 -3870743 -1345084 -1955592 -5305607 -7036347 -4365456
33725 -4365456 -69208 923522 -2394185 -6486810 -7836330 -5956639 -2297668 1585384
33717 1585384 4422304 5537948 5552705 5920322 7368099 9292838 10601468 10531271 8967807
33708 8967807 6814344 5755315 6639587 8208966 8377149 6715464 4816980 4333756 5561417
33699 5561417 7761623 9726478 10011751 7914123 4670289 2626383 2534750 2411368 -144546
33690 -144546 -4815090 -8352087 -7540893 -2337712 3696171 6177207 3753058 -560732
33682 -560732 -2454076 -1122356 -372122 -4074907 -10745666 -13884723 -8523182 3063928
33674C063928J0019769K535375m074273n313459k379003R74875K663541K691474
33666A0182227J459522n08057k054844k265722j535920p59027j42673J16121r00206
33657C591421l175483m321325k080330K055477M109112K693311N48089M72553
33649C892825J932199K691591J856220n9101k530124m899319n815305m298142
33641g229156j057431K044995L475124K730982N49570j159103p77620R69177J666009
33632A212547O10202l6751J252815K447417P74076k530739l184613O7837L018091
33623C630882J281775l604009n671075j829541M476584P671114O312315L308229
33615A5576274J075611q72596l310803n014060m696417l376566k753329k400745
$$ plain form
33674 3063928 13083697 15619072 11544799 6231340 3852337 4827212 7490753 10182227
33666 10182227 11641749 11133692 9078848 6813126 5277206 4518179 4375506 4491627 3591421
33657 3591421 415938 -3905387 -5985717 -3930240 178872 2872183 3420272 3892825
33649 3892825 5825024 8516615 10372835 10313734 7783610 2884291 -2931014 -7229156
33641 -7229156 -8286587 -6241592 -2766468 -35486 514084 -645019 -1422639 -453462 1212547
33632 1212547 1822749 1785998 3038813 5486230 6260306 3729567 544954 612791 3630882
33623 3630882 4912657 1308648 -4362427 -6191968 -1715384 5955730 12268045 15576274
33615 15576274 16651885 15779289 12468486 7454426 2758009 -618557 -3371886 -5772631
33607e772631p16644K129909M365145N142444M720335K753523r02788l968035
33599G751258l490936l48360J104301j058346l747262l694823j908899j013717
33591f406784p04113J064132L859088M932562L131190R3380k274744l333286k852879
33582b491454q41816J415747J986653O10022q80215r82364k89438k13294p86913
33573b473072n97165J207217L379354L485991N98736l208681m678672k683193
33565d969485Q62880L237386L206249J323627p35971j099360N19098J708977j59420
33556C893981l816241m627132n52382M438724M913962N65978l935573m821421
33548c940104k655639j34611J305643K021624K690722L276652L216935K291139
$$ plain form
33607 -5772631 -6489275 -4359366 5779 5148223 9868558 12622081 11719293 7751258
33599 7751258 4260322 3911962 5016263 3957917 210655 -3484168 -5393067 -6406784
33591 -6406784 -7110897 -6046765 -2187677 2744885 5876075 5969455 3694711 361425 -2491454
33582 -2491454 -3333270 -1917523 69130 679152 -201063 -1183427 -1472865 -1686159 -2473072
33573 -2473072 -3070237 -1863020 1516334 5002325 5601061 2392380 -2286292 -4969485
33565 -4969485 -4106605 -869219 2337030 3660657 2924686 1825326 2344424 4053401 3893981
33556 3893981 77740 -4549392 -5101774 -663050 4250912 4816890 881317 -3940104
33548 -3940104 -6595743 -6730354 -5424711 -3403087 -712365 2564287 5781222 8072361
33540H072361J089619L15126j05697n08182n26509Q1017J12735j551488l264194
33531C714788k175907J009879K038267p76130l769888l497802j723378j586841
33523f767012j866478M01282L600949L240534m22919j828772J689153N765056
33515C811793N199086P36919k932325l396400j993715o44933J22387M20366J83115
33506A506293o17762j606306j918219p29033J431936K367226O27134k026844k450552
33497c416127m65990Q76755k2137q90696O51654L106027L224021Q40184j067962
33488B835729q21296L3078j93627o13715K94971J551033Q36460j507835k277630
33479A37168j87652J579970j09681l062805k419189J962652M785388K803258r33446
$$ plain form
33540 8072361 9161980 9477106 9371409 8863227 8336718 8417735 8530470 6978982 3714788
33531 3714788 1538881 2548760 4587027 3810897 41009 -3456793 -5180171 -6767012
33523 -6767012 -8633490 -8232208 -4631259 -1390725 -1813644 -3642416 -1953263 3811793
33515 3811793 9010879 9747798 6815473 3419073 1425358 780425 902812 1323178 1506293
33506 1506293 888531 -717775 -2635994 -3365027 -1933091 434135 1061269 -965575 -3416127
33497 -3416127 -3882117 -3005362 -3027499 -3918195 -3266541 -160514 3063507 3903691 2835729
33488 2835729 2014433 2047511 1853884 1240169 1535140 3086173 3922633 2414798 137168
33479 137168 -50484 1529486 1419805 -1643000 -4062189 -2099537 2685851 5489109 4555663
33470D555663k259283j541675j135474n84054J434727K793569N33484l337364
33462D59593l769154l07352K179009J116634l73024O10648K103403J370301j78101
33453C211957K37870J738820J406442n71631j130134P11962K311080J172678k082759
33444G006285n030829n871735l984886K50636N063908P651024O234065J879161
33436A3197629k295172l866775k785019m47985J912420L217321K010634k002851
33428H940202n852360n201303L22111N633561N858150J947066j393473j847900
33420H406054r02328k46547n3469o58001k653585m627132l672176N23605M257510
33411C73931M022227P64073j489851n47648J580221J313931j943471m616479l218379
$$ plain form
33470 4555663 2296380 754705 -380769 -964823 469904 3263473 3796957 459593
33462 459593 -3309561 -3616913 -1437904 -321270 -694294 -83646 2019757 3390058 3211957
33453 3211957 3449827 5188647 6595089 6023458 4893324 5605286 7916366 9089044 7006285
33444 7006285 1975456 -3896279 -7881165 -7630529 -2566621 5084403 11318468 13197629
33436 13197629 10902457 7035682 4250663 3802678 5715098 8932419 10943053 8940202
33428 8940202 3087842 -2113461 -1791350 3842211 9700361 11647427 10253954 8406054
33420 8406054 7503726 7257179 7203710 6545709 3892124 -735008 -4407184 -3883579 373931
33411 373931 4396158 5160231 3670380 3122732 4702953 6016884 4073413 -543066 -3761445
33402c761445P91888K637475Q93166p14744M03425J459559n61357l067420j750898
33393c670351K211950M040193K754357J274232L37102j739704l760532k468202
33385a020955R93486J760529p28826j809335M9227Q60593p89994n83748L183802
33376A914779N263624K230000r47825R97137M586380L443815j222776l288787
33368A2976347j772509q35489j594562j206025M66217R747l162897n258453l959641
33359d337265j256863N34282J583885K373465K178423Q95413j60992r0816P49342
33350B468874J700038J967533O27322j683583k338923k01559J978262J241446
33342E759410j086756j589226l1935Q32265k76261k031440l033373k747924r38292
$$ plain form
33402 -3761445 -2969557 -332082 561084 -153660 249765 1709324 1147967 -1919453 -3670351
33393 -3670351 -1458401 2581792 5336149 6610381 6947483 5207779 1447247 -1020955
33385 -1020955 -27469 1733060 1004234 -805101 -755874 104719 -685275 -1269023 1914779
33376 1914779 7178403 9408403 8460578 9457715 14044095 17487910 16265134 12976347
33368 12976347 11203838 10368349 8773787 7567762 8033979 8043726 4880829 -377624 -4337265
33359 -4337265 -5594128 -5059846 -3475961 -1102496 1075927 1971340 1810348 1719532 2468874
33350 2468874 4168912 6136445 6763767 5080184 2741261 2539702 4517964 5759410
33342 5759410 4672654 3083428 3051493 3883758 3607497 1576057 -1457316 -4205240 -5143532
33333e143532J355147J750148m5951p71637J563851L922391K872784L00546R1227
33324E894974J550540J212095p32467j293297n34391q92651j734711n49484J133328
33315D053936n65350m204869l701853K118089O821693N296579J81420k900261
33307G099384k218238M8647J165071k76719k910155k803302J593226N571374L773657
33298A1042945j425591k995975L3202J989985Q01351P22470L222262L542988m13548
33289A6520089l632583k587582r59922k021932k514959J81855J681326j723396
33281D942896n073809k333519K963276L249682n15922j007621K707274L877213
33273H809470m12560m925131n087557k980772k052712j654005J13002K324979
$$ plain form
33333 -5143532 -3788385 -2038237 -2084188 -2855825 -1291974 2630417 5503201 5803747 5894974
33324 5894974 7445514 8657609 7925142 6631845 6097454 5204803 3470092 2920608 4053936
33315 4053936 3488586 -716283 -4418136 -2300047 4521646 9818225 9999645 7099384
33307 7099384 4881146 4929793 6094864 5818145 2907990 104688 1697914 7269288 11042945
33298 11042945 9617354 6621379 6654581 8644566 9445917 10168387 13390649 16933637 16520089
33289 16520089 12887506 10299924 9340002 7318070 4803111 4984966 6666292 4942896
33281 4942896 -130913 -2464432 498844 3748526 3232604 2224983 4932257 8809470
33273 8809470 8396910 3471779 -1615778 -4596550 -6649262 -8303267 -8190265 -5865286
33265e865286K968144J963419L56613j334393k485896k005694J52247K429617
33257c821229L234342K146156j02390j643365m08260L188739N477282L491298
33249A1562573j156645m337815m273433k270190N6663J823491K337531J969521
33241E711696K280710L015264J112866m164336p664112m477308K165607M589348
33233B569735J464189j088835M98318K556790J525894l0822J506625M278916L987804
33224A7268614N95742k281306k794600j802713J56478K909064M446624K596448
33216B1094351j068919k531180j026703k4544j490445k754800j316580L91652
33208A1272832j368116n119631n685392k053605P00224j196351m727400m657164
$$ plain form
33265 -5865286 -2897142 -933723 -577110 -1911503 -4397399 -6403093 -6250846 -3821229
33257 -3821229 -586887 1559269 1456879 -186486 -594746 2593993 8071275 11562573
33249 11562573 10405928 6068113 1794680 -475510 -418847 1404644 3742175 5711696
33241 5711696 7992406 11007670 12120536 7956200 292088 -4185220 -2019613 2569735
33233 2569735 4033924 2945089 3443407 6000197 7526091 7495269 9001894 13280810 17268614
33224 17268614 17864356 15583050 12788450 10985737 11142215 14051279 18497903 21094351
33216 21094351 20025432 17494252 16467549 16443005 14952560 12197760 10881180 11272832
33208 11272832 9904716 4785085 -900307 -2953912 -2253688 -3450039 -8177439 -12834603
33200a2834603p47758K908698L929030L437188K804181K153734J891508K501820
33192F043798K730623R06326j829903k544648r12358L90991j13054j217848j946902
33183A507025k586848k486388n09902J756304J239947j309762j512223J887740
33175b014107M902887M561652K598224Q89976j653356m790493m818919p08757
33167a032893K366031K29765l658572l597993O6919L102414M266771M543577K777424
33158I063443j781123n054881k628831K921527N121729K643016m79118k152787
33150G652975l541194m129322k004035J171079J618153q5993Q5003K240228K295926
33141E302820n12934k106365n43129J422130J982441K673355L705291K652979
$$ plain form
33200 -12834603 -13582361 -10673663 -6744633 -3307445 -503264 1650470 3541978 6043798
33192 6043798 8774421 9680747 7850844 5306196 4393838 4784829 4671775 3453927 1507025
33183 1507025 -1079823 -3566211 -4076113 -2319809 -1079862 -2389624 -3901847 -2014107
33175 -2014107 2888780 7450432 10048656 10938632 9285276 4494783 -324136 -1032893
33167 -1032893 1333138 1562903 -2095669 -5693662 -5626743 -2524329 1742442 6286019 9063443
33158 9063443 7282320 2227439 -401392 2520135 7641864 10284880 9805762 7652975
33150 7652975 4111781 -17541 -2021576 -850497 767656 681663 766666 3006894 5302820
33141 5302820 4789886 2683521 2140392 3562522 5544963 8218318 11923609 14576588
33133A4576588m09389j897582o80738J79494o78402p85738N50095L31582k057793
33124I128117k711809m1545J918527L32837j861577j832434j705190l285277l409651
33115c468002L21741M060505L609775J537243K311273M078716K113380k208779
33107A2355852l163666k20613J217742j197875l386210j776584J566556K747928
33099H143130J185414r67327j886153j127299M55566J030927m08440k368533k476975
33090A580310m84579J921826L547703M060251K966665N45065j213904j173776
33082A1749561j405958l861926n910899l423148K040488M085014O12472k905875
33074I79729j849123N26677j157563n019105m285849J816913N859474K751122
$$ plain form
33133 14576588 14167199 12269617 11588879 11768373 11089971 10304233 10854328 11185910 9128117
33124 9128117 6416308 6374763 8293290 8626127 6764550 4932116 3226926 -58351 -3468002
33115 -3468002 -3146261 914244 4524019 6061262 8372535 12451251 14564631 12355852
33107 12355852 9192186 8971573 10189315 8991440 5605230 3828646 5395202 8143130
33099 8143130 9328544 8361217 6475064 5347765 5803331 6834258 6425818 4057285 1580310
33090 1580310 1095731 3017557 6565260 10625511 13592176 14137241 12923337 11749561
33082 11749561 10343603 6481677 570778 -2852370 -811882 3273132 3885604 979729
33074 979729 -869394 -342717 -1500280 -6519385 -10805234 -8988321 -3128847 -377725
33066c77725k737778k915980J778972L857701k24904n557836o316479l133021
33058a5627050k93143Q79908K143055L900754M618858M022278L470259L168758
33050F283677J947910M7664n90974O43686K072301K381888K026954J300194p05195
33041A5408105l942095n989006m460010j63696L322157L214263K81997k074565
33033E597150j678301j28846m37287k452442k931295p27212J052816j09769j988387
33024c803573j106778J846635L373988K377562P47499k02024r22765j978717l365394
33015c033567m384677k908519K630690Q915103R408964L125969k870015l426170
33007G457778k333965m252899n721706j810120L587813L458455l24083q93326
$$ plain form
33066 -377725 -3115503 -6031483 -4252511 -394810 -619714 -6177550 -12494029 -15627050
33058 -15627050 -15920193 -15040285 -12897230 -8996476 -4377618 -355340 3114919 6283677
33050 6283677 8231587 8279251 7688277 8331963 10404264 12786152 14813106 16113300 15408105
33041 15408105 11466010 5477004 1016994 853298 4175455 7389718 7671715 5597150
33033 5597150 3918849 3790003 3352716 900274 -2031021 -2758233 -1705417 -1815186 -3803573
33024 -3803573 -4910351 -3063716 310272 2687834 3435333 3233309 2310544 331827 -3033567
33015 -3033567 -7418244 -10326763 -7696073 1219030 10627994 13753963 10883948 7457778
33007 7457778 5123813 870914 -4850792 -6660912 -3073099 385356 61273 -832053
32999h32053Q68300j170572n158692l098775M091520O144665l9980n582671m273089
32990i051347n12108R19991J840410L306186K035588j430371j287989K772225
32982a407415L901642P57491J35637L149477K043799m172446n411742J350631
32974C47074M737488j464308o713212k427148K907470J35465l691892L74220N505243
32965b89600J991059m358177l682920n60366l443585o782278k277526K986383
32957a6417010o83035n865077k113121K233280m146720j0786977l832611M088249
32949c7523022m969453j6689700r324262n223784m2965647r5775684q1560745
32942b94032297K0266033J19059825J22118964N0330713m519260m653010R898140
$$ plain form
32999 -832053 36247 -1134325 -6293017 -9391792 -5300272 844393 804413 -4778258 -9051347
32990 -9051347 -9563455 -8643464 -6803054 -3496868 -1461280 -2891651 -4179640 -1407415
32982 -1407415 2494227 3251718 3387355 6536832 8580631 4408185 -1003557 347074
32974 347074 5084562 3620254 -3092958 -5520106 -2612636 -2477171 -6169063 -5794843 -289600
32965 -289600 1701459 -2656718 -6339638 -6900004 -10343589 -17125867 -19403393 -16417010
32957 -16417010 -17100045 -22965122 -25078243 -22844963 -26991683 -37778660 -41611271 -37523022
32949 -37523022 -42492475 -59182175 -68506437 -73730221 -116695868 -212471552 -294032297
32942 -294032297 -273766264 -154706439 -32587475 17743238 13223978 8570968 18469108
32935A8469108M707655n358315j084246N594086K09540o922705k848208M340136
32927A7107051K596523k824968j791525K365413J710151j347904j094020m45211
32919A6275510l998083p366046m288714J991730L948600J322613o91891o16872
32911F576847p61868j224454j09436K064880K789274J242647j201207k871530
32903F505153k809353j361726m8174O31118J911051L282452J477986l471879n469450
32894F47178j223345K790053j18135m880991k191364N481683P275783J775446
32886I556308j525801Q56574J512220l028451n753394k291809J460288O33584
32878A419519q91912k50639j822688o547450o568648M50898L085476o186631j5161387
$$ plain form
32935 18469108 23176763 17818448 16734202 22328288 22537828 15615123 12766915 17107051
32927 17107051 19703574 16878606 15087081 17452494 19162645 17814741 16720721 16275510
32919 16275510 12277427 4911381 622667 2614397 6562997 7885610 7193719 6576847
32911 6576847 5814979 4590525 4481089 6545969 9335243 10577890 9376683 6505153
32903 6505153 3695800 2334074 2285900 2917018 4828069 8110521 9588507 6116628 647178
32894 647178 -576167 2213886 2095751 -2785240 -4976604 505079 7780862 9556308
32886 9556308 8030507 8887081 10399301 7370850 1617456 -674353 785935 1419519
32878 1419519 527607 276968 -1545720 -8093170 -14661818 -14210920 -11125444 -17312075 -32473462
32869c2473462q058955R635384J8187283J1720864L375135K934226M996737K623299
32861A2940511j071028j173894k32870j919407l093864L25586M883650M246579
32853A4905263q22882l654248j376023J950668J630571k300613o304836p103608
32845c075708l889701J245324M873044N374613M097031K465416n11174n610593
32837D968252r488881p077792J284653Q382267Q064155K536478j078209K2700
32829G613623K170992J950577P39334R75645J605813J73075k882492m981702m960212
32820B404653l426815j212583K29761r35142l538740l008539J915150N147635
32812b424620J285697m949012m345491K897226P096485L675092q09945j98501
$$ plain form
32869 -32473462 -40532417 -30897033 -12709750 -988886 2386249 5320475 10317212 12940511
32861 12940511 11869483 10695589 10462719 8543312 5449448 5775034 10658684 14905263
32853 14905263 14082381 10428133 9052110 11002778 12633349 10332736 4027900 -3075708
32845 -3075708 -6965409 -5720085 -847041 4527572 8624603 11090019 10578845 4968252
32837 4968252 -4520629 -11598421 -10313768 -1931501 6132654 8669132 7590923 7613623
32829 7613623 9784615 11735192 12474526 13450171 15055984 15229059 12346567 7364865 2404653
32820 2404653 -1022162 -2234745 -2004984 -2940126 -6478866 -9487405 -7572255 -2424620
32812 -2424620 -1138923 -6087935 -10433426 -7536200 -439715 3235377 2425432 2226931
32804B226931J966398j37166m603877n729412l190468p00362J045422L561847
32796e560687N192098L000032j260191k852223j044519N32258l27244k795471
32788e115947n858041p919751n301882K864331R408864N946152m619913r778012
32780b0374199l790842M440482L710396m899723j0882111q309855j886691l24577
32772d2317120p196392j7455495k0738376r738379J1949141L1109186L6098562
32765a8288873K6554849J1776368J625561j37863L321212N226735J343377n116029
32757B6305337o755592j714771L130001J346590m207327n821896j419379M266645
32749A5129608P020133O393180K941608k154980n258476l776774j341679l413515
$$ plain form
32804 2226931 4193329 4056163 -547714 -6277126 -9467594 -10167956 -9122534 -5560687
32796 -5560687 -368589 2631443 1371252 -1480971 -2525490 -1993232 -2320476 -5115947
32788 -5115947 -10973988 -18893739 -24195621 -21331290 -11922426 -5976274 -10596187 -20374199
32780 -20374199 -24165041 -19724559 -16014163 -20913886 -31795997 -40105852 -41992543 -42317120
32772 -42317120 -49513512 -66969007 -87707383 -97445762 -85496621 -54387435 -18288873
32765 -18288873 8265976 20042344 21667905 21530042 24851254 30077989 31421366 26305337
32757 26305337 19549745 17834974 20964975 22311565 18104238 12282342 10862963 15129608
32749 15129608 22149741 28542921 31484529 29329549 24071073 20294299 18952620 15539105
32741A5539105p685749o224647J471331N953716K025810k896052p15718M482267
32733A1950063L888583j318817k861292N2049r488m860550o704203q07099O602345
32724E931591P503118K494046k582635n056851n620628m251735r02306K277064
32716b08336L304775L025313K738523J697163n31416k083087j848529j623084
32708D471322k579264k749370r17273L55386r71421k348319p96830J814353K006722
32699a714694P20863J417334L898446M660265K403713q46540l239329m114432
32691C185626k646343Q55713L223353J514757k815710n579798m523278q8575O053141
32682h21114J0305038Q185386K74611n836556m419176M72777J555603l63843R04092
$$ plain form
32741 15539105 7853356 1628709 3100040 9053756 11079566 8183514 7467796 11950063
32733 11950063 15838646 14519829 11658537 11710586 11701098 6840548 136345 -670754 5931591
32724 5931591 13434709 15928755 13346120 8289269 2668641 -1583094 -2485400 -208336
32716 -208336 3096439 6121752 8860275 10557438 10026022 7942935 6094406 4471322
32708 4471322 1892058 -857312 -1774585 -1419199 -2390620 -4738939 -5535769 -3721416 -1714694
32699 -1714694 -993831 423503 4321949 8982214 11385927 10539387 7300058 3185626
32691 3185626 539283 1394996 4618349 6133106 3317396 -2262402 -6785680 -6874255 -821114
32682 -821114 9483924 17669310 17943921 12107365 7688189 8160966 9716569 9352726 10256818
32673A0256818M947918M772434m18774j837069N565648J3831726J1941976N68768
32665D9629445r102505r394761l842661q09740l228269o581937n713305j223179
32657I733088K146150K036951N30305j43345k84235j61348J206539K956526K326626
32648B0347257j76300m86573J535872M89716m712634o458335p6410O998809N757998
32639B3219400p06067l310605j436125q07185j449755N33709K446900j200311
32631A7289961o353263l906379M226667O903486J978411r89464K073815L832491
32623B5055725K18590k421264J47400K489452J99015k440941j131372J367696
32615B3484301J678451J074344R65217R40368K438619N900782N825345o74869
$$ plain form
32673 10256818 15204736 19977170 19558396 17721327 23286975 37118701 49060677 49629445
32665 49629445 40526940 31132179 27289518 26479778 23251509 16669572 10956267 9733088
32657 9733088 11879238 13916189 14446494 14303149 14018914 13857566 15064105 18020631 20347257
32648 20347257 20170957 19684384 21220256 21709972 16997338 10539003 10462593 17461402 23219400
32639 23219400 22513333 19202728 17766603 16959418 15509663 16043372 18490272 17289961
32631 17289961 10936698 7030319 11256986 18160472 20138883 19149419 21223234 25055725
32623 25055725 25274315 22853051 23000451 25489903 25688918 23247977 22116605 23484301
32615 23484301 25162752 26237096 27202313 28142681 30581300 36482082 42307427 41632558
32607D1632558m453110K116281Q150117Q09855p745811K531671K0272235J7069554
32599H0383350J569956J1340196L7417765J3925773p9751047j57403314j25559570
32592b18076891j3347312O3251043N2342681J2279610O001183K0881657J8147050
32585e8520979K255373P9855R334735R489055J575427J464241P945071P454627
32577a8922595M67932j894961N78588L65521p94469K777197N913654J184829m850819
32568a5175123j387290P062924P782972J016093k386933K3847J343742j14070
32560a833838O1587J444510K03159j406777P73536K746663j267474o460031m300649
32551a0039314K043215K605278k234367l384618M48486K023144J65885R68174
$$ plain form
32607 41632558 37179448 39295729 47445846 48255701 40509890 43041561 63313796 80383350
32599 80383350 81953306 93293502 130711267 144637040 64885993 -92517321 -218076891
32592 -218076891 -231424203 -168173160 -115830479 -103550869 -97549686 -76668029 -58520979
32585 -58520979 -56265606 -56185751 -46851016 -37361961 -35786534 -34322293 -26377222 -18922595
32577 -18922595 -18454663 -20349624 -19771036 -19405515 -20199984 -17422787 -11509133 -10324304 -15175123
32568 -15175123 -16562413 -9499489 -1716517 -700424 -3087357 -3063510 -1719768 -1833838
32560 -1833838 -1772251 -327741 -124582 -1531359 -757823 1988840 721366 -5738665 -10039314
32551 -10039314 -7996099 -5390821 -7625188 -11009806 -10561320 -8538176 -8372291 -7404117
32543g404117M289183K926266l221281n172525K97016N508517M683524J402027
32535C308610K6332p36689k261915k441750r16606n94408j689976j155770O77397
32526e784775K02084j941595j392587J117236J84148l728812l508021K365032
32518a2487290O030592K478661k837050l144214K14758K362476K662928K974297
32510a744842L088711K290960J515874Q15282j335703l957468l426578M09496
32502b344268K951427J945553O68407J585959K298404P79179p10963m25674q24406
32493E923618l585631n462529l350709K41370R58455j169576l028813l315395
32485a2789210k631671r80053J557516L374164L233165K116904J313786M82312
$$ plain form
32543 -7404117 -3114934 -188668 -3409949 -8582474 -8285458 -2776941 1906583 3308610
32535 3308610 3334942 2598253 336338 -2105412 -3022018 -3616426 -5306402 -6462172 -5784775
32526 -5784775 -5582691 -7524286 -8916873 -7799637 -7615489 -11344301 -14852322 -12487290
32518 -12487290 -6456698 -3978037 -6815087 -9959301 -9744543 -7382067 -4719139 -1744842
32510 -1744842 1343869 3634829 5150703 5965985 4630282 672814 -2753764 -2344268
32502 -2344268 607159 2552712 3221119 4807078 7105482 7884661 7173698 6748024 5923618
32493 5923618 2337987 -3124542 -6475251 -6233881 -5275426 -6445002 -9473815 -12789210
32485 -12789210 -15420881 -16400934 -14843418 -11469254 -8236089 -6119185 -4805399 -4323087
32477d323087p77751j477420r55900j53664J10800L35492J047741K288702M543024
32468F37937P585680Q480975M245493k981734p142925n640074k025186l40291
32460B819875m70449n06147j35872J41856K86969k81374k306860m335716l594259
32451h381977j23864K815542L170566K052010R23780j8230m52249j89482o74510
32442h78414k645643l031878J185647O632577O719393J271313l119989l034658
32434C098348j921199k466800k342605k14764P64900r49587j787794M97841K566666
32425b754994J708980P70038K394284L677763J551828j315148j260054N1485n90401
32416D233781j805322q34037O66762k40111j905112j119310O27530k39079k588867
$$ plain form
32477 -4323087 -5100838 -6578258 -7534158 -7687822 -7577022 -7241530 -6193789 -3905087 637937
32468 637937 8223617 16704592 20950085 17968351 10825426 5185352 3160166 2819875
32460 2819875 2349426 1843279 1707407 1849263 2136232 1854858 -452002 -4787718 -8381977
32451 -8381977 -8505841 -5690299 -2519733 -467723 456057 437827 -14422 -203904 -878414
32442 -878414 -3524057 -6555935 -5370288 1262289 7981682 9252995 6133006 3098348
32434 3098348 1177149 -1289651 -3632256 -3847020 -3082120 -4031707 -5819501 -5321660 -2754994
32425 -2754994 -1046014 -275976 2118308 5796071 7347899 6032751 4772697 4824182 4233781
32416 4233781 2428459 1594422 2261184 2021073 115961 -1003349 -375819 -614898 -3203765
32407c203765k235617J007624L364273L266950K513210J877554J61772k529074
32399D222927m260810l858400j482601K180605N012054M005588m53444l505681
32391A860238k156913L91330L06679p13275N01972K143202Q96294j258975m03475
32382A567077J533695k96988m314097l966283J411504N005831L148946J94000
32374D283685K84236J014057q98097l186006k155458M52312j75753m290555o692117
32365a1363696l614070K385116N467138L251418p24427j560752J066234L274001
32357a819038K833544J546891R38391m97265l242083l884220l57462L166449J679441
32348C64648k696613l789451r24467P97840o00623j242812J298919L772838K650251
$$ plain form
32407 -3203765 -5439382 -4431758 -1067485 2199465 4712675 6590229 6752001 4222927
32399 4222927 -37883 -3896283 -5378884 -3198279 1813775 5819363 5365919 1860238
32391 1860238 -296675 94655 401334 -311941 190031 2333233 3229527 1970552 1567077
32382 1567077 3100772 2803784 -1510313 -5476596 -4065092 940739 4089685 4283685
32374 4283685 4567921 5581978 4683881 1497875 -657583 -205271 -381024 -4671579 -11363696
32365 -11363696 -14977766 -12592650 -7125512 -3874094 -4598521 -6159273 -5093039 -1819038
32357 -1819038 1014506 2561397 3499788 3002523 -239560 -4123780 -4481242 -1314793 364648
32348 364648 -2331965 -6121416 -7045883 -6248043 -6848666 -8091478 -6792559 -3019721 -369470
32339c69470o53084k437851j418847J129529L285122L256029P09508j922816j907963
32330c29843j15405L58787q32682j258314m41214l81361j099508l15871J576331
32321b839080J109051k091404l542047o65623L051850L504985J707244R15359
32313A150335J350697J260528O73755O59775O60272m01460j694262j665548m88982
32304A505110O61580J538532K337691K627014K199188J570734N51693j789231
32296A1202311m620159n184560k748788l04223k63513o96692J525922N430138
32288D340436O661340L073604k537301n433924l654243K44093J958362L14526
32280D966893j346048R9321K745519K316690j230522l516357k180720N65570K413602
$$ plain form
32339 -369470 -1022554 -3460405 -4879252 -3749723 -464601 2791428 3500936 1578120 -329843
32330 -329843 -445248 -86461 -919143 -2177457 -2618671 -3000032 -4099540 -4415411 -2839080
32321 -2839080 -1730029 -3821433 -7363480 -8029103 -4977253 -1472268 234976 1150335
32313 1150335 2501032 3761560 4435315 5095090 5755362 5353902 3659640 1994092 1505110
32304 1505110 2166690 3705222 6042913 8669927 10869115 12439849 12991542 11202311
32296 11202311 6582152 1397592 -1351196 -1655419 -1918932 -2615624 -1089702 4340436
32288 4340436 11001776 14075380 11538079 6104155 2449912 2694005 4652367 4966893
32280 4966893 3620845 3720166 6465685 8782375 7551853 4035496 1854776 2420346 4833948
32271D833948L506451L368257L50735l612601l017631K760360N924063K37791
32263A4351373r204316j2077332o294502P38071L089618K167369J276880L73168
32255e579671j447226k464577m48177L679480O442620N346228J079965l045538
32247C563104l895816j702476N5383r39671k733869k210537J13506J218766O23671
32238e907939Q18941K573081L346850J521166p99041r99105K40178L92438j093072
32229I3497k435219k262752r83384L42370J090356R60158n9824j150728r07617
32220e313143J010602K723050J694615k041872n109579m277275k52438L267513
32212h298527M078796L413698L217397L315025K339849K57397j381686j374319
$$ plain form
32271 4833948 8340399 11708656 12059391 8446790 5429159 8189519 14113582 14351373
32263 14351373 5147057 -6930275 -13224777 -12486706 -9397088 -7229719 -5952839 -5579671
32255 -5579671 -7026897 -9491474 -9939651 -6260171 182449 5528677 6608642 3563104
32247 3563104 -332712 -2035188 -1979805 -2919476 -5653345 -7863882 -7750376 -6531610 -5907939
32238 -5907939 -5088998 -2515917 830933 2352099 1553058 553953 794131 1186569 93497
32229 93497 -2341722 -4604474 -5587858 -5245488 -4155132 -3194974 -3254798 -4405526 -5313143
32220 -5313143 -4302541 -1579491 115124 -1926748 -7036327 -11313602 -11566040 -8298527
32212 -8298527 -4219731 -806033 2411364 5726389 8066238 8323635 6941949 5567630
32204E567630k58084K60738p45412j987981j233783J411175K876439J252077j105105
32195F037694j090404J01241q88451l416174l503768o76382J104199L46399K45081
32186a740565J964145J750504j726232l143963J157130N820379L967844j948326
32178F100916m178490j747116l41098j491808o21360L398029N119913J570560
32170G809546k649874k836502q69992m47717n90598J497988M665258N431456L147702
32161A5157267q8212k797329m386531l944588j658501J70484j1728p79437m44836
32152A216589J00787m15279r00567o9155Q33988M90460N26336K506409L752999
32143H042567M79838n636103q334216m641455J619734M932776L815053O42383
$$ plain form
32204 5567630 5309546 5570284 4824872 2836891 1603108 3014283 5890722 7142799 6037694
32195 6037694 4947290 5048531 4160080 743906 -2759862 -3436244 -2332045 -1985646 -1740565
32186 -1740565 223580 1974084 247852 -2896111 -1738981 4081398 8049242 6100916
32178 6100916 1922426 175310 -165788 -1657596 -2278956 1119073 6238986 7809546
32170 7809546 5159672 2323170 1453178 1005461 414863 1912851 6578109 12009565 15157267
32161 15157267 15069055 12271726 7885195 3940607 2282106 2452590 2440862 1661425 1216589
32152 1216589 1317376 902097 1530 -67625 766363 1256823 1783159 4289568 8042567
32143 8042567 8522405 2886302 -5447914 -10089369 -8469635 -3536859 278194 920577
32135I20577j663284j583695N77268L146656M735607N341778M916893K128459
32127A8520259l192034p502287o841301k530650N1299j010698j736179J127969
32119c113622M907691N226081K381361l1797p75142j321586j745380m63397J924250
32110F988459K490661O12748o87039M76152J799814O62419j539013j708205N7983
32101I153979J007280K41783m91413l85671q57401k576079l888414l399339j974858
32092c170133q24011M94623K529287M058342L711149K292755J498874J190852
32084A1781738L6341j722043k364056j433873l03342J30387L24946M09168k86468
32075F572798j398269j343427n6372R4750k186040m333999k975191J002093L024628
$$ plain form
32135 920577 -742707 -2326402 -1749134 1397522 6133129 11474907 16391800 18520259
32127 18520259 15328225 7825938 984637 -1546013 -1494714 -2505412 -4241591 -3113622
32119 -3113622 1794069 7020150 9401511 9369714 8594572 7272986 5527606 5064209 6988459
32110 6988459 9479120 10091868 9404829 9880981 11680795 12343214 10804201 9095996 9153979
32101 9153979 10161259 10403042 9911629 9525958 8668557 6092478 2204064 -1195275 -3170133
32092 -3170133 -3994144 -3499521 -970234 3088108 6799257 9092012 10590886 11781738
32084 11781738 11818079 10096036 7731980 6298107 5994765 6125152 6450098 6859266 6572798
32075 6572798 5174529 3831102 3774730 3869480 1683440 -2650559 -5625750 -4623657 -1599029
32066a599029Q33221k374687k157128J302512L608036K144091o21805r62065P67297
32057I40443J032738j143937k422527k45766L010250L356728P88829j431900j935675
32048A949183k165315k458687j130139J708418L124666J788001O6021k62165q53152
32039A766831k575619k143538K668851P285079N430394j286905m945925k591359
32031C607809L16751o84278k505671q44389K388748K978924J670537J694199J868065
32022A0490695j237792n564547n056661N69194M294536K061699j625198j592296
32014B339630J98840n66966k591581j780815Q41307N78128k575636l348341L86355
32005f519079M106091L295339p45347l787825l864655j579821J646172L585088
$$ plain form
32066 -1599029 -765808 -3140495 -5297623 -3995111 -387075 1757016 1135211 173146 940443
32057 940443 1973181 829244 -1593283 -1839049 1171201 4527929 5316758 3884858 1949183
32048 1949183 -216132 -2674819 -3804958 -2096540 1028126 2816127 2882148 2619983 1766831
32039 1766831 -808788 -2952326 -283475 7001604 12431998 11145093 6199168 3607809
32031 3607809 3924560 3240282 734611 -109778 2278970 5257894 6928431 8622630 10490695
32022 10490695 9252903 3688356 -1368305 -799111 3495425 5557124 3931926 2339630
32014 2339630 2538470 1971504 -620077 -2400892 -1559585 -981457 -3557093 -6905434 -6519079
32005 -6519079 -2412988 882351 137004 -3650821 -7515476 -9095297 -7449125 -3864037
31997c864037K243082j042608k124038L45785K521056Q76991k611482l649039
31989g304290j594278R53923K562393L475985L265836J642026N83007J987441
31981E572043L926835K986070j50874j524927l31825j46035k778407n170413m331616
31972a949149j760004m67160m95637j60869M48884J26661p05226n68855N45545
31963d985810J373723J447457J205392P62472J95267K25650R62356Q73782j083941
31954I76348l088262k371977Q16294L324993L200015J631782M59629l00541j498948
31945C149333k800527k816770q95559J851675L310824K320152J08673q47615n605
31936C374581K53401j894400m409153l863488o27572J435679P68895K00073J784342
$$ plain form
31997 -3864037 -1620955 -2663563 -4787601 -4441816 -1920760 -1043769 -3655251 -7304290
31989 -7304290 -8898568 -7944645 -5382252 -1906267 1359569 3001595 3584602 5572043
31981 5572043 9498878 12484948 12334074 10809147 10477322 10331287 7552880 2382467 -1949149
31972 -1949149 -3709153 -4176313 -4671950 -4832819 -4383935 -4257274 -4962500 -5531355 -4985810
31963 -4985810 -3612087 -2164630 -959238 -196766 -1499 224151 1186507 2060289 976348
31954 976348 -2111914 -4483891 -3667597 -342604 2857411 4489193 4948822 4648281 3149333
31945 3149333 348806 -2467964 -3363523 -1511848 1798976 4119128 4227801 3380186 3374581
31936 3374581 3627982 1733582 -2675571 -6539059 -7166631 -5730952 -4962057 -4761984 -2977642
31927b977642L054643J275537j453075j403575L18340n34066l708701m058463
31919i487002j1170L085690J121875k093860q95447L103589L698981M969k535200
31910d007575q39141K070310L045746K982069K961713J356168k150891l944443
31902A473956j584886J819316K127887K10205m34496M53125O87509K64954O27426
31893E644996P56361j243939l505306k244638J779111L361628J30242m343713
31885C34742n664986l354834K99600K837416K488172k59586j605801J509218O172751
31876B756692O516110K282075o26405P71890K493830Q82778j704638k033896j655446
31867I682990k875486l479027q45351K135216J186521j708806j013024L241382
$$ plain form
31927 -2977642 77001 1352538 -100537 -1504112 -1185772 -1719838 -5428539 -9487002
31919 -9487002 -9498172 -6412482 -5290607 -7384467 -8279914 -5176325 -1477344 -1472375 -4007575
31910 -4007575 -4846716 -2776406 269340 3251409 6213122 7569290 5418399 1473956
31902 1473956 -110930 1708386 3836273 4046478 3611982 4065107 4752616 5017570 5644996
31893 5644996 6401357 5157418 1652112 -592526 1186585 4548213 4678455 334742
31885 334742 -5330244 -8685078 -8385478 -5548062 -3059890 -3319476 -4925277 -3416059 2756692
31876 2756692 9272802 11554877 10928472 11700362 14194192 15076970 13372332 11338436 9682990
31867 9682990 6807504 3328477 2483126 4618342 5804863 4096057 3083033 6324415
31859F324415N231230K248746j850769k977693j616209K3261J232799J448835
31851A0064615m74275l557969m462960k118473Q9945j037504l926099m567175
31843i989895j739384K323086N180521N881717M217613O02269l091718m222626
31835h38417j803615K173283M420713L540198J256859N5502l637q36772k710862
31826E253252l247385j269687O01149m19224k767405k790032m40294R92924N57274
31817c529428Q21784K546657K561100o64864l093426m91206M620395N736210J378458
31808I885680k926819k493685M07465N46885k618759m621582k753528J97545L33027
31799d043771j655582j815279R89632L453697K866862R33002P97162K354681K942996
$$ plain form
31859 6324415 11555645 13804391 11953622 8975929 7359720 7382981 8615780 10064615
31851 10064615 9590340 6032371 1569411 -549062 -459117 -1496621 -5422720 -9989895
31843 -9989895 -11729279 -9406193 -4225672 1656045 5873658 6475927 3384209 -838417
31835 -838417 -2642032 -468749 3951964 7492162 8749021 8804523 8800886 7964114 5253252
31826 5253252 2005867 736180 1337329 918105 -1849300 -4639332 -5079626 -4086702 -3529428
31817 -3529428 -2707644 -160987 2400113 1735249 -1358177 -1849383 2771012 8507222 9885680
31808 9885680 6958861 4465176 4872641 5419526 2800767 -1820815 -4574343 -4376798 -4043771
31799 -4043771 -5699353 -7514632 -6525000 -3071303 -204441 728561 1525723 3880404 6823400
31790F823400J511700m16028j402592j367496m20356J337120K810349K775835
31782A1651932J800667J273997O43713j846100n396671o548785l920845l93538
31774b735630J002860R50286J537679K250215J085005j475710k579158j088069
31766a052522Q08358O87583r86258j687610m6742K391957K662994k01843l382318
31757h06401k898973J502863N360208M545462K59549k703445k035848j25522n4862
31748C043031j635957k626537k263066j673676j374744l95508J641162L160596
31740b124699K544795N58262n18780Q6235R06908O78206m2052m39666j130777
31731E18432k750256l801030k008377K096944M862823L668698J29253j994079
$$ plain form
31790 6823400 8335100 7919072 6516480 5148984 4728628 6065748 8876097 11651932
31782 11651932 13452599 14726596 15370309 13524209 8127538 1578753 -2342092 -2735630
31774 -2735630 -1732770 -782484 755195 3005410 4090415 2614705 35547 -1052522
31766 -1052522 -244164 443419 -542839 -2230449 -2277191 114766 2777760 2575917 -806401
31757 -806401 -3705374 -2202511 3157697 7703159 7962708 5259263 3223415 3097893 3043031
31748 3043031 1407074 -1219463 -3482529 -5156205 -6530949 -6926457 -5285295 -2124699
31740 -2124699 420096 978358 459578 545813 1452721 2130927 2088875 1649209 518432
31731 518432 -2231824 -6032854 -8041231 -5944287 -1081464 2587234 2716487 722408
31723G22408j305144J72135K86511m30373j63743R02453M81952k222948m526826
31714f083575l476283j16166J708397P03254l20755R38489K797502K663959J383760
31705A98582J637387L178913K904082l41487l889355m917516l717066k197181
31697g143641r20551Q45983L045457M332010L790398K355240J839670K436188
31689A0580754K040992p79153l766019l163731P73636L270944J384899k007333
31681H334989k821989j544420j182294j908486j806298j160154j465426j443039
31673d997117R36197L232075J036205m138425n474393n92185N126394O707538
31665A836289N134548K515763j540902n009619k045707P386683J2557110M723828
$$ plain form
31723 722408 -582736 -410601 -124090 -554463 -718206 184247 666199 -1556749 -6083575
31714 -6083575 -9559858 -9676024 -7967627 -7264373 -7585128 -6646639 -3849137 -1185178 198582
31705 198582 1835969 5014882 7918964 7577477 3688122 -1229394 -4946460 -7143641
31697 -7143641 -8064192 -7218209 -4172752 159258 3949656 6304896 8144566 10580754
31689 10580754 12621746 11842593 8076574 4912843 5686479 8957423 10342322 8334989
31681 8334989 5513000 3968580 2786286 877800 -928498 -2088652 -3554078 -4997117
31673 -4997117 -4060920 -828845 207360 -3931065 -9405458 -9997643 -4871249 1836289
31665 1836289 6970837 9486600 7945698 2936079 890372 8277055 20834165 25557993
31657B5557993r122681j4127604p107441J007673J924504o13562n44967O24182
31649b401903r31763k943155p97109L948957N445442K487149j46339Q07422L043103
31640H511804L045537P39173j731731l119580l197661j704574Q68339K488521
31632E899828J438864j336331l146256k721392j230519j61796L40911O04851M52893
31623A41053J12331O88285K228231K575013K41496k523631k259700N16974J890194
31614C610246O33491j9595J844754L131175P48282k835466l055778l19290Q61319
31605D599138r60811k423121j224246N39789M80052k24641M87472J597391P01397
31596C572420j686733k560712j008072K99401q38120k554206j322940K717523
$$ plain form
31657 25557993 16435312 2307708 -4799733 -3792060 -1867556 -2481118 -3026085 -2401903
31649 -2401903 -3333666 -6276821 -7073930 -3124973 2320469 4807618 4661279 5468701 8511804
31640 8511804 11557341 12296514 10564783 7445203 4247542 2542968 3411307 5899828
31632 5899828 7338692 6002361 2856105 134713 -1095806 -1257602 -916691 -311840 141053
31623 141053 253384 941669 3169900 5744913 5986409 3462778 1203078 1720052 3610246
31614 3610246 4243737 4224142 6068896 9200071 9948353 7112887 4057109 3737819 4599138
31605 4599138 3638327 1215206 -9040 530749 1010801 786160 1273632 2871023 3572420
31596 3572420 1885687 -675025 -1683097 -1383696 -2221816 -4776022 -6098962 -3381439
31588c381439N203754L138664r45436k390385o55411P15406m7510o88288N37554
31579A486909J673917O09600j189321j380311p28930j067704j354210L02575K175572
31570E28097R97853k051495k212233J454323M079908J959382k407189m424682
31562b076036l402066j920519j536052j700572j575909q68830K54207Q93933K32885
31553a1698959o49284M07684L128500M394182K728927P10254Q90962J791134P97754
31544B501154r82862m65408J817454J921828j321903m002113k511784J517520
31536a526114L706225K463997k18088k290752l361526l130054p98866K887411
31528b267767M963196L428835J60068j281434l08053M06200n11357q36681J527758
$$ plain form
31588 -3381439 1822315 4960979 4015543 1625158 969747 1685153 1637643 949355 1486909
31579 1486909 3160826 3770426 2581105 1200794 471864 -595840 -1950050 -1647475 528097
31570 528097 1525950 -525545 -2737778 -1283455 2796453 4755835 2348646 -2076036
31562 -2076036 -5478102 -7398621 -8934673 -10635245 -12211154 -13079984 -12825777 -11931844 -11698959
31553 -11698959 -12348243 -11940559 -8812059 -4417877 -1688950 -978696 -87734 1703400 2501154
31544 2501154 1518292 1052884 2870338 4792166 3470263 -531850 -3043634 -1526114
31536 -1526114 2180111 4644108 4426020 2135268 -1226258 -4356312 -5155178 -2267767
31528 -2267767 2695429 6124264 6284332 5002898 4694845 5101045 4589688 3753007 5280765
31519E280765M568828M332661K84521l839021m540593k032794J075777K870574
31511H000718L190660K738233K035892J051677l47509j623634j915757j554988
31503A1575292k165283m268143n859613m833102j969925J77077P26468R48913
31495e668316J775524K795520L545106L896486L226773J013692j742864l361894
31487E480027l611298l383021k700664j039036Q08987J497872J519027K393048
31479I64942L648016L280259J269733j89782k10430k6423M3151J138569K550127
31470A2468162J377255k859428o296837n464788j626471J407492J729298O6255
31462H00938j838670k130124j78179J791571O99281k718607m067915j437601J873983
$$ plain form
31519 5280765 9849593 14182254 14466775 10627754 6087161 4054367 5130144 8000718
31511 8000718 11191378 13929611 15965503 17017180 16669671 15046037 13130280 11575292
31503 11575292 9410009 5141866 -717747 -5550849 -7520774 -7343697 -6617229 -5668316
31495 -5668316 -3892792 -1097272 2447834 6344320 9571093 10584785 8841921 5480027
31487 5480027 1868729 -1514292 -4214956 -5253992 -4445005 -2947133 -1428106 964942
31479 964942 4612958 7893217 9162950 8973168 8762738 8736315 8779466 9918035 12468162
31470 12468162 13845417 10985989 4689152 -775636 -2402107 -994615 734683 800938
31462 800938 -1037732 -3167856 -3346035 -1554464 -855183 -3573790 -7641705 -9079306 -7205323
31453g205323K620928K084203K638007L213725J689329q39856j958564k102769
31445A39680l084928m054082k737921L65297K633190L358750L783024L841906
31437D244916K327846p5497j174503n82407J83816O45286J531839K268340J303723
31428A0673359r32451k159589j579100o11921j55344M54036J461333J931137J334560
31419A0416020P7385j554722l191251l475878j491651J152903J818361K68291
31411D019458j373250j706463r92361M31149K247680L116745K058589N03196L83531
31402H688274P32195q28339l638252m547851k984710j744581k051165j614988
31394g989417R69068L397497L324584K005748J849311K456469J675971o38633
$$ plain form
31453 -7205323 -4584395 -2500192 137815 3351540 5040869 4201013 2242449 139680
31445 139680 -2945248 -6999330 -9737251 -9371954 -6738764 -3380014 403010 4244916
31437 4244916 6572762 6497265 5322762 4740355 4924171 5569457 7101296 9369636 10673359
31428 10673359 9740908 7581319 6002219 5390298 5234954 5688990 7150323 9081460 10416020
31419 10416020 10493405 8938683 5747432 2271554 779903 1932806 3751167 4019458
31411 4019458 2646208 939745 -52616 378533 2626213 5742958 7801547 8304743 8688274
31402 8688274 9420469 8592130 4953878 406027 -2578683 -4323264 -6374429 -7989417
31394 -7989417 -7020349 -3622852 -298268 1707480 3556791 6013260 7689231 7050598
31386G050598k218197j282473J606086M296616M847074L002956L43252j459986
31378A6185926k382797l265984l890106l392399k215995j647878j440093n6634
31370b105960K410698L842552L339472K707905L484164M226314K408122j874206
31362A8439061n584503o116369m135767k523043k526196k042435R29253M144083
31354E84084L484666m00739k041075N32779K145468j218038n075687l063969K583315
31345b469196M224526O48476j890047j87803K000225J602581M70462J3577j480735
31336B932066l526597k089863L074780N930231K877679j737174k886391j924537
31328B650194j814876j020245K204842M440437K316987r81490q15689R31562l42854
$$ plain form
31386 7050598 4832401 3549928 5156014 9452630 14299704 17302660 17645912 16185926
31378 16185926 13803129 10537145 6647039 3254640 1038645 -609233 -2049326 -2105960
31370 -2105960 304738 4147290 7486762 10194667 13678831 17905145 20313267 18439061
31362 18439061 12854558 6738189 2602422 79379 -2446817 -4489252 -3559999 584084
31354 584084 4068750 3668011 1626936 2159715 4305183 3087145 -1988542 -5052511 -2469196
31345 -2469196 1755330 2403806 513759 325956 2326181 3928762 4399224 4412801 2932066
31336 2932066 -594531 -2684394 390386 6320617 9198296 7461122 4574731 2650194
31328 2650194 835318 -184927 2019915 6460352 8777339 7795849 6980160 7911722 7568868
31319G568868l365652l405727r20367k71846j294591J44795L625350L917752K3109
31310F021691k670945r76924J642566J423694m16219j288875j378448j452324
31302I04216m95754J728241K873939J175963j956008m095245m268045k397741
31294f530434R44781L400034K448196q38520k592282j455924J04073M81155J122810
31285b916111K717384L087271J004020j225364j291525j12394O97337J735443
31277C696061L620258M358738J818383k705998n803947n724901l198983Q0793
31269c859596K216010J812301m74725k234872k132994j033926K26423J950453
31261c530926L542037L000867P4080k399003k069605L3133J757179K651367K756721
$$ plain form
31319 7568868 4203216 797489 -122878 -394724 -1689315 -1544520 2080830 5998582 6021691
31310 6021691 3350746 2373822 4016388 5440082 5023863 3734988 2356540 904216
31302 904216 408462 2136703 5010642 6186605 4230597 135352 -4132693 -6530434
31294 -6530434 -5585653 -2185619 262577 -575943 -3168225 -4624149 -4520076 -4038921 -2916111
31285 -2916111 -198727 2888544 3892564 2667200 1375675 1263281 1960618 3696061
31277 3696061 7316319 11675057 13493440 10787442 4983495 -741406 -3940389 -3859596
31269 -3859596 -1643586 168715 -306010 -2540882 -4673876 -5707802 -5481379 -3530926
31261 -3530926 11111 3011978 3086058 687055 -1382550 -1349417 407762 3059129 5815850
31252E815850J134393j973514l726662k229998J77643l196k358058l376827j500723
31243h041092J325391K765996K483167J499803Q78521R81690J048561M3255j457288
31234A528004j519736J93960J556578J277886R30090J880352K409866L77125l013892
31225E620233m838018m483419l390599k047665r3115J686091K434521L318648
31217a793323N325478N862558J470251o008489r955503o905153q01112K286621
31209a0518672J225439k92743P57740L393600M328059J848646k137873l947418
31201e343222k160200R32330K548414K711406K813270K418305J78662k802853
31193A296112l639074j851601k0655K92368M38875J523337K127471Q95953p46463
$$ plain form
31252 5815850 6950243 4976729 1250067 -979931 -802288 -805484 -3163542 -6540369 -8041092
31243 -8041092 -6715701 -3949705 -1466538 33265 911786 1893476 2942037 2985292 1528004
31234 1528004 8268 202228 1758806 3036692 3966782 5847134 8257000 8634125 5620233
31225 5620233 782215 -3701204 -7091803 -9139468 -9232583 -7546492 -5111971 -1793323
31217 -1793323 3532155 9394713 10864964 4856475 -5099028 -12004181 -12805293 -10518672
31209 -10518672 -9293233 -9585976 -8828236 -5434636 -1106577 742069 -1395804 -5343222
31201 -5343222 -7503422 -6571092 -4022678 -1311272 1501998 3920303 4098965 1296112
31193 1296112 -2342962 -4194563 -4215218 -3922850 -3483975 -1960638 166833 1062786 316323
31184C16323n07371J417160K673206J723653p29764k678416k373416K35320K990366
31175C067061L394802J511880j49260j25164K18977o25758j522575l67883K352716
31166G754796L638357J641183k060118m227687l346435r05309N20548J90134k69203
31157B936266N53963J681559J269433m24683j362769q35016k55770n54407q03582
31148B204994j70927O62739R73424J076823R51831k05054j715184r27033K904594
31139E756207O097035M561838p88076n291558o327144n022790k816023K60115
31131c570396L424954M563482L199757J594494J315463Q52217j494466m187141
31123E698364m286981j661518J007324J944819J756522J255863J42976j481783
$$ plain form
31184 316323 -191048 1226112 3899318 5622971 4893207 2214791 -158625 76695 3067061
31175 3067061 6461863 7973743 7824483 7699319 7918296 7292538 5769963 5402080 7754796
31166 7754796 11393153 13034336 10974218 6746531 3400096 2494787 3015335 3205469 2936266
31157 2936266 3490229 5171788 6441221 6016538 4653769 3818753 3562983 3008576 2204994
31148 2204994 2034067 2696806 3670230 4747053 5698884 5493830 3778646 2851613 5756207
31139 5756207 11853242 16415080 15627004 10335446 4008302 -1014488 -3830511 -3570396
31131 -3570396 -145442 4418040 7617797 9212291 10527754 11379971 9885505 5698364
31123 5698364 1411383 -250135 757189 2702008 4458530 5714393 5857369 4375586
31115D375586k217622j165042O29911J669901J912438J980721J471612k53686
31107H403819k079282j924778J59347J454376L6556k521457l073277o76584K686861
31098B465581M496504L602785L81622l413638n065508k911924J357933L635580
31090D548935J588861k674113m925147l416632l84632R61232J45327m78364Q47811
31081c786722K776753K732924P17665o36738k32166m07834k932286n153885l210387
31072a0132676J914847N159244M266495K160581J545812J125018o73004j945243
31064C421074p18831P16860q95922l821399l213929J486374N392545M888306J661194
31055H916272r15287j880115j774109q31044J33270l21603j699750j498588O50317
$$ plain form
31115 4375586 2157964 992922 1622833 3292734 5205172 7185893 8657505 8403819
31107 8403819 6324537 4399759 4559106 6013482 6050038 3528581 455304 -221280 2465581
31098 2465581 6962085 10564870 10946492 7532854 2467346 -444578 913355 4548935
31090 4548935 6137796 3463683 -1461464 -4878096 -5262728 -4301496 -4156169 -4634533 -3786722
31081 -3786722 -1009969 1722955 2440620 1803882 1571716 1163882 -1768404 -6922289 -10132676
31072 -10132676 -8217829 -3058585 1207910 3368491 4914303 6039321 5366317 3421074
31064 3421074 2702243 3419103 2523181 -1298218 -4512147 -3025773 2366772 7255078 8916272
31055 8916272 8000985 6120870 4346761 3515717 3648987 3327384 1627634 129046 779363
31046G79363J644615j42552j700051l03549J246328j326483o196135o987479j894555
31037a4880498L501240L834762N01321j436502M1479K694189L652369K099334
31029G694o03956j962886m79442K250818K838312M18570j972756j574151L90481
31020f87316R75091j58652j000892o71663j05814J93201O05052P46840k25741
31011c29894j487725j041986J122408K567220J933607Q30339R79245J440523M70499
31002F484236j328695j902099j031212n08706j154629j779139j531554j267675
30994d019473j529795r28186J652372M352163M261527J895708J037431L112738
30986I834485M418659J367013l542901m703705j662625J03488k254383m341773
$$ plain form
31046 779363 2423978 2281426 581375 277826 1524154 197671 -5998464 -12985943 -14880498
31037 -14880498 -11379258 -7544496 -7043175 -8479677 -8438198 -5744009 -2091640 7694
31029 7694 -596262 -2559148 -3038590 -787772 2050540 2469110 496354 -1077797 -687316
31020 -687316 287775 129123 -871769 -1543432 -1649246 -1456045 -850993 -104153 -329894
31011 -329894 -1817619 -2859605 -1737197 830023 2763630 3593969 4573214 6013737 6484236
31002 6484236 5155541 3253442 2222230 1713524 558895 -1220244 -2751798 -4019473
30994 -4019473 -5549268 -6477454 -4825082 -472919 3788608 5684316 6721747 9834485
30986 9834485 14253144 15620157 12077256 7373551 5710926 5814414 3560031 -781742
30978g81742j652316K624577K107697k495378l835715R51774N607233L815100
30970F341230j961441m734300k730719j09457L01772n2510K94055K63070p06896
30961c095196o58410J571037L464231J859173k327083m777238k904139J444929
30953e422696M469113M243227J799262n14877j140982l27807L73975k41191j634591
30944A603433j964290k19099K302992L219593J857897J25193N0654J096449J005143
30935I077965q88453k637274k450698j129410o67649j390733j879229j268081
30927c233562j82733N46163Q04185O79765J73835l20087k48376J78520L21973
30918a280317M82869J527520K774104K093099p06905k405751m30314K797666K461659
$$ plain form
30978 -781742 -2434058 190519 2298216 -197162 -4032877 -3081103 2526130 6341230
30970 6341230 4379789 -354511 -3085230 -3194687 -2892915 -2945425 -2651370 -2388300 -3095196
30961 -3095196 -3753606 -2182569 1281662 3140835 813752 -3963486 -6867625 -5422696
30953 -5422696 -953583 3289644 5088906 4574029 3433047 3105240 3479215 3238024 1603433
30944 1603433 -360857 -579956 1723036 4942629 6800526 6925719 6976373 8072822 9077965
30935 9077965 8189512 5552238 3101540 1972130 1304481 -86252 -1965481 -3233562
30927 -3233562 -3416295 -2870132 -2065947 -1386182 -1212347 -1532434 -1780810 -1602290 -1280317
30918 -1280317 -797448 730072 3504176 5597275 4890370 2484619 2054305 4851971 7313630
30909G313630j824481m974065l345603K60609R27625j235521j728676J332183
30901c274299M596552M595645K197740K03672r14151k355412l708393l192566
30893a851212p40850J554360K192513J650783Q79856M1839r24016j753894k221588
30884a172209k237217j668179p62364j70687K87897J730223L742001L493369k30267
30875C012567l618277j999767L217588N795333L069940j071102k517492j827599
30867D061191r72237M19275K602906L203514P35636k154042k466063j391097j574868
30858B464215k345745j633861m36104r64852k081480j212399N47692J79559j388894
30849f871869n12042K372472K853817J07930j315131J075572L720624K919305
$$ plain form
30909 7313630 5489149 515084 -2830519 -2569910 -1642285 -2877806 -4606482 -3274299
30901 -3274299 1322253 5917898 8115638 8319310 7405159 5049747 1341354 -1851212
30893 -1851212 -2592062 -1037702 1154811 2805594 3685450 3727289 2803273 1049379 -1172209
30884 -1172209 -3409426 -5077605 -5839969 -6010656 -5722759 -3992536 -250535 3242834 3012567
30875 3012567 -605710 -2605477 612111 6407444 9477384 8406282 5888790 4061191
30867 4061191 3088954 3508229 6111135 9314649 10050285 7896243 5430180 4039083 2464215
30858 2464215 118470 -1515391 -1951495 -2916347 -4997827 -6210226 -5662534 -5482975 -6871869
30849 -6871869 -7383911 -5011439 -2157622 -2049692 -3364823 -2289251 1431373 4350678
30841D350678K20030r72807l55127P24346K312167M254009M356592J407334k122861
30832A4174361l271326k469629j646623p65205P11620J060373j359772m367931
30824B065868m231023j067201J338691R34483m83099q68828q33035j835412l300249
30815h279805k974453K07613M280337N692878L116427n67407j418753N29517J414308
30806B000662q63924l699026l706249j178470J284753K511221K794963J856166
30798A000096n98198l137174l703765k035013M98698K608698L297310J707742
30790c61606j425317l326377k090668P74361K241426J221378j128188l110284
30782g205275l091769j70722L964233N606987L451494O61540M55346J669146J309392
$$ plain form
30841 4350678 4570708 3597901 3242774 3967120 6279287 10533296 14889888 16297222 14174361
30832 14174361 10903035 8433406 6786783 6021578 6733198 7793571 6433799 2065868
30824 2065868 -2165155 -3232356 -1893665 -959182 -1442281 -2311109 -3144144 -4979556 -8279805
30815 -8279805 -11254258 -11046645 -6766308 -1073430 2042997 1475590 56837 586354 2000662
30806 2000662 1136738 -2562288 -6268537 -7447007 -6162254 -3651033 -856070 1000096
30798 1000096 401898 -2735276 -6439041 -8474054 -7975356 -5366658 -2069348 -361606
30790 -361606 -1786923 -5113300 -7203968 -6429607 -4188181 -2966803 -4094991 -7205275
30782 -7205275 -10297044 -10467766 -6503533 -896546 2554948 3216488 3671834 5340980 6650372
30773F650372m46196j006885J50697R29777p7971k193682l872176l524038n20766
30764c910868K902379K907608p35241l445212k291746j58044j08469K11613L542323
30755a085657O317837L636982j845154l378990p56387L23043j370179j250266
30747E91229J738838L027473J202053M99858K156998J633781k178049l328194
30739E343987R94591M502139J831009k520021j969395J526604K033334j89415
30731A1552833q95408k99941j306203k283822J53756L137877P21287n605913p733700
30722b559234k887076K677588L487639J711765J772754L631842M499869L354777
30714A5689924J052421j437006l151907l545881l457466l686632l052788o24219
$$ plain form
30773 6650372 6204176 5197291 5347988 6277765 6199794 4006112 133936 -3390102 -3910868
30764 -3910868 -1008489 1899119 1163878 -2281334 -4573080 -4731124 -4839593 -4627980 -1085657
30755 -1085657 5232180 8869162 7024008 3645018 2888631 3211674 1841495 591229
30747 591229 2330067 5357540 6559593 7059451 9216449 10850230 8672181 5343987
30739 5343987 6338578 10840717 12671726 10151705 8182310 9708914 11742248 11552833
30731 11552833 10657425 10357484 9051281 6767459 6921215 10059092 10780379 5174466 -2559234
30722 -2559234 -5446310 -2768722 718917 2430682 4203436 7835278 12335147 15689924
30714 15689924 16742345 15305339 12153432 8607551 5150085 1463453 -1589335 -2213554
30706b213554J110382p82119m147681l863817L65494L282123K039050j06496K13204
30697d103414J547037J258226M7571j90796Q5902l57987q46982l26940M69638
30688b417745O92852J226613K664539L314296J518872j448430k794169j407717
30680A349111J668802M528511N028847J985515k852768n737298n102263l041631
30672b173174j643611l54919J455849K078566J05849k583382l136826j489466
30664g741114N55917K378002M074494M481364K656995L63544P1611J093186O56742
30655H590741j489020k599817j238282Q83530J994327K437535K673548J691010
30647A2943572q32720k796941k326297q68278j173276k796792k494279L70903
$$ plain form
30706 -2213554 -1103172 -1885291 -6032972 -9896789 -9531295 -6249172 -4210122 -4316618 -4103414
30697 -4103414 -2556377 -1298151 -1250580 -1441376 -1355474 -1713461 -2560443 -2887383 -2417745
30688 -2417745 -1724893 -498280 2166259 5480555 6999427 5550997 2756828 1349111
30680 1349111 3017913 7546424 12575271 14560786 11708018 5970720 868457 -2173174
30672 -2173174 -3816785 -4171704 -2715855 -637289 -531440 -3114822 -6251648 -7741114
30664 -7741114 -7185197 -4807195 -732701 3748663 6405658 6769202 6840813 7933999 8590741
30655 8590741 7101721 4501904 3263622 4147152 6141479 8579014 11252562 12943572
30647 12943572 12110852 9313911 6987614 6119336 4946060 2149268 -345011 25892
30639B5892J797027j295238n537839m675161J651770O542459M762212l49505j858039
30630A063578J271281L703068J885118j665059k938240j549148M25175J833021
30622D028794K498096J885523j6460j613314j356208J86422J175043P29161o25670
30613F891387j909207k254166j392384k67556k21615j026611q63497J160971L642589
30604C759911M532193L033287k48109l464447l929293p46042K644494J499705
30596G081699l604461o387573k978371K690427M324689J434306j404405j552506
30588c96195o08165m18520n80843l07967J26009N53090J434772K559356K796739
30579E158276J708454L01413j45416O54692J765197J613760n00039k973412l128950
$$ plain form
30639 25892 1822919 527681 -5010158 -9685319 -8033549 -1491090 3271122 2921617 1063578
30630 1063578 2334859 6037927 7923045 6257986 3319746 1770598 2195773 4028794
30622 4028794 6526890 8412413 8395953 6782639 5426431 5612853 6787896 7517057 6891387
30613 6891387 4982180 2728014 1335630 1068074 846459 -180152 -1043649 117322 3759911
30604 3759911 8292104 11325391 11077282 7612835 3683542 2937500 5581994 7081699
30596 7081699 3477238 -2910335 -5888706 -3198279 1126410 2560716 1156311 -396195
30588 -396195 -1004360 -1422880 -2003723 -2311690 -2185681 -1632591 -197819 2361537 5158276
30579 5158276 6866730 7168143 7022727 7677419 9442616 11056376 10556337 7582925 4453975
30570D453975o56161J573496J176030q01064j873420j413104m55739J14813l73608
30561A745218k269361l872369k137486K689037N699292L560930l52426p88343
30553D274492J623848K008942p93464l020175k387062o73327N40267J958221L380046
30544F911788K889119P33262o3288J248478J329932j813684n095864m720531j515106
30535i5894Q35684P47295o06400j853505k263134j314126N31778J551715P10462
30526a756125j042185k286466k559721j580681R82917L847341M226410J182646
30518A014136k634450l966609k420461o3696J014567P5096j672055j418691K177608
30509g894555N960475N138262n2498l797795k213349J926906L859822K840177
$$ plain form
30570 4453975 3797814 5371310 6547340 5746276 3872856 2459752 2004013 2118826 1745218
30561 1745218 -524143 -4396512 -6533998 -3844961 1854331 5415261 5062835 4274492
30553 4274492 5898340 7907282 7113818 4093643 1706581 1033254 1573521 3531742 6911788
30544 6911788 9800907 10534169 10470881 11719359 13049291 11235607 6139743 1419212 -95894
30535 -95894 739790 1487085 880685 -972820 -3235954 -4550080 -4018302 -2466587 -1756125
30526 -1756125 -2798310 -5084776 -7644497 -9225178 -8242261 -4394920 -168510 1014136
30518 1014136 -1620314 -5586923 -8007384 -8071080 -7056513 -6981417 -8653472 -10072163 -7894555
30509 -7894555 -1934080 3204182 3151684 -646111 -2859460 -932554 2927268 5767445
30501E767445R74416p04660j840506j165381J245140K360109K46893k347912k006525
30492B529019j51655n07862k742729l167283q82151J331184K030493K614163L455929
30483D509108K758358L35414j056376L50117K764668L442161J703899j360794
30475A3446555m075162m626346k607223m22730p61051k508150j992290J395258
30467b151139M091806L706761K003042J016183l15466l127734n137274l529601
30459c443422L00433K254461J171977m0632Q93092K380407J531440j560879l633145
30450a46268k182840J422811L430432K053957o29721j583465n45600K88254m59564
30441A647996j999696l019470l036376k077904n15278O72869Q73463J058509K457090
$$ plain form
30501 5767445 6741861 6037201 4196695 3031314 4276454 6636563 6883456 4535544 2529019
30492 2529019 2377364 1869502 -873227 -4040510 -4922661 -3591477 -1560984 1053179 4509108
30483 4509108 7267466 7602880 6546504 6896621 9661289 13103450 14807349 13446555
30475 13446555 9371393 4745047 2137824 1715094 954043 -1554107 -3546397 -2151139
30467 -2151139 1940667 5647428 7650470 8666653 8351187 5223453 86179 -3443422
30459 -3443422 -3142989 -888528 283449 242817 1135909 3516316 5047756 3486877 -146268
30450 -146268 -2329108 -906297 2524135 4578092 3948371 2364906 1819306 2107560 1647996
30441 1647996 -351700 -3371170 -6407546 -8485450 -9000728 -8327859 -7454396 -6395887 -3938797
30432c938797M023343L160785n56436m158066m549227j719962J820327L602896
30424b315137K908061J163176P27745K052235K533648N4834l119207k961620M1111
30415A084846J093705j562067l699065j692676J856586K518875R55121J043449
30407A598774K886503K542976j376129n146795n055216j919514R02492J668458
30399c898451R28609k14357r15156n62177P52928J980376J970618N69535j122432
30390e10507j417338N19961L321532M190338K019547q65307j353771N41080J954370
30381H399905J079869r93261k489137l046347k891534j716791K72790J461192
30373G6686O43138q78705p13186J197186K257784Q38995j307540j463219K40472
$$ plain form
30432 -3938797 84546 3245331 2688895 -1469171 -6018398 -7738360 -5918033 -2315137
30424 -2315137 592924 1756100 2483845 4536080 7069728 7124562 4005355 1043735 1084846
30415 1084846 2178551 616484 -3082581 -4775257 -2918671 -399796 555325 1598774
30407 1598774 4485277 7028253 5652124 505329 -4549887 -6469401 -5566909 -3898451
30399 -3898451 -2969842 -3184199 -4099355 -4661532 -3908604 -1928228 42390 611925 -510507
30390 -510507 -1927845 -1407884 1913648 6103986 8123533 7258226 5904455 6445535 8399905
30381 8399905 9479774 8486513 5997376 2951029 59495 -1657296 -1384506 76686
30373 76686 719824 -158881 -872067 325119 2582903 3421898 2114358 651139 891611
$$ [...]
##END NTUPLES=NMR SPECTRUM
##END=
