##TITLE=31P_DE-80H_X3
 64 sc D2O
 26.2.2025
##JCAMPDX= 6.0         $$ Bruker NMR JCAMP-DX V2.0
##DATA TYPE= NMR SPECTRUM
##DATA CLASS= NTUPLES
##ORIGIN= UXNMR, Bruker Analytische Messtechnik GmbH
##OWNER= root
$$ XWIN-NMR		Version 3.5
$$ Mon Jul 14 16:08:22 2025 Russian Standard Time (UT+4h)  Yarkov@DPX200
##.OBSERVE FREQUENCY= 81.013821
##.OBSERVE NUCLEUS= ^31P
##.ACQUISITION MODE= SIMULTANEOUS
##.ACQUISITION SCHEME= undefined
##.AVERAGES= 64
##.DIGITISER RES= 17
##SPECTROMETER/DATA SYSTEM= spect
##.PULSE SEQUENCE= zgpg30
##.SOLVENT NAME= MeOD
##.SHIFT REFERENCE= (INTERNAL, MeOD, 0, 198.062)
##AUDIT TRAIL= $$ (NUMBER, WHEN, WHO, WHERE, WHAT)
$$ ##TITLE= Audit trail, XWIN-NMR		Version 3.5
$$ ##JCAMPDX= 5.01
$$ ##ORIGIN= Bruker BioSpin GmbH
$$ ##OWNER= Yarkov
$$ C:/Bruker/XWIN-NMR/data/yarkov2/nmr/P31/2/pdata/1/auditp.txt
$$ ##AUDIT TRAIL=  $$ (NUMBER, WHEN, WHO, WHERE, WHAT)
(   1,<2025-07-14 16:07:17.56 +0400>,<Yarkov>,<DPX200>,
      <created by zg, POWCHK disabled, PULCHK disabled
       configuration hash MD5:
       00 E9 B6 7A A2 85 ED C7 34 08 36 98 17 FE 4E 26
       data hash MD5: 32K
       23 46 2D 5D C6 8E 54 9B A1 D4 30 68 FC 57 3D BF>)
(   2,<2025-07-14 16:07:29.45 +0400>,<Yarkov>,<DPX200>,
      <Start of raw data processing
       efp BC_mod = 2 LB = 1.5 FT_mod = 6 PKNL = 1 PHC0 = 1676.443 PHC1 = 49.15953 SI = 64K 
       data hash MD5: 64K
       AD F2 F7 F2 E3 81 93 11 0F AB B7 33 5F 67 5F 07>)
(   3,<2025-07-14 16:07:53.57 +0400>,<Yarkov>,<DPX200>,
      <pk PHC0 = -3.599993 PHC1 = 0 
       data hash MD5: 64K
       FC 04 CA 7D BC 90 23 4C 11 E2 4E 02 DD 65 2E 39>)
$$ ##END=
$$ 
$$ hash MD5
$$ AE EE 8D ED 41 45 14 48 D6 07 93 2B 53 27 9F 76
##$RELAX= 
##$RELAX= 
##$RELAX= 
##$RELAX= 
##$RELAX= 
##$RELAX= 
##$RELAX= 
##$RELAX= 
$$ Bruker specific parameters
$$ --------------------------
##$DU= <C:/Bruker/XWIN-NMR>
##$EXPNO= 2
##$NAME= <P31>
##$PROCNO= 1
##$TYPE= <nmr>
##$USER= <yarkov2>
##$AMP= (0..31)
100 100 100 100 100 100 100 100 100 100 100 100 100 100 100 100 100 100 
100 100 100 100 100 100 100 100 100 100 100 100 100 100 
##$AQSEQ= 0
##$AQ_mod= 1
##$AUNM= <au_zg>
##$AUTOPOS= <>
##$BF1= 81.014009
##$BF2= 200.13
##$BF3= 200.13
##$BF4= 200.13
##$BF5= 200.13
##$BF6= 200.13
##$BF7= 200.13
##$BF8= 200.13
##$BYTORDA= 1
##$CFDGTYP= 0
##$CFRGTYP= 5
##$CHEMSTR= <none>
##$CNST= (0..31)
1 1 145 1 1 1 1 1 1 1 1 1 1 1 1 1 1 1 1 1 1 1 1 1 1 1 1 1 1 1 1 1 
##$CPDPRG= <waltz16>
##$CPDPRG1= <>
##$CPDPRG2= <waltz16>
##$CPDPRG3= <>
##$CPDPRG4= <mlev>
##$CPDPRG5= <mlev>
##$CPDPRG6= <mlev>
##$CPDPRG7= <mlev>
##$CPDPRG8= <mlev>
##$CPDPRGB= <>
##$CPDPRGT= <>
##$D= (0..31)
0 1 0 0 0 0 0 0 0 0.06 0 0.03 2e-05 3e-06 0 0 0.0002 0 0 0 0 0 0 0 0 0 
0 0 0 0 0 0 
##$DATE= 1752494836
##$DBL= (0..7)
120 120 120 11 120 120 24 19 
##$DBP= (0..7)
150 150 150 150 150 150 150 150 
##$DBP07= 0
##$DBPNAM0= <>
##$DBPNAM1= <>
##$DBPNAM2= <>
##$DBPNAM3= <>
##$DBPNAM4= <>
##$DBPNAM5= <>
##$DBPNAM6= <>
##$DBPNAM7= <>
##$DBPOAL= (0..7)
$$ [...]
##$SUBNAM3= <"">
##$SUBNAM4= <"">
##$SUBNAM5= <"">
##$SUBNAM6= <"">
##$SUBNAM7= <"">
##$SUBNAM8= <"">
##$SUBNAM9= <"">
##$SW= 400.765351723535
##$SWIBOX= (0..15)
0 1 3 0 0 0 0 0 0 0 0 0 0 0 0 0 
##$SW_h= 32467.5324675325
##$TD= 32768
##$TD0= 1
##$TE= 0
##$TE2= 300
##$TE3= 300
##$TEG= 300
##$TL= (0..7)
0 120 53 12 22 120 120 120 
##$TP= (0..7)
150 150 150 150 150 150 150 150 
##$TP07= 0
##$TPNAME0= <>
##$TPNAME1= <>
##$TPNAME2= <>
##$TPNAME3= <>
##$TPNAME4= <>
##$TPNAME5= <>
##$TPNAME6= <>
##$TPNAME7= <>
##$TPOAL= (0..7)
0.5 0.5 0.5 0.5 0.5 0.5 0.5 0.5 
##$TPOFFS= (0..7)
0 0 0 0 0 0 0 0 
##$TUNHIN= 0
##$TUNHOUT= 0
##$TUNXOUT= 0
##$USERA1= <user>
##$USERA2= <user>
##$USERA3= <user>
##$USERA4= <user>
##$USERA5= <user>
##$V9= 5
##$VALIST= <valist>
##$VCLIST= <CCCCCCCCCCCCCCC>
##$VD= 0
##$VDLIST= <DDDDDDDDDDDDDDD>
##$VPLIST= <PPPPPPPPPPPPPPP>
##$VTLIST= <TTTTTTTTTTTTTTT>
##$WBST= 1024
##$WBSW= 4
##$XGAIN= (0..3)
0 0 0 0 
##$XL= 0
##$YL= 0
##$YMAX_a= 1109
##$YMIN_a= -1079
##$ZGOPTNS= <>
##$ZL1= 120
##$ZL2= 120
##$ZL3= 120
##$ZL4= 120
##$ABSF1= 0
##$ABSF2= 0
##$ABSG= 0
##$ABSL= 0
##$ALPHA= 0
##$AQORDER= 0
##$ASSFAC= 0
##$ASSFACI= 0
##$ASSFACX= 0
##$ASSWID= 0
##$AUNMP= <proc_1d>
##$AZFE= 0.1
##$AZFW= 0.5
##$BCFW= 0
##$BC_mod= 2
##$BYTORDP= 0
##$COROFFS= 0
##$CY= -3
##$DATMOD= 1
##$DC= 0
##$DFILT= <>
##$DTYPP= 0
##$F1P= 0
##$F2P= 0
##$FCOR= 1
##$FTSIZE= 65536
##$FT_mod= 6
##$GAMMA= 0
##$GB= 0
##$INTBC= 1
##$INTSCL= 9.790993e-09
##$ISEN= 30
##$LB= 1.5
##$LEV0= 0
##$LPBIN= 0
##$MAXI= 10000
##$MC2= 0
##$MEAN= 0
##$ME_mod= 0
##$MI= 50
##$NCOEF= 0
##$NC_proc= -14
##$NLEV= 6
##$NOISF1= 182.463
##$NOISF2= 159.3651
##$NSP= 0
##$NTH_PI= 0
##$NZP= 0
##$OFFSET= 198.0616
##$PC= 4
##$PHC0= 1672.843
##$PHC1= 49.15953
##$PH_mod= 1
##$PKNL= yes
##$PPARMOD= 0
##$PSCAL= 0
##$PSIGN= 0
##$REVERSE= no
##$SF= 81.0140089999434
##$SI= 65536
##$SIGF1= 159.3651
##$SIGF2= -187.1042
##$SINO= 113.3802
##$SIOLD= 16384
##$SREGLST= <1H.CDCl3>
##$SSB= 0
##$STSI= 65536
##$STSR= 0
##$SW_p= 32467.5324675325
##$SYMM= 0
##$S_DEV= 0
##$TDeff= 32768
##$TDoff= 0
##$TI= <>
##$TILT= no
##$TM1= 0
##$TM2= 0
##$TOPLEV= 0
##$USERP1= <user>
##$USERP2= <user>
##$USERP3= <user>
##$USERP4= <user>
##$USERP5= <user>
##$WDW= 1
##$XDIM= 65536
##$YMAX_p= 482804206
##$YMIN_p= -102953009
$$ End of Bruker specific parameters
$$ ---------------------------------
##NTUPLES= NMR SPECTRUM
##VAR_NAME=  FREQUENCY,     SPECTRUM/REAL,   SPECTRUM/IMAG
##SYMBOL=    X,             R,               I
##VAR_TYPE=  INDEPENDENT,   DEPENDENT,       DEPENDENT
##VAR_FORM=  AFFN,          ASDF,            ASDF
##VAR_DIM=   65536,         65536,           65536
##UNITS=     HZ,            ARBITRARY UNITS, ARBITRARY UNITS
##FACTOR=    0.49542278885378, 1,            1
##FIRST=     16045.7642231865, 0,            0
##LAST=      -16421.768244346, 0,            0
##MIN=       -16421.768244346, -102953009,   0
##MAX=       16045.7642231865, 482804206,    0
$$ Real data points
##PAGE= N=1
##DATA TABLE= (X++(R..R)), XYDATA
$$ [...]
##PAGE= N=2
##DATA TABLE= (X++(I..I)), XYDATA
$$ plain form
35050 -3199364 2424274 7819954 8919543 9095433 13999134 23150978 29381808 26598974
35042 26598974 16078390 4598704 -1926860 -2190306 1236202 4412426 4535891 1998017
35034 1998017 310344 2632711 7848456 11189072 9508633 5072905 3054172 5668275
35026 5668275 9999176 11909739 11186779 11835585 17069648 24618879 28167204 24279041
35018 24279041 17155236 14606020 18847480 23429602 20926600 11731284 2438947 -2980835
35010 -2980835 -6061865 -7929488 -6014979 481638 6368164 6458830 3137258 2694882 5657070
35001 5657070 6715814 4343050 4122098 10136825 18062726 20300720 14727205 5429862
34993 5429862 -2158779 -3794741 2752086 15214668 26753069 32008164 32461726 33345350
$$ packed form
35050c199364N623638N395680J099589J75890M903701R151844O230830k782834
35042B6598974j0520584j1479686o525564k63446L426508L176224J23465k537874
35034A998017j687673K322367N215745L340616j680439m435728k018733K614103
35026E668275M330901J910563p22960O48806N234063P549231L548325l888163
35018B4279041p123805k549216M241460M582122k503002r195316r292337n419782
35010b980835l081030j867623J914509O496617N886526R0666l321572m42376K962188
35001E657070J058744k372764k20952O014727P925901K237994n573515r297343
34993E429862p588641j635962O546827J2462582J1538401N255095M53562Q83624
$$ plain form
34985 33345350 36805962 40743782 42413492 39922550 32027161 20232061 9750391 4607777
34977 4607777 3006207 1278341 664514 5082454 12968284 16990769 12627896 2433563
34969 2433563 -8699613 -17704521 -22161762 -20483315 -15309708 -12184900 -12717379 -12929474
34961 -12929474 -9776943 -4745024 478860 6371722 11169874 10057551 2698317 -3719354
34953 -3719354 -3595367 -269828 819169 1513729 7068616 16666296 24884694 30100255
34945 30100255 34260727 36121066 32409454 25282766 21196904 21768242 22470393 21056109
34937 21056109 20170117 20060456 16010776 6226207 -3766812 -8112919 -6867538 -2173385
34929 -2173385 5964954 15679162 20437116 16321270 8806885 6511213 10406997 14552146
$$ packed form
34985C3345350L460612L937820J669710k490942p895389j1795100j0481670n142614
34977D607777j601570j727866o13827M417940P885830M022485m362873j0194333
34969B433563j1133176r004908m457241J678447N173607L124808n32479k12095
34961a2929474L152531N031919N223884N892862M798152j112323p359234o417671
34953c719354J23987L325539J088997O94560N554887R597680Q218398N215561
34945C0100255M160472J860339l711612p126688m085862N71338P02151j414284
34937B1056109q85992j09661m049680r784569r993019m346107J245381M694153
34929b173385Q138339R714208M757954m115846p514385k295672L895784M145149
$$ plain form
34921 14552146 15517006 15110955 14452194 11492005 5860604 1566077 2366961 6710798 8982424
34912 8982424 4925394 -4186389 -11600825 -10221355 134487 11211110 14454286 10269441
34904 10269441 6637753 8912668 14195853 16477612 14411417 12346407 15242814 23794499
34896 23794499 33642845 38863197 37107765 31440753 26395762 23117681 20060682 17299346
34888 17299346 16948422 19136418 20846934 20088458 18707317 19475929 22353686 25171175
34880 25171175 26297137 25125902 21591792 16914158 13513693 12617104 13090701 13816482
34872 13816482 15441977 18066396 19180977 16575128 11986091 8849709 7060206 3162388
34864 3162388 -4022562 -10897302 -13176681 -10367442 -5280093 -909355 1234691 1252887
$$ packed form
34921A4552146R64860m06051o58761k960189n631401m294527Q00884M343837K271626
34912H982424m057030r111783p414436J379470J0355842J1076623L243176m184845
34904A0269441l631688K274915N283185K281759k066195k065010K896407Q551685
34896B3794499R848346N220352j755432n667012n044991l278081l056999k761336
34888A7299346l50924K187996J710516p58476j381141P68612K877757K817489
34880B5171175J125962j171235l534110m677634l400465q96589M73597P25781
34872A3816482J625495K624419J114581k605849m589037l136382j789503l897818
34864C162388p184950o874740k279379K809239N087349M370738K144046J8196
$$ plain form
34856 1252887 462173 57717 -232006 -1254996 -2467053 -2538545 -1772943 -1643955 -1689762
34847 -1689762 437073 5058605 9541163 12521201 15720510 19374137 19454221 13296316
34839 13296316 5436043 3088529 6913405 10881306 10845239 8409953 6063114 3817321
34831 3817321 2385441 4596849 10497842 15097239 14871132 13388867 16045911 21445851
34823 21445851 23151103 19258173 14981606 14731182 16194012 14836461 11247735 10638126
34815 10638126 15930956 24043119 29465957 30038513 28272037 27472253 27747425 26713032
34807 26713032 23562800 20545379 19510292 18611800 14353058 6293361 -2042268 -6642563
34799 -6642563 -5784837 156009 9296562 18177648 23251047 23668807 21473628 18429204
$$ packed form
34856A252887p90714m04456k89723j022990j212057p1492P65602J28988m5807
34847a689762K126835M621532M482558K980038L199309L653627Q0084o157905
34839A3296316p860273k347514L824876L967901l6067k435286k346839k245793
34831C817321j431880K211408N900993M599397k26107j482265K657044N399940
34823B1445851J705252l892930m276567k50424J462830j357551l588726o09609
34815A0638126N292830Q112163N422838N72556j766476p99784K75172j034393
34807B6713032l150232l017421j035087q98492m258742q059697q335629m600295
34799f642563Q57726N940846R140553Q881086N073399M17760k195179l044424
$$ plain form
34791 18429204 14199010 8556847 3541243 1392633 1267412 396072 -1186784 906656
34783 906656 10752902 26397533 39913412 43502944 35523831 21078853 7647886 200183
34775 200183 -852032 1386581 3123848 2897237 2648037 5392045 11279227 16379455 16087258
34766 16087258 9708439 1239872 -4422708 -5775417 -5210469 -5593689 -6903154 -6706114
34758 -6706114 -3485735 1850802 8021286 14986400 22017276 25924567 24100428 18948033
34750 18948033 16467576 19924786 26854746 32158416 31747480 23764099 10309361 -1075749
34742 -1075749 -1857671 9020142 23669417 33767208 37422912 36392760 31423891 23906741
34734 23906741 18008747 16499456 17156509 17256640 18305707 21638071 22966910 17611554
$$ packed form
34791A8429204m230194n642163n015604k148610j25221q71340j582856K093440
34783I06656R846246J5644631J3515879L589532p979113j4444978j3430967p447703
34775B00183j052215K238613J737267k26611k49200K744008N887182N100228k92197
34766A6087258o378819q468567n662580j352709N64948l83220j309465J97040
34758f706114L220379N336537O170484O965114P030876L907291j824139n152395
34750A8948033k480457L457210O929960N303670m10936p983381j3454738j1385110
34742a075749p81922J0877813J4649275J0097791L655704j030152m968869p517150
34734B3906741n897994j509291O57053J00131J049067L332364J328839n355356
$$ plain form
34726 17611554 8689290 3383109 2742783 2166665 618967 1385476 3968170 3898081 1858900
34717 1858900 4342464 12640917 19520552 20447106 19937339 21922823 21735626 14259409 3499014
34708 3499014 -3359246 -6129477 -8144882 -7264060 630492 11750273 17172268 15140177
34700 15140177 12818595 15442699 20766356 25177158 28682373 31928434 33622562 32886442
34692 32886442 30056255 24312330 15117884 6631390 5016736 9402077 10988538 4356330
34684 4356330 -4877873 -7482760 -2009534 5539595 10641860 13666454 15264598 13679829
34676 13679829 8485983 3687251 4102764 9592826 15415133 18505354 20827365 24849075
34668 24849075 28063579 25698588 18301616 12329056 12125783 15282473 17510963 17605720
$$ packed form
34726A7611554q922264n306181o40326n76118j547698P66509K582694p0089k039181
34717A858900K483564Q298453O879635R26554n09767J985484j87197p476217j0760395
34708C499014o858260k770231k015405Q80822P894552J1119781N421995k032091
34700A5140177k321582K624104N323657M410802L505215L246061J694128p36120
34692C2886442k830187n743925r194446q486494j614654M385341J586461o632208
34684D356330r234203k604887N473226P549129N102265L024594J598144j584769
34676A3679829n193846m798732M15513N490062N822307L090221K322011M021710
34668B4849075L214504k364991p396972n972560k03273L156690K228490R4757
$$ plain form
34660 17605720 15010312 7829920 -1807214 -5042243 4060719 18611380 25839947 22694795
34652 22694795 17155892 14576316 11311053 3813061 -4131140 -7460203 -6992926 -5925700
34644 -5925700 -4009325 72759 4345278 6233619 6685056 7357934 6463679 2012999 -2737916
34635 -2737916 -1780634 6243864 16439550 22758591 22193986 15443973 6624266 1305723
34627 1305723 1697270 4229481 4194794 1648155 200499 1486204 4203186 7693006 12611647
34618 12611647 17886498 20511177 19379013 16756675 14923415 13461047 10990451 7832484
34610 7832484 5539082 4840416 5488619 7887881 13598467 23188690 33442885 37953289
34602 37953289 32422269 19771622 8355637 4101631 5488185 6961756 5703183 3577251
$$ packed form
34660A7605720k595408p180392r637134l235029R102962J4550661P228567l145152
34652B2694795n538903k579576l265263p497992p944201l329063M67277J067226
34644e925700J916375M082084M272519J888341M51437O72878q94255m450680m750915
34635b737916R57282Q024498J0195686O319041n64605o750013q819707n318543
34627A305723L91547K532211l4687k546639j447656J285705K716982L489820M918641
34618A2611647N274851K624679j132164k622338j833260j462368k470596l157967
34610G832484k293402o98666O48203K399262N710586R590223J0254195M510404
34602C7953289n531020j2650647j1415985m254006J386554J473571j258573k125932
$$ plain form
34594 3577251 3590398 6277220 9394255 10140281 7931970 5502256 6538220 11719481 18038222
34585 18038222 22507550 25190058 27727734 30315713 31474437 29947055 25714291 19786540
34577 19786540 13755284 8920551 5504822 3444432 3555501 6213580 9188472 9292994
34569 9292994 6379062 2925536 -492875 -5395829 -9939547 -8165960 1846554 12891243
34561 12891243 16363451 12911474 10688925 14166967 19469762 20970495 18244231 14982746
34553 14982746 13661301 13005543 10023825 4195516 -336881 1836874 11000331 21381379
34545 21381379 27982213 31559239 34542812 35598047 32711478 29181082 30711991 36992979
34537 36992979 41524428 40272312 35458624 29823162 22533450 13372606 6451684 5758530
$$ packed form
34594C577251J3147K686822L117035P46026k208311k429714J035964N181261O318741
34585A8038222M469328K682508K537676K587979J158724j527382m232764n927751
34577A9786540o031256m834733l415729k060390J11069K658079K974892J04522
34569I292994k913932l453526l418411m902954m543718J773587J0012514J1044689
34561A2891243L472208l451977k222549L478042N302795J500733k726264l261485
34553A4982746j321445o55758k981718n828309m532397K173755R163457J0381048
34545B1381379O600834L577026K983573J055235k886569l530396J530909O280988
34537C6992979M531449j252116m813688n635462p289712r160844o920922o93154
$$ plain form
34529 5758530 9315986 11245985 8678261 4229321 2308114 4774677 9904475 14480185
34521 14480185 16930318 18364336 19900951 19988373 16610557 11662057 9745026 11617308
34513 11617308 12070834 6504594 -2747723 -9249971 -10073587 -7868675 -6225361 -5928891
34505 -5928891 -6096441 -6403218 -6630212 -5301640 -649675 6919544 14403739 18697949 18959969
34496 18959969 16478054 13471042 12544490 15250155 19168314 18427450 10715907 2508154
34488 2508154 2271811 8458618 10631087 4670506 -220720 5258915 16488972 21606932
34480 21606932 17959990 13007836 10958018 8335918 3441545 753310 2990018 6666445
34472 6666445 9154601 12937867 18402141 19257565 11229769 235652 -4574784 -2433803
$$ packed form
34529E758530L557456J929999k567724m448940j921207K466563N129798M575710
34521A4480185K450133J434018J536615Q7422l377816m948500j917031J872282
34513A1617308M53526n566240r252317o502248q23616K204912J643314K96470
34505e928891j67550l06777k26994J328572M651965P569219P484195M294210K62020
34496A8959969k481915l007012r26552K705665L918159p40864p711543q207753
34488B508154k36343O186807K172469n960581m891226N479635J1230057N117960
34480B1606932l646942m952154k049818k622100m894373k688235K236708L676427
34472F666445K488156L783266N464274Q55424q027796j0994117m810436K140981
$$ plain form
34464 -2433803 392309 568806 -44518 -188833 -843462 -1502591 -291110 2067171 3057903
34455 3057903 3303129 6187649 11951779 16262129 15824352 12216449 9242836 9386874 13557613
34446 13557613 21154511 28967426 32534180 30304089 25074085 20499471 17721038 16014938
34438 16014938 14868249 14102690 12964732 10298284 5702502 576456 -2087671 -262833
34430 -262833 3954768 5570692 2932915 851709 4383513 10784201 11937942 5169616
34422 5169616 -2583067 -3143342 3751885 11959422 16610050 17153485 14908204 11563156
34414 11563156 9606512 10586584 12377886 11185339 7217056 5418682 8837925 13988395
34406 13988395 15552682 13588959 12367521 13184585 12879798 9867180 6916997 6159528
$$ packed form
34464b433803K826112J76497o13324j44315o54629o59129J211481K358281R90732
34455C057903K45226K884520N764130M310350m37777l607903k973613J44038M170739
34446A3557613P596898P812915L566754k230091n230004m574614k778433j706100
34438A6014938j146689p65559j137958k666448m595782n126046k664127J824838
34430b62833M217601J615924k637777k081206L531804O400688J153741o768326
34422E169616p752683n60275O895227Q207537M650628N43435k245281l345048
34414A1563156j956644R80072J791302j192547l968283j798374L419243N150470
34406A3988395J564287j963723j221438Q17064l04787l012618k950183p57469
$$ plain form
34398 6159528 5843706 4958485 6516446 11630204 14234367 8176259 -2541720 -7797714
34390 -7797714 -5114256 -1802186 -2367071 -1906515 4520420 13247601 17985315 18726001 18678550
34381 18678550 16970191 11355677 5184679 4435103 8996109 13141549 13802523 12386542
34373 12386542 9319188 3771808 -752914 2085863 11880059 19575890 18865566 14673865
34365 14673865 15947609 23421277 29351368 27829526 21040818 15305213 14077590 15835680
34357 15835680 17261403 17199711 17216900 18592437 20067300 19734470 18027433 16816265 16336335
34348 16336335 15604310 15402582 17566999 20978101 21780981 18824864 15609211 15050643 15523376
34339 15523376 14657218 14048880 16261766 18802942 15873816 6856475 -811413 295287
$$ packed form
34398F159528l15822q85221J557961N113758K604163o058108j0717979n255994
34390g797714K683458L312070n64885M60556O426935Q727181M737714P40686m7451
34381A8678550j708359n614514o170998p49576M561006M145440O60974j415981
34373A2386542l067354n547380m524722K838777R794196P695831p10324m191701
34365A4673865J273744P473668N930091j521842o788708n735605j227623J758090
34357A5835680J425723o1692J7189J375537J474863l32830j707037j211168m79930
34348A6336335p32025k01728K164417L411102Q02880k956117l215653n58568M72733
34339A5523376q66158o08338K212886K541176k929126r017341p667888J106700
$$ plain form
34331 295287 8504857 14691098 12617457 5192433 -368947 -1344061 -1072917 -2774322 -5224516
34322 -5224516 -5665526 -4188540 -2901692 -2369705 -1369690 554015 2303034 2446275 -157422
34313 -157422 -5645499 -11249260 -11844023 -5222246 4272338 10264350 11568157 11919202 13669539
34304 13669539 15655337 16928310 18334661 19751603 19552060 17883294 17270415 18973865
34296 18973865 21532026 23321512 23486670 20394150 13269830 5841694 3716022 6939315
34288 6939315 9922695 10300303 12424696 19272405 26303983 27593118 23625520 18322577
34280 18322577 12248703 4244032 -3130651 -5677754 -3520065 184560 4971414 12145897
34272 12145897 19257645 21391462 18190959 14458202 13320533 13701203 14942533 18182662
$$ packed form
34331B95287Q209570O186241k073641p425024n561380r75114K71144j701405k450194
34322e224516m41010J476986J286848N31987J000015J923705J749019J43241k603697
34313a57422n488077n603761n94763O621777R494584N992012J303807L51045J750337
34304A3669539J985798J272973J406351J416942j99543j668766o12879J703450
34296A8973865K558161J789486J65158l092520p124320p428136k125672L223293
34288F939315K983380L77608K124393O847709P031578J289135l967598n302943
34280A8322577o073874q004671p374683k547103K157689L704625M786854P174483
34272A2145897P111748K133817l200503l732757j137669L80670J241330L240129
$$ plain form
34264 18182662 21437710 19147865 10211273 1981651 1704623 6906397 9201334 6038290
34256 6038290 3262144 5561933 9441846 8518484 2611778 -2477943 -3191988 -1809541
34248 -1809541 -804193 2083398 9516296 17910324 20287391 15756199 11338208 12919025
34240 12919025 18619866 23351164 25801200 27467308 28150126 26833247 25048055 25100600
34232 25100600 26168019 25960311 25028623 25436808 26190330 24282764 19746544 15454173 12429384
34223 12429384 9966749 10002033 15630812 24124845 27039011 20012466 8377775 580846
34215 580846 -114875 4939900 13994237 24515490 31974038 33632165 31851869 30071541
34207 30071541 27455263 21446591 13919202 10111578 11751759 15308828 17268540 17505587
$$ packed form
34264A8182662L255048k289845q936592q229622k77028N201774K294937l163044
34256F038290k776146K299789L879913r23362n906706n089721p14045J382447
34248a809541J005348K887591P432898Q394028K377067m531192m417991J580817
34240A2919025N700841M731298K450036J666108O82818j316879j785192N2545
34232B5100600J067419k07708r31688M08185P53522j907566m536220m292371l024789
34223A2429384k462635L5284N628779Q494033K914166p026545j1634691p796929
34215E80846o95721N054775R054337J0521253P458548J658127j780296j780328
34207C0071541k616278o008672p527389l807624J640181L557069J959712K37047
$$ plain form
34199 17505587 17071382 16360808 16414825 18427281 20350184 17443709 8834617 873456 566615
34190 566615 7022791 12763592 12937547 9793717 7817395 8197018 9842535 12680717 16824855
34181 16824855 20260937 20803127 19655643 19677409 20309141 18001001 12430513 8347150 9276402
34172 9276402 12827752 14769618 14432669 12811652 8695477 1449861 -4746810 -5183472
34164 -5183472 -2081532 -1749339 -4388351 -3489871 3002093 7844462 4654394 -2680107
34156 -2680107 -5750600 -2574004 2710130 7749975 13105724 17055727 16011541 10673103
34148 10673103 6336836 5914051 7237316 8357960 10448771 13257796 12747871 7293411
34140 7293411 2550471 5049294 12724528 17025031 14165013 9161891 7510146 7821791
$$ packed form
34199A7505587m34205p10574N4017K012456J922903k906475q609092p961161l06841
34190E66615O456176N740801J73955l143830j976322L79623J645517K838182M144138
34181A6824855L436082N42190j147484K1766O31732k308140n570488m083363R29252
34172I276402L551350J941866l36949j621017m116175p245616o196671m36662
34164e183472L101940L32193k639012Q98480O491964M842369l190068p334501
34156b680107l070493L176596N284134N039845N355749L950003j044186n338438
34148A0673103m336267m22785J323265J120644K090811K809025n09925n454460
34140G293411m742940K498823P675234M300503k860018n003122j651745L11645
$$ plain form
34132 7821791 5929230 2473841 1530751 3481624 4854552 5499035 9992812 19115795
34124 19115795 25036193 20214921 8391547 917623 3022259 9378892 13458711 15125008
34116 15125008 16962702 18837769 19834798 21286318 23738564 24338495 21434141 18525283
34108 18525283 18896789 19393974 15332155 9284947 8149044 12372291 15400784 14427443
34100 14427443 14309736 18624926 23738499 25218797 23946971 21507992 15355140 4444067
34092 4444067 -4847185 -5348833 907908 5908949 7133906 8964397 13257639 15817147
34084 15817147 13783308 10370567 9545861 10708951 11597655 12680930 15404653 18584465
34076 18584465 19387537 16466969 10666166 4455964 1405894 3287395 6512924 4907213
$$ packed form
34132G821791j892561l455389r43090J950873J372928O44483M493777R122983
34124A9115795N920398m821272j1823374p473924K104636O356633M079819J666297
34116A5125008J837694J875067R97029J451520K452246N99931k904354k908858
34108A8525283L71506M97185m061819o047208j135903M223247L028493r73341
34100A4427443j17707M315190N113573J480298j271826k438979o152852j0911073
34092D444067r291252n01648O256741N001041J224957J830491M293242K559508
34084A5817147k033839l412741q24706J163090Q88704J083275K723723L179812
34076A8584465Q03072k920568n800803o210202l050070J881501L225529j605711
$$ plain form
34068 4907213 -2015215 -6945843 -3488564 6119968 14609364 17638380 15071055 8190551
34060 8190551 389846 -2306701 2811985 9922667 10619629 4304468 -2308123 -5042253
34052 -5042253 -5744247 -6063556 -4240320 347440 5047545 8392246 11760230 14819556
34044 14819556 14707588 12020975 11728940 14723775 14391606 6379713 -3520595 -7082070
34036 -7082070 -4809767 -2870774 -2593892 -654625 2607511 3403374 2613614 5662088 13115935
34027 13115935 18503850 17403539 12402209 7095202 1784982 -2028004 133864 8096157
34019 8096157 13258843 8604869 -1185027 -5698751 -2251276 2909646 5271473 7003604
34011 7003604 10606384 13824254 13498750 10245676 6314164 1779586 -3924218 -8668672
$$ packed form
34068D907213o922428m930628L457279R608532Q489396L029016k567325o880504
34060H190551p800705k696547N118686P110682O96962o315161o612591k734130
34052e042253p01994l19309J823236M587760M700105L344701L367984L059326
34044A4819556j11968k686613k92035K994835l32169q011893r900308l561475
34036g082070K272303J938993K76882J939267L262136P95863p89760L048474P453847
34027A3115935N387915j100311n001330n307007n310220l812986K161868P962293
34019H096157N162686m653974r789896m513724L447475N160922K361827J732131
34011G003604L602780L217870l25504l253074l931512m534578n703804m744454
$$ plain form
34003 -8668672 -9496708 -7466133 -7307735 -11153673 -14959576 -13131572 -5484264 2619313
33995 2619313 6589014 6655811 5547516 5126028 6549470 10600494 15199002 15199911 8443246
33986 8443246 480563 -838383 5239938 12455469 16240563 17221507 15875094 9955504
33978 9955504 -78234 -8249596 -9721028 -6918575 -5309005 -5835403 -5320016 -2240974
33970 -2240974 1775918 5201835 8414666 12921993 20246351 29830545 36993953 36203350
33962 36203350 28276730 20532559 17300562 15005291 10395116 7991982 12847150 20294949
33954 20294949 21295715 15819077 12215838 13805312 14914615 11383348 6486369 3748527
33946 3748527 1620446 -886233 -115351 5851129 12112048 13198248 10188399 7187247
$$ packed form
34003h668672q28036K030575J58398l845938l805903J828004P647308Q103577
33995B619313L969701O6797j108295m21488J423442M051024M598508R09o756665
33986H443246p962683j318946O078321P215531L785094R80944j346413n919590
33978I955504j0033738q171362j471432K802453J609570n26398N15387L079042
33970b240974M016892L425917L212831M507327P324358R584194P163408p90603
33962C6203350p926620p744171l231997k295271m610175k403134M855168P447799
33954B0294949J000766n476638l603239J589474J109303l531267m896979k737842
33946C748527k128081k506679P70882N966480O260919J086200l009849l001152
$$ plain form
33938 7187247 4881611 2296119 1038270 2446395 3526967 1163223 -1937241 -933621
33930 -933621 3191984 4869381 2330770 -470258 -394900 997388 710575 -2207360 -7000897
33921 -7000897 -11898108 -13976080 -10987637 -3810958 4564734 11779046 16110588 15816672
33913 15816672 11703035 8537689 9754443 12013091 9704164 4023593 2107240 6925757
33905 6925757 13713829 17639253 19285464 20289027 19317652 16226587 15303734 19159116
33897 19159116 22588673 18256715 7248418 -1185526 -468701 6864918 14043458 17488466
33889 17488466 17817503 16380189 13540737 9853041 7075718 7101630 9888266 13016681
33881 13016681 14010429 12820792 11049475 9278921 7198173 6271218 9162460 15021441
$$ packed form
33938G187247k305636k585492j257849J408125J080572k363744l100464J003620
33930i33621M125605J677397k538611k801028P5358J392288k86813k917935m793537
33921g000897m897211k077972K988443P176679Q375692P214312M331542k93916
33913A5816672m113637l165346J216754K258648k308927n680571j916353M818517
33905F925757O788072L925424J646211J003563r71375l091065r22853L855382
33897A9159116L429557m331958j1008297q433944P16825P333619P178540L445008
33889A7488466L29037j437314k839452l687696k777323K5912K786636L128415
33881A3016681R93748j189637j771317j770554k080748r26955K891242N858981
$$ plain form
33873 15021441 18184064 14294902 6064924 237379 -38694 2800608 5365526 6953924
33865 6953924 8734857 11835093 16386043 20568326 20930336 15787231 7980389 2050487
33857 2050487 -852626 -2682532 -3766153 -1987814 2813789 7318447 9151264 9854927
33849 9854927 11668158 14097884 15836752 17469406 19382409 18888249 12830249 2412476
33841 2412476 -7407756 -13141959 -14967142 -13951241 -10034544 -3888390 1299709 1917325
33833 1917325 -2327540 -7749312 -10285454 -9746515 -9870229 -13376114 -17651671 -17434542 -12135979
33824 -12135979 -7744482 -9395046 -14146725 -14337254 -7351108 1316879 5128240 3584052
33816 3584052 948651 402931 1739582 3663286 5801918 7890279 8445341 5665202
$$ packed form
33873A5021441L162623l889162q229978n827545k76073K839302K564918J588398
33865F953924J780933L100236M550950M182283L62010n143105p806842n929902
33857B050487k903113j829906j083621J778339M801603M504658J832817P03663
33849I854927J813231K429726J738868J632654J913003m94160o058000j0417773
33841B412476r820232n734203j825183J015901L916697O146154N188099O17616
33833A917325m244865n421772k536142N38939j23714l505885m275557K17129N298563
33824a2135979M391497j650564m751679j90529O986146Q667987L811361j544188
33816C584052k635401n45720J336651J923704K138632K088361N55062k780139
$$ plain form
33808 5665202 -117473 -5609503 -7132258 -4241614 -186724 1411360 -310578 -3517497
33800 -3517497 -5424571 -3630205 2310932 9259784 12048240 8482645 1721904 -3663210
33792 -3663210 -6089302 -5480761 -253618 9980397 20209236 23840877 21146234 19050867
33784 19050867 21476981 25007759 26172030 27349042 31116885 33372406 28303822 17959880
33776 17959880 10442741 9018510 9214435 7691791 7753741 12771227 19021290 20095645
33768 20095645 15945145 12166970 10787531 7258707 -1270923 -8995686 -7200020 4274569
33760 4274569 15637654 18176912 13419979 9352244 10145076 12859946 13106149 10116617
33752 10116617 5594448 760901 -3575471 -5946929 -5343794 -2746589 -174237 1510953
$$ packed form
33808E665202n782675n492030j522755K890644M054890J598084j721938l206919
33800c517497j907074J794366N941137O948852K788456l565595o760741n385114
33792c663210k426092O08541N227143J0234015J0228839L631641k694643k095367
33784A9050867K426114L530778J164271J177012L767843K255521n068584j0343942
33776A7959880p517139j424231J95925j522644O1950N017486O250063J074355
33768B0095645m150500l778175j379439l528824q529630p724763J795666J1474589
33760D274569J1363085K539258m756933m067735P92832K714870K46203k989532
33752A0116617m522169m833547m336372k371458O03135K597205K572352J685190
$$ plain form
33744 1510953 3200714 6404489 11775240 18055497 22540047 23762503 23607791 25042829
33736 25042829 27672438 27810937 23630216 17784511 13595007 10926012 7760257 4093026
33728 4093026 2154549 3825859 9238584 16495686 21538340 20583741 15014754 11896502
33720 11896502 16593525 25906008 31445632 29243897 23183592 19018429 17751018 15792999
33712 15792999 10115795 2312847 -2431893 -928700 3681534 5076965 1524510 -2520984
33704 -2520984 -3782663 -4968518 -8897287 -11678066 -7207095 3366425 12345531 15204595
33696 15204595 14296256 12712518 10043051 5857884 2619169 2555887 4919870 8390642
33688 8390642 13184213 18722068 21966997 20443713 15115421 8638190 2616273 -1998588
$$ packed form
33744A510953J689761L203775N370751O280257M484550J222456j54712J435038
33736B5042829K629609J38499m180721n845705m189504k668995l165755l667231
33728D093026j938477J671310N412725P257102N042654r54599n568987l118252
33720A1896502M697023R312483N539624k201735o060305m165163j267411j958019
33712A5792999n677204p802948m744740J503193M610234J395431l552455m045494
33704b520984j261679j185855l928769k780779M470971J0573520Q979106K859064
33696A5204595r08339j583738k669467m185167l238715o3282K363983L470772
33688H390642M793571N537855L244929j523284n328292o477231o021917m614861
$$ plain form
33680 -1998588 -3795989 -2046798 2113486 6685225 10129442 11707116 12152803 13847622
33672 13847622 18074030 22115993 21751406 16988904 12645651 12609054 15916126 18888276
33664 18888276 18738379 14989656 9859409 6867626 6276415 3313487 -4694602 -10927127
33656 -10927127 -5439493 10680075 24740976 28010056 24561790 21537922 18699669 13545953
33648 13545953 9835216 12700170 19181332 21664625 18705803 15444083 14990684 16445314
33640 16445314 20244024 27793767 35353721 35652706 27878549 20305992 20026269 24197915
33632 24197915 24441625 17194886 7244845 2431227 6032610 13337074 15855766 10389102
33624 10389102 3032005 2211857 9284068 18791647 25938297 29507952 29087922 25285953
$$ packed form
33680a998588j797401J749191M160284M571739L444217J577674M45687J694819
33672A3847622M226408M041963l64587m762502m343253l6597L307072K972150
33664A8888276j49897l748723n130247k991783n91211k962928q008089o232525
33656a0927127N487634J6119568J4060901L269080l448266l023868k838253n153716
33648A3545953l710737K864954O481162K483293k958822l261720m53399J454630
33640A6445314L798710P549743P559954K98985p774157p572557k79723M171646
33632B4197915K43710p246739r950041m813618L601383P304464K518692n466664
33624A0389102p357097q20148P072211R507579P146650L569655m20030l801969
$$ plain form
33616 25285953 22694884 26444407 34163027 36966437 31006315 22925682 20433171 22241014
33608 22241014 22230992 20060641 21312169 27895311 34232265 34692390 30722929 27714942
33600 27714942 27003724 24451980 16993928 7615609 1877148 898510 518333 -2491134
33592 -2491134 -6173059 -6690047 -3491064 1093690 5739980 10751910 15444392 17652106
33584 17652106 16151361 11828925 6398057 1304388 -2454267 -4762126 -6088403 -5689049
33576 -5689049 -1553674 6027413 12543597 13802772 11463692 10959617 14225881 17454408
33568 17454408 16213473 10234071 2957400 -1318723 144621 6359415 12428419 13750996
33560 13750996 10906596 8574285 9519844 11693720 11648300 8917610 6090067 5381349 5780139
$$ packed form
33616B5285953k591069L749523P718620K803410n960122q080633k492511J807843
33608B2241014j0022k170351J251528O583142O336954M60125l969461l007987
33600B7714942p11218k551744p458052r378319n738461r78638l80177l009467
33592b491134l681925n16988L198983M584754M646290N011930M692482K207714
33584A7652106j500745m322436n430868n093669l758655k307859j326277L99354
33576e689049M135375P581087O516184J259175k339080n04075L266264L228527
33568A7454408j240935n979402p276671m276123J463344O214794O069004J322577
33560A3750996k844400k332311R45559K173876m5420k730690k827543p08718L98790
$$ plain form
33551 5780139 4022096 -880400 -5086266 -4567722 -1796982 -3275468 -9402387 -12472700
33543 -12472700 -7689206 -174218 3656858 5545852 9507388 12435330 10065940 8286445
33535 8286445 16973666 33261298 42163317 35503777 20458381 7450615 -184418 -1360937
33527 -1360937 7014990 23082760 36887162 40860185 37606612 32468062 25414185 16064820
33519 16064820 9422048 8948753 9554447 5237217 -1002957 -2733298 -1250435 -2372172
33511 -2372172 -4918322 -1710180 8450883 18034634 20921178 18678254 15423006 11997114
33503 11997114 7221898 1107284 -4994704 -9448680 -11156212 -10623801 -9380460 -7469755
33495 -7469755 -3879320 -470959 -1347248 -5885579 -7181481 -1198386 7358110 12956292
$$ packed form
33551E780139j758043m902496m205866N18544K770740j478486o126919l070313
33543a2472700M783494P514988L831076J888994L961536K927942k369390j779495
33535H286445Q687221J6287632Q902019o659540j5045396j3007766p635033j176519
33527a360937Q375927J6067770J3804402L973023l253573n138550p053877r349365
33519A6064820o642772m73295O05694m317230o240174j730341J482863j121737
33511b372172k546150L208142J0161063R583751K886544k242924l255248l425892
33503A1997114m775216o114614o101988m453976j707532N32411J243341J910705
33495g469755L590435L408361q76289m538331j295902N983095Q556496N598182
$$ plain form
33487 12956292 17730168 25528865 32024882 29079846 16888548 4122933 -2970129 -5081286
33479 -5081286 -5103115 -5701649 -9809166 -16041532 -15273132 -442095 20642914 31342032
33471 31342032 26067420 15697172 11773056 14194030 17319751 19322644 20466077 18942457
33463 18942457 13855929 7681837 1945904 -4613331 -10219998 -8360671 3132872 16156177
33455 16156177 21030835 17793312 13907977 13718415 15241541 15459791 13962098 11890033
33447 11890033 10472634 10093899 9125680 5321446 -286933 -3561751 -3026421 -2097568 -3031443
33438 -3031443 -2181989 4929551 16272555 25028400 27381727 25366398 22961976 22234298
33430 22234298 22752775 22550107 19880645 15138013 10324569 6462422 3409680 2172301
$$ packed form
33487A2956292M773876P798697O496017k945036j2191298j2765615p093062k111157
33479e081286k1829n98534m107517o232366P68400J4831037K1085009J0699118
33471C1342032n274612j0370248l924116K420974L125721K002893J143433j523620
33463A8942457n086528o174092n735933o559235n606667J859327J1493543J3023305
33455A6156177M874658l237523l885335j89562J523126K18250j497693k072065
33447A1890033j417399l78735r68219l804234n608379l274818N35330R28853r33875
33438c031443Q49454P111540J1343004Q755845K353327k015329k404422p27678
33430B2234298N18477k02668k669462m742632m813444l862147l052742j237379
$$ plain form
33422 2172301 4142719 7421421 7902458 5431763 4414579 6204576 6282405 2870108 2735217
33413 2735217 11783021 23521029 25185035 14951201 5393680 7898100 19760708 29822471
33405 29822471 31914365 28362525 23518164 19416000 17448437 19258017 23650772 25503965
33397 25503965 20965397 12884228 8126050 9424195 12851678 14054739 13369360 12606198
33389 12606198 10623964 6472242 4357720 9600508 19925797 26456081 24709879 19861246
33381 19861246 19085691 22879632 26724651 28164538 28996668 31817293 36403864 38958214
33373 38958214 34991447 24723199 14886337 12086867 14872904 16196228 13264568 9976305
33365 9976305 9217186 8462128 4885381 -170487 -3935074 -4925655 -1432910 7453521 17434836
$$ packed form
33422B172301J970418L278702M81037k470695j017184J789997P7829l412297j34891
33413B735217R047804J1738008J664006j0233834r557521K504420J1862608J0061763
33405B9822471K091894l551840m844361m102164j967563J809580M392755J853193
33397B5503965m538568q081169m758178J298145L427483J203061o85379p63162
33389A2606198j982234m151722k114522N242788J0325289O530284j746202m848633
33381A9861246p75555L793941L845019J439887Q32130K820625M586571K554350
33373C8958214l966767j0268248r836862k799470K786037J323324k931660l288263
33365I976305p59119p55058l576747n055868l764587r90581L492745Q886431R981315
$$ plain form
33356 17434836 21257452 17748177 13106346 11397105 10624941 10448071 14872976 22615445
33348 22615445 24014191 14733167 4493286 3864842 9787435 13560058 15849132 22108392
33340 22108392 28983076 28874099 24758331 26372213 32719548 32586609 23437006 15703591
33332 15703591 15248460 15258003 10841116 8894573 15782779 25772408 30478776 31365349 33822733
33323 33822733 35870837 32463047 26013082 23043553 23532957 22425448 19569231 19574403 22584719
33314 22584719 23181370 19145112 14655665 13360373 13625252 12426666 9733932 7119026
33306 7119026 5147835 4026204 4731899 7712258 11266300 12444622 10100367 7222575
33298 7222575 9027772 16842471 24915921 26553164 22629194 19140163 16479636 8598693
$$ packed form
33356A7434836L822616l509275m641831j709241p72164j76870M424905P742469
33348B2615445J398746r281024j0239881o28444N922593L772623K289074O259260
33340B2108392O874684j08977m115768J613882O347335j32939r149603p733415
33332A5703591m55131R543m416887j946543O888206R989629M706368Q86573K457384
33323C3822733K048104l407790o449965k969529M89404j107509k856217N172L010316
33314B2584719N96651m036258m489447j295292K64879j198586k692734k614906
33306G119026j971191j121631P05695K980359L554042J178322k344255k877792
33298G222575J805197P814699Q073450J637243l923970l489031k660527p880943
$$ plain form
33290 8598693 -4317583 -10588128 -1273453 16375128 28207881 31623982 34828304 40270010
33282 40270010 41015290 35284009 32706380 40207522 50712206 53698044 50507848 50126058
33274 50126058 53521877 52027106 40997490 26438721 16104818 11096071 9436525 11786187
33266 11786187 18548948 25278630 26646823 23312970 19964314 17564842 12837294 5813546
33258 5813546 2440178 7049147 16057640 22443547 23813337 22367612 18837924 11400986
33250 11400986 1202541 -5253750 -2097762 8890975 19519282 23370128 21260335 18104566
33242 18104566 16077967 13511161 10750794 13001640 23103129 33606373 32839911 20486849
33234 20486849 10535253 14250467 25568191 29967764 24177908 18733882 21922827 29965407
$$ packed form
33290H598693j2916276o270545R314675J7648581J1832753L416101L204322N441706
33282D0270010P45280n731281k577629P501142J0504684K985838l190196l81790
33274E0126058L395819j494771j1029616j4558769j0333903n008747j659546K349662
33266A1786187O762761O729682J368193l333853l348656k399472m727548p023748
33258E813546l373368M608969R008493O385907J369790j445725l529688p436938
33250A1400986j0198445o456291L155988J0988737J0628307L850846k109793l155769
33242A8104566k026599k566806k760367K250846J0101489J0503244p66462j2353062
33234B0486849r951596L715214J1317724M399573n789856n444026L188945Q042580
$$ plain form
33226 29965407 35046568 35286186 32731090 27630727 20098540 13539703 11048083 10553793
33218 10553793 8065104 4184075 3245435 6925744 12511830 17124032 20214152 21638689
33210 21638689 20146539 14832241 6824653 -826614 -4534134 -2404831 3883992 10415623
33202 10415623 15125117 19120715 22952489 23903395 19413225 11673067 5949211 4785186
33194 4785186 6118496 6824514 6047109 5049976 5453592 7708054 10223016 10363562 7326868
33185 7326868 3413250 1429006 1664303 2446303 2491301 1504686 6737 202383 5086218
33176 5086218 13981028 20502878 18717705 11170196 7093328 11690921 20333727 24812083
33168 24812083 22305189 15815260 8542062 2015210 -1033561 3000409 13054227 21498960
$$ packed form
33226B9965407N081161K39618k555096n100363p532187o558837k491620m94290
33218A0553793k488689l881029r38640L680309N586086M612202L090120J424537
33210B1638689j492150n314298q007588p651267l707520K129303O288823O531631
33202A0415623M709494L995598L831774R50906m490170p740158n723856j164025
33194D785186J333310P06018p77405r97133M03616K254462K514962J40546l036694
33185G326868l913618j984244K35297P82000M4998r86615j497949J95646M883835
33176E086218Q894810O521850j785173p547509m076868M597593Q642806M478356
33168B4812083k506894o489929p273198o526852l048771M033970J0053818Q444733
$$ plain form
33160 21498960 21609851 15786001 12585048 15791343 20602305 21579914 19553989 17663912
33152 17663912 15044424 9612906 4311041 4295134 8703379 11284157 9495998 7039673
33144 7039673 6362074 4943642 1339152 -1121556 -56033 1984744 3186511 6746272
33136 6746272 14420368 20754367 20228915 16479969 17036022 21031181 20095441 11400425 2387381
33127 2387381 771431 5732841 11280830 13500116 11894382 7502856 2625759 -574
33119 -574 189308 1496224 3012347 5146379 6784390 5617224 2526925 1868207 5408041
33110 5408041 9561821 11157858 12328453 16029543 19725001 18514225 13281516 10419167
33102 10419167 12790807 15769695 14506717 11202245 11326846 14953171 16804282 14848795
$$ packed form
33160B1498960J10891n823850l200953L206295M810962R77609k025925j890077
33152A7663912k619488n431518n301865j5907M408245K580778j788159k456325
33144G039673o77599j418432l604490k460708J065523K040777J201767L559761
33136F746272P674096O333999n25452l748946N56053L995159r35740q695016r013044
33127B387381j615950M961410N547989K219286j605734m391526m877097k626333
33119e74J89882J306916J516123K134032J638011j167166l090299o58718L539834
33110E408041M153780J596037J170595L701090L695458j210776n232709k862349
33102A0419167K371640K978888j262978l304472J24601L626325J851111j955487
$$ plain form
33094 14848795 13705739 17124005 21275100 19876097 13570219 8879470 8418889 7941736
33086 7941736 4545759 2307048 6109150 13415194 16272702 9951290 -2916585 -14796542
33078 -14796542 -17903985 -9643710 3691940 12173981 14806329 22563613 43203330 66967765
33070 66967765 75773017 65345228 49154868 39394454 33708332 24985066 15417042 12751868
33062 12751868 17417174 22023089 22265860 20804371 19802030 16346736 8007005 -1698145
33054 -1698145 -7012964 -6698957 -3866036 -479829 4563709 11694873 17782413 18663683
33046 18663683 13693774 6564740 1721663 518718 742513 -465335 -3149631 -4143298
33038 -4143298 -831956 4902567 8192692 7148137 5027531 4970301 5346556 3541232 2015795
$$ packed form
33094A4848795j143056L418266M151095j399003o305878m690749m60581m77153
33086G941736l395977k238711L802102P306044K857508o321412j2867875j1879957
33078a4796542l107443Q260275J3335650Q482041K632348P757284K0639717K3764435
33070F6967765Q805252j0427789j6190360r760414n686122q723266r568024k665174
33062A2751868M665306M605915K42771j461489j002341l455294q339731r705150
33054a698145n314819L14007K832921L386207N043538P131164O087540Q81270
33046A8663683m969909p129034m843077j202945K23795j207848k684296r93667
33038d143298L311342N734523L290125j044555k120606n7230L76255j805324j525437
$$ plain form
33029 2015795 5616263 13397837 18507718 17263714 13459127 11837704 12001003 11485991
33021 11485991 10721369 11598139 14342911 18809159 25691480 33365914 36652474 32212015
33013 32212015 22914794 14285528 9217140 8073001 10164686 12678322 12318060 10401572
33005 10401572 11295717 13629791 10461406 2258596 714792 12093077 25050450 25240693
32997 25240693 15449999 9507219 11451015 14294124 16317176 23308922 33904704 37131895
32989 37131895 28345770 16077736 9208660 7645664 9247863 15483683 25340143 32643086
32981 32643086 34422389 34599634 36027878 36598926 35752710 36098369 36043448 30455437 21527151
32972 21527151 18454870 22667867 24509908 19072883 13568426 13328429 12632772 6590467
$$ packed form
33029B015795L600468P781574N109881j244004l804587j621423J63299n15012
33021A1485991p64622Q76770K744772M466248O882321P674434L286560m440459
33013C2212015r297221q629266n068388j144139K091685K513636l60262j916488
33005A0401572Q94145K334074l168385q202810j543804J1378285J2957373J90243
32997B5240693r790694n942780J943796K843109K023052O991746J0595782L227191
32989C7131895q786125j2268034o869076j562996J602199O235820R856460P302943
32981C2643086J779303J77245J428244N71048q46216L45659n4921n588011q928286
32972B1527151l072281M212997J842041n437025n504457k39997o95657o042305
$$ plain form
32964 6590467 314615 -1858369 -4762225 -11112353 -13145098 -5298358 5517254 12163367
32956 12163367 18653020 28919922 36000191 33964324 28869091 26229812 21198628 14050090
32948 14050090 18779793 39664873 58611704 68756398 99026224 169625498 237599594
32941 237599594 232719666 149153232 58114099 18791075 17321765 11781166 -2696412
32934 -2696412 -5026220 4881853 8304257 3161762 3862606 11427507 11774029 1738784
32926 1738784 -7192103 -10988811 -17612164 -27978225 -31587785 -24782241 -17470626 -17496531
32918 -17496531 -21211148 -22759754 -20954984 -14294415 -756817 14071084 19257131 12917506
32910 12917506 5552324 5650312 10142707 12371846 11692393 11286867 12749388 16229598 20911616
$$ packed form
32964F590467o275852k172984k903856o350128k032745P846740J0815612O646113
32956A2163367O489653J0266902P080269k035867n095233k639279n031184p148538
32948A4050090M729703K0885080J8946831J0144694L0269826P0599274O7974096
32941B37599594m879928q3566434r1039133l9323024j469310n540599j4477578
32934b696412k329808R908073L422404n142495P00844P564901L46522j0035245
32926A738784q930887l796708o623353j0366061l609560O805544P311615k5905
32918a7496531l714617j548606J804770O660569J3537598J4827901N186047o339625
32910A2917506p365182R7988M492395K229139o79453m05526J462521L480210M682018
$$ plain form
32901 20911616 23252127 19655987 12175304 6585343 4325307 1826580 -2155470 -4898162
32893 -4898162 -5542558 -5553231 -2866212 6465355 18968624 24210141 18143499 9243342
32885 9243342 7271620 11633275 15055918 13822381 9707408 5311359 1856859 -155472
32877 -155472 -799343 -192673 2257050 6294881 10146579 15188245 28382374 52644702
32869 52644702 76103946 80945900 65176905 46135811 38537833 38537111 35222475 27926265
32861 27926265 22590083 18449655 10561703 2507912 4500192 17871011 31045967 33679173
32853 33679173 27760173 22031688 21542064 25935842 32665151 37425380 34999520 24645872
32845 24645872 13316410 9289119 12536331 14890800 10838010 4919037 5380660 12252001
$$ packed form
32901B0911616K340511l596140p480683n589961k260036k498727l982050k742692
32893d898162o44396j0673K687019R331567J2503269N241517o066642q900157
32885I243342j971722M361655L422643j233537m114973m396049l454500k012331
32877a55472o43871O06670K449723M037831L851698N041666J3194129K4262328
32869E2644702K3459244M841954j5768995j9041094p597978p22l314636p296210
32861B7926265n336182m140428p887952q053791J992280J3370819J3174956K633206
32853C3679173n919000n728485m89624M393778O729309M760229k425860j0353648
32845B4645872j1329462m027291L247212K354469m052790n918973M61623O871341
$$ plain form
32837 12252001 16647124 13194465 8123864 10557675 19214506 24320186 21553889 16455751
32829 16455751 13709536 10107046 2407235 -4694097 -4901631 -33582 3557016 5339319
32821 5339319 10291444 19671425 28827161 33934052 35196458 33922486 32417046 36023548
32813 36023548 47649881 59267455 57170958 39479273 21532573 18778067 29740310
32806 29740310 41578473 47259683 49202317 48819991 42409025 29484438 17553163 13873467
32798 13873467 16579582 18388832 16506966 14397943 15085492 17526080 20312492 24981478
32790 24981478 33431047 44242778 53457808 57282984 52595231 37724843 16360021 -1276053
32782 -1276053 -6508744 -2242316 -344437 -7225046 -16210791 -16776705 -6779999 9009929
$$ packed form
32837A2252001M395123l452659n070601K433811Q656831N105680k766297n098138
32829A6455751k746215l602490p699811p101332k07534M868049L590598J782303
32821E339319M952125R379981R155736N106891J262406j273972j505440L606502
32813C6023548J1626333J1617574k096497j7691685j7946700k754506J0962243
32806B9740310J1838163N681210J942634l82326o410966j2924587j1931275l679696
32798A3873467K706115J809250j881866k109023O87549K440588K786412M668986
32790B4981478Q449569J0811731R215030L825176m687753j4870388k1364822j7636074
32782a276053n232691M266428J897879o880609q985745n65914R996706J5789928
$$ plain form
32774 9009929 28602089 53317426 77931956 86705184 64225824 10933312 -51724418
32767 -51724418 -91669729 -86637618 -41515540 13285735 45616823 47034970 34054556
32760 34054556 25797425 25089928 21748512 8228649 -11705799 -26336339 -24974232 -6858509
32752 -6858509 15816818 26744125 20831884 8762360 4037614 8621666 14326000 14600652
32744 14600652 10245864 5927488 5896222 11506820 18418238 17777396 4874087 -14514283
32736 -14514283 -30552555 -39959600 -45088937 -45502062 -38831477 -29511568 -27019884 -32416852
32728 -32416852 -34788477 -25630179 -9858621 2842671 11042261 18606053 23911951 21634669
32720 21634669 13852293 9972028 13704769 17661181 14754145 9497610 12621374 26888669
$$ packed form
32774I009929J9592160K4715337K4614530Q773228k2479360n3292512o2657730
32767e1724418l9945311N032111M5122078N4801275L2331088J418147j2980414
32760C4054556q257131p07497l341416j3519863j9934448j4630540J362107J8115723
32752f858509K2675327J0927307n912241j2069524m724746M584052N704334K74652
32744A4600652m354788m318376l1266N610598O911418o40842j2903309j9388370
32736a4514283j6038272r407045n129337m13125O670585R319909K491684n396968
32728c2416852k371625R158298J5771558J2701292Q199590P563792N305898k277282
32720B1634669p782376l880265L732741L956412k907036n256535L123764J4267295
$$ plain form
32712 26888669 43341502 51631785 50178730 44535643 38476739 30246609 17990185 5765430
32704 5765430 961001 5864110 14393221 18279767 14833575 7540748 819493 -3631147
32696 -3631147 -5866859 -5479374 -1693518 4705549 10799005 14075723 15391573 17706551
32688 17706551 21323728 22753022 20025272 16385474 15338459 14295130 7998103 -2733792
32680 -2733792 -11193992 -13916491 -13859503 -13265322 -9521812 -1156733 7305683 10406575 7670333
32671 7670333 900376 -10226591 -25214378 -38395285 -42436845 -35280396 -21195098 -7088384
32663 -7088384 540067 -975471 -6790963 -7786376 -721062 8247263 12678649 13498242
32655 13498242 14209228 14727572 15307687 20347237 30956963 38860277 36119813 27240514
$$ packed form
32712B6888669J6452833Q290283j453055n643087o058904q230130j2256424j2224755
32704E765430m804429M903109Q529111L886546l446192p292827o721255m450640
32696c631147k235712L87485L785856O399067O093456L276718J315850K314978
32688A7706551L617177J429294k727750l639798j047015j043329o297027j0731895
32680b733792q460200k722499N6988N94181L743510Q365079Q462416L100892k736242
32671G670333o769957j1126967j4987787j3180907m041560P156449J4085298J4106714
32663g088384P628451j515538n815492r95413P065314Q968325M431386Q19593
32655A3498242P10986N18344N80115N039550J0609726P903314k740464q879299
$$ plain form
32647 27240514 23057969 25633913 28125267 27228699 26183152 26479430 25895515 24676241
32639 24676241 25184103 25593725 22368378 18824622 22352342 32430534 39784078 38485053
32631 38485053 31425881 23630398 17964280 17342811 22891507 29788009 32652522 33949164
32623 33949164 38752576 43873527 42780338 38716504 40327117 45921606 45754229 38773166
32615 38773166 32499403 27704402 19819263 14199606 20439359 31547447 30799831 20559423
32607 20559423 19455939 28634574 30431426 25727881 36931118 62782359 71762485 59785417
32599 59785417 64846395 87211257 46983904 -112728243 -310507200 -393675408 -319125460
32592 -319125460 -195326174 -132997844 -126063013 -110601726 -74257701 -51364902 -50239447
$$ packed form
32647B7240514m182545K575944K491354q96568j045547K96278n83915j219274
32639B4676241N07862M09622l225347l543756L527720J0078192P353544j299025
32631C8485053p059172p795483n666118o21469N548696O896502K864513J296642
32623C3949164M803412N120951j093189m063834J610613N594489j67377o981063
32615C8773166o273763m795001p885139n619657O239753J1108088p47616j0240408
32607B0559423j103484R178635J796852m703545J1203237K5851241Q980126j1977068
32599E9785417N060978K2364862m0227353j59712147j97778957q3168208P4549948
32592c19125460J23799286O2328330O934831J5461287L6344025K2892799J125455
$$ plain form
32585 -50239447 -45948940 -30315732 -20295068 -21148557 -19543103 -12206919 -10084138 -13853259
32577 -13853259 -12247151 -5329922 -5189874 -12125973 -12414475 -2252828 6183309 5804558
32569 5804558 3730757 5885324 8782301 10301618 13727823 17475625 14866401 7984910
32561 7984910 8446402 19842450 31335264 33273228 28380966 23098203 18129056 12582921
32553 12582921 8639584 7020459 4566126 -228410 -5154589 -9080425 -12162086 -11331214
32545 -11331214 -4011939 3464270 957547 -10583602 -19283389 -19279864 -16856083 -16660186
32537 -16660186 -13249967 -2072753 10961474 17854986 18918691 18527025 17411200 15372509
32529 15372509 15324062 18385057 20478873 19384789 19363154 23105111 25453588 22024933 18077110
$$ packed form
32585e0239447M290507J5633208J0020664q53489J605454P336184K122781l769121
32577a3853259J606108O917229J40048o936099k88502J0161647Q436137l78751
32569E804558k073801K154567K896977J519317L426205L747802k609224o881491
32561G984910M61492J1396048J1492814J937964m892262n282763m969147n546135
32553A2582921l943337j619125k454333m794536m926179l925836l081661Q30872
32545a1331214P319275P476209k506723j1541149q699787L525K423781J95897
32537a6660186L410219J1177214J3034227O893512J063705l91666j115825k038691
32529A5372509m8447L060995K093816j094084k1635L741957K348477l428655l947823
$$ plain form
32520 18077110 20506000 25770038 25152251 19205077 17128320 22206861 27067448 25027945
32512 25027945 18185416 11091976 3137112 -7814063 -18532424 -22994595 -20551245 -16720623
32504 -16720623 -15476973 -14723412 -11080559 -5835740 -2866133 -2538581 -1799044 227966
32496 227966 1464288 2362646 6651317 13958662 17091313 11188785 1153049 -5445572
32488 -5445572 -8718610 -12880654 -15808256 -11145613 -130303 7614237 6663913 1635491
32480 1635491 -1640045 -3635401 -6679033 -9161088 -8122371 -3317105 4208995 13535224
32472 13535224 21555240 23588539 18870160 11819367 6294191 2790856 2379839 7708090
32464 7708090 17632522 26148134 29531310 29878507 29405605 26920883 22753002 20896122
$$ packed form
32520A8077110K428890N264038o17787n947174k076757N078541M860587k039503
32512B5027945o842529p093440p954864j0951175j0718361m462171K443350L830622
32504a6720623J243650P53561L642853N244819K969607L27552P39537K027010
32496B27966J236322Q98358M288671P307345L132651n902528j0035736o598621
32488e445572l273038m162044k927602M662643J1015310P744540r50324n028422
32480A635491l275536j995356l043632k482055J038717M805266P526100R326229
32472A3535224Q020016K033299m718379p050793n525176l503335m11017N328251
32464G708090R924432Q515612L383176L47197m72902k484722m167881j856880
$$ plain form
32456 20896122 22133614 20814638 13327370 4674856 1479639 3011539 4347200 4031749
32448 4031749 3064525 385795 -4602911 -8354596 -7821029 -5731642 -5701493 -5532962 -1629858
32439 -1629858 3265445 4025693 2400667 4420080 9677786 11346049 7402385 4327178
32431 4327178 7703826 15259139 21504508 24126078 23326645 19260890 13034159 7325192
32423 7325192 3818400 2111671 2145997 5048876 10506608 16000494 19917013 22958074
32415 22958074 25143529 23916588 17453679 8585430 3078501 3556687 6223484 4868951
32407 4868951 -1608684 -7289881 -6601541 -2003207 -652195 -3938832 -5491796 -960834
32399 -960834 5741495 9034733 9173355 8620400 5814353 -1236366 -8586887 -10554159 -8431697
$$ packed form
32456B0896122J237492j318976p487268q652514l195217J531900J335661l15451
32448D031749r67224k678730m988706l751685N33567K089387L0149J68531L903104
32439a629858M895303P60248j625026K019413N257706J668263l943664l075207
32431D327178L376648P555313O245369K621570p99433m065755o226731n708967
32423G325192l506792j706729L4326K902879N457732N493886L916519L041061
32415B2958074K185455j226941o462909q868249n506929M78186K666797j354533
32407D868951o477635n681197O88340M598334J351012l286637j552964M530962
32399i60834O702329L293238J38622n52955k806047p050719p350521j967272K122462
$$ plain form
32390 -8431697 -8259141 -10926055 -11234011 -6579713 30920 5970454 11385272 14693697
32382 14693697 12596974 6817211 4401148 7966430 11151759 7738799 560494 -3375029
32374 -3375029 -3031755 -3357713 -7038879 -11179527 -11986165 -9129658 -5051790 -2357262 -2283945
32365 -2283945 -4100862 -5619235 -5070682 -2384667 1617428 6194597 9993781 10607174
32357 10607174 6591858 -77705 -4835721 -4441290 198343 5389022 8541686 9985127
32349 9985127 10758398 10089370 6902498 3123975 2709620 6830461 12658214 17877679 23355794
32340 23355794 29477448 32991289 30762033 24772640 20089910 18807381 18625336 16537550
32332 16537550 11753889 6168825 3922486 8740406 19243122 28496627 30647513 26478502
$$ packed form
32390h431697J72556k666914l07956M654298O610633N939534N414818L308425
32382A4693697k096723n779763k416063L565282L185329l412960p178305l935523
32374c375029L43274l25958l681166m140648q06638K856507M077868K694528P3317
32365b283945j816917j518373N48553K686015M002095M577169L799184O13393
32357A0607174m015316o669563m758016L94431M639633N190679L152664J443441
32349I985127P73271o69028l186872l778523m14355M120841N827753N219465N478115
32340B3355794O121654L513841k229256n989393m682730j282529j82045k087786
32332A6537550m783661n585064k246339M817920J0502716R253505K150886m169011
$$ plain form
32324 26478502 20615005 15993298 13558699 13918124 15497341 14214801 9255689 5984711
32316 5984711 8215387 10897360 6581325 -3461491 -11267469 -13307575 -12461319 -10424899
32308 -10424899 -6055937 -915653 1455929 2309702 6245390 12429472 14983672 12953686
32300 12953686 11578011 12181894 9875693 4151469 2535350 9039433 17123954 19633324
32292 19633324 18750260 20532202 25905919 32503081 39186380 43233178 39506807 28630662
32284 28630662 19664619 17938609 16725521 8845901 12555 554851 8493582 11973425
32276 11973425 6382508 -1583507 -6144029 -8273964 -8497411 -3734666 5765903 14036238
32268 14036238 17012843 16569914 14835121 10552569 3501238 -3180407 -7785353 -12009723
$$ packed form
32324B6478502n863497m621707k434599L59425J579217j282540m959112l270978
32316E984711K230676K681973m316035j0042816p805978k040106Q46256K036420
32308a0424899M368962N140284K371582Q53773L935688O184082K554200k029986
32300A2953686j375675O03883k306201n724224j616119O504083Q084521K509370
32292A9633324q83064J781942N373717O597162O683299M046798l726371j0876145
32284B8630662q966043j726010j213088p879620q833346N42296P938731L479843
32276A1973425n590917p966015m560522k129935k23447M762745R500569Q270335
32268A4036238K976605m42929j734793m282552p051331o681645m604946m224370
$$ plain form
32260 -12009723 -15504247 -13744016 -5130207 3845428 4911505 -2372391 -10284447 -11097268
32252 -11097268 -4056540 4423983 6753275 1761232 -3880632 -3708758 436523 1897257
32244 1897257 -665523 -2208400 -570730 -312756 -4700347 -9426776 -8466221 -2402435
32236 -2402435 3310828 5782699 6301249 6155771 4642410 897018 -4622186 -10160035
32228 -10160035 -13183241 -12395469 -10217473 -10832238 -14144784 -14550280 -8269228 833827
32220 833827 6171789 6816997 6587726 6320728 2706447 -4442203 -9139394 -6380058 1271439
32211 1271439 7786803 11762144 15987813 20272201 20291556 14977124 9969467 10051617 11786487
32202 11786487 8839826 2578024 894346 6168150 11187165 9864084 5910825 5987269
$$ packed form
32260a2009723l494524J760231Q613809Q975635J066077p283896p912056q12821
32252a1097268P040728Q480523K329292m992043n641864J71874M145281J460734
32244A897257k562780j542877J637670K57974m387591m726429R60555O063786
32236b402435N713263K471871N18550j45478j513361l745392n519204n537849
32228a0160035l023206P87772K177996o14765l312546m05496O281052R103055
32220H33827N337962O45208k29271k66998l614281p148650m697191K759336P651497
32211A271439O515364L975341M225669M284388J9355n314432n007657Q2150J734870
32202A1786487k946661o261802j683678N273804N019015j323081l953259P6444
$$ plain form
32194 5987269 9077455 9289439 6359696 5851550 9433682 12303517 11646185 10939053 12823855
32185 12823855 13368354 8000594 -430275 -4339017 -536052 7181717 13717515 17639412
32177 17639412 20489512 23543328 25792376 24339781 17338435 7285351 261141 594153
32169 594153 6856638 13771786 17016283 15650465 11604085 8057218 6975786 7060333 5384274
32160 5384274 1783153 -473592 406847 1846315 1264407 823424 4229347 10257994 13561580
32151 13561580 11699339 7550314 4394488 2435310 1209895 1513837 2939650 3166048
32143 3166048 2538658 5839202 15199590 23823019 22526891 12189045 4002898 6087450
32135 6087450 15028601 22936956 27496475 30665602 31715759 27920513 20781423 15726004
$$ packed form
32194E987269L090186K11984k929743n08146L582132K869835o57332p07132J884802
32185A2823855N44499n367760q430869l908742L802965P717769O535798L921897
32177A7639412K850100L053816K249048j452595p001346j0053084p024210L33012
32169E94153O262485O915148L244497j365818m046380l546867j081432Q4547j676059
32160E384274l601121k256745Q80439J439468n81908m40983L405923O028647L303586
32151A3561580j862241m149025l155826j959178j225415L03942J425813K26398
32143C166048o27390L300544R360388Q623429j296128j0337846q186147K084552
32135F087450Q941151P908355M559519L169127J050157l795246p139090n055419
$$ plain form
32127 15726004 15167318 16145507 15230534 11922912 7017023 1636147 -1672807 -908364 1859100
32118 1859100 3062497 3912077 8973851 17721580 23497781 22958923 20551203 20588320 20867953
32109 20867953 18155047 14305245 12124847 10352328 7844440 7414296 9801764 9561471
32101 9561471 3989086 427774 5932514 14709105 16339012 12629018 13893897 20196050
32093 20196050 20174962 10313309 1903921 4027858 11314814 15149147 16823405 21348765
32085 21348765 26232888 25652679 20661166 16764734 14669257 10853419 5210978 1842558
32077 1842558 3321326 8370141 13638001 15070248 10627169 4148220 2127105 4029851
32069 4029851 2018671 -5600589 -8292224 1994781 16405827 19146653 8215484 -3722751
$$ packed form
32127A5726004n58686R78189r14973l307622m905889n380876l308954P64443K767464
32118A859100J203397Q49580N061774Q747729N776201n38858k407720L7117K79633
32109B0867953k712906l849802k180398j772519k507888m30144K387468k40293
32101I561471n572385l561312N504740Q776591J629907l709994J264879O302153
32093B0196050k1088r861653q409388K123937P286956L834333J674258M525360
32085B1348765M884123n80209m991513l896432k095477l815838n642441l368420
32077A842558J478768N048815N267860J432247m443079o478949k021115J902746
32069D029851k011180p619260k691635J0287005J4411046K740826j0931169j1938235
$$ plain form
32061 -3722751 -7452935 -6328004 -6930725 -9710324 -11455188 -10534560 -7086357 -2574545
32053 -2574545 -591802 -4081220 -11119612 -17104463 -20574312 -22546643 -21305463 -13728893
32045 -13728893 -1786209 8120839 13025764 15447129 17235569 17027024 14766484 13206380
32037 13206380 13414957 13712134 14120927 16563325 19425060 17834173 11585883 7224368
32029 7224368 9310997 14516812 17482443 17978515 18790593 20467612 21774945 22152644 20599040
32020 20599040 15312786 7584844 2929180 4809936 9475953 10021149 3783476 -6191999
32012 -6191999 -14397521 -15738516 -8833211 600728 3061364 -4329180 -13341048 -14139562
32004 -14139562 -6672310 1469026 6047797 9614892 14569095 18303161 17180984 11995484
$$ packed form
32061c722751l730184J124931o02721k779599j744864R20628L448203M511812
32053b574545J982743l489418p038392n984851l469849j972331J241180P576570
32045a3728893J1942684R907048M904925K421365J788440k08545k260540j560104
32037A3206380K08577K97177M08793K442398K861735j590887o248290m361515
32029G224368K086629N205815K965631M96072Q12078J677019J307333L77699j553604
32020B0599040n286254p727942m655664J880756M666017N45196o237673r975475
32012f191999q205522j340995O905305R433939K460636p390544r011868p98514
32004a4139562P467252Q141336M578771L567095M954203L734066j122177n185500
$$ plain form
31996 11995484 6888224 4074722 1859147 -1646803 -4321757 -1953696 4905147 9037626
31988 9037626 4976300 -2531877 -3569238 3614319 10214474 9502214 5704929 6344101
31980 6344101 10810537 12287458 8106675 2116705 -2378196 -6585449 -12345558 -18242630
31972 -18242630 -21205042 -19982261 -15901671 -11003383 -5915805 212908 7038820 11111773
31964 11111773 8984043 2151840 -3958725 -6075794 -4768049 -253054 8114663 16739188
31956 16739188 18365769 11461751 3869380 2860953 6467391 9511272 12926362 20265350
31948 20265350 28873644 32243596 29068151 23001827 15406176 5662161 -2813296 -4840912
31940 -4840912 -1573096 1051969 1853687 4787946 9607650 10726643 7263019 5962882
$$ packed form
31996A1995484n107260k813502k215575l505950k674954K368061O858843M132479
31988I037626m061326p508177j037361P183557O600155p12260l797285O39172
31980F344101M466436J476921m180783n989970m494901m207253n760109n897072
31972a8242630k962412J222781M080590M898288N087578O128713O825912M072953
31964A1111773k127730o832203o110565k117069J307745M514995Q367717Q624525
31956A6739188J626581o904018p592371j008427L606438L043881L415090P338988
31948B0265350Q608294L369952l175445o066324p595651r744015q475457k027616
31940d840912L267816K625065Q01718K934259M819704J118993l463624j300137
$$ plain form
31932 5962882 10921185 17631327 20816948 21369634 21478286 19428270 14241811 10041294
31924 10041294 10604868 13881640 16267632 17826186 19113470 18055526 15023943 15649054
31916 15649054 22263874 27264871 22345665 10741161 2435756 -25453 -2163112 -5350922
31908 -5350922 -3723409 5003584 14148294 17393066 17317883 20116894 26103194 30278814
31900 30278814 30144541 28583369 29106821 31064500 30700416 26147018 19940231 15422738
31892 15422738 11779052 5916300 -568219 -1490847 4022734 7355927 1902282 -5723705
31884 -5723705 -3985358 6642741 14540574 14518609 14160762 19832485 26340614 26385981 22360828
31875 22360828 21153779 22732567 21968551 18348153 15858290 14889978 11698361 5671764
$$ packed form
31932E962882M958303O710142L185621N52686J08652k050016n186459m200517
31924A0041294N63574L276772K385992J558554J287284j057944l031583O25111
31916A5649054O614820N000997m919206j1604504q305405k461209k137659l187810
31908e350922J627513Q726993R144710L244772p5183K799011N986300M175620
31900C0278814j34273j561172N23452J957679l64084m553398o206787m517493
31892A5422738l643686n862752o484519r22628N513581L333193n453645p625987
31884e723705J738347J0628099P897833k1965l57847N671723O508129M5367m025153
31875B2360828j207049J578788p64016l620398k489863r68312l191617o026597
$$ plain form
31867 5671764 794310 -431243 937926 4417709 10724189 17559940 20311004 18601412
31859 18601412 17355676 19375478 21211897 18696017 12633626 6405518 1387462 -2362420
31851 -2362420 -3814223 -2527352 -486857 215313 -239671 -1281810 -3731471 -7208410
31843 -7208410 -8288359 -4420267 2162566 7394981 10256229 11514583 9936710 4097032
31835 4097032 -3562526 -9276654 -13694291 -19928319 -26227696 -26634894 -20138040 -13181820
31827 -13181820 -10638410 -10063174 -8449528 -8716018 -13667770 -18181624 -15152862 -7179878
31819 -7179878 -4256067 -9570669 -15276890 -14527088 -10641168 -10113168 -12137559 -11028275
31811 -11028275 -6000432 -2401485 -3807110 -7826002 -10332646 -10157414 -8528684 -6514553
$$ packed form
31867E671764m877454j225553J369169L479783O306480O835751K751064j709592
31859A8601412j245736K019802J836419k515880o062391o228108n018056l749882
31851b362420j451803J286871K040495P02170m54984j042139k449661l476939
31843g208410j079949L868092O582833N232415K861248J258354j577873n839678
31835D097032p659558n714128m417637o234028o299377m07198O496854O956220
31827a3181820K543410N75236J613646k66490m951752m513854L028762P972984
31819g179878K923811n314602n706221P49802L885920N28000k024391J109284
31811a1028275N027843L598947j405625m018892k506644J75232J628730K014131
$$ plain form
31803 -6514553 -4141502 -478113 5691178 13688122 19718983 20180921 16450986 13978804
31795 13978804 15915489 19889204 21965608 21327121 19438309 16891624 13691442 11452293
31787 11452293 12432330 16247933 19635954 20049103 18113385 16087288 15196233 15210359 15619603
31778 15619603 16217889 17021829 18419372 20890206 23520308 23211560 17194058 7045757
31770 7045757 -1473511 -4337853 -4003190 -5924053 -10676698 -12624197 -7517662 1484229
31762 1484229 7775985 9306323 9743881 12849240 18786102 25488734 30429362 30895172
31754 30895172 25895490 18964090 16339441 20587994 27477909 30165573 25366271 15588731
31746 15588731 7460242 7501789 16056439 24745476 23875675 13970522 5956642 7643524
$$ packed form
31803f514553K373051L663389O169291P996944O030861M61938l729935k472182
31795A3978804J936685L973715K076404o38487j888812k546685l200182k239149
31787A1452293R80037L815603L388021M13149j935718k026097q91055J4126M09244
31778A5619603N98286Q03940J397543K470834K630102l08748o017502j0148301
31770G045757q519268k864342L34663j920863m752645j947499N106535R001891
31762A484229O291756J530338M37558L105359N936862O702632M940628M65810
31754C0895172m999682o931400k624649M248553O889915K687664m799302r777540
31746A5588731q128489M1547Q554650Q689037q69801r905153q013880J686882
$$ plain form
31738 7643524 14430065 17014627 13922214 10865725 10742316 11056270 10353444 10445381 11282746
31729 11282746 9476888 3998919 -1325472 -3416707 -4212779 -6829192 -10632087 -12783655
31721 -12783655 -12312954 -10297568 -7877299 -6043891 -5862160 -7454582 -9986501 -12855856
31713 -12855856 -14752005 -12107749 -2710082 8535456 12722163 8234115 3810638 6669222
31705 6669222 12528467 12756684 7408746 4356736 7575485 13334684 17424532 19156112
31697 19156112 17435313 9841003 -1686018 -9883338 -10578578 -8036670 -8442185 -11663382
31689 -11663382 -13464371 -12785425 -11720375 -9769684 -3826094 5105542 9905681 5266619
31681 5266619 -4474160 -8821405 -2554844 8691261 15313941 14412202 11434781 11970786
$$ packed form
31738G643524O786541K584562l092413l056489j23409L13954p02826R1937Q37365
31729A1282746j805858n477969n324391k091235p96072k616413l802895k151568
31721a2783655M70701K015386K420269J833408J81731j592422k531919k869355
31713a2855856j896149K644256R397667J1245538M186707m488048m423477K858584
31705F669222N859245K28217n347938l052010L218749N759199M089848J731580
31697A9156112j720799p594310j1527021q197320o95240K541908m05515l221197
31689a1663382j800989O78946J065050J950691N943590Q931636M800139m639062
31681E266619r740779m347245O266561J1246105O622680r01739k977421N36005
$$ plain form
31673 11970786 15186374 16886342 16329106 16652780 19362474 21936135 21736637 19653984
31665 19653984 18422547 19185335 21291458 23967173 26085829 24975748 17958224 6082544
31657 6082544 -4973472 -9302769 -6099811 404426 6277542 11351278 16395367 19249906
31649 19249906 17016234 11184260 6647874 5376406 5211268 5562870 8722087 13085562
31641 13085562 11611812 2606892 -3346082 4701289 22081310 33149624 30933710 23185579
31633 23185579 18438983 16006533 13058155 12008894 14446645 14720680 7093499 -5057118
31625 -5057118 -13967694 -18087985 -21489755 -25420336 -27154261 -25758064 -22818247 -18332928
31617 -18332928 -11618357 -5605445 -4330770 -5975694 -3902446 4409670 13944229 18543848
$$ packed form
31673A1970786L215588J699968n57236L23674K709694K573661j99498k082653
31665A9653984j231437P62788K106123K675715K118656j110081p017524j1875680
31657F082544j1056016m329297L202958O504237N873116N073736N044089K854539
31649A9249906k233672n831974m536386j271468j65138L51602L159217M363475
31641A3085562j473750r004920n952974Q047371J7380021J1068314k215914p748131
31633B3185579m746596k432450k948378j049261K437751K74035p627181j2150617
31625e057118q910576m120291l401770l930581j733925J396197K939817M485319
31617a8332928O714571O012912J274675j644924K073248Q312116R534559M599619
$$ plain form
31609 18543848 16939747 12037000 8024827 8483223 13564016 18800239 20202067 19966929
31601 19966929 22928782 28352462 30925344 29557540 28281432 27288064 20757102 7123490
31593 7123490 -5235389 -7653364 -1574361 5666412 10901535 15282399 18172221 17618059
31585 17618059 15147828 13993866 13282662 9345276 2415916 -3012655 -4517049 -3715072
31577 -3715072 -1676842 2953583 10320721 17855557 23423982 26535478 26018863 20609067
31569 20609067 12695306 7083308 4578003 1309689 -3608822 -4933313 521170 7176184
31561 7176184 7587947 3072159 1257733 4284517 6000030 1796594 -4714251 -7510846
31553 -7510846 -6013157 -3444981 -631762 4040333 9822088 13071948 11820867 7732525
$$ packed form
31609A8543848j604101m902747m012173M58396N080793N236223J401828k35138
31601A9966929K961853N423680K572882j367804j276108r93368o530962j3633612
31593G123490j2358879k417975O079003P240773N235123M380864K889822n54162
31585A7618059k470231j153962p11204l937386o929360n428571j504394Q01977
31577c715072K038230M630425P367138P534836N568425L111496n16615n409796
31569B0609067p913761n611998k505305l268314m918511j324491N454483O655014
31561G176184M11763m515788j814426L026784J715513m203436o510845k796595
31553g510846J497689K568176K813219M672095N781755L249860j251081m088342
$$ plain form
31545 7732525 2958388 -2085923 -6623275 -7754727 -3112342 5571781 13220281 15624203
31537 15624203 12451370 7160262 4910711 9252786 18894584 27898279 30536268 26016080
31529 26016080 17660968 8571176 209540 -5541624 -6507747 -3585447 -871768 -132947
31521 -132947 2363339 10290296 20334019 25108106 22718809 18844034 18099485 17986101
31513 17986101 14376300 8879720 5754459 3876442 -1894731 -11115463 -15728085 -10342305
31505 -10342305 100308 6707319 7366123 6884447 8927040 12896622 17761095 23442114
31497 23442114 27590669 25966479 18368146 10558045 7459614 7032669 3976516 -2178519
31489 -2178519 -6054322 -3294470 4206867 10799847 13351804 13594936 14000439 12674837
$$ packed form
31545G732525m774137n044311m537352j131452M642385Q684123P648500K403922
31537A5624203l172833n291108k249551M342075R641798R003695K637989m520188
31529B6016080q355112r089792q361636n751164r66123K922300K713679P38821
31521a32947K496286P926957J0043723M774087k389297l874775p44549j13384
31513A7986101l609801n496580l125261j878017n771173r220732m612622N385780
31505a0342305J0442613O607011O58804m81676K042593L969582M864473N681019
31497B3442114M148555j624190p598333p810101l098431m26945l056153o155035
31489b178519l875803K759852P501337O592980K551957K43132M05503j325602
$$ plain form
31481 12674837 5016263 -8544697 -19731108 -21120392 -15744092 -12867514 -14884374 -14936606
31473 -14936606 -8909866 -2479253 -1954435 -4334843 -2656041 3330557 8923838 13684357
31465 13684357 20805609 28479066 29988739 23259299 13548405 5625596 -3879 -1700259
31457 -1700259 4730843 18036018 28250239 26842205 16553029 6731331 1948881 -432132
31449 -432132 -3810410 -7935072 -9981851 -7109695 897137 9529670 12184681 7203394
31441 7203394 78781 -3535362 -4069886 -4437280 -3665970 1187531 8787257 14253385 15706612
31432 15706612 15810210 16641131 16676094 13513464 6920024 -1211230 -7845241 -9906193 -6520811
31423 -6520811 -29609 6738553 13118456 18787216 21426795 19586648 16481501 16841718
$$ packed form
31481A2674837p658574j3560960j1186411j389284N376300K876578k016860n2232
31473a4936606O026740O430613N24818k380408J678802N986598N593281M760519
31465A3684357P121252P673457J509673o729440r710894p922809n629475j696380
31457a700259O431102J3305175J0214221j408034j0289176r821698m782450k381013
31449d32132l378278m124662k046779K872156Q006832Q632533K655011m981287
31441G203394p124613l614143n34524l67394P71310M853501P599726N466128J453227
31432A5706612J03598Q30921L4963l162630o593440q131254o634011k060952L385382
31423f520811O491202O768162O379903N668760K639579j840147l105147L60217
$$ plain form
31415 16841718 20294609 21780632 18717044 13896393 10635757 8950112 7999364 8780748
31407 8780748 11909518 14939968 14450325 10083683 5159113 3653320 6754132 11368318
31399 11368318 12126107 6418147 -2399996 -8220976 -8416784 -5253097 -1776514 922349
31391 922349 2197254 849525 -2775916 -5920618 -6514366 -5901194 -6942611 -10105166 -12559172
31382 -12559172 -10993026 -5080948 1518292 3961307 699599 -5389088 -10844402 -14854439
31374 -14854439 -17117391 -14990833 -6488512 5048176 13593756 17701983 20888474 24610202
31366 24610202 26150018 25121081 26308428 32019807 36182225 31812575 21998899 17147450
31358 17147450 21264237 26668500 24415051 15687406 9288159 9984932 13463353 13193628
$$ packed form
31415A6841718L452891J486023l063588m820651l260636j685645r50748P81384
31407H780748L128770L030450m89643m366642m924570j505793L100812M614186
31399A1368318P57789n707960q818143n820980j95808L163687L476583K698863
31391I22349J274905j347729l625441l144702n93748O13172j041417l162555k454006
31382a2559172J566146N912078O599240K443015l261708o088687n455314m010037
31374a4854439k262952K126558Q502321J1536688Q545580M108227L186491L721728
31366B4610202J539816j028937J187347N711379M162418m369650r813676m851449
31358A7147450M116787N404263k253449q727645o399247O96773L478421k69725
$$ plain form
31350 13193628 8969145 6220320 8321124 12881331 16271437 18592135 21622065 24099758
31342 24099758 23041268 19362834 18090476 21715780 26475486 26986347 22223196 15326360
31334 15326360 9873732 8231561 11190230 16529701 19495920 17466319 13295394 11633897
31326 11633897 12733454 12588773 9027998 4878747 4151953 6902250 9191858 7474116
31318 7474116 2121128 -3235289 -5294600 -3769039 -787494 1520144 2404755 2491170 3549517
31309 3549517 7368073 13170406 16922121 15357717 10036235 4790105 70786 -6082782
31301 -6082782 -11512955 -9947124 64074 11162030 16022008 16174192 17293150 19274688
31293 19274688 17490597 12369773 10577152 15503946 22323279 24626291 21357591 14851688
$$ packed form
31350A3193628m224483k748825K100804M560207L390106K320698L029930K477693
31342B4099758j058490l678434j272358L625304M759706N10861m763151o896836
31334A5326360n452628j642171K958669N339471K966219k029601m170925j661497
31326A1633897J099557j44681l560775m149251p26794K750297K289608j717742
31318G474116n352988n356417k059311J525561K981545K307638Q84611Q6415J058347
31309C549517L818556N802333L751715j564404n321482n246130m719319o153568
31301f082782n430173J565831J0011198J1097956M859978J52184J118958J981538
31293A9274688j784091n120824j792621M926794O819333K303012l268700o505903
$$ plain form
31285 14851688 6585517 -1448288 -4776003 -928924 5303932 5730664 -1601972 -10005690
31277 -10005690 -12423576 -9198549 -5690246 -4466388 -3229644 -300583 1367019 -2016988
31269 -2016988 -8779060 -12162677 -7475655 2780751 11321309 12286432 5161652 -5167496
31261 -5167496 -11368498 -8960738 -543662 6479110 7598570 4998196 2602796 289160
31253 289160 -4019677 -8956290 -10971425 -10253861 -10518897 -12100850 -10007702 -1304557 9408172
31244 9408172 15604984 17530463 20853191 27243633 30957039 26653075 17415126 11657075
31236 11657075 13017112 16700970 16694784 13689065 13232387 17468338 22254218 23047519 20591730
31227 20591730 19012039 20534535 24330551 28742530 31701069 30062685 22220485 11792102
$$ packed form
31285A4851688q266171q033805l327715L847079O232856M26732p332636q403718
31277a0005690k417886L225027L508303J223858J236744K929061J667602l384007
31269b016988o762072l383617M687022J0256406Q540558R65123p124780j0329148
31261e167496o201002K407760Q417076P022772J119460k600374k395400k313636
31253B89160m308837m936613k015135P17564k65036j581953K093148Q703145J0712729
31244I408172O196812J925479L322728O390442L713406m303964r237949n758051
31236A1657075J360037L683858o186l005719m56678M235951M785880P93301k455789
31227B0591730j579691J522496L796016M411979K958539j638384p842200j0428383
$$ plain form
31219 11792102 5512988 6131099 9778177 11815233 12850140 16557261 23230519 28790300
31211 28790300 30148359 28652497 27192588 26216254 24426845 21829195 19684471 18174915
31203 18174915 16711386 16339584 18630215 21405659 19341285 11337991 3964023 3573959
31195 3573959 7450532 7987228 4399158 3813219 9817965 16545143 17383570 14180538 13240892
31186 13240892 16167492 19735453 21962477 22847751 20897150 14705972 7709181 6075866
31178 6075866 10947059 16772017 18237199 15279614 10353523 4448926 -2252510 -8387083
31170 -8387083 -12283136 -13677454 -13267203 -11180719 -6463530 2045494 13657785 24245589
31162 24245589 28534171 25594058 20287322 17211020 15306790 11332086 6362979 4498266
$$ packed form
31219A1792102o279114O18111L647078K037056J034907L707121O673258N559781
31211B8790300J358059j495862j459909r76334j789409k597650k144724j509556
31203A8174915j463529l71802K290631K775444k064374q003294p373968l90064
31195C573959L876573N36696l588070n85939O004746O727178Q38427l203032r39646
31186A3240892K926600L567961K227024Q85274j950601o191178o996791j633315
31178F075866M871193N824958J465182k957585m926091n904597o701436o134573
31170h387083l896053j394318M10251K086484M717189Q509024J1612291J0587804
31162B4245589M288582k940113n306736l076302j904230l974704m969107j864713
$$ plain form
31154 4498266 6290791 8393578 9926752 14458995 24008037 34361139 38331942 32306898
31146 32306898 19307147 7044227 2244025 4877139 8837963 9789068 9713855 11171193
31138 11171193 11264098 6741957 1698487 2912735 9344213 14106870 15861424 19326239
31130 19326239 24182961 23524356 16192696 11275541 15612122 24517332 29685205 29145229
31122 29145229 24606048 16453935 7327776 3769671 7763162 12643780 13469918 14615206
31114 14615206 20133116 24270335 20924097 15824427 18010608 23983300 22695406 13729755
31106 13729755 7935528 10434573 15008948 16430243 16936554 18023108 16378847 11655943
31098 11655943 9172728 11052163 12786477 11999276 12303140 14729138 14049858 8558205
$$ packed form
31154D498266J792525K102787J533174M532243R549042J0353102L970803o025044
31146C2306898j2999751j2262920m800202K633114L960824R51105p5213J457338
31138A1171193R2905m522141n043470J214248O431478M762657J754554L464815
31130A9326239M856722o58605p331660m917155M336581Q905210N167873n39976
31122B9145229m539181q152113r126159l558105L993491M880618Q26138J145288
31114A4615206N517910M137219l346238n099670K186181N972692j287894q965651
31106A3729755n794227K499045M574375J421295N06311J086554j644261m722904
31098A1655943k483215J879435J734314p87201L03864K425998o79280n491653
$$ plain form
31090 8558205 5063080 7926051 10766857 6498876 -795050 -2426462 1134533 1981059
31082 1981059 -2183029 -5181097 -2244306 4173693 9358759 12020448 13760562 16149980
31074 16149980 19232513 21361145 21102535 20352859 23322560 30512200 36348903 35389965
31066 35389965 28410163 19874983 12466133 7224250 5702525 7567828 8478548 5001968
31058 5001968 186618 70345 5803565 13044056 18053383 20676037 22075464 22815978
31050 22815978 22696829 20517329 15808184 12459104 16769523 28471932 37956744 37447871
31042 37447871 30946864 26870381 24914411 18906174 10344106 8511087 15907379 23264114
31034 23264114 22492175 16613468 12739552 12418770 13937513 17657383 22716569 23328209
$$ packed form
31090H558205l495125K862971K840806m267981p293926j631412L560995Q46526
31082A981059m164088k998068K936791O417999N185066K661689J740114K389418
31074A6149980L082533K128632k58610p49676K969701P189640N836703r58938
31066C5389965o979802q535180p408850n241883j521725J865303R10720l476580
31058E001968m815350j16273N733220P240491N009327K622654J399427P40514
31050B2815978j19149k179500m709145l349080M310419J1702409R484812n08873
31042C7447871o501007m076483j955970o008237q562068j833019P396292P356735
31034B3264114p71939n878707l873916l20782J518743L719870N059186O11640
$$ plain form
31026 23328209 15364200 3816152 -2566941 -2200707 -576968 -915805 -906155 1786644 6575054
31017 6575054 12931723 20888609 27304858 26836481 19262246 11835122 11117803 15429193
31009 15429193 18793520 19726182 21352293 23889561 22833219 16543703 10858069 12008558
31001 12008558 17669423 19981219 16323946 11491719 8782987 5462229 134960 -1670628
30993 -1670628 4546207 12798950 12947122 5339216 1344931 8268041 20895440 30566771
30985 30566771 35938402 40380018 44045329 44367525 41512549 37798519 32945326 24543574
30977 24543574 12943642 2138348 -4231242 -5430086 -3003524 16247 288454 -2844615
30969 -2844615 -6140119 -6205691 -3422756 -351176 1944809 3629765 4345027 4820018 7951912
$$ packed form
31026B3328209p964009j1548048o383093L66234J623739l38837R650K692799M788410
31017F575054O356669P956886O416249m68377p574235p427124p17319M311390
31009A5429193L364327R32662J626111K537268j056342o289516n685634J150489
31001A2008558N660865K311796l657273m832227k708732l320758n327269j805588
30993a670628O216835Q252743J48172p607906l994285O923110J2627399R671331
30985C0566771N371631M441616L665311L22196k854976l714030m853193q401752
30977B4543574j1599932j0805294o369590j198844K426562L019771K72207l133069
30969b844615l295504o5572K782935L071580K295985J684956P15262M74991L131894
$$ plain form
30960 7951912 14152756 17499486 11856119 433733 -6216106 -2700046 5573238 10725108
30952 10725108 11514229 11315374 11105747 8824858 4165178 238473 63898 3048525 5344988
30943 5344988 3568646 -1300960 -4104705 -1013441 5472188 9015823 6735988 1466194
30935 1466194 -3374526 -7915268 -13502528 -18963071 -21237646 -18351476 -10732982 -1258658
30927 -1258658 5325758 5390952 307247 -4251587 -3790458 1762197 10155854 19091810 25790484
30918 25790484 28045150 27494485 28498467 31762330 32621554 28190216 22455195 20744982
30910 20744982 22444222 23312229 22101903 20087172 16377344 9262992 1123855 -3428560
30902 -3428560 -4037386 -4271344 -5082473 -4105030 -2019485 -3491922 -9195661 -12033726 -5532340
$$ packed form
30960G951912O200844L346730n643367j1422386o649839L516060Q273284N151870
30952A0725108P89121j98855k09627k280889m659680l926705j74575K984627K296463
30943E344988j776342m869606k803745L091264O485629L543635k279835n269794
30935A466194m840720m540742n587260n460543k274575K886170P618494R474324
30927a258658O584416O5194n083705m558834M61129N552655Q393657Q935956O698674
30918B5790484K254666n50665J003982L263863Q59224m431338n735021j710213
30910B0744982J699240Q68007j210326k014731l709828p114352q139137m552415
30902c428560o08826k33958q11129R77443K085545j472437n703739k838065O501386
$$ plain form
30893 -5532340 6731529 14044485 10079848 -952518 -9223337 -8714711 -1890305 4059912
30885 4059912 4978540 2835886 1235173 781398 1099596 4202544 11164607 17277062 16429104
30876 16429104 10184923 6307304 7042148 5305614 -4393712 -16757408 -21721957 -15841910
30868 -15841910 -3744564 8203615 15432394 15579511 10439912 5920976 5886417 7378556
30860 7378556 5538770 1365834 188179 3689495 8297484 11481241 15164643 21562979
30852 21562979 28556359 30742890 24158226 10258766 -3623322 -9104380 -4189864 4881555
30844 4881555 10862181 13035873 15511459 20075337 24073287 24504895 21287875 16844544
30836 16844544 14333180 15121525 16415227 13605293 6927619 2611739 4596261 8998053
$$ packed form
30893e532340J2263869P312956l964637j1032366q270819N08626O824406N950217
30885D059912R18628k142654j600713m53775L18198L102948O962063O112455q47958
30876A6429104o244181l877619P34844j736534r699326j2363696m964549N880047
30868a5841910J2097346J1948179P228779J47117n139599m518936l4559J492139
30860G378556j839786m172936j177655L501316M607989L183757L683402O398336
30852B1562979O993380K186531o584664j3899460j3882088n481058M914516R071419
30844D881555N980626K173692K475586M563878L997950M31608l217020m443331
30836A6844544k511364P88345J293702k809934o677674m315880J984522M401792
$$ plain form
30828 8998053 10801496 11524393 14314569 15665143 10045706 126042 -6514542 -9338214
30820 -9338214 -13685885 -18092012 -14126819 -1158541 10118665 13437781 15311241 21164778
30812 21164778 23830462 15490222 2654627 -2281948 1113546 3715349 3365593 6355191
30804 6355191 13443509 17124889 14879334 13865411 18479930 23158066 23075843 23408315 30342974
30795 30342974 38776537 37516795 24357681 8782925 267416 -273005 2881186 6865515
30787 6865515 11425497 16591684 21527565 24858363 25165141 21598938 14461415 5342262
30779 5342262 -2796230 -5950151 -1496844 8244157 16221332 16711328 11209332 6710093
30771 6710093 7994959 13112399 16787150 16348910 12718498 6896284 -1512523 -11381880
$$ packed form
30828H998053J803443P22897K790176J350574n619437r919664o640584k823672
30820i338214m347671m406127L965193J2968278J1277206L319116J873460N853537
30812B1164778K665684q340240j2835595m936575L395494K601803l49756K989598
30804F355191P088318L681380k245555j013923M614519M678136q2223L32472O934659
30795C0342974Q433563j259742j3159114j5574756q515509n40421L154191L984329
30787F865515M559982N166187M935881L330798L06778l566203p137523r119153
30779E342262q138492l153921M453307R741001P977175M89996n501996m499239
30771F710093J284866N117440L674751m38240l630412n822214q408807r869357
$$ plain form
30763 -11381880 -18167092 -17591943 -10676118 -2715085 2730355 6318348 9071658 9479954
30755 9479954 6750847 4342872 6578505 12431038 16073134 14078592 9368911 6910997
30747 6910997 7575741 8003434 5700565 2627739 3274413 9593190 18413055 24356727 25168907
30738 25168907 23459038 23307130 26205433 30199583 31377157 26150574 14541399 2183267
30730 2183267 -3513755 -982278 3837480 5138095 3872182 4269903 6661147 7670354
30722 7670354 5689985 1925823 -2864040 -8357939 -12123697 -11629648 -8684227 -7382241
30714 -7382241 -7507279 -4837303 1267888 5800777 5381988 2667175 993810 -670803
30706 -670803 -4025172 -6749169 -5685057 -1715181 2636417 7796796 14694859 19736673
$$ packed form
30763a1381880o785212N75149O915825P961033N445440L587993K753310M08296
30755I479954k729107k407975K235633N852533L642096j994542m709681k457914
30747F910997O64744M27693k302869l072826O46674O318777Q819865N943672Q12180
30738B5168907j709869j51908K898303L994150J177574n226583j1609175j2358132
30730B183267n697022K531477M819758J300615j265913L97721K391244J009207
30722G670354j980369l764162m789863n493899l765758M94049K945421J301986
30714g382241j25038K669976O105191M532889m18789k714813j673365j664613
30706f70803l354369k723997J064112L969876M351598N160379O898063N041814
$$ plain form
30698 19736673 17724562 9654524 2747984 1746921 4187722 5844257 7157253 11320537
30690 11320537 18086675 23030656 23095730 20243456 18242977 17456567 15091780 10247044
30682 10247044 5767380 3776961 2151027 -1748766 -5953878 -6569560 -4495684 -4442342
30674 -4442342 -6869254 -6488651 -1048328 3714215 2065332 -2715438 -2576569 4163502
30666 4163502 11218539 13280206 11732913 10817537 12009444 13611668 13261405 9408423
30658 9408423 2064072 -6585223 -13036848 -14643954 -11068077 -4313422 2340573 6758549
30650 6758549 10131835 15384810 22744970 28926839 31580426 31723747 30356637 26472854
30642 26472854 21261436 20177032 26170868 33987569 36569041 34447744 32440682 29391791
$$ packed form
30698A9736673k012111q070038o906540j001063K440801J656535J312996M163284
30690A1320537O766138M943981O5074k852274k000479p86410k364787m844736
30682A0247044m479664j990419j625934l899793m205112o15682K073876N3342
30674d442342k426912L80603N440323M762543j648883m780770J38869O740071
30666D163502P055037K061667j547293r15376J191907J602224l50263l852982
30658I408423p344351q649295o451625j607106L575877O754655O653995M417976
30650F758549L373286N252975P360160O181869K653587J43321j367110l883783
30642B6472854n211418j084404N993836P816701K581472k121297k007062l048891
$$ plain form
30634 29391791 19696923 5109323 -3985531 -1868054 5663255 11421992 16238048 22806923
30626 22806923 27148814 24275107 18232260 17812890 23644479 27445970 24373993 18869408
30618 18869408 16419678 15773951 12741136 7407459 3679981 3899818 7004831 10678653
30610 10678653 12747203 11169344 4980775 -4230345 -12619636 -16352897 -14119140 -8183675
30602 -8183675 -2794270 -603667 -592950 -49788 1999611 4252903 5130353 3872115 584790
30593 584790 -2785918 -2289603 4540870 14976791 23281094 26709683 26890540 25520207
30585 25520207 22435882 18867326 18410998 22106221 25624492 24388492 19010154 12555112
30577 12555112 5172332 -4057053 -11656088 -11723919 -3960997 4775297 8301285 7012378
$$ packed form
30634B9391791r694868j4587600r094854K117477P531309N758737M816056O568875
30626B2806923M341891k873707o042847m19370N831589L801491l071977n504585
30618A8869408k449730o45727l032815n333677l727478K19837L105013L673822
30610A0678653K068550j577859o188569r211120q389291l733261K233757N935465
30602h183675N389405K190603J0717N43162K049399K253292Q77450j258238l287325
30593E84790l370708M96315O830473J0435921Q304303L428589J80857j370333
30585B5520207l084325l568556m56328L695223L518271j236000n378338o455042
30577A2555112p382780r229385p599035o7831P762922Q736294L525988j288907
$$ plain form
30569 7012378 4920281 4614747 6854379 11250849 14645435 12264513 4088339 -2591709
30561 -2591709 -1101433 5984659 10569700 10012266 8983540 10427452 10956735 7812994
30553 7812994 4912523 7064663 11492900 11062168 5054971 715749 2567113 5410615
30545 5410615 1737772 -7067287 -11839060 -7284633 2050257 8624170 10862697 12602154
30537 12602154 16107940 19258376 19020201 14663683 7572096 680642 -1761186 2796940
30529 2796940 11267329 17092898 18083210 18938388 23398369 27239223 23601168 13435920
30521 13435920 5188203 3946940 6207462 7047965 7374839 10229068 13484857 11821209
30513 11821209 5683533 3381127 11745342 26861777 37045190 35220228 26285828 20729941
$$ packed form
30569G012378k092097l05534K239632M396470L394586k380922q176174o680048
30561b591709J490276P086092M585041n57434j028726J443912N29283l143741
30553G812994k900471K152140M428237m30732o007197m339222J851364K843502
30545E410615l672843q805059m771773M554427R334890O573913K238527J739457
30537A2602154L505786L150436k38175m356518p091587o891454k441828M558126
30529B796940Q470389N825569R90312Q55178M459981L840854l638055j0165248
30521A3435920q247717j241263K260522Q40503L26874K854229L255789j663648
30513A1821209o137676k302406Q364215J5116435J0183413j824962q934400n555887
$$ plain form
30505 20729941 22161169 23953840 18766033 8159300 101893 -873561 2863799 7475511
30497 7475511 11920318 15853225 17333031 14855181 9164990 1560844 -6867470 -12954725
30489 -12954725 -12203311 -4805429 2167450 2503056 -1216302 -1424757 4174949 10766948
30481 10766948 14390642 16700684 20265175 23272254 22031044 16777229 12015423 11336718
30473 11336718 13659327 14664983 10785202 1715096 -9566841 -18136076 -19438549 -12806053
30465 -12806053 -3685015 -3927 -3734152 -7565805 -3365153 7044910 14024299 12959591
30457 12959591 9261210 8764994 9533413 7730888 6168110 9971065 16659546 18311151
30449 18311151 13357746 9223160 11725499 17563702 19683716 15638597 7972004 -165460
$$ packed form
30505B0729941J431228J792671n187807j0606733q057407r75454L737360M611712
30497G475511M444807L932907J479806k477850n690191p604146q428314o087255
30489a2954725P51414P397882O972879L35606l719358k08455N599706O591999
30481A0766948L623694K310042L564491L007079j241210n253815m761806o78705
30473A1336718K322609J005656l879781r070106j1281937q569235j302473O632496
30465a2806053R121038L681088l730225l831653M200652J0410063O979389j064708
30457A2959591l698381m96216P68419j802525j562778L802955O688481J651605
30449A8311151m953405m134586K502339N838203K120014m045119p666593q137464
$$ plain form
30441 -165460 -6749217 -10335234 -10414708 -7758222 -3603528 830522 4641211 8677207 15298691
30432 15298691 23731240 27119761 18956420 2550646 -10756044 -13909429 -10221010 -6112777
30424 -6112777 -3311756 -1120270 -1408974 -6635184 -15410518 -23687584 -28433372 -27679257
30416 -27679257 -20130244 -8375657 357376 1278791 -1650487 -762002 5130408 10150499
30408 10150499 10470461 8828980 8586019 7847402 2932473 -4604545 -8448228 -5403039
30400 -5403039 200681 2189863 1115033 3431108 11328686 17803218 15935206 10028097
30392 10028097 10928881 20526136 28300298 25943582 18507546 15834996 18384305 18782263
30384 18782263 14375934 10023418 8558994 6239195 164553 -5709735 -5857142 -686131
$$ packed form
30441a65460o583757l586017p9474K656486M154694M434050L810689M035996O621484
30432A5298691Q432549L388521q163341j6405774j3306690l153385L688419M108233
30424f112777K801021K191486k88704n226210q775334q277066m745788P54115
30416b7679257P549013J1754587Q733033R21415k929278Q88485N892410N020091
30408A0150499L19962j641481k42961p38617m914929p537018l843683L045189
30400e403039N603720J989182j074830K316075P897578O474532j868012n907109
30392A0028097R00784R597255P774162k356716p436036k672550K549309L97958
30384A8782263m406329m352516j464424k319799o074642n874288j47407N171011
$$ plain form
30376 -686131 5211461 9853907 14667208 19475268 21104305 18161783 13981816 12368530
30368 12368530 12247999 9655262 4345864 578480 476629 930555 -156153 1063927
30360 1063927 7822683 14485944 12467235 3858622 815229 9120690 20149945 23350657
30352 23350657 19721940 17076382 17853237 18987290 19598326 20485874 18228879 8340943
30344 8340943 -5650855 -13644043 -10707224 -1661790 6819978 12827550 16600474 17221203
30336 17221203 14928338 12909777 14106440 18323794 23256323 25853659 23017901 14740141
30328 14740141 6495071 4178240 6315478 5811988 -152422 -6981510 -9992962 -9047582
30320 -9047582 -4473806 4877129 16125259 21142419 15983562 7205002 3764837 6312128
$$ packed form
30376f86131N897592M642446M813301M808060J629037k942522m179967j613286
30368A2368530j20531k592737n309398l767384j01851M53926j086708J220080
30360A063927O758756O663261k018709q608613l043393Q305461J1029255L200712
30352B3350657l628717k645558P76855J134053O11036Q87548k256995r887936
30344H340943j3991798p993188K936819R045434Q481768O007572L772924O20729
30336A7221203k292865k018561J196663M217354M932529K597336k835758q277760
30328A4740141q245070k316831K137238n03490n964410o829088l011452R45380
30320i047582M573776R350935J1248130N017160n158857q778560l440165K547291
$$ plain form
30312 6312128 9678628 12448646 17507899 24811536 30321064 32448052 33995993 36459461
30304 36459461 37030081 33348938 27813043 24533655 23781678 21716525 15283555 6373464
30296 6373464 1112384 4739373 16259238 28190747 32675042 28304835 20605453 15937375
30288 15937375 15611741 16176428 14838329 13442167 15939732 22120625 26102662 22846315
30280 22846315 14581497 7939019 5463863 3460969 -1483880 -7652364 -11428294 -12187714
30272 -12187714 -11656630 -10710112 -9223439 -7425698 -5115118 -802757 6216779 13756785
30264 13756785 18319688 18009955 12906627 4238940 -5045374 -10410610 -9008084 -2875393
30256 -2875393 2411720 2362922 -3098095 -9547997 -10961056 -4814424 4403108 8598458
$$ packed form
30312F312128L366500K770018N059253P303637N509528K126988J547941K463468
30304C6459461N70620l681143n535895l279388p51977k065153o432970q910091
30296F373464n261080L626989J1519865J1931509M484295m370207p699382m668078
30288A5937375l25634N64687j338099j396162K497565O180893L982037l256347
30280B2846315q264818o642478k475156k002894m944849o168484l775930p59420
30272a2187714N31084R46518J486673J797741K310580M312361P019536P540006
30264A3756785M562903l09733n103328q667687r284314n365236J402526O132691
30256b875393N287113m8798n461017o449902j413059O146632R217532M195350
$$ plain form
30248 8598458 4623687 -2002813 -3475736 1595567 7623011 9065649 6063432 3323409
30240 3323409 4688846 9100702 12079367 11503298 10559591 13079189 17514652 19209182
30232 19209182 17905432 18088775 21253907 23265107 21277486 17576885 13463810 5512986
30224 5512986 -6818859 -15373719 -12592954 -3447695 -9884 -5342833 -10819334 -9739996
30216 -9739996 -5351469 -2712940 -27500 6759348 15397563 19295951 16512094 12166095
30208 12166095 11688153 14556192 15657388 11710648 5539936 3473858 7990239 13913826
30200 13913826 13985614 8180731 4827060 10951103 23274261 31008253 27222528 15593166
30192 15593166 5502765 2264647 4016023 7294614 11960093 18471586 23356984 22035050
$$ packed form
30248H598458l974771o626500j472923N071303O027444J442638l002217k740023
30240C323409J365437M411856K978665n76069r43707K519598M435463J694530
30232A9209182j303750J83343L165132K011200j987621l700601m113075p950824
30224E512986j2331845q554860K780765R145259L437811n332949n476501J079338
30216i739996M388527K638529K685440O786848Q638215L898388k783857m345999
30208A2166095m77942K868039J101196l946740o170712k066078M516381N923587
30200A3913826P1788n804883l353671O124043J2323158P733992l785725j1629362
30192A5593166j0090401l238118J751376L278591M665479O511493M885398j321934
$$ plain form
30184 22035050 15602701 10218621 9153498 9949180 10383688 11765018 13865937 12312833
30176 12312833 5256548 -2167354 -4934102 -5235074 -6976799 -7840174 -4062295 745845
30168 745845 520866 -1708667 2725268 13105717 18145129 12210285 2931648 -1634102
30160 -1634102 -4225995 -10244589 -16043737 -14083673 -5430134 1678596 4043553 6279914
30152 6279914 11082268 13781969 9300518 123409 -5914097 -3976039 3857385 12133662
30144 12133662 17457455 19746067 19344546 15437700 8797434 4017524 5510724 11435376
30136 11435376 15064521 13080348 9541041 10359923 16386097 23269984 26083956 23159302
$$ packed form
30184B2035050o432349n384080j065123P95682M34508J381330K100919j553104
30176A2312833p056285p423902k766748l00972j741725q63375L777879M808140
30168G45845k24979k229533M433935J0380449N039412n934844r278637m565750
30160a634102k591893o018594n799148J960064Q653539P108730K364957K236361
30152F279914M802354K699701m481451r177109o037506J938058P833424Q276277
30144A2133662N323793K288612m01521l906846o640266m779910J493200N924652
30136A1435376L629145j984173l539307Q18882O026174O883887K813972k924654
$$ [...]
##END NTUPLES=NMR SPECTRUM
##END=
