##TITLE=31P_DE-80H_X3
 64 sc D2O
 26.2.2025
##JCAMPDX= 6.0         $$ Bruker NMR JCAMP-DX V2.0
##DATA TYPE= NMR FID
##DATA CLASS= NTUPLES
##ORIGIN= UXNMR, Bruker Analytische Messtechnik GmbH
##OWNER= root
$$ XWIN-NMR		Version 3.5
$$ Fri Jul 31 10:57:59 2026 Russian Standard Time (UT+4h)  Yarkov@DPX200
##.OBSERVE FREQUENCY= 81.013821
##.OBSERVE NUCLEUS= ^31P
##.DELAY= (6, 6)
##.ACQUISITION MODE= SIMULTANEOUS
##.ACQUISITION SCHEME= undefined
##.AVERAGES= 64
##.DIGITISER RES= 17
##SPECTROMETER/DATA SYSTEM= spect
##.PULSE SEQUENCE= zgpg30
##.SOLVENT NAME= D2O
##.SHIFT REFERENCE= (INTERNAL, D2O, 0, 243.863)
##AUDIT TRAIL= $$ (NUMBER, WHEN, WHO, WHERE, WHAT)
$$ ##TITLE= Audit trail, XWIN-NMR		Version 3.5
$$ ##JCAMPDX= 5.01
$$ ##ORIGIN= Bruker BioSpin GmbH
$$ ##OWNER= Yarkov
$$ C:/Bruker/XWIN-NMR/data/yarkov2/nmr/P31/2/audita.txt
$$ ##AUDIT TRAIL=  $$ (NUMBER, WHEN, WHO, WHERE, WHAT)
(   1,<2026-07-31 10:57:21.46 +0400>,<Yarkov>,<DPX200>,
      <created by zg, POWCHK disabled, PULCHK disabled
       configuration hash MD5:
       00 E9 B6 7A A2 85 ED C7 34 08 36 98 17 FE 4E 26
       data hash MD5: 32K
       1B 22 8B F3 55 01 54 CF AF E4 89 E9 EF 0E 13 D4>)
$$ ##END=
$$ 
$$ hash MD5
$$ 01 22 38 07 D3 91 F4 E5 EA 24 1B 0A E0 AF 39 35
##$RELAX= 
##$RELAX= 
##$RELAX= 
##$RELAX= 
##$RELAX= 
##$RELAX= 
##$RELAX= 
##$RELAX= 
$$ Bruker specific parameters
$$ --------------------------
##$DU= <C:/Bruker/XWIN-NMR>
##$EXPNO= 2
##$NAME= <P31>
##$PROCNO= 1
##$TYPE= <nmr>
##$USER= <yarkov2>
##$AMP= (0..31)
100 100 100 100 100 100 100 100 100 100 100 100 100 100 100 100 100 100 
100 100 100 100 100 100 100 100 100 100 100 100 100 100 
##$AQSEQ= 0
##$AQ_mod= 1
##$AUNM= <au_zg>
##$AUTOPOS= <>
##$BF1= 81.014009
##$BF2= 200.13
##$BF3= 200.13
##$BF4= 200.13
##$BF5= 200.13
##$BF6= 200.13
##$BF7= 200.13
##$BF8= 200.13
##$BYTORDA= 1
##$CFDGTYP= 0
##$CFRGTYP= 5
##$CHEMSTR= <none>
##$CNST= (0..31)
1 1 145 1 1 1 1 1 1 1 1 1 1 1 1 1 1 1 1 1 1 1 1 1 1 1 1 1 1 1 1 1 
##$CPDPRG= <waltz16>
##$CPDPRG1= <>
##$CPDPRG2= <waltz16>
##$CPDPRG3= <>
##$CPDPRG4= <mlev>
##$CPDPRG5= <mlev>
##$CPDPRG6= <mlev>
##$CPDPRG7= <mlev>
##$CPDPRG8= <mlev>
##$CPDPRGB= <>
##$CPDPRGT= <>
##$D= (0..31)
0 1 0 0 0 0 0 0 0 0.06 0 0.03 2e-05 3e-06 0 0 0.0002 0 0 0 0 0 0 0 0 0 
0 0 0 0 0 0 
##$DATE= 1785481040
##$DBL= (0..7)
120 120 120 11 120 120 24 19 
##$DBP= (0..7)
150 150 150 150 150 150 150 150 
##$DBP07= 0
##$DBPNAM0= <>
##$DBPNAM1= <>
##$DBPNAM2= <>
##$DBPNAM3= <>
##$DBPNAM4= <>
##$DBPNAM5= <>
##$DBPNAM6= <>
##$DBPNAM7= <>
##$DBPOAL= (0..7)
0.5 0.5 0.5 0.5 0.5 0.5 0.5 0.5 
##$DBPOFFS= (0..7)
0 0 0 0 0 0 0 0 
##$DE= 6
##$DECBNUC= <off>
##$DECIM= 4
##$DECNUC= <off>
##$DECSTAT= 4
##$DIGMOD= 1
##$DIGTYP= 9
##$DL= (0..7)
0 0 52 120 120 21 21 25 
##$DP= (0..7)
150 150 150 150 150 150 150 150 
##$DP07= 0
##$DPNAME0= <>
##$DPNAME1= <>
##$DPNAME2= <>
##$DPNAME3= <>
##$DPNAME4= <>
##$DPNAME5= <>
##$DPNAME6= <>
##$DPNAME7= <>
##$DPOAL= (0..7)
0.5 0.5 0.5 0.5 0.5 0.5 0.5 0.5 
##$DPOFFS= (0..7)
0 0 0 0 0 0 0 0 
$$ [...]
##$SUBNAM1= <"">
##$SUBNAM2= <"">
##$SUBNAM3= <"">
##$SUBNAM4= <"">
##$SUBNAM5= <"">
##$SUBNAM6= <"">
##$SUBNAM7= <"">
##$SUBNAM8= <"">
##$SUBNAM9= <"">
##$SW= 400.765351723535
##$SWIBOX= (0..15)
0 1 3 0 0 0 0 0 0 0 0 0 0 0 0 0 
##$SW_h= 32467.5324675325
##$TD= 32768
##$TD0= 1
##$TE= 0
##$TE2= 300
##$TE3= 300
##$TEG= 300
##$TL= (0..7)
0 120 53 12 22 120 120 120 
##$TP= (0..7)
150 150 150 150 150 150 150 150 
##$TP07= 0
##$TPNAME0= <>
##$TPNAME1= <>
##$TPNAME2= <>
##$TPNAME3= <>
##$TPNAME4= <>
##$TPNAME5= <>
##$TPNAME6= <>
##$TPNAME7= <>
##$TPOAL= (0..7)
0.5 0.5 0.5 0.5 0.5 0.5 0.5 0.5 
##$TPOFFS= (0..7)
0 0 0 0 0 0 0 0 
##$TUNHIN= 0
##$TUNHOUT= 0
##$TUNXOUT= 0
##$USERA1= <user>
##$USERA2= <user>
##$USERA3= <user>
##$USERA4= <user>
##$USERA5= <user>
##$V9= 5
##$VALIST= <valist>
##$VCLIST= <CCCCCCCCCCCCCCC>
##$VD= 0
##$VDLIST= <DDDDDDDDDDDDDDD>
##$VPLIST= <PPPPPPPPPPPPPPP>
##$VTLIST= <TTTTTTTTTTTTTTT>
##$WBST= 1024
##$WBSW= 4
##$XGAIN= (0..3)
0 0 0 0 
##$XL= 0
##$YL= 0
##$YMAX_a= 8859
##$YMIN_a= -7619
##$ZGOPTNS= <>
##$ZL1= 120
##$ZL2= 120
##$ZL3= 120
##$ZL4= 120
##$ABSF1= 60
##$ABSF2= -190
##$ABSG= 5
##$ABSL= 3
##$ALPHA= 0
##$AQORDER= 0
##$ASSFAC= 0
##$ASSFACI= 0
##$ASSFACX= 0
##$ASSWID= 0
##$AUNMP= <proc_1d>
##$AZFE= 0.1
##$AZFW= 0.5
##$BCFW= 1
##$BC_mod= 2
##$BYTORDP= 1
##$COROFFS= 0
##$CY= 9.86611175537109
##$DATMOD= 1
##$DC= 1
##$DFILT= <>
##$DTYPP= 0
##$F1P= 182.462994727601
##$F2P= 168.069089081705
##$FCOR= 0.5
##$FTSIZE= 0
##$FT_mod= 0
##$GAMMA= 1
##$GB= 0
##$INTBC= 1
##$INTSCL= 1
##$ISEN= 30
##$LB= 1.5
##$LEV0= 0
##$LPBIN= 0
##$MAXI= 11.51145
##$MC2= 0
##$MEAN= 0
##$ME_mod= 0
##$MI= 1.244541
##$NCOEF= 0
##$NC_proc= 0
##$NLEV= 6
##$NOISF1= 0
##$NOISF2= 0
##$NSP= 1
##$NTH_PI= 0
##$NZP= 1
##$OFFSET= 243.8632
##$PC= 1.4
##$PHC0= 1589.076
##$PHC1= 109.1595
##$PH_mod= 0
##$PKNL= yes
##$PPARMOD= 0
##$PSCAL= 0
##$PSIGN= 0
##$REVERSE= no
##$SF= 81.0140731611343
##$SI= 65536
##$SIGF1= 0
##$SIGF2= 0
##$SINO= 80
##$SIOLD= 65536
##$SREGLST= <31P.CDCl3>
##$SSB= 0
##$STSI= 0
##$STSR= 0
##$SW_p= 25641.0256410257
##$SYMM= 0
##$S_DEV= 0
##$TDeff= 0
##$TDoff= 0
##$TI= <>
##$TILT= no
##$TM1= 0
##$TM2= 0
##$TOPLEV= 0
##$USERP1= <user>
##$USERP2= <user>
##$USERP3= <user>
##$USERP4= <user>
##$USERP5= <user>
##$WDW= 1
##$XDIM= 64
##$YMAX_p= 0
##$YMIN_p= 0
$$ End of Bruker specific parameters
$$ ---------------------------------
##NTUPLES= NMR FID
##VAR_NAME=  TIME,          FID/REAL,        FID/IMAG
##SYMBOL=    X,             R,               I
##VAR_TYPE=  INDEPENDENT,   DEPENDENT,       DEPENDENT
##VAR_FORM=  AFFN,          ASDF,            ASDF
##VAR_DIM=   16384,         16384,           16384
##UNITS=     SECONDS,       ARBITRARY UNITS, ARBITRARY UNITS
##FACTOR=    3.08e-05,      1,               1
##FIRST=     0,             0,               0
##LAST=      0.5045964,     0,               0
##MIN=       0,             -7619,           0
##MAX=       0.5045964,     8859,            0
$$ Real data points
##PAGE= N=1
##DATA TABLE= (X++(R..R)), XYDATA
$$ [...]
11225i5r68J597l6j515K20K00J122l05oK97q70p5k9N7N21qP26j112O10r36J799
11246A194q76l07o84q3J154r92Q58j678K307q1j984J307m90L65p63P48j09J35
11264B1O67j956R15R60N1p20p34J372j521M04l44R41l8m56J30j348J911m1L88
11283F02l12q80R88o58L51o83j47J298j537J628k330K366j058J051N86k514J819
11300E70l89J62o97J67Q90k04N36j699K98M04O26j090p2J937k396J069M85j259
11318f62J051k8m99p88J767q99N34N41j080N95r91L62Q09m64k84J034o80L28p61
11337a15O55j914J345J14j57o9k51R03k012J964l87j395O12N05K34p07J246j042
11355d71K97R01j308J539k033J835k01K76r94j070J544j646K589o80N61j319q44
$$ plain form
11225 -95 -1063 534 498 -1017 -797 -597 525 220 214 511 -359 -434 -463 -406 115 107 833 -279 331 -605 1194
11246 1194 318 11 -673 -756 398 -594 264 -1414 893 812 -1172 135 -355 10 -753 -5 -114 21
11264 21 688 -1268 -353 607 658 -62 -796 576 -945 -541 -885 56 18 -438 -308 -1656 255 214 602
11283 602 290 -590 398 -260 91 -592 -739 559 -978 650 -1680 686 -372 679 1265 -1249 570
11300 570 181 343 -354 -187 703 499 1035 -664 -366 38 664 -426 -498 1439 -957 112 597 -662
11318 -662 389 361 -138 -926 841 -58 476 1017 -63 532 -459 -97 712 248 -36 998 318 646 -115
11337 -115 540 -1374 -29 85 -72 -141 -392 511 -1501 463 76 -1319 -707 -202 32 -675 571 -471
11355 -471 -174 727 -581 958 -1075 760 559 835 -159 -1229 315 -1331 1258 578 1139 -180 -1024
11372a024M34N40K26m95J479j712n6L85j637L102j460N63K1j546J655r19J057
11389F13j74Q8q37K42K44m38P23m97L72k08j350J565q46N24J15j223J85K49M95
11408a58j129N18L25L22J474j675M68N5J91q3o0l62k94m49J598j159N44J91o66
11427c49N48j305J369j589K194r60J010j353L37J068j366P71j047J761j690K98
11443c03K39j207J989j618K572j833m55Q43j020J480l33k2p45N87j26p86M34P
11461b97J511j434K74O0p55Q9l87P58l88J91Q76q31J055j345J738j692P04q71
11479g44l2J006p21P33m05N06l89L55J86m61J90P8K99J41p47p1j93k16j5P05l54
11500a49K95j00j072O30M30j87n33j97L39L64J175o59j383J826j132Q98k64K20
$$ plain form
11372 -1024 -590 -50 176 -319 1160 -552 -608 -223 -1860 1242 -218 345 366 -1180 475 -444 613
11389 613 439 527 -310 -68 176 -262 461 -36 336 128 -1222 343 -503 21 136 -1087 -902 -653 -158
11408 -158 -1287 -769 -444 -122 1352 -323 145 200 391 308 248 -114 -408 -857 741 -418 126 317 -349
11427 -349 199 -1106 263 -1326 868 -92 918 -435 -98 970 -396 375 -672 1089 -601 -303
11443 -303 -64 -1271 718 -900 1672 -161 -616 227 -793 687 354 332 -413 174 48 -738 -304 -297
11461 -297 1214 -220 54 114 -641 -552 -939 -181 -569 -378 498 -333 722 -623 1115 -577 127 -744
11479 -744 -776 230 -491 242 -163 343 -46 309 495 34 224 302 601 742 -5 -76 -269 -485 -500 205 -149
11500 -149 146 46 -1026 -396 34 -153 -686 -883 -544 -180 995 336 -1047 779 -353 545 281 501
11518E01K30j798J563n25m59P31j226K017k096J690j262P93R60r01J071k149K171
11535A311j006k31L93n94K333k509J233r85Q53p48k07J792j754P49j753J176M93
11552E46j023N39n98J236j739K91J117j399J482l06J77l41p32j18J229Q19k182
11569a002J302j485J042j278P20R57r84J673j849P53R22j590P57n92J791j316
11585a79K25l97L29j28M81j75J01J12k16N84l93K7p32P94p57k75M47J759k234
11604f27J027p0p9j00p63O42k56j24L86j634K408j487N88K84O86K2j218J082j315
11623e48K97L52J23j62m94J525j843L34O58K84K23j424J968k509Q63P41j376J942
11641I54j186j49K50M44r23M2J266j232m71m40J421N59j914J89Q64J506j849P86
$$ plain form
11518 501 731 -1067 496 -29 -488 243 -983 1034 -1062 628 -634 159 1119 218 1289 -860 1311
11535 1311 305 74 467 -127 2206 -303 930 -55 798 50 -157 1635 -119 630 -1123 53 546
11552 546 -477 62 -536 700 -1039 -748 369 -1030 452 146 323 -18 -750 -868 361 1180 -1002
11569 -1002 300 -1185 -143 -1421 -701 256 -728 945 -904 -151 771 -819 -62 -654 1137 -179
11585 -179 46 -351 -22 -150 331 156 257 369 153 737 344 371 -361 433 -324 -599 -152 1607 -627
11604 -627 400 330 251 151 -612 30 -226 -350 36 -1598 810 -677 -89 195 881 903 -315 767 -548
11623 -548 -251 101 224 62 -432 1093 -750 -416 242 526 749 -675 1293 -1216 -353 388 -988 954
11641 954 -232 -381 -131 313 -610 -568 698 -534 -1005 -1445 -24 535 -1379 -1190 -326 1180 -669 117
11659A17p00Q89p44n07J625j401J073n43jQ98o85J44l77M87l72O65m14n76P64
11678C42r01J206o64m06J47J82K21r11R92N05j635J311q01Q88k98l71O74l19n3
11697A09l43P49J04j587J123o73R63j70q9N05r76Q67j688J891r76q22J211j173
11715i75J633q62M56L57l38J042j903Q00r84J736M2l70n50n82J630k659J818p74
11733d83J313n48j363R71j052K040n14o72N45m20R56k253J579J15J35L16j212
11750e47jR9O91k4o50Q38j204J543j202j10R71j014K37P24J294j718Q96J60j089
11769a06R37o35Q28j403Q70r94J39J158q44O38j305J09l83J250Q97j861J458j654
11787i01R22K68q61L17J376q13N67l57j034M58M90m19N67M92j758J109n94J93
$$ plain form
11659 117 -583 306 -438 -945 680 -721 352 -191 -192 706 21 165 -212 275 -97 568 154 -422 342
11678 342 -559 647 -17 -423 -276 -94 127 -784 208 713 -922 389 -412 476 178 -193 481 162 109
11697 109 -234 515 619 -968 155 -518 445 275 186 691 -285 582 -1106 785 -191 -1013 198 -975
11715 -975 658 -204 252 609 271 1313 -590 210 -774 962 1004 634 84 -498 1132 -1527 291 -483
11733 -483 830 282 -1081 -110 -1162 878 364 -308 237 -183 773 -1480 99 214 349 665 -547
11750 -547 -548 -449 242 218 -432 406 -798 745 -457 -567 404 -610 -373 351 1645 -73 823 983 -106
11769 -106 831 196 1024 -379 491 -503 -364 794 -50 588 -717 -608 -991 259 1156 -705 753 -901
11787 -901 21 289 -572 -255 1121 308 875 518 -516 -58 432 13 580 1072 -686 423 -171 22
11805B2R20j721P30p55Q30n9N18j160p0J383n87O38j69m88J169j667J317j362
11823e11O98p53Q70J8p95J964j724J589k692Q66M25l77J624j874J449j37p39J405
11841A306l81N31j001j87j59L96j419J476l35k03o7n00J129p06p76J971j330Q55
11859F00r34k27J008p05J002p71L78q17k53K04J034m94p10M3J13J416q49m15J144
11878G67j090J109r29K55N17m12L90Q6N90j307k45J49l99Q09n42N32p01q8l14
11897h23O36K24L97m70K51j331K470k484O1J281m68J623j276J252j672J8J407
11914A096p69P09k164N85P94K36m03L4J068j126M23q35M08O8M36O64j939J115
11932D00j387K066n24m75O41j449J917j440r17J927l14J72j783Q84p76J402m83
$$ plain form
11805 22 942 -779 -49 -804 26 -33 485 -675 -745 638 51 689 520 32 1201 -466 851 -511
11823 -511 187 -566 304 322 -473 1491 -233 1356 -1336 -470 -45 -422 1202 -672 777 640 -99 1306
11841 1306 925 1456 455 268 109 505 -914 562 227 24 -43 -543 586 -120 -896 1075 -255 600
11859 600 -334 -561 447 -258 744 -27 351 -466 -719 -515 519 25 -685 -642 -529 887 38 -377 767
11878 767 -323 786 -143 112 629 217 607 693 1283 -24 -269 -120 -519 290 -252 280 -421 -509 -823
11897 -823 -187 37 434 -36 215 -1116 1354 -1130 -1069 212 -256 1367 91 1343 -329 -311 1096
11914 1096 327 1036 -1128 -543 251 487 84 118 1186 60 483 -352 56 124 560 1224 -715 400
11932 400 -987 1079 555 80 721 -728 1189 -251 -1168 759 445 617 -1166 -282 -1058 344 -139
11949a39J15O3l35N05o25R78l11j69k75m75K36M92n69J001j421J804k203K899
11967A571k636j28P40l9K178k087J338j214J433Kj036J023j083p6k49j10M41p47
11985f79K60J02J008n94o25J43K48J032p45j65k41M11j83r19J541j449L39Q24
12003C08p38K41p4J315o21j233J933r84P05k151R83N46r52K49L25J225r97j31
12021e1K13r78M28q40J866k571K277L41r17J195o99P17j367J225r9l29j328k28
12039a145J248r71J158K47k049J500j693J589L6N02J35p94K60m45Q79p04R65J69
12057H87R8p63o48Q80j754K34J343l13N74N14P6r96O02j709K43J094o88j22Q02
12076C54M24m70r28L91N72n32K55p37J866j594K143p87j038Q4J088j053m32Q01
$$ plain form
11949 -139 -24 39 -296 209 -416 562 251 82 -193 -668 -432 60 -509 492 -929 875 -1328 1571
11967 1571 -1065 -1193 -453 -492 1686 -401 937 -277 1156 1158 122 1145 62 -14 -263 -373 68 -679
11985 -679 -419 -317 691 97 -528 -385 -137 895 150 -15 -256 155 -28 -947 594 -855 -516 308
12003 308 -430 -189 -263 1052 431 -802 1131 147 852 -1299 -316 230 -722 -473 -148 1077 80 -51
12021 -51 162 -816 -388 -1228 638 -1933 344 685 -232 963 264 981 -386 839 740 411 -917 -1145
12039 -1145 103 -868 290 537 -1512 -12 -1705 -116 -80 422 557 -237 23 -422 457 -247 718 887
12057 887 985 222 -426 454 -1300 -1066 277 -36 538 1052 1128 132 734 -975 -732 362 -326 -448 354
12076 354 778 308 -620 -229 343 -189 66 -671 1195 -399 1744 957 -81 3 1091 38 -394 407
12094D07k0R48j379m3M84j312R60q74M96J455j315n33n73J151j4k87J263j894
12112a080J902r16m4p85J910J24j850J393j183J561j391N65J4j419J541o66l60
12129f84J063j150J881j831K73q9J509j954R97q91O32j67J138L5l73l05o54L68
12147b02O93k056K009r77o2J265j649J737j078M32J66l86k04N39Q5p10O78J04
12165C84j517K373k144N88m53J39J677j717J249j304NO77N4l31P02j03o26n3P48
12184C48m8j0j389J841j515N24j0p93J277o92J774j340j00m7n10J962j480k92
12202e00m36P41J014k110Q74O54J127r02m5O4o58K75j035m48K051m71p98m34K233
12221A196l216K039o76P12k09j045J842n38J219k141Q88o01R05P0q66R50k98l62
$$ plain form
12094 407 387 1335 -44 -87 397 -915 45 -829 -333 1122 -193 -726 -1299 -148 -162 -449 814 -1080
12112 -1080 822 -94 -138 -923 987 1111 -739 654 -529 1032 -359 206 220 -1199 342 -324 -684
12129 -684 379 -771 1110 -721 -448 -537 972 -982 15 -876 -244 -411 727 762 389 84 -570 -202
12147 -202 491 -1565 444 -533 -595 670 -979 758 -320 112 278 -108 -312 227 312 -398 280 384
12165 384 -1133 1240 -904 -316 -769 -630 1047 -670 579 -725 -720 -43 11 -320 382 279 -347 -400 348
12184 348 300 290 -1099 742 -773 -249 -259 -1052 225 -467 1307 -33 -133 -180 -690 1272 -208 -500
12202 -500 -936 -195 819 -1291 -417 237 1364 462 417 481 -177 98 -937 -1385 666 195 -603 -1037 1196
12221 1196 -2020 19 -657 55 -154 -1199 643 105 1324 -817 71 -530 375 445 -421 529 231 -131
12239a31N2q76J201j99K71N2j33j09j167R14n53J027k77Q1M8J59K18j17m23K39
12259B77M78k66k10j96l77J080j228R77r18K28J187j504N11J349j846J491j642
12276f09J102p08M85P84n93N2j178J484m95n66J166p62L76q26o53P97m03K191
12294A644k740K749j301m10L1o73J504j809J769j718J92O50p02J904j989J294
12310C95j452M18M4q42K753k214O93mj39N38j164L254k291K50r35O54m07J107
12328F58p78m8Q69j386R15j109p59K249j084J810j146j214J097k008K945j331
12344c20K95m8l74l6j03P94N93l38j72L05j952P58JP74q91J554j035Q86j246N13
12364d2P84j023j06L13M66j085J586q07R52j173j37O59m90m02J091j143J135m04
$$ plain form
12239 -131 -79 -955 246 47 318 370 237 128 -1039 -125 -678 349 72 153 201 360 578 461 38 277
12259 277 755 489 279 83 -294 786 -442 535 -383 -155 1032 -472 39 1388 -458 1033 -609
12276 -609 493 -215 270 1054 461 513 -665 819 324 -242 924 162 538 -288 -941 -144 -547 1644
12294 1644 -1096 1653 352 -58 -27 -700 804 -1005 764 -954 -762 -112 -814 1090 -899 395
12310 395 -1057 -639 -595 -1437 1316 -898 -205 -209 -348 190 -974 2280 -11 239 -696 -42 -449 658
12328 658 -120 -168 701 -685 230 -879 -1638 611 -473 1337 191 -1023 74 -1934 1011 -320
12344 -320 -25 -73 -447 -483 -586 208 801 463 291 596 -1356 -598 -597 177 -714 840 -195 691 -555 -42
12364 -42 742 -281 -387 -74 392 -693 893 86 1038 -135 -272 387 -103 -505 586 -557 578 174
12382A74n26L76p12P42K2Q9n76L23m23O51K10k97N29r5J420l169J246Q68k036
12401a184J759j423L93J281R%j345J246j598L04r35L90P93M15Q00k353J725j702
12419a425J074J22rN43j542M84J84N18L57o88J125j208J803j270o48J453j557
12436f84J136r96J350q76K14K50j421K185j411l02p52J386j16p5N5J170k644K00
12454a331O64J442L79j074J29j208O93k81nK075j220K45k20l30p26R76M97n74
12472A31N05r88J95j006K072J34o96m3j372P33N3O89j231L08J112n79L74j246
12490h55J054k63j11K206k861P59j158J280J471j425O17j235J360j251R35p99
12506b76l59K84Q9R59k17k71K8M66q96q92K345k515J172p18O77J198j419P15j362
$$ plain form
12382 174 -352 24 -688 54 76 165 -411 -88 -511 140 350 53 582 487 1907 -1262 -16 852 -1184
12401 -1184 575 -848 -455 826 835 835 -510 736 -862 -558 -1493 -1103 -310 105 905 -1448 277 -1425
12419 -1425 -351 -229 -238 305 -1237 -753 -569 -51 306 -382 743 -465 1338 68 -580 873 -684
12436 -684 452 -544 806 -70 144 394 -1027 1158 -253 -555 -1307 79 -37 -112 -57 1113 -1531 -1331
12454 -1331 -667 775 1154 80 209 -999 -306 -587 -592 1483 263 508 288 -42 -768 208 705 131
12472 131 636 -352 -157 -1163 909 1043 347 304 -1068 -335 -282 407 -824 -516 596 17 391 -855
12490 -855 199 -64 -175 2031 -830 -71 -1229 51 1522 97 714 -521 839 -412 523 -276
12506 -276 -635 -351 -262 697 480 209 237 703 -193 -1085 1260 -1255 -83 -801 -124 1074 -345 370 -992
12525i92J625p89m55N84j104J835N13j918J678j211Q98j067O27j272R03K73j30
12542bO48k34j315L0J223n04N84Np55N01l79m50J149k366K595p35R07j814Q66
12561d6Q8r03J808j312M68j33o51P06j504K378j409j22P38j542J761l14J400j665
12579b54j19M25o54N88j289J926m39J76m55L5N4j160J371k23k38J020j455J158
12597D67N9l39L25n40P77j207J318k370K152m84J79J428k452N41m25O11L7j14
12615c7L93j019P07j295N99K56Q43m92j70J279j686J605j639P75M36j072K113
12632A596k261Q60k86M01j16j385K007j830O26J115n20K63K8m33m37L97j82m00
12650e57R23r06K25j3l15J66N67J199k250P98p53N37J980j954J035l84n35o23
$$ plain form
12525 -992 633 -156 -611 -27 -1131 704 1217 -701 977 -234 664 -403 224 -1048 -145 128 -2
12542 -2 646 412 -903 -873 350 -154 430 435 -320 181 -198 -648 501 -1865 730 -5 902 -912 -46
12561 -46 42 -861 947 -365 103 -30 -681 25 -1479 899 -510 -632 106 -1436 325 11 1411 -254
12579 -254 -373 52 -602 -14 -1303 623 184 360 -95 -60 -6 -1166 205 -18 -256 764 -691 467
12597 467 526 187 512 -28 749 -458 860 -1510 642 158 337 1765 -687 -146 -571 40 77 -37
12615 -37 356 -663 44 -1251 -652 -396 447 -45 -215 1064 -622 983 -656 119 555 -517 1596
12632 1596 -665 195 -91 310 194 -1191 816 -1014 -388 727 207 470 498 65 -372 25 -157 -557
12650 -557 366 -540 -315 -328 -643 -477 90 1289 -961 -163 -916 -379 1601 -353 682 298 -237 -860
12668h60O1j88L93R98o15l5l98j18M38M3R27o13m21P83r19M50m79R39N46r34m03
12689d05m11J684j815P13J384j292k2q59J278m98J160j408J81J477j649J383j806
12706i05J395j505P66M27m38Q69k189J975o40l31Q52j576J400j13L7l02N19o2
12724A79q48J06L81J001m91n72N91j494J768j800J652o20O5P43k168J822m1k78
12742dN02k37O34k97r28p3j13J398j008K19m52m55N43K95M81j51r52P47N47o87
12762IP84l3p36M58q97M15k55Q37Q46j498K89O69r01j71m12J047j238J462k161
12781a486Q84R14l53N1j121J641q05K55p42N08J030j180J070n94L33J82j038R2
12799c59j42R7j284J284QJ41R72j669Q87J0K43J17j181J982n68O6r37Q98q92m01
$$ plain form
12668 -860 -799 -987 -594 404 -211 -246 -644 -762 -324 -281 646 33 -388 395 -524 -74 -553 386 932 -2 -405
12689 -405 -816 868 -947 -234 1150 -142 -164 -1023 255 -243 917 -491 -310 1167 -482 901 -905
12706 -905 490 -1015 -249 178 -260 609 -1580 395 -245 -576 276 -1300 100 -13 24 -278 241 179
12724 179 -669 -563 -182 819 328 -244 347 -1147 621 -1179 473 -147 -82 661 -1507 315 274 -4
12742 -4 498 261 895 598 -330 -403 -516 882 -126 93 -359 -814 -271 24 505 354 -598 149 696 9
12762 9 793 760 24 482 -415 0 -255 582 1428 -70 219 888 -13 -184 -596 451 -787 675 -1486
12781 -1486 -602 312 -41 10 -1111 530 -275 -20 -762 -254 776 -404 666 72 405 587 -451 -359
12799 -359 -501 -404 -1688 -404 -396 -255 717 -952 -65 -55 188 305 -876 1106 538 604 -333 565 -327 -728
12819g28K390k836J843j454J535k77j340J509j166J539j177l49J239q62J30N03
12835D99o6j90m27k41Q15k84K53n36qm20J387k263J623Q06k09m0j84o87L73j817
12855a616J790M85J5J12Q58k472J147nr55M54j012J361j534J898n47j313J651
12872C17O28L23j383J7J55p41J700k027K177j718l81N77p61J906j841J338n97
12889c11L22P31j111j64J9J899j305p59J084j027J223n74L90m93P29J34k131K650
12907A306j314Q57m29q91J314j439j93L40K29l27N26k48P83n10r05R79m78Q60
12925D60n13l75p82J899N20j251j34K36q98M09K3L95k14k97o4J039N8J2j983J846
12945C86K76Qm87L83j92l1Ro61J59o12N57J183m28J70j199J52M52q77Q73n70J806
$$ plain form
12819 -728 1662 -1174 669 -785 750 473 -867 642 -524 1015 -162 -511 728 -134 -4 499
12835 499 433 243 -184 -425 390 106 359 -177 -185 -605 782 -1481 142 948 739 699 515 -172 201 -1616
12855 -1616 174 659 674 786 1644 -828 319 314 -641 -187 -1199 162 -1372 526 -21 -1334 317
12872 317 945 1268 -115 -98 57 -684 1016 -1011 1166 -552 -933 -356 -1117 789 -1052 286 -311
12889 -311 11 742 -369 -533 -514 1385 80 -679 405 -622 601 27 417 -76 653 787 -1344 1306
12907 1306 -8 849 420 -471 843 -596 -789 -449 -220 -547 -21 -269 514 4 -901 78 -400 460
12925 460 -53 -428 -1210 689 1209 -42 -176 60 -838 -429 -406 -11 -225 -522 -586 453 511 523 -1460 386
12945 386 662 670 183 566 374 343 352 -309 -150 -762 -205 978 550 720 -479 -327 125 -752 121 -449 1357
12966A357k056J051j4j635J927j288J444l87p8j155L30l69O8J135q55R64j136
12983f97o21N97R39J295j623J051k047J417m88p10J180m28L29p61J201R4k083
13000a355J852n63J511j747m7J05n7P50j403J389m10p02J041j159J484k46P55
13017A198j002l73p64J253m16p15J693j047Q6N95m12r4N53j7j70j174N39r5P71
13036D09o36J469j513L19M34j253J177K65J48j15j170L90m46J238o41Q67j967
13053a025J74N28P23n61P22r82J378k23j25j317j58J037k68J288j695Q48j757
13070a413K105K09r3m10j21p2l34n7R26p95K66n42J167j273J368j049J127p60
13088B49j450P36m0N96l21J07Q46m07o4o54P74q14l83J166j053J457q80M59l15
$$ plain form
12966 1357 -699 352 338 -1297 630 -658 786 399 321 -834 -504 -873 -805 330 -525 439 -697
12983 -697 -1318 -721 218 1513 -110 941 -1106 311 -177 -887 293 -135 194 -567 634 728 -1355
13000 -1355 497 -66 1445 -302 -349 -244 -301 449 -954 435 25 -677 364 -795 689 443 1198
13017 1198 196 -177 -941 312 -104 -819 874 -173 -87 508 96 2 555 538 368 -806 -267 -362 409
13036 409 -227 1242 -271 48 482 -771 406 671 819 704 -466 -76 -522 716 75 942 -1025
13053 -1025 -851 -323 400 -161 561 -421 957 734 609 -708 -866 171 -97 1191 -504 344 -1413
13070 -1413 692 901 808 398 277 205 -129 -186 740 -55 211 -331 836 -437 931 -118 1009 249
13088 249 -1201 -465 -505 91 -230 -123 723 316 252 -402 372 -442 -825 341 -712 745 -135 324 9
13107IK40J416p88m74J06n20M20k20P70q64m72L64m82J263j200P15o09K35P95
13126G04l73M4q12J725r57q58P86n37J145J36r41N45j9j111KP82p89Q84j210J116
13146B62J48n45o94N79J173l68j317J405j142J668j657P70o82L35J02q47J274
13163D64j026J708n54J07N40p26P36j731M44K75p38Q42r66Q17r58K036p97j692
13181a219K026j309J222j12l59J11j255J466j380P79k182L036M47q04m92j883
13197a908J757L41q12J207J68P9k906K503P7o98l87L58J023j168P46J45N2Q48
13215A425j294Om83L70k35N40k30p9R22j679J612l88M90o52p52J509r84R7L11
13234E06r47P35j263J615r21o72J213m5N2j107J921l79k146K166j223Q43QP05
$$ plain form
13107 9 249 1665 877 403 509 -11 409 189 959 95 -377 -13 -495 768 -432 283 -326 -91 704
13126 704 331 375 -437 1288 331 -527 259 -278 867 1003 62 607 588 -523 -521 261 -528 356 -854 262
13146 262 410 -135 -829 -250 923 555 -762 643 -499 1169 -488 282 -400 -65 37 -810 464
13163 464 -562 1146 592 699 1239 513 1249 -482 -38 237 -501 341 -625 192 -766 1270 473 -1219
13181 -1219 807 -502 720 608 249 360 -895 571 -809 -30 -2212 824 1271 467 -25 -1908
13197 -1908 -151 190 -622 585 753 832 -2074 429 506 -192 -579 -221 802 -366 380 525 577 1425
13215 1425 131 137 -346 24 -211 329 99 20 942 -737 875 487 977 325 -427 1082 98 195 506
13234 506 -441 294 -969 646 -275 -947 266 221 273 -834 1087 708 -1438 728 -495 348 356 1061
13252A061j088j102J949j944J981j556J096p31k94J028j071K113j529j27r0q65
13268a169J771j255J686p43n95L79p86K607j965j04m41O65k55n26L21n92K135
13285A133j295Q2k19n90J271r75J007j257J496n98M21m05m86K83N02k65q72Q25
13303E8M28r66M30p8P5O39n15M58j140J369p36k74L90L01m38j306J385o13R27
13322C94m82n43P15nJ68n26p40R94N3Q56k93k315J662M92L3K88L14j206o02J921
13342A178r05K64j146J79m2o22K48N7J199j528O91J585j684L01J14J251j431J635
13360A344j495L4P99k918L230r02j256J843l73M60j903K058j09o20M82p50J025
13377I49j240O86q27L64M23P2m70k162K313J33L47m66r9J034r98J352k944K298
$$ plain form
13252 1061 -27 -1129 820 -1124 857 -699 397 -334 -628 400 -671 1442 -87 -214 -304 -1169
13268 -1169 602 -653 1033 290 -305 74 -712 1895 -70 -174 -615 50 -205 -731 -410 -1002 1133
13285 1133 -162 -80 -299 -889 382 -593 414 -843 653 55 476 71 -415 -132 370 105 -767 58
13303 58 486 -480 -50 -128 -53 586 71 529 -611 758 22 -252 138 439 1 -1305 80 -533 394
13322 394 -88 -631 84 79 247 -279 -1019 -25 28 884 591 -1724 -62 430 463 751 1065 -141 -743 1178
13342 1178 273 537 -609 -430 -472 -1094 -846 -789 410 -1118 -427 1158 -526 -225 -111 1140 -291 1344
13360 1344 -151 -117 682 -2236 994 92 -1164 679 306 766 -1137 921 812 192 674 -76 949
13377 949 -291 395 -432 -68 355 427 -43 -2205 108 241 588 122 23 1057 59 1411 -1533 765
13395G65p44K75L16j898J470j214O62L84L20m23o27J728j231L53M73p45J238j842
13413g40Q04k34M69m06J095j134j213J193K60m37o4P52o39J399J33j681k24J350
13431F83j040P63o7M04j50n94q08R31K94j509J783o06J56R26j449j28J099j19
13449E69N6j309L68P30n25o45N64p41k68K530k032J251j355K02J695r86O66q32
13467f2P50j472M42J356j762J634k289K643j785Q92q6j9k98L94l03m63O42j83
13485C1k66J280j072J44k22M94Q23j540J420j010K88L91j355O77q61M98O03r8
13503B25j74J15l90o32J713j704N08M53k40j50L64O4J503k146J29p4J107k556
13521a885K608k06l20J85j679J824q87J015k54r13Q07j55P46o11n56n50M61J568
$$ plain form
13395 765 21 296 612 -1286 184 -1030 -368 16 336 -87 -714 1014 -217 136 609 -136 1102 -740
13413 -740 64 -170 299 -107 988 -146 -1359 -166 94 -343 -407 345 -294 1105 1238 -443 -667 683
13431 683 -357 406 339 743 593 -1 -809 122 416 -1093 690 84 240 1166 -283 -411 688 569
13449 569 625 -684 -316 414 -111 -756 -192 -933 -1201 1329 -703 548 -807 -605 1090 104 770 -62
13467 -62 688 -784 -342 1014 -748 886 -1403 1240 -545 347 261 242 -56 338 35 -428 214 31
13485 31 -235 1045 -27 117 -105 389 1212 -328 1092 82 370 761 -594 83 -778 -280 323 225
13503 225 51 166 -224 -856 857 -847 -339 114 -126 -276 88 152 1655 -491 -362 -436 671 -1885
13521 -1885 723 517 197 382 -1297 527 -360 655 401 -512 295 140 886 275 -281 -831 -370 1198
13539A198j419M16o50m2R24j172L41M17N69j180P05o92L05P67n89K18l42o77J025
13558A22l05J662k416J43N41j98N66q20K548k245m7L35M66p5J51o2L63j69j037
13577d77P68N8o28K030k198J194n36l44J06j365K074o25J15K30j377J324n04q38
13595i93L53K08J408j754l6%J352j970J308M03K5o90l13N98N27N3L0l07k33n21
13615e52o78J458m68J220k537J661J68k44K02L01Kj199R66j41n57l15N21L81n13
13634c24M19p0N62Q4q33R5j694K638j161R34p51J47J433k195P80P21q64j77j37
13653c93L37j104J708J47j539K118j350N71l02o98P5m09J208j007Q20k16o3P11
13671F14o68J425j608l4l29K75K96J206j246j48J506r81m07m85P31K9n13J767
$$ plain form
13539 1198 -221 195 -455 -497 427 -745 -404 13 582 -598 107 -585 -280 487 -102 116 -226 -903 122
13558 122 -183 1479 -937 -794 -253 -451 115 -705 1843 -402 -449 -114 352 277 428 366 729 560 -477
13577 -477 291 349 -279 1751 -447 747 211 -133 -27 -1392 682 57 172 402 -975 349 -155 -993
13595 -993 -640 -432 976 -778 -814 -814 538 -1432 -124 279 304 -386 -699 -101 426 479 509 202 -31 -552
13615 -552 -1230 228 -240 980 -1557 104 272 28 230 531 533 -666 300 159 -398 -713 -192 189 -324
13634 -324 95 25 587 671 -162 -67 -1761 877 -284 650 -101 46 1479 -716 64 785 -79 -256 -393
13653 -393 -56 -1160 548 695 -844 1274 -76 495 193 -505 -430 -839 369 -638 182 -34 -97 614
13671 614 -54 1371 -237 -271 -600 -325 -29 1177 -69 -217 1289 308 -99 -584 147 176 -337 1430
13689A430k171O72J12k15J47M43p2p59J09j128J501J85p77M99L2R3P50l69L1o2
13709D51j041j29J242M50j541O87q4L54p90m05Q50l57O51j25o23J735k131J284
13727D78m37l24r43J268kK3P26j194M64J532k077P88j29J018j909R83k52l80R13
13746E46m63Q89j373J182j292k52Q26j53P34j445J048k13k00L56m58J666k025
13763f27M51j08n32J834j406J337j608M13j81P94M93p90R22k100J552j053R92
13780C83P00k034J271m87j89K8J12M48l5J098j867J34P73l5mm52K77p41J042j023
13800f01J035k5k10o12N60n26p52P72R32j098P08L03n69P49m27n63L14J082j49
13819I23r18J23j48k47r8O52k13j035K147j159R52p94n88Q81j080P13j331K635
$$ plain form
13689 1430 -741 -69 43 -172 -25 418 346 -413 -304 -1432 69 254 -523 -24 8 101 851 482 513 451
13709 451 -590 -719 523 973 -568 119 35 389 -401 -806 44 -313 338 213 -410 1325 -806 478
13727 478 41 -283 -1226 42 40 63 789 -405 59 1591 -486 302 173 1191 -718 265 13 -367 546
13746 546 83 972 -401 781 -511 -763 63 -90 644 -801 247 34 -166 190 -268 1398 -627
13763 -627 -176 -284 -816 1018 -388 949 -659 -246 -427 367 860 70 992 -1108 444 -609 383
13780 383 1083 -951 320 -167 -356 -328 -216 232 197 1295 -572 -438 335 300 296 -156 121 -620 422 -601
13800 -601 434 409 199 -413 147 -379 -1131 -359 573 -525 183 486 -83 666 239 -324 -10 1072 923
13819 923 5 128 -20 -267 -365 287 74 -961 1186 27 979 185 -403 478 -602 111 -1220 1415
13837A415j360Q26m99j252J658j580J647p34j210J100q3J95j171J447j303Q39
13853f5J536k344J519j459N15n00J17Q37m26K091k680R64L8Mn2n36R01r69J784
13872A275o99M40j763J72J189j342J322k25j514K158m71j51J5j058K39k08Q20
13889A99r31M11K60O93n62r9N10p59K2p50J837K8j734O63l83M83R26p51K92L29
13909F84m99N17N50p15q76J243j053N04j35R05k20j144n08Q37l50l57N81P62o19
13928A07L53j607O45R91n39K23J69k89o15J851j791L12J645j462n7n97J485p10
13946A14J19L23p26J038j274K29K22p45k49O88M33j431K059q56Q38l98n23j51
13964b90o39J170q87J172n88j745K096k268K194l27Q46n35L93p64l87m20J036
$$ plain form
13837 1415 55 881 382 -870 788 -792 855 121 -1089 11 -72 123 -1048 399 -904 -65
13853 -65 1471 -873 646 -813 -298 -798 -681 156 -270 1821 -859 105 143 147 95 -441 460 -509 1275
13872 1275 576 1016 -747 -575 614 -728 594 369 -1145 1013 542 391 406 -652 -413 -621 199
13889 199 -732 -321 -61 632 70 -29 481 -278 -256 -1006 831 859 -875 -212 -595 -112 814 63 355 684
13909 684 185 702 1252 537 -339 904 -149 355 220 1125 905 -239 -747 90 -260 -617 -36 726 107
13928 107 460 -1147 -502 489 -50 173 342 53 -562 1289 -502 -190 1455 -7 -64 -661 824 114
13946 114 233 556 -170 868 -406 -177 45 -700 -949 -261 172 -1259 800 -56 782 384 -139 -290
13964 -290 -929 241 -646 526 -62 -1807 289 -1979 215 -112 734 199 592 -172 -559 -979 57
13981E7j99K13O3M42n84O08q94O06M2j290J885n10L05j358N46M67m39k75P81m67
14001aL37j728R36J093p13J107r50j421J828J280k676O98J05r57J030l00P86j414
14019i60P49O32r93J170k70k24J19N17k71r48Q60J31K36p50O22R1j156N86r59
14038h18J271j423Q19q7l83J496j266N84p31J046l66q86k28j266J930P81j178
14055g05K797k527M00p74J937j231r49J512n22P63j684K229j123j91L93j139J355
14072E41n50n36J76P79r22J67K08p91J371p03P7J669r17l72n45m6Q58j327K090
14091A227j256L41r66P96j69p8n24O76k58j48mJ023p33J78j61Q65q21J15O59j405
14111f43P29j509P30r9N71N66j138kP29J561q31q22L87n68P70M08n72Kr34Q38
$$ plain form
13981 57 -142 71 134 576 -8 600 -294 312 354 -936 949 439 744 -614 -68 399 -40 -315 466 -1
14001 -1 336 -1392 -456 637 -76 1031 81 -1340 488 1768 -908 -210 -105 -1062 -32 -332 454 -960
14019 -960 -211 421 -572 598 328 104 223 740 469 -479 381 512 748 -2 620 711 -445 141 -818
14038 -818 453 -970 -151 -238 -621 875 -391 193 -538 508 142 -744 -972 -2238 -308 473 -705
14055 -705 2092 -435 -35 -809 1128 -103 -1052 460 -62 701 -983 1246 123 -68 325 -814 541
14072 541 -9 -545 -369 410 -512 -345 -137 -928 443 -260 -183 1486 569 197 -348 -394 464 -863 1227
14091 1227 -29 312 -654 142 -27 -105 -629 47 -211 -359 -363 660 -73 105 -56 809 -12 103 762 -643
14111 -643 86 -1423 -693 -792 -221 345 -793 -795 -66 1495 664 -158 229 -339 431 839 267 269 -665 173
14131A73r40J536q08o71J88J6J165j947K530j222M8P85j993J860j409J398L73
14148A082j075l5o28J936j442J002j059J391j741L36J858k765K807j561o31K45
14164b80j96N02l99R6J75O27O9j821R19J75J181p25J11O89j581M67j35o54R57
14183A77n90P58o02J016r56K81J093j841J463k283J338r76O54P96j273J204n71
14200c12kR11o31O64r83j32Q67m34j80mP05j634J500M74j677J444l63J749k668
14219g06m66J971j898J601j638K048j770J872k183Q45qL78J539k630K273j089
14235A39m0j86p32P33l99J486j258j567J425N95K83j252K059k153R69l86o16J203
14253C03q74J690j316l65J157o27R41j922J046p5M78j87m38Q75r15j38N80J40
$$ plain form
14131 173 -767 769 -39 -710 -522 -506 659 -1288 1242 20 68 853 -1140 720 -689 709 1082
14148 1082 7 -28 -656 1280 -162 840 -219 1172 -569 -233 1625 -1140 1667 106 -525 -280
14164 -280 -476 26 -373 -277 -102 525 594 -1227 -308 -133 1048 323 434 1123 -458 9 -126 -780 177
14183 177 -413 345 -257 759 -197 84 1177 -664 799 -1484 -146 -1122 -468 328 -945 259 -312
14200 -312 -314 597 -34 630 -353 -485 382 -52 -232 -236 469 -1165 335 809 -868 576 213 1962 -706
14219 -706 -1172 799 -1099 502 -1136 912 -858 1014 -1169 -324 -332 46 1585 -1045 1228 139
14235 139 99 -87 -819 -86 -485 1001 -257 -1824 -399 196 479 -773 1286 -867 102 -284 -900 303
14253 303 -571 1119 -197 -562 595 -32 909 -1013 33 -42 436 249 -189 686 -229 -367 213 353
14271C53R33N0j791L91n50J608j094l60J95L13M02J79p54m16O82q09O46K45n72
14290c49J92Q30j189J070k1o7j098J486m96N00j651O44J06r4O25l1J96j096K73
14309a70O20n05J073j718J004q94m54J727k896L084q70J134j915J002p02k36J718
14326A002k421L004j327m47L11k17J319j425J322k080P96J56o23N70J64R80j287
14343b03O72o31J06j58k6O94n87J42M82r15R57j066J073n45q62L49J11K36r46
14362a117J896j651j2J156n62M0L13j044O37M23N48j753J374N45r69J85j598O69
14380i20R79O1m67R92M53j420O61L43j113Q3R44L65j594L33N8J509r57j323J195
14399A82o89J180j279j85J288p08L19k8J94m8J26P48j395P60j102K2o44K643j071
$$ plain form
14271 353 1286 1336 -455 -64 -614 994 -100 -460 -265 48 450 629 -125 -541 141 -668 -22 223 -349
14290 -349 -157 673 -516 554 533 466 -632 854 358 858 -793 -149 -43 -137 488 457 653 -443 -170
14309 -170 450 -55 1018 -700 304 -590 -1044 683 -2213 871 1 1135 -780 222 -480 -716 1002
14326 1002 -1419 1585 258 -189 122 -95 1224 -201 1121 -959 -163 -7 -630 -60 104 1084 -203
14343 -203 469 -162 -56 -214 -240 454 -133 9 491 -424 533 -533 540 -5 -867 -518 -407 -171 -1117
14362 -1117 779 -872 -884 272 -290 -250 63 -981 -344 79 627 -1126 248 793 -176 9 -1589 -920
14380 -920 59 120 -347 645 1098 -322 339 682 -431 -348 596 961 -633 -300 -242 1267 310 -1013 182
14399 182 -507 673 -606 -791 497 -211 108 80 274 226 352 1100 -295 465 -637 -615 -1259 1384 313
14418C13j745K890k202P02r10K7J800q02Q60j190l31P72k65L46L1O01j304J265
14436H58j720J367K4r26K573k346m64j39k18P61Q5R54j165J464j773J541o48q85
14454f57K51K42N38p95O67l94J232j355q34J401n3l98L82M52o98o72J688o62q64
14473e29J69N01k46M29n6n97m10J753j316O16O60p54p59m00J253m43N99k4j263
14492h17J657l54qj119J461n27m98J364j725M14J039o18O62j016M34j454J316
14509B11o6L03l42q09J751k325K722r49j150J665j638Q13m48K04K71o24M4k95
14527f62P15p99J123j505K123K65q28Mj838K508k950J170N77m2J650j811M75m18
14545b43Jo2P7M26M4M02J20o20R62m80n20k71J314n25j255O16J72O20j101j69
$$ plain form
14418 313 -1432 1458 -744 -42 -952 -925 875 73 933 -257 -588 184 -81 265 296 897 -407 858
14436 858 -862 505 529 -397 2176 -170 -634 -773 -991 -230 -145 809 -356 1108 -665 876 228 -657
14454 -657 -406 -164 374 -421 246 -148 1084 -271 -1105 296 243 -155 227 679 -19 -691 997 335 -529
14473 -529 -360 141 -105 324 268 -329 -739 1014 -302 314 974 220 -539 -939 314 -129 470 446 -817
14492 -817 840 486 478 -641 820 293 -205 1159 -566 -152 887 269 931 -85 349 -1105 211
14509 211 145 448 106 -703 1048 -1277 1445 496 -654 1011 -627 186 -262 -58 213 -411 -367 -662
14527 -662 53 -746 377 -1128 995 1260 432 436 -1402 1106 -1844 -674 -97 -139 1511 -300 175 -243
14545 -243 -242 -304 -227 199 243 645 765 145 1107 627 107 -164 1150 625 -630 -14 158 778 -323 -492
14565d92k24N19L45N86K89l67N6n79p60R91q66M56j71J334q40p18N74J27J18R7
14585D75j349J830p30l58Q97J27M8j177J76j023J625p37K32k01j25j69r3J051
14603D99q76J034J35j093J70r55J493j661J685N89j460J034j382O71M68n41R19
14620G29j085J332k276J885j269J014N83j014N29p29L65j172J407j286P76j02
14636c13n65P22O09Q87j232J30K83RK51m68k90Q54j216L17p28J347r09l0K142
14655A800k376M60J89l65p19Q60R82k024J813k33o65P50j572O4J581m83M27j349
14673h60J024q04J942k129J46O92M3J208k635J812j123K065j423K29P17j814L24
14690e86P29n65N81k62j53nO34n75K08l31M09L69L30M14k234J381q46k07J210
$$ plain form
14565 -492 -716 -197 148 734 1023 656 712 133 -627 364 -502 -46 -217 1117 277 -441 133 260 378 475
14585 475 -874 956 226 -132 765 892 940 -237 -61 -1084 541 -196 36 -165 -290 -459 -552 499
14603 499 -377 657 792 -301 -131 -1086 407 -1254 431 1020 -440 594 -788 -117 351 -190 729
14620 729 -356 976 -1300 585 -684 330 913 -101 428 -301 64 -1108 299 -987 -211 -313
14636 -313 -878 -156 453 1340 108 238 521 530 781 313 23 877 -339 -22 -750 597 -312 -342 1800
14655 1800 -576 -116 73 -292 -1011 -151 831 -1193 620 387 -278 472 -1100 -1036 545 62 489 -860
14673 -860 164 -640 1302 -827 -681 11 54 1262 -1373 439 -684 1381 -42 187 904 -910 -586
14690 -586 143 -422 159 -103 -256 -261 373 -202 6 -325 84 453 783 1197 -1037 344 -502 -709 501
14709E01p62J493j563M54L75k35L14r63Q95n41m86P80j176K047j399K061l500
14726a705K880l94j288K293k702J161o24Q50M10j97j12j757J182m05M62n96L99
14743a43j61l0K05J68j60J441k160O32O2P74j65j063J736j704N76p47Q95L64o07
14762h7N7P70p48J71O47o23K46J44j205k96N29J059K33j424K48Q0m28j09M84P93
14782E41r93Q51o15p2O11m33p12N23J196k49l06m5j388Q28m87J848r26k31Q99
14801H40p96P79q45O6j414J524J042k034J182j887J281j78O29j94k93J068j811
14818a041J277k17K77M74j480K74k09J374j093O06Q36j256Q66j343L42K091j969
14835a91L00K09q8M41l41n0M15p05n38O10m7j23m53J830j615k28J215j051R50
$$ plain form
14709 501 -261 1232 -331 123 498 263 577 -386 509 -32 -518 262 -914 1133 -266 1795 -1705
14726 -1705 1175 781 -507 1786 -916 245 -379 471 881 684 572 -1185 -3 -408 54 -542 -143
14743 -143 -304 -334 -129 39 -121 1320 -840 -208 -146 628 463 -600 1136 -568 8 -739 156 520 -87
14762 -87 -30 740 -8 163 810 187 433 577 -628 -924 -395 664 897 -527 -279 -199 -627 -736 -252 541
14782 541 -452 399 -216 -288 323 -110 -822 -299 897 648 342 297 -1091 -263 -750 1098 172 -59 840
14801 840 44 823 -22 44 -1370 154 1196 -838 344 -1543 -262 -440 189 -5 -298 770 -1041
14818 -1041 236 19 296 770 -710 -436 -645 729 -364 242 1078 -178 688 -655 -313 1778 -191
14835 -191 109 318 230 671 330 280 695 -10 -548 62 15 -108 -561 1269 -346 -574 641 -410 540
14854E40m65M82j084R25n92m16Q59m54q73J501r34R25j245J669j9j244k5Q3M47
14873H0q47N49K22J54L73m68q3O88k228K294j109j39m73J016L3n07R49j440R73
14892C7M9M86l71j80R41m84M62k523J499q79L16R01m57N10o64M11m06O19N88j93
14912F62j98o28N07r29Q43Q12k021J354j238N97q84J544M26m12J037k251R79m50
14930b50o1J072j370M99O42n86J73r78J269j201P59O87p01P42j000Q95l50m54
14948b13R27p78J021j189P0q05J037M10j947J477l60O44j019R85L81L6M41j444
14966c26O80l6j72M21j747P10k86J577o73j023J714p26l14o59J166M40n61P38
14984I23m66o28p64L63M13n97J418j259J564j006L69o19M07J542l050K905k584
$$ plain form
14854 540 75 557 -527 398 -194 -610 249 -205 -1078 423 -511 414 -831 838 819 -425 -450 -367 80
14873 80 -767 -218 4 158 531 63 -20 668 -1560 734 -375 -514 -987 29 62 -445 504 -936 37
14892 37 86 572 201 21 962 478 940 -1583 -84 -963 -647 254 -203 307 -357 54 -352 267 855 662
14912 662 464 -164 343 -586 257 1069 -952 402 -836 -239 -1123 421 847 435 1472 -779 200 -250
14930 -250 -311 761 -609 -110 532 -54 119 -859 410 -791 -32 655 -46 696 -304 591 241 -213
14948 -213 714 -64 957 -232 -162 -967 70 480 -1467 10 -350 294 -725 260 641 677 1118 -326
14966 -326 354 318 146 567 -1180 -470 -756 821 148 -875 839 113 -201 -860 306 746 185 923
14984 923 457 -171 -935 -572 -159 -756 662 -597 967 -39 330 -289 118 1660 -1390 1515 -1069
15001a069J716j541J569R34j802O74j736J901K47j096k69j07J045j113K65P51
15017C69R1K94j471O53j589K185j126J7R07p96L74l50R44q34O74j85N51m64%k48
15037dR33j214Q45p40J013m70m87N26j795J156J184p89K22r99Q72k67l27l85K121
15056A395j091L09p95m29J593j340N34p15j53J280j982J471N11l5j25j758J682
15073C52j710J326m1J3L48p92K998k900J118r15J77k67l82P8N75O58j878J116
15091a26O47j354J745k262K197j033k38P76r98R56j570J669j657J666k7o21J044
15108H14r01J12j503Q71J355j215J339j853P11m65Q92m29M20J34p27N60p09R74
15126C80O38j668J491o65O0K96o77L45o53p19m40M06J796M20p27Jl90N63p65k74
$$ plain form
15001 -1069 647 -894 675 1609 -193 481 -1255 646 893 -203 -472 -579 466 -647 -382 369
15017 369 460 754 -717 -64 -1653 532 -594 -577 330 -466 -92 -442 502 -332 342 157 708 244 244 -4
15037 -4 929 -285 560 -180 833 363 -124 402 -1393 -237 947 158 380 -619 253 -14 -341 -726 1395
15056 1395 304 613 -182 -611 982 -358 176 -539 -692 588 -1394 77 588 553 428 -1330 352
15073 352 -1358 -32 -73 -60 288 -504 2494 -406 712 -203 -26 -293 -675 -597 -22 636 -1242 -126
15091 -126 521 -833 912 -1350 847 -186 -424 352 -646 310 -1260 409 -1248 418 391 -230 814
15108 814 -87 25 -1478 -607 748 -467 872 -981 -270 -735 157 -272 148 282 -445 115 -594 380
15126 380 1018 -650 841 176 236 532 -145 200 -453 -1172 -1612 -1206 590 1010 283 284 -106 457 -308 -582
15146e82K3Q76R8j012O25P9O32j402P11K88o55K91p71Q02k24L77m04o60J337o46
15166b17M33M90l98j050R08J45r02R96j048J128o98K17m37m27J948j656j17M16
15184b69m23J896k472J756n96l3o68N30L93q69J113j323O12n59m39J680j64J68
15202C33j312J922q50j071J589j084N36m04J027L76k115M84l39O16J0N86m5Q7
15220C46m58n47J170n6O2r77R96j90m25L45o29J605j027o50J454o21q40j018J628
15239A68l74K1L78m09R26o68o9Q24q43j11l55O16Qo64K169k564M66J064p55o75
15259h47M20J468j424Q75p74q75N12L51O36j345J124r22R04q5r14J306o88O39
15277C61K17n30r28J24M50n22J053R2m34J362j478K79l00K07j178J444M54j043
$$ plain form
15146 -582 -559 317 415 -597 28 107 739 -663 48 336 -319 -28 -799 3 -221 156 -248 -908 429 -217
15166 -217 216 706 308 -742 166 311 -591 405 -643 485 -213 4 -433 -860 1088 -568 -685 -269
15184 -269 -692 1204 -1268 488 -108 -141 -809 -279 114 -755 358 -965 -353 -912 -1351 329 165 333
15202 333 -979 943 93 -978 611 -473 63 -341 686 1062 -1053 -569 -908 -292 -282 304 259 346
15220 346 -112 -659 511 455 517 -460 536 346 -79 266 -363 1242 215 -435 1019 398 -442 -1460 168
15239 168 -206 -185 193 -216 710 42 -27 797 -46 -157 -512 104 112 -552 1617 -947 -481 583 -172 -847
15259 -847 -427 1041 -383 492 -282 -1157 -645 -294 342 -1003 121 -801 103 18 -896 410 -278 361
15277 361 578 48 -880 -756 -306 -828 225 317 -117 1245 -233 46 -254 -47 -1225 219 673 -370
15295c70K53K7P92j137n63J166j923L868l408J282k30n73R49r38J603j660K069
15312A207k279R67J25m51n4l40J784m54J89r22N26K6j449J092n09J825o28r04
15330b49k29M10K59N36N30j808M31M69K59n42o8n38O49Q2q39K113j227L31j070
15349e01J068J38j623J008L55m44m41R67pL99q68p72J518j244P81p51m65J802
15367I20p06o19n0J277p11m33L28o63Q81j033J899n56r25P94M32k61j221J607
15385I60r14J56J5j133J609l051L225j836J359K21j281J107n56J060j764Q12Q79
15402H68q55Q05j547R36o91J87o4q8J446p01K70M07j554L61j009J801j033Q44
15420C83j625Q59Q60j043J003K94q60P18o88L91l64p58Q52M20P73j154M37m49
$$ plain form
15295 -370 -117 -90 702 -435 -998 168 -1755 2113 -1295 -13 -243 -816 133 -805 798 -862 1207
15312 1207 -1072 -105 20 -431 -485 -825 959 505 694 -228 298 324 -1125 -33 -542 1283 655 -249
15330 -249 -478 -68 191 727 1257 -551 -120 349 608 66 -2 -540 109 191 -648 1465 238 569 -501
15349 -501 567 705 -918 90 445 1 -440 527 520 919 51 -721 797 -447 334 -417 -882 920
15367 920 214 -405 -455 822 111 -322 6 -657 224 -809 1090 534 -391 403 835 574 -647 960
15385 960 46 202 217 -916 693 -2358 867 -969 390 611 -670 437 -119 941 -823 -11 868
15402 868 13 818 -729 207 -484 -297 -361 -449 997 296 566 973 -581 -220 -1229 572 -461 383
15420 383 -1242 -383 477 -566 437 731 -129 589 -99 292 -72 -830 22 442 1215 61 498 49
15438D9n1K64j422J606j473J327P28j619M74m81J831j532J108j950J420J569k085
15455b37k60P81J230j707L21p12J22Q19o07M0K52Q78k71j945J402j263J399m76
15473b34L74k7j190R19m61J875j235q21J083j222J685k671K258j476R72M49n18
15490b40J852k574J248p45o1K00P87j22o75M55o54O54P92p48K47o35K79o9M0j71
15510a40o16O67j541J746K17Q4o11L66P55r67j69j20M0P54j58j080K86R25K49
15529F87k98P94k69j205m27N96q8K60M12K34r22M86j624K642j196N1l60j26O40
15548B87L25j30j722J588k98o7J115k351K070p41p02L82m4k46m93J551j601J492
15566D15k23Q6m27M7P05j725J853j556P55N39j935J618R0R12j501K25l06r02J244
$$ plain form
15438 49 -2 262 -1160 446 -1027 300 1028 -591 -117 -598 1233 -299 809 -1141 279 1848 -237
15455 -237 -497 284 1514 -193 128 -584 -462 357 -250 -210 42 920 649 -1296 106 -1157 242 -234
15473 -234 140 113 -1077 -158 -619 1256 21 -800 283 -939 746 -1925 333 -1143 -171 278 -240
15490 -240 1612 -962 286 -459 -520 -320 467 345 -330 125 -529 125 917 169 416 -219 60 -9 31 -140
15510 -140 -756 -89 -1630 116 333 417 -194 172 927 -40 -209 -329 -289 465 307 -773 -487 438 687
15529 687 389 1183 914 -291 -718 -122 -210 50 462 696 -226 260 -1364 1278 82 133 -227 -353 287
15548 287 612 482 -1240 348 50 -17 1098 -1253 817 76 -626 -244 -288 -534 -1027 524 -1077 415
15566 415 192 278 -149 -102 603 -1122 731 -825 -70 469 -1466 152 242 1154 -347 -122 -428 -1330 -86
15585h6j501K350o31n89M40r79K178k280K123j503K46J11l58J258k041J666l00
15602A04m52Q85p27P00j326M3J206r83P70N53l43l30p49M08P44M83j365M73K67
15621C61M01q84l65J021n73k24k15L02K04J72J63m87O70p17J39J040j582O46l25
15640b53l8O24j336J181r26J268j329J174m13j95M92q29J510o69K25m23q35J957
15658A185j574O03J08n62P48j020P71j399K205j794J047o61k50J038j525K376
15674A296j871P67J13r46J668j773J171p25K45J36k93R05p84M24r60O54J79p51
15692e45K713l862J876K41m78l86L87Q07j537Q23m37N06m92m7J879j957R43k014
15710a580J262j39O41%L22q24l64M24j314J993j830J314m4J642k640J172j85l22
$$ plain form
15585 -86 -1587 763 132 -457 -17 -996 1182 -1098 1025 -478 -232 -121 -479 779 -1262 404 104
15602 104 -348 537 -190 510 -816 -773 433 -550 220 773 430 100 -649 -241 503 986 -379 94 361
15621 361 762 -122 -487 534 -39 -263 -478 -176 28 200 363 -124 546 -171 -32 1008 -574 72 -253
15640 -253 -291 333 -1003 178 -748 520 -809 365 -48 -243 249 -580 930 261 486 63 -772 1185
15658 1185 -389 214 322 -240 508 -512 259 -1140 1065 -729 318 -343 -593 445 -1080 1296
15674 1296 -575 192 305 -641 1027 -746 425 -300 -55 81 -212 693 -91 333 -627 27 206 -545
15692 -545 2168 -1694 182 423 -55 -441 -54 753 -784 39 -398 108 -384 -431 1448 -509 434 -1580
15710 -1580 -318 -457 184 184 506 -318 -682 -258 -1572 421 -1409 -95 -139 1503 -1137 35 -150 -472
15728d72R83j054J110j025J286p55p76o1qJ295j453R9O15J235q69j119J318j272
15746i23J315k21O4O91j637R39j250J470n49O14n48q85R95m73R33p07k66L17k76
15765c97K026k599K652j560O59n61o02J370k067J646j243O20L39p01J566k263
15781a115K052j147n2L49O24P05j559P49k14K08n39j212L22J595R8m32j188J964
15799A208j205n91j49M06J009p1n71j83J098j003O90j120r3P03mJ19r18O30P21
15818F76j888J391j799K800q26j029R91r22N34q01Q09K79j065J538j966Q95L43
15835d0K20L14j337J949j084J98o46J226J66j665J792j994J931j535o97J815j411
15852g98J590j813K111k466M35J452j590J597j166J654j686J007J080j778K99
$$ plain form
15728 -472 511 -543 567 -458 828 73 -703 -764 -772 523 -930 -831 -216 1019 150 -969 349 -923
15746 -923 392 171 235 926 -711 228 -1022 448 -101 513 -35 -920 75 -398 535 -172 -438 -121 -397
15765 -397 1629 -970 1682 122 781 220 -382 988 -1079 567 -676 -56 283 -418 1148 -1115
15781 -1115 937 -210 -262 87 711 1416 -143 606 392 600 61 -1151 -829 766 864 432 -756 1208
15799 1208 3 -588 -737 -331 678 607 36 -147 951 -52 638 -482 -575 128 124 243 -675 -45 676
15818 676 -1212 179 -1620 1180 354 -675 316 -606 -72 -873 -64 215 -850 688 -1278 -383 -40
15835 -40 180 494 -843 1106 22 220 -426 800 966 -699 1093 -901 1030 -505 -1202 613 -798
15852 -798 792 -1021 1090 -1376 -941 511 -1079 518 -648 1006 -680 327 1407 -371 -72
15867g2j612J406J48Q34j23k371K537L55k53j825Q67j28N33O45j027L29l70K53
15885A26L26r22P86m20K87j054K09M83l26J296j430l5n1P36j57J200j363j020
15903a329J010Q86j096J384q58N54j216L72P8J78Q20p39P64q60l31q63J580l50
15921a6m03O09o62m63J746p78K97o94m85N46R77j012j62J739j255j6L15k461K312
15940A34j418J721k94K56j13j306J683j231J097o59M98L51r61j4p58J710k081
15957a385J782O9j348J940k021J230l98n55J099j283J651o83J372k805J156n11
15973f90o23J880p94Q10o90L50O07k66j45j076J278k60o84j76P49J152j156j084
15991h18J00K40K55N48o47r45J239o3Q2k56l65J136p72Q79l8j019q5J414l05N67
$$ plain form
15867 -72 -1684 -278 -130 704 581 -1790 747 1102 849 -976 -109 -237 296 941 -86 243 -127 126
15885 126 452 -470 316 -104 183 -871 -662 -179 -505 791 -639 -674 -725 11 -146 1054 -309 -1329
15903 -1329 -319 567 -529 855 -3 551 -665 -293 -215 -37 783 44 808 -52 -383 -1246 334 -16
15921 -16 -419 190 -472 -935 811 33 330 -364 -849 -303 674 -338 -500 1239 -16 -32 283 -2178 134
15940 134 -1284 437 143 399 286 -1020 663 -568 529 -130 368 719 -242 -256 -1014 696 -1385
15957 -1385 397 466 -882 1058 -963 267 -131 -686 413 -870 781 98 1470 -1335 -179 -690
15973 -690 -1313 567 -227 583 -107 243 850 584 439 -637 641 381 -303 -479 270 1422 266 -818
15991 -818 -718 -478 -223 325 -322 -1267 -28 -91 -9 -265 -630 506 -266 613 575 -444 -529 885 580 1147
16011A147o74K34j500M95o5K6L70l66O12j005J433r98M40n54l25J358j064L33
16029a03J58L50m67j27R55j533J804j670M69m23o4J411j520R35j006J608o81l82
16047b86L03o9J198n97r20r6o7M17n76J97j64J165K88j751J896l163K597m21N39
16066D90j082J414l88j436J645j639J921n32j091J015l88k72k62N00P98m00N8
16083C51q81P13k24R5m70N63q98M21J78J88r66K89K58L6q82J544m65K50j99l57
16103d56p1j55L09k44j06Q6L12M64L90j497J100n22K87Q9p95M87l53N15j11Q11
16123E40j522J326R43j521P23j265J171P9O4K9j761J776j378J442r85J161J35
16140I57l42J14j090J667j984M46j68Q00O3q87J428m86M87j882o70K043q32K36
$$ plain form
16011 1147 473 707 -793 -298 -363 -337 33 -333 279 -726 707 -291 149 -405 -730 628 -436 -103
16029 -103 55 405 -62 -189 766 -767 1037 -633 -164 -587 -651 760 -760 175 -831 777 96 -286
16047 -286 17 -52 1146 549 -371 -467 -534 -117 -693 -496 -660 505 793 -958 938 -2225 372 -49 490
16066 490 -592 822 434 -1002 643 -996 925 393 -698 317 -71 -343 -605 -105 693 293 351
16083 351 -530 183 -41 54 -416 147 -751 -330 -152 36 -930 -641 -383 -347 -1229 315 -150 100 -99 -456
16103 -456 -527 -682 -373 -617 -723 -637 -325 139 529 -968 132 -390 -103 -14 -809 -322 -675 -160 -271 540
16123 540 -982 344 1287 -234 489 -776 395 474 538 567 -1194 582 -796 646 -339 822 957
16140 957 615 729 -361 1306 -678 -232 -400 400 463 -424 1004 518 1005 -877 -1547 496 -336 -100
16158a00p05J450l76j0l74j011J803m01Q99j398j305J675o98J042j308J300m3
16175D40o00O35j157J474o91J156n98l1m9r51J203j575P64J37n5n74j543K715
16193G00o57m0O30P67r43j484Q69P19r21M84l08j8m99J173O49j736P71l73M11
16212A94j328R95P18j174J044j221J597M4j371P86j216P75l14L13q09J236J114
16229A383k060O92j345J295Q98k29K00j193J830k330J002P01j736J816j720K359
16245A563j291Q02j066l31M98o51J009n29l91l15Q99Q57j913L178k943J557p55
16262A78o43L96K86O67j451m55P37q44J681o11R80j084L99K20j613J013k92J473
16280A037J17k054J757q56k35N27r61P42J75j84p57J1J10J65R30o44R74n68R6
$$ plain form
16158 -100 -805 645 269 259 -115 -1126 677 276 1175 -223 -1528 147 -551 491 -817 483 440
16175 440 -160 475 -682 792 101 1257 659 628 579 -372 831 -744 20 157 102 -472 -2015 700
16193 700 43 3 633 1400 457 -1027 -158 561 -360 124 -184 -202 -701 472 1121 -615 156 -217 194
16212 194 -1134 -139 579 -595 449 -772 825 869 -502 284 -932 -157 -471 -158 -967 269 1383
16229 1383 -677 15 -1330 -35 863 634 834 -359 1471 -859 143 844 -892 924 -796 1563
16245 1563 272 1074 8 -323 175 -476 533 4 -387 -702 197 1054 -859 2319 -624 933 178
16262 178 -465 -69 217 884 -567 -1022 -285 -1129 552 -59 921 -163 236 456 -1157 -144 -436 1037
16280 1037 1154 -900 857 1 -234 293 -668 74 249 65 -692 -681 -571 -406 524 -120 854 286 382
16299C82m90M42M79j127J564j255J87Q91q42m50m61K37l8R25q75R01L91j640J62
16318f17L17J051j503P03K35j070P98M06n74M05j230K092o64J266k614J190R73
16335A164p33n04o81K81p2J166j079J265P8r16N86o12J86j253M51J014m52J124
16353A013j462R6L12M80k50l96K61m42L41m1O14m4n21j412J091J18l0j421K025
16372C32k69K03j26J13L46j264R61j220J910p12Q5
$$ plain form
16299 382 -108 334 813 -314 1250 -5 182 1073 231 -219 -680 -443 -481 444 -431 470 861 -779 -617
16318 -617 -300 751 -752 -49 186 -884 -86 320 -254 151 -1079 1013 349 1615 -999 191 1164
16335 1164 431 -73 -754 -473 -545 621 -458 807 885 -31 555 -57 129 -1124 -673 341 -111 1013
16353 1013 -449 -353 -41 439 189 -207 54 -388 -47 -88 526 482 -39 -1451 -360 -242 -272 -1693 332
16372 332 63 266 140 253 599 -665 296 -924 986 274 359
16383C59
$$ Imaginary data points
##PAGE= N=2
##DATA TABLE= (X++(I..I)), XYDATA
0@%%%%%%%%%%%%%%%%%%%%%%%%%%%%%JkKlOpMmJ1j7J9j9K2k8L5l6L0l5M3m8M9m7
51b4N3n9O2p0Q2q6R3j07J23j49J90k30K81l81N96M321k870O000q57m134p904k408
73g478J262O572N131L372o733o214l000P93N362O388Q54j835p558k518J12M687
89h03M930J191k128m812m489r59N100N826J935j240o656l399J72M409K986K884
105D947O23o503l356j355L118N217J062N86m331l619j872L363M376K013L20m600
121a1l051k093K703L609M510j029m326l108k167J928M688K807R98m741m249k472
137f004J649N463L182J676l670n061l567J416N708M550J904m634l771m755p86
152f700N835L407L858k282m669m420j922M264L120O011j654m393m055l085L841
$$ plain form
0 0 0 0 0 0 0 0 0 0 0 0 0 0 0 0 0 0 0 0 0 0 0 0 0 0 0 0 0 0 0 1 -1 1 -2 4 -3 1 -3 8 -9 10 -9 13 -15 20 -16 14 -21 22 -26 23 -24
51 -24 29 -30 32 -38 44 -42 51 -56 67 -82 108 -122 159 -222 374 4695 1825 7825 6968 2834 -5070 -7478
73 -7478 -6216 356 5487 8859 2126 -4088 -7088 -6295 -933 5455 6309 4474 -3084 -5602 -5490 -803
89 -803 4127 5318 3190 -1622 -6111 -7070 -1970 3856 5791 4551 -2105 -5504 -5332 -923 2063 4947
105 4947 5570 -933 -4289 -5644 -2526 2691 3753 4339 8 -3611 -5483 -2120 2256 4269 4589 -11
121 -11 -3062 -5155 -2452 1157 5667 4638 312 -2796 -4963 -3035 1653 4460 5458 717 -3532 -6004
137 -6004 -4355 1108 4290 5966 2296 -2765 -6332 -4916 792 5342 7246 2612 -1159 -5914 -6700
152 -6700 -865 2542 6400 4118 -551 -4971 -6893 -2629 491 6502 4848 455 -3600 -6685 -2844
167b844L166M985o18j699n631j924Q16L418N187o84l098l222k390J595K457M879
183D393q73j722k747l598J922J297M569R17j627l965l410L83L571L687J139k134
199A802k892k232M60J755K707L067k107k781k759m96K196K755J394o44j889k957
215b621j247K350K842J879o36k407l753j50L137J301L563K15l235l256k493J103
231c408M154K499P71k424l652j270j196K947N995n92r05m258k621l3J739N408
247C154J047O2m280j699j916J957M301J50J194l974k798l98Q27L242J010J861
263C740k677k543j055q9L194J786J874k442l181j083l21L107J622J305q07l802
279a372k447J268K447J212K038j102k725j876j50K620N13K491q82k586j278j044
$$ plain form
167 -2844 322 5307 4689 2990 -2641 -4565 -3749 -331 4856 4172 1074 -2148 -4538 -2943 -486 4393
183 4393 3520 1798 -949 -4547 -2625 -1328 3241 4158 2531 -1434 -4844 -4461 -890 2797 3936 1802
199 1802 -1090 -3322 -2862 -1107 1600 4667 2560 -221 -2980 -3476 -1280 1475 2869 2225 336 -2621
215 -2621 -3868 -1518 1324 3203 2567 160 -3593 -3743 -606 695 4258 4473 1238 -2018 -4511 -3408
231 -3408 746 3245 4016 1592 -2060 -3330 -4526 -1579 4416 3824 2919 -1339 -3960 -3993 -2254 3154
247 3154 4201 4263 -17 -1716 -3632 -1675 2626 2776 3970 -4 -2802 -3200 -2373 869 1879 3740
263 3740 1063 -1480 -2535 -2624 570 2356 4230 1788 -1393 -2476 -2797 310 1932 3237 2430 -1372
279 -1372 -3819 -2551 -104 1108 3146 2044 -681 -2557 -2707 -87 426 2917 2035 -551 -1829 -2873
295b873J781K192K101o68k847j108j743L423J082J396m99k169l005j24K717J349
311A005J255Q04k929k263j959K880J957J794P78j622k853j706L63K361K219J586
327C670k101k693k365m4L208K378K554k490k401l064L0K535J485L372j615k069
343C90l223L17P16J859K070Q76j906l690l35J212J896L520j679q08l985j80Q28
360b122J729L493j584L87m208j215O97K522K498P78m66l038k587J073J643J632
376A232M70l74j741j995N65J285K822O52l99k958k467K21K588K657m8R31l588
393a47k844O53J485J893K854j308k812l411J34Q91M470J919n76k361l402j485
409d047J885L715K359r89r09m431j020o76L977L031J453j471l480k124NJ808K006
$$ plain form
295 -2873 -1092 1100 3201 2533 -314 -1422 -3165 258 1340 2736 2237 68 -2937 -3061 -344 1005
311 1005 2260 3064 135 -2128 -4087 -1207 750 2544 3322 1700 -1153 -2859 -2496 -135 2084 3670
327 3670 1569 -1124 -3489 -3533 -325 2053 4607 2117 -284 -3348 -3318 -783 702 4074 2459 390
343 390 -2833 -2516 -1800 59 2129 3005 1099 -2591 -2926 -1714 182 3702 2023 1215 -2770 -2950 -2122
360 -2122 -393 3100 1516 1903 -2305 -3520 -2823 -301 2197 2975 2509 -529 -3116 -2043 -400 1232
376 1232 1702 1328 -413 -2408 -1843 -558 2264 2916 2517 -441 -2908 -2687 -99 2558 2510 3441 -147
393 -147 -2991 -2338 -853 1040 3894 2586 -226 -3637 -3503 -2612 1858 3777 3201 840 -2562 -4047
409 -4047 -2162 1553 3912 2923 2014 -2417 -3437 -4113 -136 2895 4348 2877 -603 -2727 -2722 -914 1092
426A092K685n14m657j216l00K325J655P61Q60k586k211j845J903L674K159M28
442D213l749k747j503J020L386K254K005l850p78m365J532L008K597O79l149r50
458c97l580J487K210K632Q77j387k127k922J203J833R03L075j397k268j951j438
474c247L174J465K355k556m73l904P68J530K145K246k098j242l092q89K910K405
490A497J166N40k914l457o4J283K365K388N18j546k493k840J292K442K191M7o19
507A796k642l406K046K206K762R06k110j803l038J249j56M892K45r88j477l310
523b828M45J524L085L22l18j685m113J187J138J492K437o61q55l751J85n51K884
540f3L174l69p37l636o89r67K966K684m13R6k592j450r54P29M362Q80M18l860
$$ plain form
426 1092 3777 3263 -1394 -2610 -2910 -585 1070 1831 2691 105 -2106 -3951 -2048 1626 3785 4213
442 4213 464 -2283 -3786 -2766 620 2874 4879 1029 251 -4114 -2582 426 3023 3702 553 -397
458 -397 -3977 -2490 -280 2352 3229 1842 -285 -3207 -2004 -171 732 3807 2410 142 -1809 -3247
474 -3247 -73 1392 3747 1191 718 -3186 -2418 -888 1257 3503 1405 163 -2929 -3818 -908 1497
490 1497 2663 3203 289 -3168 -3232 -1949 416 2804 3322 1776 -717 -3557 -2265 177 2368 2415 1796
507 1796 -846 -4252 -2206 0 2762 3668 1558 -245 -3283 -2034 -2190 2702 2947 1959 482 -2828
523 -2828 -2383 -859 2226 2548 2230 545 -3568 -2381 -1243 249 2686 2025 1170 -2581 -2396 -2947 -63
540 -63 3111 2742 2005 -1631 -2320 -3287 -321 2363 1950 2046 -546 -1996 -2950 -2221 2141 3021 3439 -421
558d21j746o27J931J528J910mk598j657j701L347J377J348m49l110o10n29P63
575a248L224k39J147k545k120j345J259L241J627k56k574k007j699J240K563Q64
591A132K447k646k498k057Q8J753L074K268k325j612j969j41J808K703R0J73k501
608b13j783k071L325Q15L222q01k715k195M20J351Q20L118j820q46k407j641K064
625a357J456K609O28l109j495k478J732Q23L098Q73j727j909k450M00K704J375
641A173L043l196j951j233R04J18J696K423j546j854l077L71J645L187O59o83
657A679j885k690L39P29K682K130j799N3l811M06K53L050J902j96k370j960j804
674c292J984K160J195j62n3l615r53J639J572K423j010j113k227o65R05J184K626
$$ plain form
558 -421 -2167 -2794 -863 665 2575 2571 -27 -1684 -3385 -38 1339 2687 2238 -872 -1482 -2011 -1248
575 -1248 1976 1737 2884 339 -1781 -3126 -1867 1374 3001 2745 171 -1836 -3535 -2295 268 1132
591 1132 3579 933 -1565 -3622 -3534 -1781 1293 3561 1236 -376 -2345 -2486 -678 2025 2115 2288 -213
608 -213 -1996 -4067 -742 73 3295 2494 -221 -2416 -1996 -645 175 3293 1473 627 -1780 -3421 -1357
625 -1357 99 2708 3336 227 -1268 -3746 -2014 -1191 1907 2780 1053 -856 -3306 -2906 -202 1173
641 1173 4216 1020 -931 -2164 -1260 -1142 554 2977 1431 -423 -3500 -3129 -1484 1703 2362 1679
657 1679 -206 -2896 -2557 -1828 854 2984 1185 1238 -2573 -2167 -1914 1136 3038 2842 472 -1488 -3292
674 -3292 -1308 852 2047 1885 1832 -1783 -2736 -1097 475 2898 1888 775 -1452 -2117 -1212 -28 2598
691B598R11k470k158j324M50J877K843o58k39l102k032J072J127L669O01j327
707A838j901k984M44J471M223j012M63l534j970J43O28M468jN0j112l049l47K75
725a907L041M85J205k099k894J147j395L091P08J210k737q62j430o78M910J18
741A913Q83j953k449J65j291K927J176M19kk403j462L29K671Q19P61j102k156
758g55j363j52J073K637L42q28j635j245oJ318J408J792r98k328l72o52J180M18
776a66J306R91l904L54r74J736K218J53J930l876j395j44ML006J347j78l164j034
794a790l30K57K271J903j55j644k409j353K369j15L435j59k427o26j139q34K104
811f42J636J511k968Q33j356j362K088l21K364j007j88j516r75K180q0K134k462
$$ plain form
691 2598 3509 1039 -1119 -2443 -1993 -116 2727 2069 1830 -1272 -3304 -2232 -1105 2564 3165 1838
707 1838 -63 -3047 -2603 -1132 3091 2079 2542 -992 -2962 -2819 -2191 2277 2276 2326 1214 -1835 -2182 -1907
725 -1907 1134 1619 2824 725 -2169 -1022 -2417 674 1382 2592 -145 -1007 -2437 -3115 1795 1913
741 1913 2796 843 -1606 -1441 -2732 195 1371 1790 1788 -615 -2077 -1748 923 1742 2503 1401 -755
758 -755 -2118 -2270 -1197 1440 1782 954 -681 -1926 -1932 -614 794 2586 1588 -740 -1112 -1764 -584 -166
776 -166 1140 2131 -1773 -1419 -2393 -657 1561 1714 3644 -232 -1627 -1771 -1767 1239 2586 2408 -756 -1790
794 -1790 -2120 -1863 408 2311 2156 512 -1897 -3250 -881 -996 2439 2280 -147 -773 -1912 -2746 -642
811 -642 994 2505 -463 370 -986 -2348 -260 -581 1783 776 588 -928 -1903 277 197 2331 -131
828a31k07M69j900K495n53K373j786m09k661q0J351O92K328j745J055k362m7K44
846h74L00J857q26J24k047k27P13L35J916M5R1j488m23Q42j259J442k91o99j17
865e86k73P08r74K510K87j729l18j426P41L16J684l43o85j41j088k68J566Q70
883H51J593r99j563j527R01m10L31K405K6q81j405N5n77J316N53k12R39j698j46
902d48N67j23J97j69J127j742P59j422R83L04J0K311k183n85l56l04Q43M85J580
921A834j625m91j065L05J190j245K085n62k9p96O56m78o62J609J14L78p73j773
939a328J24P00J577m46M75m36p65L1p36Q39K41J193o07j713L95k12K40J122o84
958A0J302k399M90k40J112K70m1M86j111k42q18K115J37m33q8j776J700o56k45
$$ plain form
828 -131 -338 131 -1769 726 173 2546 760 351 -2310 -2390 -1039 -347 1981 236 1291 -1071 -1118 -874
846 -874 -574 1283 457 581 -1466 -1693 -980 -645 1271 1316 1407 -81 -504 338 -921 521 230 -469 -586
865 -586 -859 -151 -1125 1385 1672 -57 -375 -1801 -1060 -744 940 597 -88 -229 -1317 -1585 -19 851
883 851 2444 1445 -118 -1645 -744 -1154 -823 1582 1608 727 -678 -623 -1200 116 669 457 1396 -302 -448
902 -448 119 -4 193 24 1151 -591 168 -1254 -271 33 43 2354 171 -414 -770 -1074 -231 254 1834
921 1834 209 -282 -1347 -1042 148 -1097 988 426 397 -399 257 -221 -883 726 840 1218 445 -1328
939 -1328 -1204 -504 1073 627 1102 666 -99 -68 -804 35 276 1469 862 -851 -456 -668 -428 694 10
958 10 1312 -1087 -597 -837 275 545 504 990 -121 -363 -1181 934 1071 638 550 -1226 474 -182 -427
977d27J801j051N60j261l99j111J860J636p64Q44k386n43j62J40J511Q79L28j591
995a36n58q9j000K163J637k3k413n62r86N90L560j029J093j755k63k112J348R03
1013C68Q16K70r50j042j189K90J252J08K742l026J009k124o15J652J719J529j365
1030A444r50j889j43J193L90J937j206n19j791j565K056K7K776j67j696j170q82
1047b155J254J270K095o95K46l145q41k81J593K074j032P99k513m39O59J739J53
1064G81L49q05j407R3J42N75Q43M76J008l151j311J136J14J442K217j246l33j693
1082g70k94l18K798L24r57r04k372J062N60K158O70q48n84k620N30l69J345J961
1100A372m98L94l809K329k116J978K806p48n60k428N3j650K613J532K13J090l195
$$ plain form
977 -427 1374 323 883 -378 -777 -1888 -28 1608 844 1688 -698 -1241 -1403 -1263 248 1127 1455 -136
995 -136 -694 -783 -1783 380 2017 1994 -419 -981 -1967 -1377 2183 1154 2247 492 229 -1883 -535 368
1013 368 1184 1454 504 -538 -1727 -1437 -185 -77 2665 -361 648 -1476 -2091 -439 1280 2809 1444
1030 1444 494 -1395 -1538 -345 45 1982 776 257 -1534 -3099 -1043 -1016 1760 1593 -103 -1273 -2155
1047 -2155 -901 369 2464 1769 2015 -1130 -1971 -2252 -659 1415 383 1182 -1331 -1770 -1111 628 781
1064 781 1130 325 -1082 -989 -847 -272 571 1047 2055 -1096 -2407 -1271 -1157 285 2502 1256 923 -770
1082 -770 -1064 -1382 1416 1740 783 -121 -2493 -1431 -871 1287 1957 1109 525 -2095 -1565 -1934 -589 1372
1100 1372 874 1268 -2541 -212 -2328 -350 2456 1708 1148 -1280 -1227 -2877 -264 1268 1481 2571 -624
1117f24j298n05Q71L538R0R23k762j257j055J521J161m76J866j870m96j675k42
1134b290K796p3P53j548o25l09J204L23L00J477j651l47j282R40Q79J418K05k247
1152g7l81j755J475J809N02N32j670o88j534p21K923Q64J339j017k565n62r63
1169b489J872J171K462k364j911o5k341K501J124K542J0k348k277m01J259J132
1185a23K620N90l160j295j889K537M26J242J375m67k359k779J132R56J898J478
1201B182j501o91k687J138l85K703J811k426Q17k407N38q40K769J419j415n71
1217D54j559L83j19J338J393j115L32k472M30k7J035J621j042Q90k156L0j32J589
1235H73q20J634J02l111q34J811O13J935p85q40j735r10J149R62J770R34j225
$$ plain form
1117 -624 -1922 -2427 -1556 1982 2072 2995 233 -1024 -2079 -558 603 127 1993 123 -373 -2048 -2290
1134 -2290 506 433 1186 -362 -987 -1296 -92 231 531 2008 357 10 -1272 -332 547 1965 2170 -77
1152 -77 -458 -2213 -738 1071 1573 2105 435 -253 -1787 -2508 415 1279 2618 1601 -964 -1526 -2489
1169 -2489 -617 554 3016 652 -1259 -1324 -3665 -1164 -40 2502 2512 164 -2113 -2514 -1255 -123
1185 -123 2497 3087 -73 -1368 -3257 -720 -294 948 2323 1856 -503 -3282 -2150 -1194 704 2182
1201 2182 681 -10 -2697 -1559 -1944 759 2570 144 961 -1446 -908 -1748 1021 2440 1025 454
1217 454 -1105 -722 -841 497 1890 775 1107 -1365 -935 -962 73 1694 652 1542 -614 -584 -716 873
1235 873 53 1687 1789 -1322 -2156 -345 268 2203 1418 578 -1157 -2067 -918 44 1814 2748 1523
1252A523k495j318Q86R62K978j84l03j563k603N17K77K667M4p14r95k824J583
1269a562J49L060n76Q20j083m123J354j23L720J23K17j092l042l89M89K540K524
1286C006q44m31l418k73j303M684o68K002n62m116K98l68J518J880J405L8m372
1303a524P21j825K033J192R56m97j514n35p65J192K250q19J236k176j426k38J223
1320e16N34J708l85j601j461N62N17J132J498K65j846k344j446J650K533J802
1336B602j130o29j018j635o51J854K423P59k591p06j473k05K337P21K824k771
1352G11j996j638Q16J947K027J724j517j914k280p51M070o99J666M44k056k627
1368b073k86K007J622J657r33k133j762n50O71K005K169K81j636j885k431K241
$$ plain form
1252 1523 -972 -2290 -1404 -442 2536 2352 2049 486 -2117 -1600 -1323 1344 1388 674 -321 -3145 -1562
1269 -1562 -1413 1647 1071 1891 808 -3315 -1961 -2084 1636 1759 1976 884 -2158 -2547 -2058 482 3006
1286 3006 2162 1731 -1687 -1960 -3263 1421 753 2755 2193 -1923 -1625 -1993 -475 1405 2810 2848 -1524
1303 -1524 -803 -2628 -595 597 1553 1056 -458 -993 -1758 -566 1684 865 2101 -75 -1501 -1739 -516
1320 -516 18 1726 1341 -260 -1721 -1159 -642 490 1988 2253 407 -1937 -3383 -1733 800 2602
1336 2602 1472 843 -175 -1810 -2461 -607 1816 2575 -16 -722 -2195 -2400 -63 658 3482 711
1352 711 -1285 -2923 -2107 -160 1867 3591 2074 160 -2120 -2871 1199 500 2166 2610 554 -2073
1368 -2073 -2359 -352 1270 2927 1994 -139 -1901 -2451 -1780 225 2394 2675 1039 -846 -3277 -1036
1384a036K53L485o89P84l500k584N63K136K334l89l14j462j152J197j293K862
1400A195P31q10j042j906J628j042L333j464J140k120j190N58m73K266J405o05
1416A604j903j338M71k79L934n78m29j082k566R95l20K210M66l76m40k133q00
1433b564P30J201J100J362j77k662r85K7K474J993k63j06l055j468j81J646K409
1450A481N8P39k453k304M1J839J548N59J377j644k781j228J0L261K117l36m62
1467A822k834o19j36J490J658K183k686j985j374L84K311L31K408p30k970j091
1483a838J73K18J564J205O97j801j593k135K357M87L305j956o86j098o42P59J32
1500h52M063j841q39j693j333N27J729K286j015l60j787j741R71K252J524J157
$$ plain form
1384 -1036 -783 2702 2013 2797 -703 -3287 -2724 -588 1746 1357 1043 -419 -1571 -374 -1667 1195
1400 1195 1926 1116 74 -1832 -204 -1246 2087 623 1763 -357 -1547 -989 -1462 804 2209 1604
1416 1604 -299 -1637 -1166 -1445 2489 1911 1482 400 -2166 -1171 -1491 719 1185 809 369 -1764 -2564
1433 -2564 -1834 -633 467 1829 1652 -1010 -1995 -1968 506 2499 2236 2130 -925 -2393 -2574 -928 1481
1450 1481 1539 2278 -175 -2479 -2438 -599 949 1508 2885 1241 -1540 -2768 -2758 503 2620 2284 1822
1467 1822 -1012 -1631 -1767 -277 1381 3564 878 -1107 -2481 -2097 214 545 2953 2223 -747 -1838
1483 -1838 -1665 -1447 117 1322 2019 218 -1375 -3510 -1153 -666 2639 683 -3 -1101 -1743 -984 -852
1500 -852 3211 1370 531 -1162 -2495 -1968 -239 2047 1032 672 -1115 -2856 -1885 367 1891 3048
1516C048j738k508j731J441m38K904J343o29k983j689K66K006J128K481k506j83
1532B12k664J225m20K429L249j073j880k992l69r08K533L932m8j187m193p29o89
1549c572L211L475o49J06l833q52p81J229L599J502l29l800j901O59o5L291R16
1566B206J08k363j378j428J061L006K031j71l475j233j706Q64L893J097N19j992
1582A039k517j087L37K677N18K480k455k050j769Q26Q35K649K887k813l717q61
1598c021Q26J770J694K214k168j847k219m41K382J848K922l096j314k156p18K625
1614f99J286L058j984k423j626n53K617K129J775q68k475k225k364L468J219K582
1630B917M19l790k245j739K315K034M459m62k341l116l478K057K747L700J37j969
$$ plain form
1516 3048 1310 -1198 -2929 -1488 -1926 978 2321 1692 -1291 -2980 -2714 -708 420 2901 395 212
1532 212 -2452 -1227 -1647 782 4031 2958 1078 -1914 -2283 -3191 -658 3274 3226 2039 -2154 -2883 -3572
1549 -3572 -361 3114 2465 2571 -1262 -2114 -2895 -1666 1933 3435 3106 -694 -2595 -1936 -2001 1290 2206
1566 2206 2314 -49 -1427 -2855 -1794 1212 3243 3072 -403 -1636 -3342 -2478 1415 2512 3031 1039
1582 1039 -1478 -2565 -2228 449 967 3447 992 -1058 -2827 -2001 -1166 1483 4370 1557 -2160 -3021
1598 -3021 -2195 -425 1269 3483 1315 -532 -2751 -3192 -810 1038 3960 864 -450 -2606 -3324 -699
1614 -699 587 3645 1661 -762 -2388 -2941 -324 1805 3580 2712 237 -1988 -4352 -884 335 2917
1630 2917 3336 -454 -2699 -4438 -2123 -89 4370 3908 1567 -1549 -5027 -2970 -223 3477 3614 1645
1646A645k488l813K364J037L542J342j578l419k063j85K312L082J768k052k669
1661a175j835K03J555K949K357l054j026l788p26M087J833K440j597j168m534
1676c479N34J343K412L367j912j049l780j533K705J706L650j197j865l255j713
1691d066K059J634M123j672l10k866k455J644J778K302r1j05l097k279N05K224
1707f72L909m89l96m253k279J728J772K736J845j683k860k204L63J209K909J959
1723C594j066k653k284k12M96M209J041L51k575k973j700N92M730J924O3k075
1739A462l606n34M41K760L128j228ll979j515J614K181J747K50k194k642n50M79
1756b189J333L713p99r41l450n42P10K278K515N11n63m418j161n6L434K042J2
$$ plain form
1646 1645 -843 -4656 -2292 -1255 2287 3629 2051 -1368 -3431 -3616 -1304 1778 3546 1494 -1175
1661 -1175 -3010 -2807 -1252 1697 4054 1000 -26 -3814 -4540 -453 1380 3820 2223 1055 -3479
1676 -3479 -2945 -1602 810 4177 2265 1216 -2564 -4097 -1392 314 3964 2767 902 -2353 -4066
1691 -4066 -2007 -373 3750 2078 1768 -1098 -3553 -1909 -131 2171 2080 1975 -1122 -3401 -2896 -672
1707 -672 3237 2748 2352 -1901 -4180 -2452 -680 2056 3901 2218 -642 -2846 -2483 -1274 1635 3594
1723 3594 2528 -125 -2409 -2621 -2125 2084 3125 3476 901 -2072 -3772 -3180 1550 3474 3537 1462
1739 1462 -2144 -2678 -2237 523 3651 2423 2420 -1559 -3074 -1460 721 2468 2718 524 -2118 -2668 -2189
1756 -2189 -856 2857 2058 1117 -2333 -2875 -2165 113 2628 3139 2576 -1842 -3003 -3059 375 2417 2429
1773B429O25m648j546J18K278L159M44O44l926j984q49J171L309J287L99l899
1789i89p11k175L670J776J585j54m604j88k499K936K766J405O14k692k302l283
1805d845K279L052J427K181l314j936k255mM613N21K034k202l247j018q65K169
1821a410L642J203j975j407l429o05L704R40K536j116l220q93r7M38L319J048
1837B678j437j930j616o96K713P28L228r98k079j500k805K998J437K571r35j763
1853E94j570k746J097K988K339L38k300j251k561J374J378K365R87j923j792k535
1869c218M34K317K430J436j771q61m270J330O37K954L178j929j783l294n60J245
1885a725K534K208k234j8k677q87j25L313K201M01r34m206j007Q14L244K386r92
$$ plain form
1773 2429 3054 -1594 -3140 -3022 -744 2415 2859 3503 -423 -2407 -3256 -2085 1224 2511 2910 -989
1789 -989 -1700 -3875 -205 1571 3156 3002 -1602 -1790 -4289 -1353 1413 2818 3432 740 -1562 -4845
1805 -4845 -2566 486 1913 4094 780 -1156 -3411 -3415 1198 1719 3753 1551 -1696 -2714 -3579 -1410
1821 -1410 2232 3435 1460 53 -3376 -3981 -277 663 3199 2083 -1137 -2030 -2127 -1689 1630 2678
1837 2678 1241 -689 -2305 -3001 -288 440 3668 2670 591 -909 -3714 -716 721 3292 2357 594
1853 594 -976 -3722 -2625 363 2702 3040 740 -511 -3072 -1698 -320 2045 3032 1109 -683 -3218
1869 -3218 -2784 -467 1963 3399 1628 767 -3503 -2173 -1536 1418 4596 2667 884 -2410 -2970 -1725
1885 -1725 809 3017 783 765 -1912 -2799 -2924 389 2590 2991 2057 -2149 -3156 -2342 902 3288 2296
1902B296m24k901k453K69L954R18J333j155k038k228l31J885K637J032m81k724
1918d11k765K89J727K884J041j70k565j821j215K070K410P22J501k916l922J00
1934c041J996J131L032l57r64k946j157k93L406J707R21k909j972j185o18L505
1950B56J533L81k065j598l91N8J891K019N86j226k947J83j864L147R86J547J27
1967B623k890j332k353L584J522J006j57j969j495j593K013J453J449N07j746
1982F22k125j080J006J873K926j178p65j918k781K190O43L598k90j813j792k578
1998c462K436J289J72K125q42j984l010J064K147J573J990j876k532j801N45J001
2014a165K376K477o98k112m201M53J561K468J787q33j857k003r77J234K811J216
$$ plain form
1902 2296 1872 -1029 -3482 -3213 741 1659 2992 1837 -201 -2429 -2760 -875 1762 2794 2313 -411
1918 -411 -3176 -2887 -1160 1724 2765 2595 30 -1791 -3006 -936 1474 2196 3697 781 -3141 -3041
1934 -3041 -1045 86 3118 2761 1797 -1149 -2306 -2599 807 2514 3435 526 -1446 -2631 -3249 256
1950 256 1789 2170 105 -1493 -1884 -1826 65 2084 2670 1444 -1503 -1320 -3184 -37 949 2496 2623
1967 2623 -267 -1599 -3952 -368 1154 2160 2003 34 -1461 -3054 -1041 412 1861 2368 622
1982 622 -1503 -2583 -1577 296 3222 2044 1279 -639 -3420 -1230 -587 3011 2721 908 -884 -3462
1998 -3462 -1026 263 435 2560 1718 -266 -3276 -2212 -65 1508 3498 1622 -910 -2711 -2166 -1165
2014 -1165 1211 3688 2990 878 -3323 -2870 -1309 1159 2946 2113 256 -1747 -2724 -1490 1321 2537
2030B537p39n04k952l50J756p68L694j275P0k648j668J305K175J322m4n39k464
2047a092k377J425J547L447l9r57l332j038J034o64L778J528n63k178l164l63
2063c008J161L156k05R25r22l298R62r80L219R94J18j643k546l77J58L022L56
2080A092J058j463j147m73j082L343j65P60p82k147p58n88K417J331J92j223m41
2097g6j262j582K737J653J662n25k845k72k006J660K231M69l6k553j42k114K068
2114i33J061K277O18k933j019j977K305k51L111q83j108j275j919J194K210J311
2130A789J328l381l47j991M63J647J407J371j668l44j272p05J720J89K695l80
2146B521k957l66j884K427R46J754q44j171k575J90O34J138K505o34r41k724K95
$$ plain form
2030 2537 1798 1294 -1658 -2008 -252 -1020 2674 1399 1469 -1179 -2847 -1542 633 1955 1911 1372 -1092
2047 -1092 -3469 -2044 -497 2950 2911 1954 -1378 -2416 -1382 -2046 1732 3260 2697 519 -2645 -3008
2063 -3008 -1847 1309 1104 2029 1107 -2191 -1229 -2209 1010 2004 2122 479 -2067 -2444 -2286 736 1092
2080 1092 2150 687 -460 -933 -2015 1328 1163 1923 1141 -1006 -1764 -2352 65 1396 1588 365 -76
2097 -76 -1338 -2920 -183 1470 3132 2607 -238 -510 -2516 -856 1375 1844 1808 -745 -887 -3001 -933
2114 -933 128 2405 3023 90 -929 -2906 -601 -852 2259 1376 268 -1007 -2926 -1732 478 1789
2130 1789 3117 -264 -611 -2602 -2139 -492 915 2286 618 274 -998 -1703 17 206 2901 2521
2146 2521 -436 -802 -2686 -259 687 2441 1597 426 -2149 -1959 -1325 -187 2318 1684 743 -1981 -1686
2163a686J265o33K799j014k1r46k273J205J447J938j061q64p54j726P21J435J944
2180A776k88n93j069k647L27R31L513l70k34j783j345M63L03K335O91j195J79
2197I94k213p11J120J430N06O44j595j158o57l43K110J662J72j298j392p51k02
2214a682K307R83P61q24l699L70Q94Q19J438J65K4l572r33Q63J765K076l11K67
2232A711k746l6q20J099L414l61K4l298j79j980J958K835l69Q70k472n33j855
2249b738J677K040N79L54k002j307j338J464J683P27J815l196q98j175J93L597
2265A475J34J855k849q57j830K13J320J944J132k60k443k213R22J386J242J280
2281B451j383j073j841j271K611J673J452l03j563k275n42R56J944J816r6k743
$$ plain form
2163 -1686 -421 -1054 1745 731 710 -236 -2509 -1304 143 2081 1020 156 -598 -2324 -1603 -168 1776
2180 1776 1488 895 -174 -2821 -2494 -1563 1950 1580 1346 -437 -1782 -1319 -1016 1319 2010 815 994
2197 994 -1219 -1930 -810 620 1126 1770 175 -983 -1640 -1983 127 1789 1961 663 -729 -1480 -1682
2214 -1682 625 1608 2369 1545 -2154 -1784 -890 -71 1367 1532 1556 -2016 -2949 -2086 -321 1755 1444 1711
2232 1711 -1035 -1071 -1891 -792 2622 2261 2285 -1013 -1192 -3172 -1214 1621 1252 2122 -350 -883 -2738
2249 -2738 -1061 979 1558 1912 -90 -1397 -2735 -1271 412 1139 2954 -242 -1140 -2315 -2122 1475
2265 1475 1609 3464 615 -242 -2072 -1859 -539 1405 2537 2277 -166 -2379 -1457 -71 1171 2451
2281 2451 1068 -5 -1846 -3117 -506 1167 2619 2316 753 -1522 -2064 -1108 836 2652 2556 -187
2297a87k016O24l34K432K092J48k689k428J29R87K395J591j14k231j704r38R13
2314a330P75K916m34j028j036l010K219K43L104o06n97j847k597L74J871K898
2330A915N64j779r62k648l1J865K416J804p71j897l109N11K046J929Q35j277j276
2347A35l628K61J828L078P35j460j732j805n78J235K918K003l34j468l537L09
2363b040O59J844L043j479l31l642q13J76K548K216M77m52l504k453J092K300
2379c59K723m68j17k338j695j138K351K818m43k30j284q11j394O20L583N3j57
2396A714j474j575j098q8M541q55J148l035j990K74O86K438J757l61r95k530p32
2413b175J064J644J201J36K70l963o06Q62K639J240o32l81j699j865L88J922J615
$$ plain form
2297 -187 -2203 -1579 -1913 519 2611 2759 70 -2358 -2229 -1242 1153 2744 2630 399 -1305 -2243 -1330
2314 -1330 -555 2361 1927 899 -137 -3147 -928 -685 2419 1813 1216 -631 -3228 -2854 -983 1915
2330 1915 2479 700 -262 -2910 -2941 -1076 1340 3144 2373 476 -2633 -2122 -76 1853 2688 1411 135
2347 135 -3493 -3232 -1404 1674 2409 949 -783 -2588 -3166 -1931 987 2990 2656 1188 -2349 -2040
2363 -2040 -1381 463 3506 2027 1696 -1946 -2759 -2583 -35 2181 2658 2206 -1298 -3751 -2659 -359
2379 -359 2364 1896 1779 -559 -2254 -3392 -1041 1777 1334 1104 -180 -991 -2385 -1765 1818 1871 1714
2396 1714 240 -1335 -2433 -2521 2020 1165 2313 -722 -2712 -2438 -1752 686 2443 2082 1087 -1443 -2175
2413 -2175 -1111 533 1734 1870 2140 -1823 -2429 -1567 1072 2312 1680 1299 -400 -2265 -1877 45 1660
2430A660o89K3k643J275j792J878K354K31j278k091M89k426K994J392J292k097
2446E72m83r33k442L241J120R13q06j794j05k115K392J571Q70M37k916Q7k218
2463b609J252K031J150k39j003o69j076M1j00K639N96j372j596j280L24J584K377
2480B050j59m47k012l61j55J237j5K041j673k06k662J413M98K67K019j251n36
2497D8j068j528J295K003J818k503n26k94N87p79M45K562k362Q25j359j83N31
2514d88K36J936k28k81r97k638J670m45L230q33j390J60j516J588p32K336j289
2531C19k06J52j659N96P17K527j051q61l84j518J405j474K452m89L7P92l240J070
2549h15r29J247N48J198o4k110R30j277R98J356J048k059p71L78q36J654r46K50
$$ plain form
2430 1660 971 994 -1649 -374 -2166 -288 2066 2297 1019 -1072 -583 -3009 -15 1377 2669 572
2446 572 89 -844 -3286 -45 1075 1988 1182 -612 -717 -2832 -440 1131 2001 2438 -478 -391 -2609
2463 -2609 -1357 674 1824 1585 582 -87 -1163 -1122 -1222 1417 2013 641 -955 -2235 -1911 -327 2050
2480 2050 1891 1444 -568 -929 -1084 153 138 2179 506 300 -2362 -949 -451 -184 1835 584 48
2497 48 -1020 -2548 -1253 750 2568 65 -461 -755 -168 -947 -502 2060 -302 523 -836 -1019 -488
2514 -488 -252 1684 1456 1175 178 -2460 -790 -1235 1995 1162 -228 -68 -1584 4 -728 1608 319
2531 319 113 265 -1394 -798 -81 2446 1395 534 150 -1368 37 -1437 1015 526 563 1355 -1885 -815
2549 -815 -1744 -497 51 1249 1185 -925 5 -1272 -274 1082 2130 71 -700 -322 -1158 496 -450 -200
2567b00P88j999K346j378J120l65N55j50q77L8j439R23J189n36M46k81l50l85
2585e55l38Q49p77K440r34m40n26J61Q7J71J685j246k90o88l7K65J98O98l41j66
2605B16p56P06r95J225M77j079m24O55m19P06o53J452m76j94j453l8O49j52J868
2624A315l07j176J08M6N82j232K404j477N26p33j698O98M66P49l39J389j900j673
2642b252J338o13K278K89k23j61j694M90j37K032q56j13Q09l354K064j63P7P65
2660E76J45j202l1k08n39J284J015O2J72k278Q77j336J440L37N73r8j879J432
2678C42k047J478l09J025J768k580O74j544J134n2P57j145k32o58L05J401n99
2695b82J577j78j175m28q91J384L50o01J658j511p09O43J92K47O31J103j455p78
$$ plain form
2567 -200 588 -1411 935 -443 677 312 867 717 -160 -122 -1561 -638 551 15 461 180 -170 -555
2585 -555 -893 -44 -821 1619 685 245 -281 -120 -33 138 1823 577 287 -401 -438 -173 25 723 382 216
2605 216 -540 166 -829 396 873 -206 -630 25 -394 312 -341 1111 635 441 -1012 -1050 -401 -553 1315
2624 1315 1008 -168 -60 -14 568 -664 1740 263 789 56 -1642 -944 -478 271 -68 1321 -579 -2252
2642 -2252 -914 -1527 751 1040 817 656 -1038 -548 -685 1347 491 378 1187 -2167 -103 -266 -189 576
2660 576 721 -481 -512 -720 -1259 25 1040 1102 1274 -1004 -127 -1463 -23 314 887 789 -1090 342
2678 342 -1705 -227 -536 489 2257 -323 351 -1193 -59 -111 646 -499 -731 -1389 -1084 317 -282
2695 -282 1295 1117 -58 -486 -1377 7 357 -244 1414 -97 -806 -163 29 276 907 2010 555 -223
2713b23N53j003J855k43l1l01j748R20j95K409j514j71n35q36o01K51J505P55
2731H47o6r71j38k90j589K455m05J696j345O84j469j133J760k83J774j381J64
2748C10j41j759J877K20R17j431J16k33j473J788j123J598Q60j077N42k477K198
2765G12j289J235J74k98J04j693O50n27J635n20m21q1k19o2M08J104j247K334
2783A999q44j436l31K33L10J354j387J08o72j3p25L57K786j96j603q93Q17M16
2801B80n40J396k33k23j811L80J22j93K339r81M10j081o85J81R77k09N09P31j901
2820e32n66k76k77K965j720K576j865q8j318r28K851m20J582j156j003o74j018
2837a867J504P07J510k537K12Q59k509J958K00J636j54j795j003o87J164M99J898
$$ plain form
2713 -223 330 -673 1182 939 908 607 -1141 -221 -416 1993 479 308 -227 -1063 -1664 -1413 92 847
2731 847 781 -190 -328 -618 -2207 248 -157 1539 194 878 -591 -1724 36 -247 1527 146 310
2748 310 169 -1590 287 507 1424 -7 109 -124 -1597 191 -932 666 1526 449 991 -1486 712
2765 712 -577 658 832 534 638 -1055 -405 -932 703 183 -238 -319 -538 -600 -192 912 -335 1999
2783 1999 1155 -281 -612 -379 -69 1285 -102 6 -666 -679 -1404 -1047 1739 1543 -60 -953 -136 280
2801 280 -260 1136 903 680 -1131 -751 -629 -822 1517 536 946 -135 -820 -639 338 129 638 1369 -532
2820 -532 -1098 -1374 -1651 1314 -406 2170 305 217 -1101 -2029 822 402 1984 828 -175 -849 -1867
2837 -1867 -363 344 1854 -683 -471 388 -2121 -163 37 1673 1519 -276 -1279 -1966 -802 -303 1595
2854A595j46j209r47q21Q17P60J310j300J235j177j361P40J56K123j321m95M5
2871Dj68q84O21J343P85j886j6j208M32R16P91M40q65o03j632J464J531r27J809
2890A947j058j276j887J409N48K382j30j473k13k292M1J477R91J929k386P52k469
2907a708j144J53L612J619j482k20j311r36L10O97K432l23p46j430j154J948j472
2924a155L721k280J505j645k102J165n69K590m55J298k360j515P08L84K475l6
2940A729J184l920j422M96N80K187N24J034k627j79j433J32L007p31P56j251r39
2957h73k98p47K598J92P24j293j376J242p09k19K616o48q18q91m20n45Q71K288
2975A694p26j19j611r34k46J439Q53J046r56n74r38j157L193J76J110l59k233
$$ plain form
2854 1595 1449 240 -707 -1528 -711 49 1359 59 1294 117 -1244 -504 -348 1775 454 -41 4
2871 4 -164 -1048 -427 916 1701 -185 -201 -1409 -977 -61 730 1170 305 -298 -1930 -466 1065 138 1947
2890 1947 889 -387 -2274 -865 -317 2065 1935 462 249 -2043 -2002 -525 466 2395 9 761 -1708
2907 -1708 -2852 -2699 913 2532 1050 830 -481 -1417 -1107 -410 2022 1699 953 -477 -1631 317 -1155
2924 -1155 2566 286 1791 146 -1956 -791 -1360 1230 775 2073 -287 -1802 -1094 -710 1765 1729
2940 1729 2913 -1007 -2429 -1933 -1353 834 1358 2392 -235 -414 -1847 -1715 1292 561 1317 66 -873
2957 -873 -1171 -1918 680 872 1596 303 -1073 169 -540 -759 1857 1209 391 -500 -920 -1465 -594 1694
2975 1694 968 849 -762 -1696 -1942 -503 350 1396 440 -134 -1072 -2229 964 1140 2250 1891 -342
2992c42j110n31K460J762n83m33k853m56l18J963K24J611M61l038K27k30N77J317
3010G08L8P63j963j40p72Q65J366L82K61r65P6k916k46J984J247J207j399l29
3028A67q36j109L66J169J533j170N32j624j17M15N34J172m60k32q90l58P29k6
3046b05J423q16M53j718R42j055J963Q12k012O7r42o07J842r20K808j597K98j055
3064c19j617J238Q70O72m8m03o49j608J487l35J701j103L61r19o0o09M13J973
3082A045J33n35m20r77k7M99J88J130q2o94j495N36o93J914RJ086j070r60r32
3101a345q48J956R42L51O68j848n92M4J234j31L53m9j630K46j455J886J553j099
3119B36J183n92j138j432L51J610J25J745l298J117j056n16J797q8J591j882J205
$$ plain form
2992 -342 -1452 -1983 477 2239 1656 1223 -1630 -2086 -2404 -441 -217 1394 1855 -1183 -956 -1186 -609 708
3010 708 746 1509 -454 -594 -1366 -501 865 1247 1508 543 619 -2297 -2543 -559 688 1895 496 167
3028 167 -669 -1778 -1412 -243 1290 120 652 -972 -1089 -674 -140 1032 572 340 -550 -908 -179 -205
3046 -205 1218 402 855 -863 79 -976 987 1799 -213 -146 -1088 -1695 147 -773 2035 438 736 -319
3064 -319 -1936 -698 172 844 796 393 -256 -1864 -377 -712 989 -114 247 -672 -732 -1341 -928 1045
3082 1045 1178 643 223 -754 -781 -282 -94 1036 954 260 -1235 -699 -1392 522 531 1617 547 -413 -1345
3101 -1345 -2193 -237 705 1056 1724 -124 -716 -672 562 431 784 735 -895 -649 -2104 -218 1335 236
3119 236 1419 827 -311 -1743 -1392 218 343 2088 -1210 -93 -1149 -1665 132 44 1635 -247 958
3136I58j282p82R40L42K095k245Q07j331J32Q19j77J072j934Q57j605J179l85
3153e40j77J505k39n98M52j272J117O0J357j577K21o67p90N37O00J530k87j410
3171a78q71p55J467o72K153j93o08j037n91J461o89K586j076n00J0j796O0mK480
3190A247P14k118o61p99M16J087J336O87j533L7k897K823j620J577J582j082N65
3207A361k667R20j526K361M49P61r1k706o97j96J637K357j50n7l057N90j173J725
3225a59Q32l50J212j180j033j189K010J426p38J125k731p80k64R64K598N95m96
3242A842l074J972k430J088K103M71J64k194q82q66P68J114J763j139J91j946
3258a055q42Q84Q81R74J074j526j307p26M56K049P74J183k155j857j88J082R11
$$ plain form
3136 958 -324 -1106 -166 176 2271 26 833 -498 -366 453 276 1348 -586 271 -1334 -155 -540
3153 -540 -717 788 549 -49 403 -869 248 308 1665 88 309 -358 -1148 -611 -11 1519 1232 -178
3171 -178 -1049 -1804 -337 -1009 1144 951 343 -694 -1285 176 -513 2073 997 497 507 -1289 -1229 -1233 1247
3190 1247 1961 -157 -818 -1617 -1201 -114 1222 1909 376 413 -2484 339 -1281 296 1878 796 1361
3207 1361 -1306 -386 -1912 449 898 1659 1568 -1138 -1835 -2031 -394 1963 1813 1756 -1301 -711 -1884 -159
3225 -159 673 323 1535 355 -678 -1867 143 1569 831 1956 -775 -1555 -1819 -855 1743 2338 1842
3242 1842 -1232 740 -1690 -602 1501 1972 2136 -58 -940 -1806 -1038 76 1839 700 891 -1055
3258 -1055 -1897 -1013 -132 842 1916 390 -917 -1643 -1187 862 1636 2819 664 -1193 -1381 -299 612
3275F12K07K068k317j941Q8j40J597K11K058r50k088p00j391K334J396J390K82
3292B716l131j080r84J889L26K931j500l47j465j866J959J190J042o0k721k8j564
3309b693K365p44J986K40j530P36l237K544P25O52l70J026k311j297J091R30J246
3326A359M11j019r92k576J150Q99L311l14j890m00k598J402J486P46J936j417
3342A494j827k249K273m99K185P88r61k96k499m62J529K023L04j07p96k884l31
3359b315P12J733J630K18j088k498j146R35K189R69N53j504j502j759J605N64
3375g04L067k38p23q40l144J209J77L452j14N16l832j99r9j524L791O04J289k394
3393B94k166R2J139K279L39K35k685k93J28j071K008N52O75j752j438J066j612
$$ plain form
3275 612 819 2887 570 -1371 -1283 -1423 174 385 2443 1493 -595 -1295 -2686 -352 1044 2434 2716
3292 2716 -415 -1495 -2479 -590 -264 2667 1167 820 -645 -2511 -552 638 1680 1620 -1101 -1129 -2693
3309 -2693 -328 -1072 914 1154 -376 360 -2877 -333 392 1044 674 1700 -611 -1908 -817 113 1359
3326 1359 1770 751 -241 -2817 -1667 -768 2543 2229 339 -61 -2659 -1257 229 975 2911 1494
3342 1494 -333 -2582 -309 -808 1377 2165 1204 908 -1591 -2053 -524 1499 1803 1696 900 -1984 -2315
3359 -2315 -1603 130 1760 1978 890 -1608 -2754 -1819 370 1339 1892 388 -1114 -2873 -1268 -704
3375 -704 2363 2125 1402 562 -2582 -1373 -1196 2256 2142 2658 -1174 -1373 -1472 -2996 795 1399 2688 294
3393 294 -1872 -1780 -641 1638 1977 2212 -473 -766 -638 -1709 299 851 1526 -226 -1664 -598 -2210
3410b210K259J478P69k591q14l85j127L417P22M20j854q35o69j672K982J919o89
3427A120K87k420J28O8Q00P13J091j972n38r4j541L375K0J640r03k685j623K66
3445b268K620J233J232q1l606o83j824L773J261J075o93k480j640o07J565K486
3461A363N69k44j097j670k91J6J725J759N91k087j030k426J670O29J138K350j852
3478A113k012j297J283L73J309J950k288m38r51j63q68K402J112N96k122j133
3494a134l54J019N57K168q67o37j956n86K08J327K993j895k64j019o01Q5J044
3511H8J636J44j037k170j528K601n30K806n7j057j653j481J544J6K184L56j208
3528F54o34j871O95Q64J919j4n13k101n09J912l25j3K803j773j694k045K54J929
$$ plain form
3410 -2210 49 1527 2296 -295 -1109 -1494 -2621 796 1518 1938 84 -751 -1420 -3092 -110 1809 1120
3427 1120 1407 -1013 -885 -817 -17 696 1787 -185 -723 -817 -2358 1017 1037 2677 1774 -911 -2534 -2268
3445 -2268 352 1585 2817 2736 -870 -1553 -3377 396 1657 2732 2039 -441 -2081 -2688 -1123 1363
3461 1363 1932 1688 591 -1079 -1370 -1354 371 2130 2721 634 -396 -2822 -1152 -523 615 2965 1113
3478 1113 -899 -2196 -913 -540 769 2719 431 -7 -958 -1121 -1989 413 1525 2121 -1 -1134
3494 -1134 -1488 -469 88 2256 1389 752 -1204 -1790 -1582 -255 2738 843 579 -440 -1041 -956 88
3511 88 1724 1868 831 -1339 -2867 -266 -796 2010 1953 896 -757 -2238 -694 -678 1506 1862 654
3528 654 20 -1851 -1156 -292 1627 1613 1100 -1001 -1510 402 77 64 2867 1094 -600 -2645 -2391 -462
3546d62K173R24j011o57k482p13M13L171J189n71r40k377p91l34K262J883j98
3563A479o60j892o06P35J314J616r84O94k750p18J21K18K229Q17o04j905j174
3580b070K17J745J866J28K79l130k69o13J70L704m49p16j786o24K37k02K571l63
3598F95O01j780J7p00j040L167k22K183k452n78j717o07M125n31L99k51k736j645
3616c072J085J273K194M90k080j410n33Q22J303N94J358j363j449o68m04K557
3632F97P79P60j360j275n62j321J868J937O23j864p44j817J059L27J395K498k258
3649G42j992o25O0N8K122J427m51j693j026j557J637J435K033m60j436p52j296
3666a774J130J23J900J187k554p39j163j56K185O33M63p46l70k234M91J680J149
$$ plain form
3546 -462 1711 2635 1624 967 -1515 -2228 -1815 1356 2545 1974 1034 -1343 -2134 -2468 -206 1677 1479
3563 1479 819 -1073 -1679 -944 370 1986 1002 1696 -1054 -1772 -1651 -1433 796 1613 1009 -896 -2070
3580 -2070 -1853 -108 1758 1886 2165 -965 -1234 -1847 -1677 2027 1578 862 -924 -1548 -1311 -1513 1058 695
3598 695 1296 -484 -467 -1167 -2207 960 738 2921 469 -109 -1826 -2433 1692 1161 1560 1309 -1427 -3072
3616 -3072 -1987 -714 1480 1970 -110 -1520 -2053 -1231 72 666 2024 661 -788 -1456 -1860 697
3632 697 1476 2236 876 -399 -961 -2282 -414 1523 2146 282 -462 -2279 -1220 -893 502 3000 742
3649 742 -1250 -1875 -1815 -1757 365 1792 1341 -352 -1378 -2935 -1298 137 2170 1710 274 -478 -1774
3666 -1774 -644 -521 1379 2566 12 -727 -1890 -2046 139 772 1235 489 119 -2115 -1624 56 1205
3683A205K018l002j49k226J184P10R90N18N65j629k840R05Q5K895J791k057q85
3700G8j009J59k11J816J340j724P51k538K12M79O68K072j361M36k444j028J598
3717g06R92J950j471M58j749j390Q11J450J145n26k68k249q29J957K75J691j16
3734A425L08k270r95N51P31K258n14l12o15j376l39m22J818R63k73l82k307R64
3752g87l51J754J203n07j005j139l88j55R12K214o15l34j469q82O9L03K757o1
3770A519j97j542p40q48J304J678J162r10k743P49j765J025P45K177r13j115O30
3787B16j759J258N0J818m49k081J90j348J022N2J743J206j546k77k712K206J410
3804I99P26O51k053o10k329J612P19J104J547l174J711k283J60J419NK227j536
$$ plain form
3683 1205 3223 221 72 -2154 -970 -260 730 1248 1813 184 -2656 -1751 -1666 1229 3020 963 78
3700 78 -931 -772 -983 833 2173 449 1200 -1338 -1126 -647 21 2093 732 1168 -1276 -2304 -706
3717 -706 286 2236 765 1223 -526 -1916 -1105 345 1490 964 696 -1553 -2382 -425 -150 1541 1425
3734 1425 1733 -537 -1532 -981 -250 2008 1494 1182 567 -809 -1148 -1570 248 1211 938 556 -1751 -787
3752 -787 -1138 616 1819 1312 307 -832 -1220 -1375 -463 1751 1136 802 -667 -1549 -1480 -1177 1580 1519
3770 1519 1322 -220 -960 -1808 -504 1174 2336 1426 -1317 -568 -2333 -1308 -563 1614 701 -414 216
3787 216 -1543 -285 -235 1583 1134 -947 -757 -2105 -1083 -1031 712 1918 372 95 -2617 -411 999
3804 999 1725 2376 323 -287 -2616 -1004 -285 819 2366 -808 903 -1380 -1220 199 204 2431 895
3821H95j012o06o13K028J8J467j789M39j229j441J351J367J700j314J02k458o70
3838a765R12J163J867j179L2j557j229M14N81L291j092J40k098k869J210K079
3854a00N78O57P68j402k976P55k83L031K418k326q94j517L15n72K385R1J515n34
3872A909m116J016o43K827M84n53l23k102j51j009K324J934K46N0l830Q09k52
3889a380J570J147P62l21l847J823j614K401N62Q32R6k700M04k302K518J163%
3906A114M51l376J194k121K291J463L00N71k950O19j670P17J625J342J138l388
3922f80l10j259J910J104R25K16k195O13l114J263L001m61J547l036k18j847N72
3939a969K915L80R45j182j285j789n11L277M22J312j575j631j591J03R83J640
$$ plain form
3821 895 -117 -723 -1336 692 710 2177 388 827 -402 -1843 -492 875 2575 1261 1363 -1095 -1765
3838 -1765 -853 310 2177 998 1030 -527 -1756 -1342 -761 2530 1438 1578 -520 -3389 -2179 -100
3854 -100 478 1135 1903 501 -2475 -1720 -2003 1028 3446 1120 226 -1291 -976 -1548 837 928 2443 1909
3872 1909 -2207 -1191 -1834 993 1477 924 601 -1501 -1652 -2661 -337 1597 1843 1893 -1937 -1128 -1380
3889 -1380 190 1337 2099 1778 -2069 -246 -1860 541 1103 1935 2031 -669 -265 -2567 -49 1114 1114
3906 1114 1565 -1811 -617 -2738 -447 1016 1316 1887 -1063 -444 -2114 -1397 228 1570 2708 -680
3922 -680 -990 -2249 -339 765 1690 1906 -289 324 -2790 -1527 1474 1013 2560 -476 -694 -2541 -1969
3939 -1969 946 1326 2271 1089 -196 -1985 -2496 781 1203 2515 940 -691 -2282 -2179 -1196 444
3955D44J869j322j750o10k389K718K336K54R89l911r95P68J287R59J186m7p31
3972A055j348j649J425Q28K039j638r64q90j998K406J805N80j000j552j537Q38
3988a600N19O31K138P49j317j899j763J067J791J249Q28j224j670j983J343p11
4004a852M402p07j019j682k124K066j12K887J54j797m7k332M6L37L442J158j579
4021A241n15k708K01m10L383P47o64O1l399L82R60J607O36K1o58k695P4J096J550
4040I10J271r22j186r26l36l78J318K328M34k760j84j358J193K72J579k21O25
4057A659k598k26m83M08K990j445R78k031r06J186j04J962q61J096j922r63N32
4074g28q47K265l4j7j082j073r0K57K716r32J235j822j517P55M04J513n70O70
$$ plain form
3955 444 2313 991 -759 -1369 -3758 -1040 1296 1550 2539 -1372 -2367 -1599 -312 647 1833 1786 1055
3972 1055 -293 -1942 -517 311 2350 712 -252 -1142 -3140 -734 1071 1651 651 -901 -2438 -1600
3988 -1600 -1081 -450 1688 2437 1120 -779 -2542 -1475 316 1565 2393 1169 -501 -2484 -1141 -1852
4004 -1852 2550 1843 824 -858 -2982 -916 -1028 1859 2013 216 169 -2163 -2117 -1780 1662 2820 1241
4021 1241 726 -1982 -1781 -2191 1192 1939 1275 1336 -2063 -1681 -721 886 1522 1543 885 -1810 -1736 -640 910
4040 910 2181 1259 73 -853 -1189 -1567 -249 2079 2513 -247 -431 -1789 -596 -324 1255 1034 1659
4057 1659 -939 -1165 -1648 -1240 1750 305 1283 -748 -1654 -468 -572 1390 529 1625 -297 -1260 -728
4074 -728 -1575 690 656 639 -443 -1516 -1606 -1349 1367 435 1670 -152 -1669 -914 -510 1003 433 1103
4092A103j463o94l4k67K486M60P29k197j060j198L7J582K248J017j659k162j078
4109b150k56J395J946J613j876j147l86q56J104J156J906j769j059j088r52J800
4125f19O29J687P9j080p51j665K05K433N52j70j648L70j273J221k06J350K73k062
4143f75M96j420Q57O13J019M29j436p46O73j505J507J178O19j310q40q13l24K099
4161D21q33J371o51n56p65P8N43J055J915j925M9k440j40J672k45J994q60r60
4179b77j104m56J607J332R94j745O98l076J48J222Q72J730r47J179k452j146Q0
4196a341J142J910r38K45j312q41K90p49K791K98N45k893j87j51j12J628M23Q94
4214A642r56j550K76j340K055R79j169L61k48q99q67K313k5O09J58k229j51n47
$$ plain form
4092 1103 -360 -1054 -1088 -1355 1131 1591 2320 123 -937 -2135 -2098 -516 1732 2749 1090 -1072 -2150
4109 -2150 -2406 -1011 935 2548 672 -475 -861 -1717 -613 543 2449 680 -379 -1467 -2419 -619
4125 -619 10 1697 1776 696 -55 -1720 -1515 918 1470 1300 -348 22 -1251 -30 -236 1114 1387 -675
4143 -675 -179 -1599 -742 -129 890 1319 -117 -863 -190 -1695 -188 990 1609 299 -541 -1354 -1678 421
4161 421 -412 959 308 -248 -1013 -935 -392 663 2578 653 702 -1738 -1878 -206 -451 1543 683 -277
4179 -277 -1381 -1837 -230 1102 2096 351 1049 -2027 -1879 -657 215 1945 998 2177 -275 -1421 -1341
4196 -1341 -199 1711 773 1018 -294 -1135 -845 -1594 1197 1495 2040 -853 -1040 -1191 -1303 325 748 1642
4214 1642 686 -864 -588 -1928 127 1106 -63 298 50 -849 -1716 597 572 1181 1339 -890 -1041 -1588
4232a588P24J469K06K27j278l96r48J38K092km81j10n41m77J267l72m41L128k854
4251b37M8p37J172L47K9R19k516J008r10R77L77l56J095j860J212k437J373J259
4269G63p37J286k638O12Q9K13R86r19K433k989K32j141Q01R23Q61K650m072P65
4287A18q73o32K165j251L273k744M15j497M5P61O71O48r04M88k184Q85j71K40
4305e47K360j133N50j716L77q50J229J447j679j25k35o10M46J79J193o83O64p97
4323G0j773N51Q48L21J287m45j018N63o17K22J127j765J495J4j662O55q67J445
4341D51Q09j195j85j196J042P38j015O01j92N38j407N98j75L26J394j88Q5k564
4359a535J006M08J165O37j280m5p90k10o16J183K011j867J010j546m35n77J458
$$ plain form
4232 -1588 -864 605 811 1038 -240 -636 -1584 -1446 646 644 163 53 -488 -965 302 -70 -511 2617 -237
4251 -237 -189 -926 246 593 622 1541 -975 33 -877 100 477 121 1216 -644 568 -1869 -496 763
4269 763 26 1312 -1326 -714 -625 -412 574 -345 2088 -901 -669 -1810 -1009 -86 775 3425 -647 118
4287 118 -755 -1387 778 -473 2800 56 471 -1026 -981 -220 451 1099 195 683 -1501 -616 -787 -547
4305 -547 1813 680 1230 -486 -109 -959 270 1717 38 -87 -322 -932 -486 -307 886 203 867 70
4323 70 -1703 -1152 -304 17 1304 859 -159 404 -213 9 1136 -629 866 880 -782 -127 -994 451
4341 451 1260 65 -120 -1316 -274 464 -551 50 -142 396 -1011 -413 -588 -262 1132 944 1029 -1535
4359 -1535 -529 -121 1044 1681 401 356 -434 -644 -1260 -77 1934 67 1077 -469 -904 -1481 -23
4376b3N38p76J955k940K01j64J489R93j862J524o70M18j631Q07L96M65K73j067
4394g4K28r82J389j002o79J715j030J321j087n71N46Q05R44j020n25J004r12Q71
4412I41k615J379J17K25m50q76L55J044J878j466J04k38j209J67p10K667p93r87
4430d67P43p26J708j219J048p0j811P96j042R8O54K85N77k219K273p90N4l93P68
4449B67M33k17J76j433J302N8j350J089j143J025j013J268m08J78J27L9k70j432
4467a304J134q81J577R92p51R30l104O93n49O99K336j878J718k678J069p19Q72
4484A56l72J817j030J71p63j653J317O48o41J124m33p41N83j953K022n58J351
4501A045j24r76l10J45K49r71J400M02j509l45N90Q52l91L33j6K84j206m39J348
$$ plain form
4376 -23 515 -261 1694 -1246 -1045 -1209 280 1273 -589 935 265 683 -948 -141 255 720 993 -74
4394 -74 154 -828 561 -441 -1120 595 -435 886 -201 -772 -226 579 1523 503 -22 982 70 941
4412 941 -1674 -295 -178 47 -403 -1279 -924 120 1998 532 636 398 -811 -644 -1354 1313 520 -467
4430 -467 276 -450 1258 39 1087 1017 -794 2 -1040 -942 -288 -3 574 -1645 628 -162 -108 -501 267
4449 267 700 483 659 -774 528 586 -764 325 -818 207 -806 462 54 232 359 398 128 -1304
4467 -1304 -170 -1051 526 1518 767 1697 -1407 -714 -1263 -564 1772 -106 1612 -1066 3 -716 156
4484 156 -216 1601 571 742 -21 -1674 -357 291 -350 774 341 -400 183 -1770 252 -306 1045
4501 1045 921 -55 -365 -220 29 -942 458 860 -649 -994 -404 448 57 390 374 658 -548 -987 361
4520C61J04k35J87j0r42l92J172P25l14r43j12L79m66j50R25J013o76j861J830
4539E95k078J423NJ909j270j479j54jJ033J59Q50K97j600O57j503J738m68J405
4557A518n27q36m26r91J385j62J481J24j816n47j129J763K02P08N15j120j65k393
4575b416K533p69P87J530n81j849j254J034M15J199n66q9J182k762M12Q29Q66
4592E01L64p33k55q20O45p56J085J261o64k61p75M74j435J110R76J011j632k06
4610a10j082J266M2K53Q83p26n52L89l17j376J896n40M33j478o42K310j163J356
4628H42O08r51k76j347N14k22K175j960J124q44j105N84k89K586j045O26j982
4645i62n00O99j049L483j45m93rk237N35m84K291P9p00o51j436J463k251K508
$$ plain form
4520 361 465 230 417 407 -535 -927 245 970 656 -287 -399 -20 -486 -636 289 1302 626 -1235 595
4539 595 -1483 -60 -55 1854 584 -895 -1049 -1050 -17 142 992 1289 -311 346 -1157 581 113 1518
4557 1518 991 155 -271 -1262 123 -39 1442 1566 -250 -797 -1926 -163 39 747 1262 142 -23 -2416
4575 -2416 117 -652 135 1665 1084 -765 -2019 -985 -570 629 63 -26 1156 -1606 -1194 -365 501
4592 501 865 132 -123 -943 -298 -1054 31 1292 628 367 -408 66 -1369 -259 717 1728 96 -110
4610 -110 -1192 74 116 369 1252 526 -26 363 46 -1330 566 26 459 -1019 -1661 649 -514 842
4628 842 1450 499 223 -1124 -610 -832 1343 -617 507 -337 -1442 -858 -1147 1439 394 1020 -962
4645 -962 -1462 -763 -1812 1671 1526 1033 1024 -1213 -678 -1162 1129 1208 508 -143 -1579 -116 -2367 141
4663A41J339P5m69j954M84j010K003L27J42j54j790K47k38J771l49J980k253j486
4681a194N19n29O55P62l88M98j727J484r12Q06n60K65J569j896R41j067J294r37
4699d17J042j91j520M62k87R21P78r41J661k237k55J215k36Q68j265O30J4j282
4717a040K41o57J599j43J258j658m45j47K96J486j236J483o84n06l04l59J97R9
4735e20K388j507o56Q48q67j39k00J856j334k01M56j523J651j631J944J90M73
4752A228j262j086J928j675J506K09n55J54j905J953j162J835q44N0J77j882N03
4769h28j22J482n85J052O95k789Q09q04N08M17L60K8o62l25n23O95l63M14J120
4788E79M67k281M40Q84M10m79J30l55J038j970J555m10N76O38j541J55m92l44
$$ plain form
4663 141 1480 1555 1086 -868 -384 -1394 609 936 1078 924 -866 -619 -857 914 565 2545 292 -1194
4681 -1194 -675 -1204 -549 213 -175 323 -1404 80 -832 -26 -586 -321 1248 -648 293 -774 520 -417
4699 -417 625 434 -1086 -624 -911 10 788 -153 1508 -729 -984 231 -5 863 -402 228 242 -1040
4717 -1040 -799 -1456 143 0 1258 -400 -845 -992 -696 790 -446 1037 353 -153 -457 -816 -619 -520
4735 -520 1868 361 -295 553 -314 -453 -653 1203 -131 -332 124 -1399 252 -1379 565 755 1228
4752 1228 -34 -1120 808 -867 639 848 293 447 -1458 495 -667 1168 324 374 551 -1331 -828
4769 -828 -950 532 -53 999 1694 -1095 -286 -1090 -582 -165 195 223 -439 -764 -1287 -592 -955 -541 579
4788 579 1046 -1235 -795 89 499 20 150 -205 833 -1137 418 8 584 1222 -319 -164 -656 -1000
4806a000J065J532k319R36r69L88j054J505K0J742j968K59q23J68J718p26O12
4823A086j094M02j96k000K218q81J817j007J76n97j717L115k338J070P1J02l66
4840a39j161J913k067K475j08j349p23k73N67Q72K093n42j287j027l54K142j824
4857g92J777n00Q8q53q28O94k65J957J24j240j44j499P83r9J430k11j27m07J5
4876i7k50q45J031P27R85j077j618N14k2R44J642j225J42j215P0j470K149M91
4894H76o31J015k341J89q01R10K532j778R47k245J820j151m6K148m83L9j970J89
4912g81P37j43O85L05l93q23R3m13n58J898l67J807j750j676M68L81J251n98L4
4931A57N05j228l91o45K218k42R06j857L8j078L80J953r37K363j357j609R2m33
$$ plain form
4806 -1000 65 1597 -722 214 -755 -367 -1421 84 104 1846 -122 137 -686 -518 1200 474 1086
4823 1086 -8 394 198 -1802 416 -465 1352 345 521 -76 -1793 1322 -1016 54 125 227 -139
4840 -139 -1300 613 -1454 1021 913 -436 -1159 -1432 -865 7 2100 1558 271 -756 -1110 1032 -792
4857 -792 985 485 573 -280 -1108 -414 -679 1278 1402 162 18 -1481 -698 -797 633 422 295 -112 -97
4876 -97 -347 -1192 -161 566 1551 474 -1144 -630 -652 292 1934 709 851 -364 -294 -1764 385 876
4894 876 245 1260 -1081 -892 -1693 -783 1749 -29 918 -1327 493 -658 -704 1444 961 1000 -970 -781
4912 -781 -44 -187 498 803 410 -413 -320 -733 -1291 607 240 2047 297 -1379 -911 -530 721 123 157
4931 157 662 -566 -957 -1602 616 374 1280 -577 -539 -1617 -1237 716 -221 2142 785 -824 -732 -1165
4949a165J671Q96m49m07p94l51j297J078M44J974k014L80j047p08K844j834K424
4966A645n3k107p07k56O91M53K215k113n46K92q58J810n53K4J099r76j250L93
4984g97N94l60J383L28j127Jp76L12O44M13R40q16o64j652PJ460J624l92j022
5003A00L15k286J125N07J71J839n66j194r52K38J378l39O57j058j08o61p6j75
5021a085J102K020k380M81j321j54J021M05J330r97o26j66l37Q1K25J941j138
5038D02J454l355K42N50J272J038q2j251r72j002K43R8K260p00J430k431j74l58
5056a336M06K923k711J612j713o84R5P89J316O43L69j960J24j138M6J943M74J01
$$ plain form
4949 -1165 506 1402 953 546 -248 -599 -1896 -818 -374 1600 -414 -34 -1081 -1789 1055 -779 1645
4966 1645 1592 -515 -1222 -1478 -787 -334 1881 -232 -778 -486 -1344 466 -87 -63 1036 60 -1190 -797
4984 -797 -203 -563 820 1148 21 22 -754 -442 202 615 1555 739 75 -1577 -1570 -110 1514 1122 100
5003 100 415 -1871 -746 -239 -68 1771 1205 11 -941 -703 675 336 993 -65 -173 -834 -910 -1085
5021 -1085 17 2037 -343 138 -1183 -1337 -316 89 1419 422 -204 -370 -707 -626 -401 1540 402
5038 402 1856 -1499 -1257 -707 565 1603 1521 270 -702 -1704 -1461 -1363 897 197 1627 -804 -978 -1336
5056 -1336 -930 1993 -718 894 -819 -1503 -1408 -619 697 1340 1709 -251 -127 -1265 -1219 724 1198 1299
$$ [...]
16383B46
##END NTUPLES=NMR FID
##END=
