##TITLE=31P_DE-80H_X3
 64 sc D2O
 26.2.2025
##JCAMPDX= 6.0         $$ Bruker NMR JCAMP-DX V2.0
##DATA TYPE= NMR FID
##DATA CLASS= NTUPLES
##ORIGIN= UXNMR, Bruker Analytische Messtechnik GmbH
##OWNER= root
$$ XWIN-NMR		Version 3.5
$$ Thu Jul 23 14:57:53 2026 Russian Standard Time (UT+4h)  Yarkov@DPX200
##.OBSERVE FREQUENCY= 81.013821
##.OBSERVE NUCLEUS= ^31P
##.DELAY= (6, 6)
##.ACQUISITION MODE= SIMULTANEOUS
##.ACQUISITION SCHEME= undefined
##.AVERAGES= 64
##.DIGITISER RES= 17
##SPECTROMETER/DATA SYSTEM= spect
##.PULSE SEQUENCE= zgpg30
##.SOLVENT NAME= D2O
##.SHIFT REFERENCE= (INTERNAL, D2O, 0, 243.863)
##AUDIT TRAIL= $$ (NUMBER, WHEN, WHO, WHERE, WHAT)
$$ ##TITLE= Audit trail, XWIN-NMR		Version 3.5
$$ ##JCAMPDX= 5.01
$$ ##ORIGIN= Bruker BioSpin GmbH
$$ ##OWNER= Yarkov
$$ C:/Bruker/XWIN-NMR/data/yarkov2/nmr/P31/2/audita.txt
$$ ##AUDIT TRAIL=  $$ (NUMBER, WHEN, WHO, WHERE, WHAT)
(   1,<2026-07-23 14:57:09.93 +0400>,<Yarkov>,<DPX200>,
      <created by zg, POWCHK disabled, PULCHK disabled
       configuration hash MD5:
       00 E9 B6 7A A2 85 ED C7 34 08 36 98 17 FE 4E 26
       data hash MD5: 32K
       1D BA B4 61 12 AD FE 25 8C 89 75 98 73 61 71 04>)
$$ ##END=
$$ 
$$ hash MD5
$$ 35 0D E7 B8 32 09 69 53 69 24 4A 0F 12 7E D2 B2
##$RELAX= 
##$RELAX= 
##$RELAX= 
##$RELAX= 
##$RELAX= 
##$RELAX= 
##$RELAX= 
##$RELAX= 
$$ Bruker specific parameters
$$ --------------------------
##$DU= <C:/Bruker/XWIN-NMR>
##$EXPNO= 2
##$NAME= <P31>
##$PROCNO= 1
##$TYPE= <nmr>
##$USER= <yarkov2>
##$AMP= (0..31)
100 100 100 100 100 100 100 100 100 100 100 100 100 100 100 100 100 100 
100 100 100 100 100 100 100 100 100 100 100 100 100 100 
##$AQSEQ= 0
##$AQ_mod= 1
##$AUNM= <au_zg>
##$AUTOPOS= <>
##$BF1= 81.014009
##$BF2= 200.13
##$BF3= 200.13
##$BF4= 200.13
##$BF5= 200.13
##$BF6= 200.13
##$BF7= 200.13
##$BF8= 200.13
##$BYTORDA= 1
##$CFDGTYP= 0
##$CFRGTYP= 5
##$CHEMSTR= <none>
##$CNST= (0..31)
1 1 145 1 1 1 1 1 1 1 1 1 1 1 1 1 1 1 1 1 1 1 1 1 1 1 1 1 1 1 1 1 
##$CPDPRG= <waltz16>
##$CPDPRG1= <>
##$CPDPRG2= <waltz16>
##$CPDPRG3= <>
##$CPDPRG4= <mlev>
##$CPDPRG5= <mlev>
##$CPDPRG6= <mlev>
##$CPDPRG7= <mlev>
##$CPDPRG8= <mlev>
##$CPDPRGB= <>
##$CPDPRGT= <>
##$D= (0..31)
0 1 0 0 0 0 0 0 0 0.06 0 0.03 2e-05 3e-06 0 0 0.0002 0 0 0 0 0 0 0 0 0 
0 0 0 0 0 0 
##$DATE= 1784804229
##$DBL= (0..7)
120 120 120 11 120 120 24 19 
##$DBP= (0..7)
150 150 150 150 150 150 150 150 
##$DBP07= 0
##$DBPNAM0= <>
##$DBPNAM1= <>
##$DBPNAM2= <>
##$DBPNAM3= <>
##$DBPNAM4= <>
##$DBPNAM5= <>
##$DBPNAM6= <>
##$DBPNAM7= <>
##$DBPOAL= (0..7)
0.5 0.5 0.5 0.5 0.5 0.5 0.5 0.5 
##$DBPOFFS= (0..7)
0 0 0 0 0 0 0 0 
##$DE= 6
##$DECBNUC= <off>
##$DECIM= 4
##$DECNUC= <off>
##$DECSTAT= 4
##$DIGMOD= 1
##$DIGTYP= 9
##$DL= (0..7)
0 0 52 120 120 21 21 25 
##$DP= (0..7)
150 150 150 150 150 150 150 150 
##$DP07= 0
##$DPNAME0= <>
##$DPNAME1= <>
##$DPNAME2= <>
##$DPNAME3= <>
##$DPNAME4= <>
##$DPNAME5= <>
##$DPNAME6= <>
##$DPNAME7= <>
##$DPOAL= (0..7)
0.5 0.5 0.5 0.5 0.5 0.5 0.5 0.5 
##$DPOFFS= (0..7)
0 0 0 0 0 0 0 0 
$$ [...]
##$SUBNAM1= <"">
##$SUBNAM2= <"">
##$SUBNAM3= <"">
##$SUBNAM4= <"">
##$SUBNAM5= <"">
##$SUBNAM6= <"">
##$SUBNAM7= <"">
##$SUBNAM8= <"">
##$SUBNAM9= <"">
##$SW= 400.765351723535
##$SWIBOX= (0..15)
0 1 3 0 0 0 0 0 0 0 0 0 0 0 0 0 
##$SW_h= 32467.5324675325
##$TD= 32768
##$TD0= 1
##$TE= 0
##$TE2= 300
##$TE3= 300
##$TEG= 300
##$TL= (0..7)
0 120 53 12 22 120 120 120 
##$TP= (0..7)
150 150 150 150 150 150 150 150 
##$TP07= 0
##$TPNAME0= <>
##$TPNAME1= <>
##$TPNAME2= <>
##$TPNAME3= <>
##$TPNAME4= <>
##$TPNAME5= <>
##$TPNAME6= <>
##$TPNAME7= <>
##$TPOAL= (0..7)
0.5 0.5 0.5 0.5 0.5 0.5 0.5 0.5 
##$TPOFFS= (0..7)
0 0 0 0 0 0 0 0 
##$TUNHIN= 0
##$TUNHOUT= 0
##$TUNXOUT= 0
##$USERA1= <user>
##$USERA2= <user>
##$USERA3= <user>
##$USERA4= <user>
##$USERA5= <user>
##$V9= 5
##$VALIST= <valist>
##$VCLIST= <CCCCCCCCCCCCCCC>
##$VD= 0
##$VDLIST= <DDDDDDDDDDDDDDD>
##$VPLIST= <PPPPPPPPPPPPPPP>
##$VTLIST= <TTTTTTTTTTTTTTT>
##$WBST= 1024
##$WBSW= 4
##$XGAIN= (0..3)
0 0 0 0 
##$XL= 0
##$YL= 0
##$YMAX_a= 59197
##$YMIN_a= -51553
##$ZGOPTNS= <>
##$ZL1= 120
##$ZL2= 120
##$ZL3= 120
##$ZL4= 120
##$ABSF1= 60
##$ABSF2= -190
##$ABSG= 5
##$ABSL= 3
##$ALPHA= 0
##$AQORDER= 0
##$ASSFAC= 0
##$ASSFACI= 0
##$ASSFACX= 0
##$ASSWID= 0
##$AUNMP= <proc_1d>
##$AZFE= 0.1
##$AZFW= 0.5
##$BCFW= 1
##$BC_mod= 2
##$BYTORDP= 1
##$COROFFS= 0
##$CY= 9.86611175537109
##$DATMOD= 1
##$DC= 1
##$DFILT= <>
##$DTYPP= 0
##$F1P= 182.462994727601
##$F2P= 168.069089081705
##$FCOR= 0.5
##$FTSIZE= 0
##$FT_mod= 0
##$GAMMA= 1
##$GB= 0
##$INTBC= 1
##$INTSCL= 1
##$ISEN= 30
##$LB= 1.5
##$LEV0= 0
##$LPBIN= 0
##$MAXI= 11.51145
##$MC2= 0
##$MEAN= 0
##$ME_mod= 0
##$MI= 1.244541
##$NCOEF= 0
##$NC_proc= 0
##$NLEV= 6
##$NOISF1= 0
##$NOISF2= 0
##$NSP= 1
##$NTH_PI= 0
##$NZP= 1
##$OFFSET= 243.8632
##$PC= 1.4
##$PHC0= 1586.076
##$PHC1= 109.1595
##$PH_mod= 0
##$PKNL= yes
##$PPARMOD= 0
##$PSCAL= 0
##$PSIGN= 0
##$REVERSE= no
##$SF= 81.0140731611343
##$SI= 65536
##$SIGF1= 0
##$SIGF2= 0
##$SINO= 80
##$SIOLD= 65536
##$SREGLST= <31P.CDCl3>
##$SSB= 0
##$STSI= 0
##$STSR= 0
##$SW_p= 25641.0256410257
##$SYMM= 0
##$S_DEV= 0
##$TDeff= 0
##$TDoff= 0
##$TI= <>
##$TILT= no
##$TM1= 0
##$TM2= 0
##$TOPLEV= 0
##$USERP1= <user>
##$USERP2= <user>
##$USERP3= <user>
##$USERP4= <user>
##$USERP5= <user>
##$WDW= 1
##$XDIM= 64
##$YMAX_p= 0
##$YMIN_p= 0
$$ End of Bruker specific parameters
$$ ---------------------------------
##NTUPLES= NMR FID
##VAR_NAME=  TIME,          FID/REAL,        FID/IMAG
##SYMBOL=    X,             R,               I
##VAR_TYPE=  INDEPENDENT,   DEPENDENT,       DEPENDENT
##VAR_FORM=  AFFN,          ASDF,            ASDF
##VAR_DIM=   16384,         16384,           16384
##UNITS=     SECONDS,       ARBITRARY UNITS, ARBITRARY UNITS
##FACTOR=    3.08e-05,      1,               1
##FIRST=     0,             0,               0
##LAST=      0.5045964,     0,               0
##MIN=       0,             -51553,          0
##MAX=       0.5045964,     59197,           0
$$ Real data points
##PAGE= N=1
##DATA TABLE= (X++(R..R)), XYDATA
0@%%%%%%%%%%%%%%%%%%%%%%%%%%KnQj8L6n0O2p2P8r0J02j10J19j33J53j69J80
43I3j97K20k43K67k94L23l56L91m30M79n37N97o61P46q50R69j119J316j581J964
63A097k573L673o321K6577L6744m9719n0379j0652M2539M4868N755l6794l6059
76c1244j708L3509K8657l362l2177k1141O512K8043K0140j0800k4326j5156Q276
89a4777K3135J1802q959k1237r582J0800J9122P948r091j8865q888R418J8147
102H973J0796q368j9339r326O507J6792J1014p562j4427q880O513J5754M193o124
116F516j4808j977O170J2006J534q556q614J083R472N598l461q679l801O016Q026
131F525k60q409n739K443Q312O064n606q890l375Q034R080J242q403j1781J331
$$ plain form
0 0 0 0 0 0 0 0 0 0 0 0 0 0 0 0 0 0 0 0 0 0 0 0 0 0 0 0 2 -3 5 -13 23 -27 35 -37 41 -49 53 -57 62 -71 82 -87 93
43 93 -104 116 -127 140 -154 169 -187 204 -226 253 -284 313 -348 398 -452 517 -602 714 -867 1097
63 1097 -1476 2197 -4124 22453 59197 9478 -40901 -51553 -9014 35854 41609 4815 -31244
76 -31244 -32952 557 29214 25852 -6325 -27466 -20954 7089 27229 16429 -7897 -23053 -14777
89 -14777 8358 20160 11201 -10036 -19618 -8818 10304 18252 9161 -9704 -18592 -9174 8973
102 8973 19769 11401 -7938 -17264 -10757 6035 17049 9487 -4940 -13820 -7307 8447 12640 6516
116 6516 -8292 -10269 -4099 7907 9441 885 -7729 -6646 2826 8424 4963 -3716 -7517 -1501 6525
131 6525 6265 -2144 -7883 -5440 2872 8936 3330 -5560 -8935 -901 8179 9421 1018 -10763 -9432
146i432R628J2277k155j4035j0345L320J5660Q883m382j5891q628P268J5820Q426
160A6414r042j6549p140R644J7666P152j0548j8988o902J1116J7940Q110j3063
173E810j8115n739R814J9504O828j1846j6587n848J0213J5850O491j1337j4678
186i640m940R751J4629L982j0911j4885k539J2280J4342K709j3392j3885j831
199a4330J3945J5039j278j3994j3863J097J5422J3176j346j6064j2801K961J4883
212B847J0942l784j3631r598M371J1916R317n481j1380o755N628J2297M468o913
226D244r953k425N336Q180N80n210n000o94O740K115k877l652q24L108M087P03
242D458n333m618K151N703L802j639p097m855L910P266L470l664q490j357M239
$$ plain form
146 -9432 196 12473 10318 -3717 -14062 -10742 4918 13801 9419 -6472 -15100 -7832 7988 16414
160 16414 7372 -9177 -16317 -6673 10993 18145 7597 -11391 -18293 -7177 10763 18873 5810
173 5810 -12305 -18044 -8230 11274 18102 6256 -10331 -16179 -5966 9884 16375 5038 -9640
186 -9640 -14580 -4829 9800 13782 2871 -12014 -14553 -2273 12069 14778 1386 -12499 -14330
199 -14330 -385 14654 13376 -618 -14481 -13384 2038 15214 13868 -2196 -14997 -12036 2847
212 2847 13789 10005 -3626 -13224 -8853 3063 12380 6899 -4481 -11236 -5608 6689 11157 4244
226 4244 -5709 -8134 -2798 5382 5962 752 -4248 -4942 1798 3913 1036 -2616 -3440 -332 3755 4458
242 4458 -875 -5493 -3342 2361 6163 4524 -2573 -7428 -3518 3748 7218 3554 -4936 -6293 -2054
257b054P356J953o007o905r52P655N530o02q608n780K709J0311O845o428j0959
272e936o566N454J3856O893q104j2569q140Q322J4491O665o713j5691p969Q238
286g769J3957P336p388j4812m764Q718J2516N565r687j4025k047J0438J4407K80
300A2725j2089j4063o86J4769J4592l64j6113j4813Q19J7148J4900l479j5965
313b619j5218M759J7793J1366k462j8448j1508K902J8787J0936n629j6569j0255
326a6165O766J5700Q529p503j6089m459P759J5673L169r648j3122l707J0985J2120
340A0008K995j1039j2138k054J1501J1080l34j0112j0423K732Q916P554J9j0301
354a596p067J185J0201O178j155j0280o009L571P269N194k350q131m479L462Q180
$$ plain form
257 -2054 5302 7255 1248 -5657 -6609 1046 6576 5974 -2634 -8414 -5705 4606 11451 5023 -5936
272 -5936 -12502 -7048 6808 13701 5597 -6972 -15112 -6790 7701 14366 7653 -8038 -16007 -7769
286 -7769 6188 13524 6136 -8676 -13440 -4722 7794 13359 3672 -10353 -12400 -1962 12445 12725
300 12725 636 -13427 -14113 656 15248 14884 -1229 -16042 -15223 1925 16825 13346 -2619
313 -2619 -17837 -13078 4715 16081 13619 -4829 -16337 -13435 5352 16288 10659 -5910 -16165
326 -16165 -9399 6301 14830 7327 -8762 -13221 -5462 10211 13380 3732 -9390 -13097 -2112 10008
340 10008 13003 1964 -10174 -12228 -727 10353 10019 -93 -10516 -7784 1132 8686 8705 -1596
354 -1596 -8663 -7478 2723 8901 7746 -2534 -8543 -4972 2297 7491 5141 -2990 -7469 -4007 4173
369D173M107n125p313l933O882O146J426o131o008P00O311O688l927p196m130
384g330L604R952K344n040j0854l271R994R381J565j1955r153J144J1147R875
398A1403l157j3377p612N071J4191P660p439j5823m892R212J4321M042r274j4248
412i922m740J2968J2534L719j3028j3858j680J1595J5780M50j3111j3619J13J3639
426H40J0205J139j3702r439l75J2766J1161l106j0654j1944J584J3099J2816k811
440A1579j4097j0140k4J3865J3454l224j3794j2611M587J4608J1320m916j6787
453f180p679M518J5280R199o799j3349q817P597J2717N353o074j3868k788O855
467d035J1091J784o600r137k493Q821O926R11n741p385J136M047M405l44k626
$$ plain form
369 4173 8280 3155 -4158 -8091 -1209 4937 6363 232 -5776 -5076 1235 7923 3996 -3200 -7330
384 -7330 -3726 6226 8570 3530 -7324 -10595 -601 8780 10345 -1610 -10763 -9619 1528 11403
398 11403 8246 -5131 -12743 -7672 6519 14179 6740 -9083 -13975 -4763 9558 13600 4326 -9922
412 -9922 -14662 -1694 10840 14559 1531 -12327 -14007 -2412 13368 13818 707 -12912 -12799 840
426 840 11045 12184 -1518 -10957 -11332 1434 12595 9489 -1165 -13109 -11525 1574 14390 11579
440 11579 -2518 -12658 -12682 1183 14637 11413 -2381 -14992 -10405 4203 15523 10607 -6180
453 -6180 -13859 -9341 5939 15138 8339 -5010 -13827 -6230 6487 11840 5766 -8102 -10890 -4035
467 -4035 7056 8840 2240 -6897 -9390 -569 6357 7268 1527 -5858 -4722 -675 3730 3386 760
482G60l103r35M231J199l12k795q46Q85J481K75r97K188k823P3K55J466p67j268
500a033K824j130M01k298q38L72L442K703l728q93k336P64L382K664j573o470
516c747k441K945O607M384n228p545m000O618P170M023n033j0312k487O768R454
531G176K857q807r622j567Q981J1271o0j0984j1288K421J1307J0929j233j3321
545a940j1703M084J2337J0915l280j4394q045L144J2121R010n097j0177p682L248
559g459J0562P164k592j0921n840J847R453O717k598r063n264L116P135L700k115
574C842n666n630K803Q000M735m568o955l796L719P363M588m762p766l720M585
589c228R280J875n910o959l444P174O825J717o672o977J28N030Q119k275n389
$$ plain form
482 760 -2343 -3278 953 2152 1840 -955 -1801 -916 565 840 -157 2031 -792 -719 -464 1002 235 -1033
500 -1033 1791 661 1062 -1236 -2074 -1702 1740 4443 715 -178 -2514 -1750 1632 4296 2723 -3747
516 -3747 -6188 -3243 3364 7748 2520 -5025 -9025 -2407 4763 8786 3753 -6559 -9046 -2278 7176
531 7176 10033 1226 -8396 -9963 -982 10289 10229 -755 -12043 -9622 1685 12614 11381 -1940
545 -1940 -13643 -9559 2778 13693 10413 -3981 -12026 -8882 3239 12249 7152 -3025 -10707 -7459
559 -7459 3103 10267 7675 -3246 -9086 -7239 2214 8931 6333 -2730 -7994 -4878 2257 5957 3842
574 3842 -1824 -7454 -4651 3349 8084 3516 -3439 -7235 -3516 3847 8435 3673 -4093 -7813 -3228
589 -3228 6052 7927 2017 -4942 -8386 -1212 5613 7330 658 -6319 -6191 -1161 6958 4683 -706
604g06n386L401M685J139j558m784mL157K289J05l812j369J489L970R40k956m298
621c698J43N786K377j353n349k962J780M478N294l938n077k316K889N878K27j139
637C020p424n54L666N630P97m179n349j425N243M648J119m430o108j6N413O181
653F232J274p254o538r0N573O606J796o625p515j221P151P916J15q033o295q70
669g778Q666P074j593q005o329L005P329O309l828q107n063N851P094K718m816
684B527r324j308N667R159L726q612q935k508Q056R646P1n947q503k589P527O065
700D718K508p253n818j363N887O955J347n901o985O62M581N021M1n825j627p21
716c773M742K335q46m675j316K750L185K671m863l957j671N081N852j120m849
$$ plain form
604 -706 -6092 -2691 1994 3133 1575 -3209 -3213 -56 2233 2338 -1474 -2843 -1354 2616 3556 600 -3698
621 -3698 -3555 2231 4608 3255 -2094 -5056 -3276 1202 6496 2558 -2519 -4835 -1946 3932 4159 3020
637 3020 -4404 -4958 -1292 4338 5135 956 -4393 -5818 -575 4073 5192 762 -5346 -5362 51 6232
653 6232 7506 252 -6286 -6376 -803 5803 7599 974 -6541 -7762 -611 7305 7420 -613 -6908 -7778
669 -7778 888 7962 6369 -1636 -7965 -4960 2369 8678 4850 -3257 -8320 -2469 4625 7343 2527
684 2527 -6797 -8105 -2438 6721 10447 1835 -7100 -9608 -1552 8094 8165 2218 -6285 -8874 -1347 4718
700 4718 7226 -27 -5845 -7208 -1321 5634 6981 1080 -5905 -5243 -662 4359 4400 -1425 -3052 -3773
716 -3773 969 3304 2458 -2217 -3533 -783 2402 5073 210 -3747 -5418 -337 5515 4395 -454
731d54l892J221L880M389n15o444k500J472M108M096k507m643k682K501M068J640
747C738k694k985n97K062M271j458l565l708L811L038M194m333m929k784L054
762b885N769M297m727o141k450M584O175J663l855p256k418N748P224J684p590
777a78o622j0O644P388j418o817o934L066O968O885m214q821m697L613J0027M520
793I400m501r730o092P702Q748M917o380j0104k957M825J0662K637o263q247k064
808g447M422O745L963n565o263k277L223O260K743k021q453R1K112N902J506m073
824H68m082j602K457M644J714k706n144r69L616N295N31m759m055K77M356N421
840E862J11o097n889O53N399N703j216o106m965L865M236M156j886m792l018K707
$$ plain form
731 -454 -4346 -3125 755 5144 4629 -1815 -4315 -2843 1265 5361 2854 -1789 -4471 -1970 2098 3738
747 3738 1044 -1941 -2538 -476 3795 2337 -1228 -4936 -1125 1913 6107 1774 -3155 -5939 -2885
762 -2885 2884 7181 2454 -3687 -6137 -1553 4622 6285 2430 -4826 -7244 -1496 5728 7412 -178
777 -178 -6800 -6810 -166 7222 5804 -1013 -7947 -4881 2087 8972 4758 -4063 -8760 -5147 4880 9400
793 9400 4899 -4831 -10923 -3221 5527 10444 4064 -6040 -8997 -4172 6490 9127 2864 -5383 -7447
808 -7447 -3025 3720 7683 2118 -4145 -6422 -3199 3061 5804 3783 -4670 -4579 -2467 3435 4941 868
824 868 -3214 -4816 -2359 2285 3999 1293 -3851 -4820 -1204 4091 4622 -137 -4192 -3915 441 5862
840 5862 5973 -124 -6013 -5360 39 5742 4526 -1580 -6545 -2680 1556 5712 3826 -966 -3984 -1277
856a277K880J066j908k485J430J248R1k364J67j62L913J220l009m243r57M954
872E64L676J88m546n510J407M376N163Kp382l132J224P273J585j974o305j228
888d619K571M065M439n415l968k104M548M155J936l985n914j65K953M584L094
903F175m080l486m299K516N260L679j053o754m318J978O954M474l530m999n260
918f743K091O442N211l282p065l463K480Q063K953l879p013l367N546O472K718
933G164n313p978p95O740O089j888m608n722P07O748M343j741o355l414J506N525
949A008L578j947k889l432J310L097J790n03k777P88m91o5K33J208o54O7L59j162
967d82p85K47R56K246j696q47j715J26L124l36M93k06j993p17J031J724j271K595
$$ plain form
856 -1277 1603 2669 761 -1724 -294 954 1045 -1319 -1152 -1314 2599 3819 810 -3433 -4390 564
872 564 4240 4428 -118 -5628 -4221 155 5318 5320 -2062 -5194 -3970 3303 4888 2914 -3391 -4619
888 -4619 -2048 2017 6456 1041 -2927 -5031 -483 3672 5608 1623 -4291 -4456 -1503 3081 6175
903 6175 2095 -1391 -5690 -3174 2086 5765 4712 -2042 -6360 -4382 2572 7046 3516 -1483 -6743
918 -6743 -4652 1790 7001 3719 -3346 -6809 -4329 3734 6687 2808 -4205 -7572 -2026 4446 7164
933 7164 1851 -6127 -6922 -182 5907 4019 -589 -6311 -5604 1144 5487 3746 -2609 -6023 -4517 1008
949 1008 4586 2639 -250 -3682 -2372 725 2515 2012 -765 23 -468 -533 -300 908 254 321 680 -482
967 -482 -1267 -1020 -64 2182 486 -361 -2076 -1950 1174 838 1331 1125 -868 -1585 -554 1170 -101 2494
985B494k904j70o96K088J446n48k663k153K700K164J322k061m337j98K642N040
1001D166J44m714l508j140N194N653l37o791o273K614N603P561l407o693n445
1016g373L245P419M514k799q402l216K771P516M539m839p487l647N618N598J704
1031E161j246p902j593K789O093K197l840n500j271M662M781M27l849m177j261
1046d529L615M396Q43l530n296n00L841N255J265m539n444n50L916N121Q02l338
1062A328m600l134O290L523R5l125m475O48M099L377p62m644l512L253M507j51
1078B717p36n602O10K096M745j56m052k854j313N951K708j069m942k209K169L113
1094A176K688k696l212k69N02L560O66k106k264K16L128J213r73l936p54J704
$$ plain form
985 2494 -410 -580 -1276 812 2258 1710 -953 -3106 -406 1758 3080 1019 -3318 -3516 -874 4166
1001 4166 4310 -404 -3912 -5052 142 5795 5458 -1333 -7606 -4992 611 8172 4765 -1928 -7373
1016 -7373 -4128 3291 7805 5006 -3396 -6612 -3841 3675 8214 3375 -4112 -7759 -2141 3457 5161
1031 5161 3915 -3987 -5580 -2791 3302 5499 1659 -3841 -5112 -450 4331 4758 909 -3268 -4529
1046 -4529 -914 3482 4325 795 -4501 -5001 -1160 4095 5360 821 -4623 -5173 -1257 3864 4666 1328
1062 1328 -3272 -6406 -116 3407 3502 377 -4098 -3450 649 4026 3264 -1380 -4892 -1639 2868 2717
1078 2717 1981 -3621 -3011 -915 3830 3674 -378 -3232 -4545 1406 4114 3045 -1897 -4106 -1937 1176
1094 1176 3864 1168 -2044 -2313 -1811 1749 2415 309 -1955 -1739 1389 2602 1629 -2307 -3061 -1357
1110a357K394K040l012j454j430J940J684K904k272m674l02K145M445J228m706
1125d27l405k50M524J870L60k438l806J212K146L840j359k249l588J144L637J919
1141C130k022k948j087O97M626J087k438k796j029J765M532l77j921l944q41K270
1157a296L881J611m609l374j805M279M392M66l709l305r3K839L708R90n777r86
1173b788j320N323L143j671l510l818J623M072M414k427n412l505M473M404K386
1188E387l192m811q29J525N215N63l794l098j04K003L071O50k373l716J868K466
1204H31K243k669j218o28J54L339r73m30k336j295L736J192N45l818j746J711
1220a362J053L414j634j622o50r50J817R29L94j093p51O35J154j009o47K72r1
$$ plain form
1110 -1357 1037 3077 65 -1389 -2819 -879 805 3709 1437 -3237 -3539 -1394 3051 4279 -427
1125 -427 -3832 -4082 442 2312 2672 234 -3572 -2360 -214 3626 2267 18 -3570 -2426 1211 3130
1141 3130 1108 -1840 -2927 -2230 2396 3483 1045 -1751 -2780 -1015 3517 3140 1219 -2725 -3566 -1296
1157 -1296 2585 4196 -413 -3787 -5592 -1313 3079 3545 -164 -3469 -3562 -723 2985 3975 -1802 -2788
1173 -2788 -4108 1215 4358 2687 -823 -4641 -3018 1054 5468 3041 -2371 -5876 -1403 3001 5387
1188 5387 2195 -2616 -3445 -1920 3295 3858 64 -3034 -3138 -1135 1936 2586 213 -3503 -1635 831
1204 831 3074 405 -813 -1441 -1287 2052 1079 649 -1687 -2982 754 1946 2491 -1327 -3073 -1362
1220 -1362 -309 3105 1471 -151 -801 -1751 66 995 1389 296 -455 180 1334 325 -322 -50 -141
1237a41m06K215P54j886l609J195K369J499J170l712k755J221L290J518J18l774
1253i34l708L114L653L021l370m404j444K307O117j93k539n441j417L995O040
1268D797J134n869m775k34M324O704k265l695o096J381O125K562J147o568m312
1283e640J917N057L977l298k810l251Q35M362K816j171k557k813K81L649J646
1298C000j909n33l190O24J132L978m56k224l708J05L196K596Q16l275m155J199
1314b804L301L799k731l706j752J185N542J537k128n830N85K373M353q60j912
1329I52m366r76L559L621L1l976j568Q30L468M29k195j268J65K468J098j511j901
1346a140k37J083M044k242k190k222l40M966J889j440m515j140K891L996J378
$$ plain form
1237 -141 -547 1668 2422 536 -3073 -1878 491 1990 3160 -552 -3307 -2086 1204 2722 2840 -934
1253 -934 -4642 -1528 2125 5146 1776 -2628 -4072 -1765 4352 4159 1620 -3821 -5238 -1243 4797
1268 4797 5931 62 -4713 -4947 -623 6081 3816 121 -5975 -4594 1531 4093 5240 -1328 -5640
1283 -5640 -3723 1334 5311 2013 -797 -4048 -3213 1149 3965 2794 237 -2576 -2295 1354 3000
1298 3000 1091 558 -2632 -2008 -876 3102 2646 422 -3286 -3181 15 2611 3427 152 -4003 -2804
1314 -2804 497 4296 1565 -2141 -3893 -2708 2834 4371 2243 -3587 -3002 -629 3724 2864 952
1329 952 -3414 -4390 -831 2790 2821 -1155 -2723 -1893 1575 2004 -191 -1459 -1294 1174 2272 761 -1140
1346 -1140 -1377 -294 3750 1508 -682 -2904 -3244 1722 3611 2171 -2344 -3484 -593 3403 4781
1361D781k955l612k310K735L610L74j935k189o61J138K433J649l549r71j215K241
1377d36K032P98r27m006J136l83L741J538k299k711r72J230K872L302k934m209
1393b228j932K188N570o0j542o726k52M527L914J970o198m609J06N642N162j814
1409C718l973n153J857L922L494K83o390k527J146O207K456l144l709k519L877
1424d55J700L569n053k576N8K247N099j992j282l464j328K474K753N9q20k365
1440a376r19K101J064J06j289q2n49L60j27J580m50n53O93o27Q05j627Q73j327
1458a344K182P31p98q98k728K325J599J863m64l434j579m4M909P55o22l638j961
1475c146L096P12J756j567l089j279L248K355J31o20l135M51K267J273Q61n354
$$ plain form
1361 4781 1826 -1786 -4096 -1361 2249 2623 688 -1501 -2162 -1024 1409 3058 -491 -1462 -2677 -436
1377 -436 1596 2394 1467 -2539 -1403 -1786 1955 3493 1194 -1517 -2489 -1259 1613 4915 1981 -2228
1393 -2228 -4160 -1972 3598 3538 1996 -4730 -4982 -455 3459 5429 -769 -5378 -5272 370 5532 3718
1409 3718 -255 -5408 -3551 371 3865 4148 -2242 -4769 -3623 2584 5040 1896 -1813 -4332 -455
1424 -455 1245 4814 -239 -2815 -2757 -510 4589 2597 1315 -2149 -3477 -1003 1750 1809 989 -1376
1440 -1376 -2295 -194 870 976 -313 -395 -944 -584 -711 869 419 -134 559 -68 737 -890 -17 -1344
1458 -1344 838 1569 771 -127 -2855 -530 1069 2932 2468 -966 -2545 -2589 2320 3075 2453 -1185 -3146
1475 -3146 -50 662 2418 851 -2238 -3517 -269 2086 2217 1597 -1538 -1087 1180 2453 3314 -2040
1491b040q24Q87M135P38j896l361k210L996M110m83j113l832j015J396K955L270
1507D713k928m094k689L996K409K853l492k743l99P00L543J07o53l994o23K596
1523f98K541R28k828k266j40K414L032p97j496l778J524K706J757P05l906k691
1539b993J675K435K126k364k102j663J269K635J224r09m010J354K54K958J45j465
1555E69j045j935K451R15q43j688o63O54K277K211j857j583j790k06M552o6o64
1572A289k344o06J139J595J979l490l89j951J921K445P55j064m776Q00K093K247
1588A643J82k542l24P63J740L40p41k755j245K162J594J467l065j244J200O32
1604a93K809m6l146j351L02K052O97J022m522nM9J795K916n08k149j636M30L006
$$ plain form
1491 -2040 -2864 -1977 2158 2896 1000 -2361 -4571 -575 3535 3052 1939 -1893 -2908 -1512 1443 4713
1507 4713 1785 -2309 -4998 -1002 1407 4260 768 -1975 -2374 -1674 1869 1976 1323 -2671 -3294 -698
1523 -698 1843 2771 -57 -2323 -2463 -49 2983 2186 690 -3088 -1564 1142 2899 3604 -302 -2993
1539 -2993 -1318 1117 3243 879 -1223 -2886 -1617 1018 2242 1333 -2677 -1323 -1069 1889 2034 569
1555 569 -476 -2411 40 955 112 -1576 -2239 -1585 692 2903 1046 -537 -2327 -2533 2019 1953 1289
1572 1289 -1055 -1661 -522 1073 3052 -438 -827 -2778 -857 1588 2343 1279 -3497 -2697 -604 1643
1588 1643 1825 -717 -1041 -278 1462 1802 1061 -1694 -2939 -777 817 2284 -781 -2025 -825 -193
1604 -193 2616 2570 -576 -1927 -1625 427 1124 2146 -2376 -2381 -2332 -537 2379 1871 -278 -1914 -1484 1522
1622A522Q71j258j517o07k36K578k66j39j415K01k38J347J370j232k787N54J53
1639a099L257J97k313j582j383L898J582L79l334l434O74L459L482j734l448j839
1655c238R01K140L517n93m715j198K743K292K204l854l297K82L021K769j196j753
1671B5k917Q86K587J361M47m636M50j48K922J640n03k549k020J943J598J020k180
1688g4n40k91j072J882R10Q35k983O24k10k69J381N88k03J8j438N70M78K79j182
1707f97M58k81Q69L88m10j066J28J073J339q49p68l058J614K255O08K76k947o35
1725a703L17K268J541j832k073M2J888J419j66k669j929L022K332o74j193k778
1741b188n16K898L476r82l135k062l50L521K432n19l078k102K06K994K160n35
$$ plain form
1622 1522 2393 1135 -382 -989 -1225 1353 1087 948 -467 -266 -504 843 2213 981 -1806 -1252 -1099
1639 -1099 2158 2355 42 -1540 -2923 975 2557 2936 -398 -3832 -3158 301 3783 2049 -1399 -3238
1655 -3238 -2337 -197 3320 2727 -1988 -3186 -443 1849 4053 199 -3098 -2816 205 2974 1778 25
1671 25 -2892 -2006 581 1942 2389 -2247 -1797 -1945 977 2617 2114 -435 -2455 -512 1086 2106 -74
1688 -74 -614 -905 -1977 -95 815 1650 -1333 -709 -919 -1188 193 781 578 596 -842 -272 206 485 -697
1707 -697 -239 -520 349 737 327 -739 -611 462 1801 952 184 -2874 -1260 995 1603 1879 -1068 -1703
1725 -1703 -1386 882 2423 591 -1482 -1440 448 1867 1701 -968 -2897 125 2457 1783 590 -2188
1741 -2188 -2704 194 3670 2688 -447 -2509 -2859 662 3094 2575 -503 -2605 -2399 595 2755 2220
1757B220j412k122m21J890K374j847j547R4q66K009K051j287k040j8j69J696K601
1774C206j204k780j456N20K643Q96K03k645j458j64K431K653p65r51n267K122
1790b016K821K228j759l262l80Q66M792R36m245k523q6K209K537J684m225k396
1806b819J514P51L733j332l111j476K089K896L68k723p44j529K178N99J432k362
1822e36l52j046J991J699j343P9j137N54M51j579R03k08N4Q35J071r72k127O52
1840a011P98J299r93Q72j860n70K159p78O62J71L90k533n39R64K300j022k10j089
1858i90j266K588J077M33j678k075n24L138Q26J28k829j335J666K281K270k086
1874A624l858j006J835L434J001k488l934J877K560J303k18k666j774N46L211
$$ plain form
1757 2220 808 -1314 -1735 155 2529 682 -865 -771 -1637 372 2423 1136 -904 -922 -1091 605 3206
1774 3206 2002 -778 -2234 -1714 929 1825 2028 -617 -2075 -2239 192 2845 2080 1129 -4138 -2016
1790 -2016 805 3033 1274 -1988 -2368 -1502 3290 4226 -19 -2542 -2628 -419 2118 3802 -423 -2819
1806 -2819 -1305 -554 3179 1847 -1264 -2740 -651 2245 2613 -110 -854 -2383 -205 394 1826 -536
1822 -536 -888 -1934 57 1756 413 492 -645 -91 360 -1219 -316 -524 -470 365 1436 464 -1663 -1011
1840 -1011 -213 1086 93 965 -895 -1465 694 -84 578 749 1139 -1394 -1933 -969 1331 309 99 -990
1858 -990 -2256 332 1409 1842 164 -1911 -2435 703 1529 1657 -1172 -2507 -841 1440 3710 1624
1874 1624 -2234 -3240 -1405 2029 3030 542 -3392 -1515 1045 2348 2130 -536 -2310 -1764 1447
1889A447J403k085k020j497K630K288N72k849j998l68K269J359R14j248k784K23
1905a744J214J795J216j640j807N97o7L41J627l8l019P68N22L21Q23j394J24m7
1923d08k10K618k315L33o42O55K31K19R96j818k74r41J387K056j968k70j264J308
1941c07Q54j47J644l038K56Q61J226q23r75l30K10M45J977p10j823r69L02K056
1959G09R49k016l42j089J401J470n44P17k739M91P63J551m14k175K33p42J990
1976B13Q87j31j094o23l08Q26J250j236q05k50P22K083j271K71k276O39Q22J971
1994A690m6j551j356J210P59P88m38k69k422J331L67J364k70k440M62o36K293
2011H36J94k15j730L81q43J482Q95o96k199L58R32R89P17k6k117m4K429l33j36
$$ plain form
1889 1447 2850 765 -1255 -2752 -122 2166 2738 -111 -2109 -2477 -208 1151 2065 817 -1967 -1744
1905 -1744 -530 1265 2481 841 -966 -369 -436 -95 1532 1494 -1525 -757 -235 86 909 -485 -361 -408
1923 -408 -618 2000 -315 18 -624 31 262 481 1477 -341 -615 -1556 -169 1887 -81 -351 -1615 -307
1941 -307 547 400 2044 -994 -738 123 1349 526 -449 -779 -569 -124 1853 1143 -680 -1649 -1347 709
1959 709 1658 -358 -700 -1789 -388 1082 538 1255 -1484 -993 -230 1321 907 -1268 -1035 -1777 213
1976 213 1100 969 -125 -748 -1056 -230 1020 -216 -1021 -1271 -549 1534 263 534 -1742 -1103 -281 1690
1994 1690 1644 93 -1263 -53 706 1494 1056 787 -1635 -304 63 1427 1157 -1283 -821 -1457 836
2011 836 1030 815 -915 -534 -1377 105 1000 304 -1895 -1537 -605 384 1101 1075 -1042 -1086 1343 1010 874
2030H74m18k551O43J389P89O78r34j450R18k77J783J40j049q42q95J405J449q05
2048H47p45j733J439J790j10L13l016p77N79K750M98j745j205q15K585l72M95
2065G78k038L81N02K49J785j801N7m30J347N20j821Q78j487j10J419o52Q26j825
2083a422J754N48o35K02j209O05m16R11Q26j025p32j156J239k89J615J10l88j73
2101C65r77m71P54k74J349l435R77J222J054R68p88j197j182O72J173J356j531
2118C5q34m0K44J051M56j257j109J523K00J823q12k106p26J523J584J004k379
2135A80k060j394J346L863j210p25k459J000J758J335J33k535j114j15K455o91
2151b33L86j427p0J015R82N04j710Q40p38J091Kp42J650j504M01j173K4J729o49
$$ plain form
2030 874 456 -2095 -1452 -63 726 1404 470 -980 -62 -339 1444 1584 535 -307 -1202 203 1652 847
2048 847 102 -1631 -192 1598 1488 1801 -1215 -1992 -1413 1337 1835 90 -1115 -1930 655 283 778
2065 778 -1260 -879 -377 -128 1657 -144 -87 -517 830 1350 -471 407 -1080 -1190 229 -423 403 -1422
2083 -1422 332 880 245 447 -762 -157 -573 338 1164 139 -593 -1749 -510 -799 816 926 538 365
2101 365 -612 -1083 -329 -603 746 -2689 -1712 -490 564 1532 744 -453 -1635 -963 210 1566 35
2118 35 -799 -839 -595 456 912 -345 -1454 69 269 2092 1280 -826 -1552 -29 1555 2559 180
2135 180 -1880 -3274 -1928 1935 725 0 -2459 -1459 299 1634 1767 -768 -1882 -1997 458 -233
2151 -233 153 -1274 -1344 -329 653 1157 -553 287 -451 640 642 -100 1550 46 447 -726 -702 1027 378
2170C78J782l206M70Q36n45K259j396L64l298K355J077N94o53k294O05j83J198
2187C43K70n53M65k24N20m75m76n06n98J088K51J251k068n70Q06O32J240o95j183
2206d82O79n74J713o80j238k172K312K158j038L15k262J531m8J355j008j705K80
2223h64n48K735J15l05j696o15K204K15m26l56j428r68J613K253j385k43j298
2240i97L80P9j32J585m66j020R6M11J25L36J719j393j937j33Q76J250l87O36j682
2259f54o23J127R90N49k756L43J161Q62M22j459k9q69J14J144Q93k255k87J26
2277a201J448K089j584j333o39J293M88m94J698k370j00K57R20q45J25Q31p58
2294a75M04p12O2J091k05M81q20j077Q37j145J751J51j283n84M15P7K12J102j252
$$ plain form
2170 378 2160 -1046 -576 260 -285 1974 578 942 -2356 -1 1076 1670 1017 -1277 -672 -855 343
2187 343 613 60 525 301 821 346 -130 -636 -1234 -146 105 1356 -712 -1282 -476 156 1396 701 -482
2206 -482 197 -377 1336 656 -582 -2754 -442 1716 678 993 -1269 262 214 1569 561 -1144 -864
2223 -864 -1412 1323 1438 1133 -563 -1178 1026 1241 815 459 -969 -1937 -324 1929 544 301 -997
2240 -997 -617 -538 -670 915 449 -571 -475 -64 61 397 2116 723 -1214 -1347 -471 779 392 1028 -654
2259 -654 -1277 -150 840 1389 -1367 -1024 137 999 1421 -38 -67 -936 -822 322 1215 -1040 -1327 -1201
2277 -1201 247 2336 752 -581 -1220 73 561 67 1765 -605 -705 -448 472 -373 -248 583 -175
2294 -175 229 -483 -421 670 465 946 126 -951 -114 -1259 492 643 -640 -1224 -809 -732 -520 582 -670
2313f70J633l99l69P78r27R0j294J487Q23k083J24J20J254j232K88M82n08J099
2331F96q74jP47j185J198O55j014j854R00P17P83O00k041L12j232J318J503K22
2349A450j296j082N80L39J073J48j888n57M22Q97k33Q35j232mJ488k98l91j082
2367h31l93J374N04M74n85q02n32J276q32J739j397j606J403q62Q80J326j647
2384e11L14j619K225k04N69o6j552N84L24r0k47J353R0j634J055r10l73Q8R14
2403C10N13j586J956m31j97j64j771J844P19j64o01j282p6J394K33l3j091j037
2421a464J181Q55l84M74k129J167r7p09K258j860R80j762J142P65l19L74p57j97
2439d82K58K35K04l64r23L2J797J20Pn39k145J063J545O67o58o19q97o62J922
$$ plain form
2313 -670 963 564 195 973 46 136 -1158 329 1152 -931 -807 -687 567 -665 -377 105 -403 696
2331 696 -178 -179 568 -617 581 1236 222 -1632 -732 -15 768 1368 -673 -361 -1593 -275 1228 1450
2349 1450 154 -928 -348 -9 1064 1212 -676 -1233 -811 86 -147 688 -544 -548 940 642 251 -831
2367 -831 -1224 150 654 1128 543 -259 -791 485 -347 1392 -5 -1611 -208 -1070 -190 1136 -511
2384 -511 -197 -1816 409 205 774 708 -844 -260 64 -26 -273 1080 1170 -464 591 -319 -692 -604 310
2403 310 823 -763 1193 762 565 401 -1370 474 1193 1029 428 -854 -930 464 697 664 -427 -1464
2421 -1464 -283 572 188 662 -1467 -300 -397 -1106 1152 -708 272 -1490 -348 417 98 472 -285 -482
2439 -482 -224 11 215 -149 -1072 -1040 757 877 884 345 -1800 -737 808 1475 817 198 -699 -1361 561
2458E61L61j18p19j467m92J618P83j923J437j043N33J66J248j218l46R49r3K6
2476B63j038O67j16r0Q29m15l10j80l92J251p31J190p19p84L95K06P99q35m68
2495d78J482q53P80k057J210P39L4j559O08M94J572o43j038j32j11j70R92m12
2513D58j592Q62O74L48p60o55q91R20P51R27P68l198J464j247J652R42j621m12
2531f10j781K615J93Q20j517j306L8J699O65j028n95O67j255K740j806J403j309
2548c67P7O50J07q39L81N98j729J618L50j355J55j1J495k052J129q2l81N61l32
2567b7Q48k087K377q81J33j30j185J030m11M83R13r61M0O07q37Q08j038L51L24
2586C57L91j097l5o07P28J098j55j109q94P44J248k8L28q36j844P69J695M90j870
$$ plain form
2458 561 922 804 85 -1382 -1874 -256 527 -1396 41 -1002 -469 -303 945 -273 -619 330 237 263
2476 263 -775 -108 -224 -314 515 100 -210 -390 -782 469 -262 928 209 -575 -180 26 825 -10 -478
2495 -478 1004 151 931 -1126 84 823 857 -702 -94 400 1972 1329 291 159 48 -122 870 458
2513 458 -1134 -272 402 750 -10 -665 -1556 -636 115 1042 1810 -1388 76 -1171 481 1423 -198 -610
2531 -610 -2391 224 417 1237 -280 -1586 -1548 151 816 -212 -807 -140 -1395 1345 -461 942 -367
2548 -367 -290 360 467 -372 9 607 -1122 496 846 -509 -354 -365 1130 -922 207 125 -256 305 -27
2567 -27 821 -1266 1111 230 363 233 -952 78 -333 150 1063 102 142 749 -88 720 -318 33 357
2586 357 748 -349 -384 -991 -263 835 680 -429 -1323 -579 669 641 969 133 -1711 -942 753 1243 -627
2605f27j299R1J970J504p17m75j597Q80q69K498r42k102R18J031J261r96O49j887
2623g09j297K811J13N33k154O81J56l84R64l80j98q4J39N68o76J126k007J534
2641G36r56J66j406J013Q13K14O92j748Q9K14K39P04r21QJ302m51q93N75j136
2660g46o7K549j921N44l75j228J298P81k41p80q35P88o5J432p85p98q14K226L97
2679A360j249qk255K075Q18J124j207j042j78J87J584k43q21j796J68K377j18
2696G76o42p99n83J480N82L69j626r2M39M25N44o64j41j664R06J064n20J108q67
2715I5r42P36J22N26j79j29j822J776P56m83J275k546J399j535R74L23L22n72
2733I6j25m93k7J16M90K63j425j93O11J368J273l310R75k64Q67K404k858J53l96
$$ plain form
2605 -627 -1926 -1835 135 1639 922 447 -1150 -270 -1139 1359 417 -1685 -767 264 1525 529 1178 -709
2623 -709 -2006 805 918 1451 -703 -22 134 -250 714 334 136 52 191 759 83 1209 -798 736
2641 736 -220 -54 -1460 -447 366 580 1272 -476 -387 -173 66 770 -151 -143 1159 708 -185 390 -746
2660 -746 -813 1736 -185 359 -16 -1244 54 835 594 -186 -1021 -233 -298 1134 349 -449 -1263 963 1360
2679 1360 111 103 -2152 -77 741 1865 658 -384 -562 -375 1209 966 145 -1651 -1483 894 776
2696 776 134 -665 -1248 232 814 1183 -443 -535 -96 329 873 209 68 -1596 -690 374 -146 962 95
2715 95 -847 -111 11 537 358 229 -1593 183 939 456 1731 -815 584 -951 23 346 668 96
2733 96 -29 -522 -549 -433 57 320 -1105 -1298 -687 681 1954 -1356 -381 -645 222 2626 -232 -79 -475
2752d75l55K571j169O46k090Q39l57N82j3J6n15j90J015j486Q88k7j153J346J065
2771A138m04K21j148J62o37J157k15r17K22n31K685k294J098r97P32o38k33O98
2789I9r30L84R55o94P78q28J00k37p37Q24o91N36j34N52l51r15Q66Q90k89j923
2809a745J610j019Q34J633j703M32K54m95J64j67K34r4Q93J106l89k019J27j40
2827d84n81K250j003K70r19j477J776J092L45j553J64r3k93J130r21J436j572
2844d33p3R00q69J447j390J128j521J301pj700K93L00j89l22K886j336o20l94
2862e99L03J045q00l00l68m02J737M06l92n62p72M7N60O14J9J4j788J307o0l37
2882c28R47M2j400N43J83L96K35j818J111q79Q43J053q03q60n17M23J632n72j6
$$ plain form
2752 -475 -830 1741 572 1218 -872 -33 -390 192 179 195 -320 -510 505 -981 -93 -120 -1273 73 1138
2771 1138 734 955 -193 -31 -668 489 274 -643 -421 -952 1733 -561 537 -460 272 -366 -599 99
2789 99 -831 -447 508 -186 592 -236 -136 -373 -1110 -286 -977 -441 -575 -23 -374 -1289 -423 467 178 -1745
2809 -1745 -135 -1154 -320 1313 -390 42 296 -199 -35 -202 32 -62 831 1937 1548 -471 -344 -484
2827 -484 -1065 1185 182 452 -467 -1944 -168 924 1269 -284 -120 -213 -506 624 -297 1139 -433
2844 -433 -506 394 -475 972 -418 710 -811 490 483 -1217 -924 -624 -813 -1135 1751 415 -205 -599
2862 -599 -296 749 -51 -351 -719 -1121 616 1022 630 68 -704 -657 -97 517 536 550 -1238 69 9 -328
2882 -328 619 661 -739 -196 -13 383 618 -1200 -89 -968 -125 928 125 -735 -1252 -829 803 231 215
2901B15N68j835J151K29J464j670m47k1N48J480K2j092o80r58J938r40J297q63
2919D06p13j56m78K076j804Q98j178M11J842j162M04k178J451N48K41O60k114
2936h46O89r35J924N31l49r31j022Q47N4P47q79O03k54j587L367j828P60j637
2954g46O90J346j413M57j952K192m38P2k22l89k95o98K441J45j901J282m81M35
2972E25j251Q29J17p40Q19n54k78p31J896M98j429M5p26R68J45J234p35j732R71
2991a29j022J257J034q87j182n2J475q49M00m97q44J293j09J852l000O8J408l1
3009A85J859j383j445j108J768J147n1m83j688J319j763K415O93k064j037j56
3025a792K371K83k95o05l28J306j011N36j865J838Q22j352M20j468P34m69O18
$$ plain form
2901 215 783 -1052 99 328 1792 122 -325 -346 202 1682 1704 612 -68 -1026 912 -28 1269 406
2919 406 -307 -463 -941 1135 -669 229 -949 -538 1304 142 546 -1632 -181 367 608 1268 -846
2936 -846 -157 -1092 832 1363 1014 83 -939 -92 -38 709 -170 433 179 -1408 1959 131 891 -746
2954 -746 -56 1290 -123 334 -1618 574 136 208 -14 -403 -698 -1396 1045 1190 -711 571 90 525
2972 525 -726 103 220 -520 299 -255 -533 -1264 632 1130 -299 -254 -980 -12 133 1367 632 -1100 -129
2991 -129 -1151 106 1140 253 -929 -981 494 -355 45 -452 -1296 -3 -112 1740 -1260 -1192 216 185
3009 185 2044 661 -784 -1892 -124 1023 972 489 -1199 120 -1643 772 1465 -599 -1636 -1792
3025 -1792 579 862 567 -38 -366 940 -71 465 -1400 438 1260 -92 328 -1140 -406 -875 -257
3042b57K61j526J636m56Q95o43K52Pj169K286q93M6j263J167o89K95P53j413L37
3061c74K86L88j683L20J036L05N11R3j306o89k49K450q48J176j950j09P97LJ145
3080A302r51j172m0K43J700n39j028p08O24J861r74n34M7k52J236j417J472l76
3098D94k75j617J227J566n21q46q17J273L03J89r6o21K01n59L6q49O09j57l4J716
3118A222j766J813n30J505j790j201M14P75j13N26r56o1k35J010j106Q03n74j059
3136a323J262N60J92j879N83k9J394j104m1j223P90M38J91P88n92j305P75O61
3154A38O57j471j87K58k48K511j416o59o08j20J165o7N26n16j162O34M88J082
3172A005r89l66m63J203o12j15J76p61O54P20q21k03j18k80l21K290N7n46J31
$$ plain form
3042 -257 4 -1522 114 -342 553 -90 162 169 -1000 1286 393 439 -824 343 -346 -51 702 -711 -374
3061 -374 -88 300 -1383 -1063 -27 278 789 882 -424 -1113 -1362 1088 240 1416 -534 -643 154 157 1302
3080 1302 351 -821 -861 -618 1082 543 -485 -1193 -569 1292 318 -216 -169 -421 815 -602 870 494
3098 494 219 -1398 -171 1395 874 28 -789 484 787 976 880 259 460 -99 -63 -912 -303 -460 -494 1222
3118 1222 -544 1269 739 2244 454 -747 -333 442 329 855 -101 -162 -397 613 -493 310 -264 -1323
3136 -1323 -61 499 691 -1188 -605 -634 760 -344 -385 -1608 -818 -380 -189 599 7 -1298 -523 138
3154 138 795 -676 -863 -605 -853 1658 242 -417 -1025 -1145 20 -47 479 -37 -1199 -565 -77 1005
3172 1005 16 -350 -813 390 -222 -337 -161 -922 -268 452 -369 -572 -690 -970 -1291 999 1056 510 641
3191F41j155r4l58J787q34q36Q09j185O46Q94M89r30J15N95j048N24L40n84Q65
3210F81j427O15Q66N3m29j800J052RO79n98J213j858N31p8R22K95j808O86N89
3229A93l01N96j213J142j139J169O3J449j244j333O38L21p30J10P54q66l32J233
3247E10k81L71j829J648j25l79M0n65m81N62m64J391J67k6q12P17q22J456m31
3266F47p64m76J138l02J9J75l31o94q2J760k188K101k531J935o08j14M01K41N46
3285H73j085m7R11l23N68j461J560k342J268O27O8j840J242O7l90J393j565O35
3303A59R9j250J448q56P28r87P81N33r55O63j420J501r98R01L41j305O32J56J35
3322C06n35J816k520L12J501k80L34l71p81l80J031j142J175p91L76j58q59J695
$$ plain form
3191 641 -514 -608 -966 821 -13 -849 -40 -1225 -579 315 804 -126 -11 584 -464 60 400 -184 681
3210 681 -746 -131 735 788 359 -1441 -389 -380 299 -299 914 -944 -413 -491 431 726 -1082 -396 193
3229 193 -108 488 -725 417 -722 447 510 1959 715 -618 20 341 -389 -279 475 -391 -723 510
3247 510 229 600 -1229 419 294 -85 -45 -610 -1091 -529 -993 398 565 539 -273 444 -378 1078 647
3266 647 -117 -593 545 243 262 437 106 -588 -670 1090 -1098 1003 -1528 407 -201 -315 86 327 873
3285 873 -212 -259 652 329 897 -564 996 -1346 -78 549 617 -1223 19 86 -304 1089 -476 159
3303 159 258 -992 456 -400 328 -659 122 655 -300 363 -1057 444 -554 347 688 -617 15 171 306
3322 306 -229 1587 -933 -621 880 600 934 563 -218 -598 433 -709 466 -325 51 -107 -966 729
3340G29PQ2l96j373M63O85P88r67K67j388J938P74k038l02k16P51P61m11M14P94
3360A362j992K85P60j940Q23O41M01j059N78o25J250l45J51p24p2P30n1L54j06
3379D21n46N64M9M31l34j159m94N16J367n74p39O80o72J332o79J194j945P40j12
3398D0J051o4o93J06k93J74m25K91q29m96J686j68K92j848j89J024J90J984j460
3417C73j048J248j198J065k69K36j160R48N41q91kj216Q55N65N93n9j147Q25j6
3436B43K28m28M28k94j08M70j049R27o00j54L01o07O37J08m50J097j248O79o74
3455d94J364j857J369m02j95l55J065K39j647Q60o76n13J008L41J284k545M91
3472f63K12J489K87j646n61J034Q20N08j201o20M4L2M08n82l28j35J344l59k52
$$ plain form
3340 729 736 818 422 -951 -488 197 985 18 285 -1103 835 1609 -429 -731 -947 -196 565 154 568 1362
3360 1362 -630 -345 415 -1525 -702 -61 340 -719 -141 -766 484 139 290 -434 -506 224 173 527 421
3379 421 -125 439 488 919 585 -574 -1068 -552 815 241 -498 182 -490 842 163 1357 -588 152 40
3398 40 1091 1027 334 440 147 321 -104 187 -642 -1138 548 380 672 -1176 -1365 -341 -151 1833 373
3417 373 -675 573 -625 440 171 407 -753 195 736 -155 -157 -1373 -518 47 640 581 -566 259 243
3436 243 471 43 471 177 69 539 -510 417 -183 -337 -36 -643 -6 102 -348 749 -499 180 -494
3455 -494 870 -987 382 -20 -215 -570 495 734 -913 -53 -729 -1242 -234 107 1391 -1154 -663
3472 -663 -451 1038 1325 -321 -882 152 972 1480 279 -341 -297 -265 143 -439 -767 -902 442 83 -169
3491a69J478j818O61k027K817L57k510J007p89J174o88J106q28M34J27l58J649
3508A623j521O16k23n65p66J37O49j360J121K43O7K24j033R66P32j083k08l64
3526g45J255M22K71j401J48r30P93P30r95kJ02K30K82j22n64j33Q98M86k02j8
3546E05m40l31j14P03j45l67k11P31R52q00j023j593J244J547j219J246j456Q26
3564E5p79J852p14q36q95J410n68O28k38k18j198R97K00O01o57M18m88Q83M94
3583I47k348K873j942k10K24l08J021K82j322N23O31n97j40j80Q07M88l32n06
3601h9J238j786J572r72j58K66N11K43j236J254j937J421Q51j139M18j098P98
3618A57k155K807n75K0Q64j644J690r78m43P16r32L221k731K7o33K89J057j77
$$ plain form
3491 -169 1309 -509 152 -1875 942 1299 -1211 -204 -993 181 -507 599 -229 205 332 -26 1623
3508 1623 102 718 495 -70 -836 -699 -50 -1410 -289 -46 21 245 -788 178 910 -173 -381 -745
3526 -745 510 932 1203 -198 -50 -980 -187 543 -452 -454 -352 -122 160 38 -526 -659 239 725 523 505
3546 505 65 -266 -380 323 178 -189 -400 331 1283 483 -540 -2133 -889 658 -561 685 -771 55
3564 55 -724 1128 414 -422 -1317 93 -475 153 -85 -303 -1501 -504 -304 297 -360 58 -430 453 947
3583 947 -1401 1472 -470 -680 -456 -764 257 539 -783 -260 371 -226 -366 -546 261 749 417 -89
3601 -89 1149 -637 935 -37 -195 71 582 825 -411 843 -1094 327 1178 39 457 -641 157
3618 157 -1998 809 234 254 1118 -526 1164 186 -257 459 -473 2748 17 44 -589 -300 757 580
3636E80N76k71j009L82N26J30r10r79K44J508p69L39M92j930K013k30j604R54
3654D2J26J028j119p53P8P03j42j375K181p86O1R54j289R89j250Q1O51O3k01R76
3674A018j282k71N06L3O77l47Mj09o01J352j207l36K03P14M79Q6j295q01J564
3693C87j118O90j75n50J238k58j635J821j63Q73k324J439K70n32Q91p7Qj613J131
3712C03q14R09m44n58L41O24j091L04K39R25M0O97j320L66r41l20J519K0o92n5
3732E2P5m20N37O82j573J90M2J917j428m32R54j065J765j437m76Q80p71P87r47
3751f68J360p84J0M5l01N5K12K04k06l46N02j574Q30R25N52j360Q81o79k53J90
3771d05O93r75N8J062M81l65n69k62K89N62j181P91l96K56m6J103n99N04m53j603
$$ plain form
3636 580 1156 885 -124 258 784 914 4 -975 -731 777 8 347 839 -1091 922 692 -912 42
3654 42 168 1196 77 -676 -598 105 -37 -1412 769 -17 44 998 -291 698 -552 -471 180 243 42 1018
3674 1018 -264 -535 -29 4 681 334 338 229 -372 980 -227 -563 -360 354 833 919 -376 -1177 387
3693 387 -731 -41 -216 -766 472 214 -1421 400 237 1110 -1214 225 495 -37 854 777 785 -828 303
3712 303 -511 398 -46 -604 -263 361 -730 -426 -187 738 778 1475 155 521 -420 -740 779 799 107 52
3732 52 127 -293 244 926 -647 -457 -415 1502 74 -358 596 -469 1296 -141 -617 263 -508 279 -668
3751 -668 692 -92 -82 -37 -338 -283 -71 133 -73 -419 83 -1491 -661 264 816 -544 337 -342 -595 -405
3771 -405 288 -687 -629 433 914 549 -20 -282 7 569 -612 179 -217 39 -7 1096 497 1001 548 -1055
3791a055J239M9N70K1j574o25J434R03j864J370j065KJ231r43N62j455J733j389
3809h56J427R3K08p21m65Q42l82m80J603j812J657j234n65J368p28M54n49Q58
3827G18p4j041j149J034j06k6J278j686L75M01m77R42o95n29J782m21P04j495
3845d65N30J21o21L67Q9k05j249J492l54q84P37K07J237j198L29m12j32J60OP15
3865D70p90l33j33J065j12r39j82K43J006m32M84j227J68O0K80J056k95j437J820
3884G72j260J083o28M10m65l12J384j196j92j320J262M08K46L02k138K494j985
3901a135J032N00o31k82n26J354J48o39J082p49O96l80M10r09p21J536o93M38
3919E31p09L20o80J669K45j122N39m80N24n51QK77p81O86q65R18j223J49J397
$$ plain form
3791 -1055 184 233 803 824 -750 -1375 59 962 -902 468 -597 -595 636 -307 255 -1200 533 -856
3809 -856 571 664 872 151 -314 528 146 -334 1269 -543 1114 -120 -685 683 -45 409 -140 718
3827 718 644 -397 -1546 -512 -618 -644 634 -1052 -677 -276 -753 189 -506 -1035 747 326 1030 -465
3845 -465 65 186 -435 -68 21 -184 -1433 59 -295 -1179 -442 -235 1002 -196 133 -279 -411 -251 -245 470
3865 470 -320 -653 -786 279 167 -772 -954 -711 295 -137 347 -880 -712 -652 -372 684 389 -1048 772
3884 772 -488 595 -33 377 -88 -400 984 -212 -404 -1724 -462 -54 192 494 -1644 850 -1135
3901 -1135 -103 397 -234 -516 -1042 312 460 -179 903 154 850 470 880 -29 -750 786 93 531
3919 531 -178 142 -538 1131 1376 254 793 313 837 286 294 571 -210 476 -389 529 -694 -545 852
3938H52l44o45R44q91L33k66N94n91j333O81p64J339q0k73j160J862M03n35Q86
3957A012r28L32k28p48J389k23m50m81K43O20J50j49j040J459j028N76j600R98
3975i6j348J528J318k494P85j12J100J59j647M74p84K117q1N2j179k71J549j687
3993f17J482j850J375n41O62J26j176N8j778K004K00n13N79K94k0n78Q1n26O95
4012d3J574j841J349p34p02Q4k95J277m84Q75j312R14P89j568q0q23J540p69J416
4031A167M47k085P19o98P79N14k27l53j722J304k02R89L57j874J026K35j148J021
4049B49j01L2o16N13Q45o52N20j247R69J8k06j314J588o66m71K46N64k71o62M30
4069b32M48k94M51j266K711k088j59o33R80O63j031J670j745Q14M39m40lp50J489
$$ plain form
3938 852 508 -137 807 -84 249 -17 577 -14 -1347 -666 -1430 -91 -171 -444 -1604 258 661 126 1012
3957 1012 84 416 188 -560 829 606 156 -325 -82 538 688 539 -501 958 -70 506 -1094 -96
3975 -96 -1444 84 1402 -1092 -307 -419 681 840 -807 -333 -1117 1000 919 971 -208 -479 1070 -617
3993 -617 865 -985 390 -151 511 637 -539 -481 -2259 -255 -55 -568 11 305 285 -293 -212 -738 -43
4012 -43 1531 -310 1039 305 -397 -313 -608 669 185 1060 -252 662 1451 -117 -197 -1020 520 -249 1167
4031 1167 1614 -471 248 -450 329 843 616 263 -1459 -155 -357 632 989 -885 141 376 -772 249
4049 249 148 180 -436 77 922 270 790 -457 512 530 324 -990 598 -68 -539 -293 271 0 -662 -232
4069 -232 216 -78 373 -893 1818 -270 -429 -1062 -82 581 -450 1220 -525 289 728 288 285 -465 1024
4088A024j299o1l87m19J783p32J681k683K87R98J64L64j160J645j107J05o17L92
4106b2J419k073J156o59o8M67n53J041r34M57J26m72M34j155J123q29P54M91m39
4125B64M23j862J330j450K909j527Q06j096n6N26l7J08K52O98l31k184J026J48
4143e3q82J141L22o3j49n30p99j097K416m96L71o49n85J14J421J245k425J103
4161D05o56J237n60p77L21o28K084j302R01k242J545r43M42P19j170M3L36l89
4179f34J048P4J332j042m98J72o44M06l46N51n19M5J12l9N23p44L75on13K54L11
4200B18k2p31P91j078L78Q82j407O45R43P9j417J164n99r54O35M56Q85l80o60
4219a72L51l53J476j006l23J866j772M28l57O4j564J353j471J574p92P57k00L5
$$ plain form
4088 1024 -275 -336 -723 -1142 641 -91 1590 -1093 -806 192 356 720 -440 1205 98 203 -414 -22
4106 -22 1397 -676 480 -179 -247 220 -333 708 -226 231 357 -115 319 -836 287 -542 212 703 264
4125 264 687 -1175 155 -1295 1614 87 893 -203 -259 267 230 338 590 1288 957 -1227 -201 -53
4143 -53 -935 206 528 465 316 -214 -1013 -2110 306 -190 181 -468 -1053 -939 482 1727 -698 405
4161 405 -251 986 426 -351 -30 -658 1426 124 1025 -1217 328 -615 -173 546 -624 -581 -245 -634
4179 -634 414 488 1820 778 280 452 -192 214 -132 419 -100 -55 57 18 541 -203 172 166 -347 -93 218
4200 218 196 -535 256 -822 -444 438 -969 -324 619 698 -719 445 -154 -1108 -473 -17 868 488 -172
4219 -172 179 -174 1302 296 -27 1839 67 495 138 202 -1362 -9 -1480 94 -698 59 -141 -106
4237a06o32J220j100Q0M83j97O63O82j840o12J993j815K834k504J083m64J09K38
4255A15j113J889k77n31M95j827J370m03K85Q98j738J820m71o53Q65r67J36p50
4273h57J601m45R99o56l93l82m9P36n27Q38k039J176m94O64J05o15J285p43O7
4292B71M03j541N78k9J145j281M94J60o79PR97J012j531O0l19M97o93j06J44p18
4312a129M63J06O41l11n85J306n36M75o05l61J054J52j143J565p52k18K73J142
4330A537k194K96J049j210K240k018Q79q50M07L72r59Q74o31R11r50J360j356
4347b43l03J62j308K493j266k47Q87p00J242j12m80o38j27J463O7k64j139N80
4365F7o5m32O78j419J752k066J219J03k62K75j220K042j187O43r39M79Q63j263
$$ plain form
4237 -106 -738 482 -618 -538 -55 -252 411 1093 -747 -1359 634 -1181 1653 -851 232 -232 -123 115
4255 115 -998 891 614 83 578 -1249 121 -282 3 901 -837 983 512 -141 724 -243 -107 -857
4273 -857 744 299 1298 642 249 -133 -182 554 27 865 -1174 2 -492 172 277 -338 947 204 271
4292 271 674 -867 -289 -318 827 -454 40 200 -479 -472 525 1537 6 66 -253 244 -449 -555 -411 -1129
4312 -1129 -666 -560 81 -230 -815 491 -45 430 -175 -536 518 670 -473 1092 340 122 395 1537
4330 1537 -657 -361 688 -522 1718 -300 579 -271 136 508 -451 423 -208 703 -247 1113 -243
4347 -243 -546 -384 -1692 801 -465 -712 175 -525 717 605 125 -513 -640 823 890 626 -513 67
4365 67 2 -430 248 -1171 581 -1485 -266 -163 -425 -150 -1370 672 -515 128 -811 -332 531 -732
4383g32Q63r08J063m35N05m1n74m47J072L80n72j54M60j864J780q50O67m56L63
4402A20P43j009Q0K45J81P65j481P07o47j1j44O81K78o24O37j394J968r42L66
4421E19K69j777J545J75M7J86j395j91l88K685j691j18j70M4J4N70J029j077j15
4440A61j155R90J148k073L85J088r61J279k0K2o20L83m41j45j65k11N58o60O97
4459B60j59n11O31m03P97j384Rp9J125o59J6L89j482K033n86p96O86M0Q09j762
4479a026J496r15J170n44L66p46n59k04K82O21J045j424R68j527P95O32o41J392
4497A181n88o69j033Q41J209n06j714K304o3q10o3L72k52M76j326J592q66O72
4515G57j073N2J148j172N30l82k93K1N67Q45q75m18k16j9J053j421N06k87Q48
$$ plain form
4383 -732 131 -777 286 -149 356 315 -259 -706 366 746 174 20 480 -1384 396 -454 213 -243 120
4402 120 863 -146 -66 179 360 1125 -356 351 -296 -307 -451 230 508 -116 521 -873 1095 153 519
4421 519 788 -989 556 731 778 964 -431 -622 -1010 1675 -16 -134 -304 -260 -246 324 1353 276 161
4440 161 -994 -4 1144 -929 -544 544 -417 862 842 864 244 627 186 41 -124 -335 223 -437 260
4459 260 101 -410 221 -182 615 -769 -760 -839 286 -373 -357 32 -1450 583 -3 -799 -113 -73 736 -1026
4479 -1026 470 -445 725 181 547 -199 -758 -962 -680 -59 986 -438 530 -997 -202 430 -211 1181
4497 1181 593 -76 -1109 -268 941 435 -1279 1025 962 152 89 461 209 685 -641 951 85 757
4515 757 -316 -264 884 -288 242 -140 -433 -412 155 1000 125 -293 -509 -528 525 -896 -390 -677 171
4534A71j216J074Q13k159Q52J61Q92m87j610J047R55k72R04k254J758n40m28K21
4552a18N75r08P19q13N03N21j541J382j74L06n83j247J839l5P67q29n22P6N7O45
4572F20j177L76R30q56J53n23R55k310L098j578K99J091j618L78n60N80k44O40
4590B54P46j543O72p13J299J82K75o74o93P17j096P38K6l40J430q87k15n27k18
4609e67J008o41O00m63l89K42N22J31l12k67K33j231L99R39K99m44l19m45P22
4628A7R8j631K416j185J930k517M40P40m89J695j787Q94q30l83J270O53q86p45
4646c00o3k08J323j59J65m20r31J260q76j11K17m26O61K58j273l00O99O61k00
4665b3L99j102n20K470L27r97j319J044o62O40M23l78j97M14l09J29K90j202N04
$$ plain form
4534 171 -1045 29 842 -1317 -465 -304 588 101 -1509 -462 493 221 1125 -1129 629 89 -339 -118
4552 -118 457 -451 268 -545 -42 479 -1062 320 146 452 -131 -1378 461 426 1193 364 -158 -82 -25 620
4572 620 -557 -181 749 -107 46 -477 478 -1832 1266 -312 -13 1078 -540 -162 -722 -142 -386 254
4590 254 1000 -543 129 -584 715 897 1172 498 -195 522 -574 164 190 -150 1280 393 178 -349 -567
4609 -567 441 -200 400 -63 -452 -210 312 443 131 -136 97 -1134 -735 204 503 59 -260 -705 17
4628 17 115 -1516 900 -285 1645 -872 -432 308 -181 1514 -273 621 -209 -592 678 1331 445 -300
4646 -300 -363 -571 752 593 758 338 -593 667 -209 -320 -103 -529 132 390 -883 -1183 -484 177 -23
4665 -23 376 -726 -1246 1224 1551 554 -765 279 -383 257 680 302 105 519 210 339 629 -573 -69
4684f9N72j225J459j497P69m41j8J115o66k7j84q13Q97O28K89j525J47P44K93
4703D48P43j480J482j903J717j377j60R33o75mo9j20K27n80Q75L18j126O29K44
4722A22L96p47J14K95n18J244j682J681j414O44k91K95L99L95j699m48K393j709
4740e30J429o74k5N94j542J274j7j48j524J080P80j086O28j076L39K182k309R51
4758C26j017J641l20j119R95j022o9k28J020q89J369p66m73O56O09j791M02R98
4776C22m08K03K78R8L06j665J592r97j3O29j07O24j456Q49l80o1k17K58J062r48
4796c1m89O02K87p14M70q52J237r29J837k367K43Q4K85L5l88N98r41J174l96r9
4816c54Q30r71J649o72r69J460j149L52j132L71M10O74n82K78p52P77K42J38j271
$$ plain form
4684 -69 503 -722 737 -760 9 -432 -450 665 -1 -28 -212 -1025 -128 500 789 -736 -589 155 448
4703 448 1191 -289 1193 -710 1007 -370 -530 403 -272 -276 -345 -465 -238 -818 57 375 -751 -122 122
4722 122 518 -229 -115 180 -338 906 -776 905 -509 135 -156 139 538 933 -766 -1214 1179 -530
4740 -530 899 225 200 794 -748 526 509 361 -1163 -83 697 -389 239 -837 -498 1684 -625 326
4758 326 -691 950 630 -489 506 -516 -585 -813 207 -682 687 -79 -552 104 713 -1078 -676 322
4776 322 -86 117 395 493 799 -866 726 -271 -284 345 238 862 -594 255 -125 -186 -403 -145 917 -31
4796 -31 -520 82 369 -345 125 -727 510 -419 1418 -949 -706 -622 -337 -302 -690 -92 -1033 141 -255 -354
4816 -354 476 -495 1154 482 -487 973 -176 176 -956 -585 -175 499 -83 195 -557 220 462 600 -671
4835f71J311n53l82n42R48j574K159J74j421J391P02j607J98Q78k315J864j194
4852f34J120k17m22k73O7Q01q97R76M96m74n85o84Q74M01j119l90M05O30N5q9
4872D1m72J114Q20j613k86N03m4O44p10l68l78J101j42o40J36n88J684q54J576
4891A524j338j072J043o6K32j51l79j76q28J536O0j069R37q84J031M38p30j19
4909a1j02R11n85p43J58P04j22o71J342k064J121P3K43l25j50R50j520R42O8m6
4929A73M91K45n72p23J394j811J688j217l8M22j008J122L07k67K89j334P81j043
4947a101K115j894J743j177O68r0K30M46j073m70M89K4J047j835J159r72Q93q96
4965f94L93J074j632J499k124J926p53l25L79R03p17j4J79o13l96J204n3L40j432
$$ plain form
4835 -671 640 87 -295 -837 111 -1463 696 870 -551 840 1542 -65 133 1011 -1304 560 -634
4852 -634 486 269 -153 -426 -359 442 -455 521 1017 543 -42 -726 148 549 -570 -960 -555 75 130 41
4872 41 -431 683 1503 -110 -396 107 63 707 -3 -371 -749 352 210 -430 -294 -882 802 -52 1524
4891 1524 186 -886 157 91 323 172 -207 -383 -1211 325 385 -684 253 -631 400 838 108 -11
4909 -11 -113 798 213 -530 -372 332 210 -461 881 -1183 -62 11 254 -71 -221 729 -791 151 219 173
4929 173 664 909 337 -386 1008 -803 885 -332 -370 52 -956 166 473 206 495 -839 -58 -1101
4947 -1101 1014 -880 863 -314 354 264 494 940 -133 -603 -114 -90 957 -878 281 -691 202 -694
4965 -694 -301 773 -859 640 -1484 442 -311 -636 -257 646 -71 -85 94 -519 -915 289 236 576 -856
4984h56J281j175O83R15m32j94r87J582l79q33Q97o55M13r36M65P20j057K060
5002A512j295J3L9M28l50j293J737J48r87o44o66N70r9J649j268Q55n75p24J084
5021A34p05J515j401R99o59M17O00l08k38r55K78L18q51J107n50J16m5P09p85
5040c04M08J212j942N33l60L27M4K60K30p85K63q11N3R88m64O75l24N68l39L64
5060E96q03p04Q22o83J179q8r84J414j623J315n15r6R37j263R66k73Q73j101J358
5079A327n01j183j1J631o69j025P00m43L61j277J391J15n77nL71p42J059j034
5097e12J370p59l9K31o34O81O5m0l03l97J056m32m75k60M39K14j3N10O57m96J5
5118H78q41Q23j557Q47j59M21j182m60K274j080O58n81k37l13P27p18J39J517
$$ plain form
4984 -856 425 -750 -67 848 416 222 -765 817 438 -395 502 -153 260 -676 -211 509 -548 1512
5002 1512 217 230 269 697 347 -946 791 939 -48 -692 -1358 -788 -887 762 -506 349 -226 -950 134
5021 134 -571 944 -457 542 -117 300 900 592 354 -601 -323 -5 -856 251 -299 -183 -228 481 -304
5040 -304 104 1316 -626 -93 -453 -126 -82 178 408 -377 -114 -925 -872 116 -348 327 3 571 232 596
5060 596 -207 -911 -89 -772 407 319 -665 749 -874 441 -74 -170 767 -496 470 197 1070 -31 1327
5079 1327 826 -357 -368 1263 594 -431 269 -174 187 -1090 301 416 -161 -166 205 -537 522 -512
5097 -512 858 99 60 291 -343 338 403 363 60 -337 719 287 -188 -448 -9 205 192 702 1359 863 878
5118 878 37 860 -697 150 -9 412 -770 -1230 1044 -36 622 41 -196 -509 218 -500 -361 1156
5136A156k545J241m34M71O26o2N7p21R69n82m70k76L77N11j319J380p83j107J968
5155D57j196R79j092J232r71P36J071j880J313j561J207L44M3l63j292J102k68
5172a39P30n68j24K26n21J350J68m94j235M69L76k23M4m64K07L24r21J821j572
5191e46J073J093j476J021j509R54j573J477o46L85j192O4J545o20l50L7j29N8
5209c34p29J004J89k60k88J96P07j077J553j119J8Q29j566Q42P5j78J50L52Pn85
5229b14j97K94l35o93J168l08L79J456r90j218K28J96O67j106J465j544K062j383
5247g3J58N8k72K36r13O49L11l03K82l61P01L06p82k75l77J355p19Q08q99O41
5267E31q78N19O41r71J011r30J102j039P13m25m14k78M99n9o74P62j199P82J056
$$ plain form
5136 1156 -1389 -148 -582 -111 515 453 510 -211 758 176 -294 -570 -193 318 -1001 379 -404 -1511 457
5155 457 -739 240 -852 380 -591 145 1216 -664 649 -912 295 639 682 319 -973 129 -139
5172 -139 591 23 -101 125 -396 954 1122 628 -607 -138 238 15 59 -405 -198 126 -795 1026 -546
5191 -546 527 1620 144 1165 -344 610 -963 514 -132 253 -939 -875 670 50 -300 -263 -392 -334
5209 -334 -1063 -59 130 -130 -418 -222 485 -592 961 -158 -140 689 -877 -35 40 -138 12 364 371 -214
5229 -214 -411 -117 -452 -1145 23 -285 94 1550 560 -658 -430 -234 433 -673 792 -752 1310 -73
5247 -73 85 143 -129 107 -806 -157 154 -149 133 -228 473 779 -3 -278 -655 700 -19 789 -110 531
5267 531 -347 172 813 -158 853 -77 1025 -14 699 274 -140 -418 81 22 -652 110 -1089 -307 749
5286G49r19k48N33n00j72l6K67Lk98J521j434N49l04M24L5L56j02j714R47l1P90
5307D16q83r97K001j107J117p35K54o70N46j69K8K32p71J468n30n43M70P38k25
5326F40J10l11o53j10J439k367J761m72k10J99r27R69q02J953j844L09j47j05
5344e68N72j09P53j054J55J469k163K143j530j51m79O54J509j745P40o3j93m73
5362e33L56k45p63K143j076J1l85N59n91P84n75N8J073p07j029J224L03Q9k82
5381D14j179R20p79J756j237J324k017J173j191L33Q95o70R2J325j232k9n5R89
5399H32k18j90n06m10J359j582J339q36R71o47j8O25j160J790j064l63R07j169
5417c40Q55j559P37Q3m51M12r15R62J82J99n91N01J862j570o97M3P63p58Q34r33
$$ plain form
5286 749 -170 -418 115 -385 -557 -593 -326 -323 -621 900 -534 15 -289 135 170 526 424 -1290 -343 -374 416
5307 416 -467 -1464 537 -570 547 -188 66 -604 -58 -227 -199 33 -738 730 200 -343 127 865 640
5326 640 750 439 -214 -324 1115 -1252 509 37 -173 26 -901 68 -734 1219 -625 -316 -463 -568
5344 -568 4 -105 648 -406 -251 1218 -945 1198 -332 -483 -962 -308 1201 -544 196 133 -60 -533
5362 -533 -177 -422 -1185 958 -118 -107 -492 67 -524 260 -315 -257 816 109 -920 304 607 696 414
5381 414 -765 155 -624 1132 -105 1219 -798 375 -816 -483 412 -258 -166 1159 -73 -102 -157 832
5399 832 614 424 -82 -492 867 -715 624 -212 759 112 94 719 -441 1349 285 -78 829 -340
5417 -340 515 -1044 -307 -224 -675 -263 -1178 -216 -34 165 -426 75 1937 367 -330 -287 476 -282 552 -381
5437c81L11k4R3k00q55K278j442M72J18lk19p31N73M63j227P52r93J390r32L44
5457b13j17K42J72k73N96j538p45L256j350Q16r65o29J29J0J014m05N08l41r1
5476G6J17j572J304J227j072l38Q1j20K34J004k50P7j210j75J335j127J03J46
5494a60R98q70N73r45k28Q55q81l47J880j622R90j335J051j61j048J465j122K318
5512A411j251P47Q5j732Q30o50Q97j367J459p72J105j743k79K234k126J448l63
5529f7k80p9n36J064k8M2m38q70Q17o17J567l34N81o60J134j867L42P84r53L27
5549g1j608J640r66J312j189O24J435k10n67K09r36Q00r18J039j171P61K47r51
5567e20J134j040j87J034o05P00o68N80K83r10M10j28l88m4R25n04q3K75l07j71
$$ plain form
5437 -381 -70 -94 -1 -201 -1056 1222 -220 252 370 367 148 -583 -10 453 -774 -22 -1015 375 -557 -213
5457 -213 -330 -88 84 -189 407 -1131 -1876 1380 30 846 -119 -748 -619 -609 405 0 508 167 76
5476 76 193 -1379 -75 1152 80 -258 -177 -297 -63 941 691 768 -442 -617 718 -409 -306 -160
5494 -160 838 -32 541 -404 -632 223 -658 -1005 875 -747 243 -1092 -41 -202 -1250 215 -907 1411
5512 1411 160 907 992 -740 90 -560 337 -1030 429 -343 762 -981 -1260 974 -1152 296 -67
5529 -67 -347 -426 -962 102 74 116 -322 -1192 -375 -992 575 241 822 162 1296 -571 -229 555 -398 -71
5549 -71 -1679 -39 -1005 307 -882 -258 1177 967 400 609 -327 473 -445 594 -577 184 431 -520
5567 -520 614 -426 -613 421 -184 516 -152 428 711 -199 211 83 -305 -349 576 72 -11 264 -43 -214
5587b14m99J184m95N15n63r25J276K06o0j019p56J562j71J198j991R47nm38N01
5606B53o25R31n79n50J490j173K96p99J070L55O46j280j086M16Q61K9j95n1L0
5625C9j47P1N44N11j755J042j010o76Q53N34j34K64p75R90q87L20J376p87J075
5644A448q26P2q99J211K16m45j619J173q62M82j38P03J82k9N7m70l88M79r3k88
5664c4q06p25K017l01r08L87O22j113L59J257j909O63M96R3l64J042m73n96k79
5683e72k57J64K75k25N59l06l21R24o98L71m1N7l10Q68j255J632n73j130J116
5702B78n48O04n57k37J067on77l21j96L57O08m9j426K151j825P54O90j466J251
5721E52p27r02J638l19j064J496m29q3J046m93n07j221J104J671j114m96p2k37
$$ plain form
5587 -214 -713 471 -24 491 -72 -997 279 485 425 -594 -1350 212 41 1239 -752 195 190 -248 253
5606 253 -372 559 -20 -570 920 -253 43 -756 314 669 1315 35 -1051 -635 226 255 60 9 39
5625 39 -108 -37 507 1018 -737 305 -705 -1381 -528 6 -128 136 -639 351 -536 -216 1160 373 1448
5644 1448 622 694 -205 1006 1222 777 -842 331 -531 -49 -187 516 698 669 726 256 -132 347 254 -34
5664 -34 -840 -1565 452 151 -757 -370 252 -861 -502 755 -1154 -491 5 98 -266 776 303 -293 -572
5683 -572 -829 -665 -390 -615 -56 -362 -683 241 -457 -86 -127 -70 -380 488 -767 865 292 -838 278
5702 278 -270 334 -223 -460 607 601 24 -297 -493 -136 472 423 -1003 1148 -677 77 767 -699 552
5721 552 -175 -1077 561 242 -822 674 245 162 1208 715 208 -1013 91 1762 648 152 80 -157
5739a57O84m85K11j031M26L46l84N76n46P17J56O82j403M96o87q97J117k83P08
5758B46j388J476n56j80M57m3M94j096M2K24J85J403j719OJ730p08M4j582J324
5777C59k39l56J01o21J020j125M96J309M93j624O85l35o38K02m21Q68j51J87O78
5796H88r68J356j496j01J446k861J327o16N16R03o63R98j657J30J600n06N44j257
5814d17K12J76R6Mp4l78Q81m30o79J891k460J941j742N76Q45q75J8N18n20Q94
5834D77q14j52R40P90k262J592J36j419J248l45L08j26M61j401O93l6o64N06l42
5853d10L47M47L10o26l96%Q37j032P20k454J599j097K055M06k32j293J033n65
5871c51j45k87R13j47Q21k92K54k220O13J462j192Q91j640J827m46n38M49o39
$$ plain form
5739 -157 527 42 253 -778 -352 -6 -390 186 -360 357 513 1195 -208 288 -399 -1296 -179 -462 246
5758 246 -1142 334 -222 -402 55 12 506 -590 -548 -324 -139 1264 -455 -449 1281 573 617 -965 359
5777 359 120 -236 -135 -756 264 -861 -365 944 1437 -187 498 163 -475 -273 -694 174 23 210 888
5796 888 -80 1276 -220 -321 1125 -1736 -409 -1025 -509 394 -269 729 -928 -798 802 296 840 -417
5814 -417 -205 -29 67 71 -3 -381 500 70 -609 1282 -1178 763 -979 -403 442 -433 -415 103 -417 477
5834 477 -337 -489 451 1241 -1021 571 707 -712 536 191 499 373 834 -567 126 90 -574 -68 -410
5853 -410 -63 384 694 68 -328 -328 509 -523 197 -2257 -658 -1755 300 706 474 -819 214 -351
5871 -351 -496 -783 130 -17 804 512 766 -1454 -841 621 -571 320 -1320 507 61 -477 -28 -667
5889f67j37j24J434j325N4Q70j000J00N60Q73n24P7j92k10P37j187J015J49r14
5908d11M81l60J132j205L6O81J04j31l36K46m22m3P6K66J272k690J898p39j618
5927a763J298O1J185j179P64o90p89J398j027J912r48Pj114J221j169J030m96
5944b99o1j16J496j392P4J0L55l42K4N48P4o46O8L16M67k98k35k10L28m42K0L28
5966F7p33M78P24J92k119K058p7L74J11j655O31O99r0j626j01O96r32L418j813
5985C02o75P9j98M03m25J811j650J404l66m08J53j361K317k089m18J516r67L20
6003b52j292J943n84Q70o58k34M18o71M28p54J002r33J135K33o20M54l20o01L63
6022g3j05J233j884M56O10O27q00p70J128j193Q44p9P1M83p8Q08j687Q00j646
$$ plain form
5889 -667 -804 -928 506 -819 -765 105 -895 -795 -235 638 114 191 -1 -211 526 -661 354 503 -411
5908 -411 70 -290 842 -363 -327 354 458 327 -9 237 -185 -228 -152 114 1386 -1304 594 -145 -1763
5927 -1763 -465 -404 781 -398 366 -324 -1113 285 -742 1170 222 229 -885 336 -833 197 -299
5944 -299 -360 -476 1020 -372 -298 -288 67 -275 -251 297 371 -275 -207 109 576 278 43 -167 161 -281 -261 67
5966 67 -666 -188 536 728 -1391 667 590 964 1075 -580 51 750 660 -966 -1067 -371 -1303 2115 302
5985 302 -373 -294 -492 -89 -514 1297 -353 1051 685 277 430 -931 1386 -703 -1121 395 -572 -252
6003 -252 -1544 399 -185 685 27 -207 211 -460 -32 -786 216 -717 418 651 31 485 165 -436 -73
6022 -73 -178 1055 -829 -373 237 864 64 -706 422 -771 73 -6 65 548 470 1278 -409 391 -1255
6041a255R11O11m26Q80j323K2R91o76Q1J91M8m52J646j115J51o54M44j41J119
6060A053j594P04l2pr48J535j05j097Q16K74K80j902O53n77P51Q93L70J68n31
6079G04R7p72L52K14k19O09p62P86j454O63r92l24J923j518J134o37N39M66j390
6098e81J153m15N09m34K59j022j73J777r73p9j42K56j2o20K052j840R04r87R06
6117E38m51r29J869j496J55M31P2o51o70Q39j92K86L21j84J512j735J237j256
6135c04N1O71o11Q69j101P82q80J000q16P20J26o23N16r3P0k98l27LQ67j279Q83
6156B26J42j265K77J439j559J765j751K35J120j846J463N81Q8K11q19l75L05L56
6174E93o39q37K40J91Q99l65k08J04O29J7k02o13M04R09n82o30J471k322J628
$$ plain form
6041 -1255 -344 267 -159 721 -602 -580 411 -265 -184 7 55 -397 1249 134 285 -369 75 -66 1053
6060 1053 -541 163 131 124 -824 711 606 -491 325 599 879 -1023 -370 -947 -196 697 1067 1235 704
6079 704 801 29 381 595 376 985 223 1009 -445 218 -774 -1098 825 -693 441 -196 343 809 -581
6098 -581 572 157 666 232 491 -531 -704 1073 100 21 -121 135 123 -497 1555 -285 619 -368 538
6117 538 87 -842 1027 -469 -314 117 189 -462 -1132 -293 -485 -199 122 -62 1450 -285 952 -304
6135 -304 -253 418 -193 676 -425 357 -523 477 -339 381 507 -116 400 307 377 79 -248 -245 622 -657 226
6156 226 368 -897 -620 819 -740 1025 -726 -491 629 -1217 246 827 915 1126 307 -68 237 593
6174 593 -46 -883 -643 -452 447 82 -126 -22 607 624 422 -191 213 1122 540 -90 1381 -941 687
6193F87k606J665J349q93J468j067J53m03Q5q82O92p01P90p08K49L66l52L89n52
6212b71L37Q31l34K18j005k09J188j103N84M43q19m56J192J97m1r18qP44j15n23
6232f8R0q33L11K40j31N63K61j226M4M52Q77m40j84k69l41J853j900K9R5J490
6252I13m07l47R2k64K87o17P92j709K383j289K87L36k34J720k728O68j42K1L48
6271A10j49J21l87M04Q48j077l56J319k94n53J94MM52j34m67j01N63q59J94m61
6291f29K243k517O78o89K590j159j366J845j528Q25j322N79m46Q53L90j045J110
6308D12r36R65j793J103J080j413J254n89k79Q56l21J081k912J500p98Q70j03
6325b3o3l15L21O70m74J46L53m15l07l15Q26n75m8P9r01J602p61K30n12k20O84
$$ plain form
6193 687 -1919 -254 1095 202 1670 603 756 353 438 -444 248 -453 337 -371 -122 244 -108 281 -271
6212 -271 66 897 563 781 -224 -433 755 -348 236 679 -140 -596 596 793 752 -166 -174 570 455 -68
6232 -68 22 -811 -500 -260 -391 172 433 -793 -749 -297 580 140 -44 -313 -654 1199 -701 -672 -577 913
6252 913 506 159 251 -13 274 -343 449 -1260 1123 -166 121 457 223 1943 -785 -117 -259 -238 110
6271 110 -39 82 -305 99 947 -130 -486 833 539 -14 180 184 636 502 35 -66 497 -362 -168 -629
6291 -629 1614 -903 -225 -914 1676 517 -849 996 -532 293 -1029 -450 -896 -43 347 -698 412
6308 412 -524 441 -1352 -249 831 -582 672 83 -196 660 339 1420 -1492 8 -790 80 -23
6325 -23 -86 -401 -80 590 116 262 615 200 -107 -422 404 -171 -219 -140 -1041 561 -200 30 -482 -702 -18
6346a8J96o5j384J714o47O5M56l82K74l76N86R66k092Q54r64K017j635O76N88
6365H29j105Q7n79N52j366R6K333j498J211R6n54m15M08O41j188J443j563J261
6383F89j44l48M01l18M92r47l74N56p15N36p15K310p73J18j715l82J237R0l40
6402c42m09L16J44K51R42r71O24o0p82O53j043J285n98R04j848O58K81l99J50
6421b44l82Q23q39N04J163q90J80n96J402k428K960j307oM40n66r46J299j009
6439d42k89j56J70J550q28m0J79j49q7m4j46P80j058Q05J07l63J168q5j128m48
6459e04K87N44j282J393j391O61Q27j190J152L04o13K08j593K015j302J163p57
6476g8O60j136L44J808j503M59q91J520o34m55R22j311O66j032K29K76m36J453
$$ plain form
6346 -18 178 113 -1271 443 -204 -139 317 -65 209 -167 419 1385 -707 147 -817 1200 -435 241 829
6365 829 -276 -189 -768 -216 -1582 -1486 847 -651 560 656 102 -313 95 736 -452 991 -572 689
6383 689 545 197 598 280 772 -175 -549 7 -708 -172 -887 1423 650 768 -947 -1329 -92 -2 -342
6402 -342 -751 -435 -291 -40 902 -69 555 495 -287 366 -677 608 10 914 -934 -276 5 -394 -244
6421 -244 -626 197 -642 -138 1025 135 315 -281 1121 -1307 1653 346 340 780 214 -732 567 -442
6439 -442 -731 -887 -717 833 5 -35 144 -5 -92 -136 -282 498 -560 245 352 -11 1157 1072 -56 -504
6459 -504 -217 327 -955 438 -953 -292 535 -655 497 801 188 396 -1197 818 -484 679 -78
6476 -78 582 -554 -210 1598 95 554 -337 1183 549 94 1016 -295 371 -661 -432 -156 -592 861
6494H61j559J744j319N90l05L80k36j91L2n88K42k52R14M61r43N54m97M5q06R59
6514H6J121j871J713j859Q99J350j469l49m64J199j08M98j477k70K435j610m7
6531b23j127K214n42p44J029j423p64K092k15J56j295Q86k058J925L43J78p05
6548b73M62K91m41K75j13m07J072j526J717m43o21O02p86L08j267J843k095J315
6566h7J63q6K72o03J352j279p6J43j96Q23j607J480N5L64j349n59K266j75K12
6585A113j342m82R50j99L69n82J588r71m66K32m44N25p15J537j468O44N9j282
6603i34J838j514J592q56m36J022j148J643j859O3K43J220q5q84N41j692J784
6620E38k14N51k4j448J563j588J649L6j452N94q27N76L83j03N76l21q37L63j02
$$ plain form
6494 861 -698 1046 -273 317 12 392 156 -35 -3 -591 -349 -601 313 774 -169 385 -112 -67 -873 86
6514 86 1207 -664 1049 -810 89 1439 -30 -379 -843 356 248 746 -731 -1001 1434 -176 -223
6531 -223 -1350 864 322 -422 607 -816 -1580 512 297 453 -842 44 -2014 -89 254 432 -273
6548 -273 189 480 39 314 201 -206 866 -660 1057 614 -7 595 -191 117 -1150 693 -1402 -87
6566 -87 76 -10 262 -341 1011 -268 -344 -201 -397 426 -1181 299 354 718 -631 -1190 1076 901 1113
6585 1113 -229 -711 239 40 409 -173 1415 444 -22 210 -234 291 -424 1113 -355 289 348 -934
6603 -934 904 -610 982 126 -310 712 -436 1207 -652 -589 -346 874 789 -95 446 -1246 538
6620 538 324 875 851 -597 966 -622 1027 1063 -389 205 -622 -46 337 234 810 489 -348 15 -87
6639h7j29M27r07P76o05K63j03J41M17L52J01J78m7M5j618N04J034j744P78J174
6659I50j608J076r44M68p86J480j006N75M0o14j4n18J784k2k5p06J5P50j518L26
6679b97k64J21J259j322J876j287r56l97Q50P02j270J018o42J396j308M40p5r54
6697a110J213j671J629l84Q20m13m03J014j790J825m73n00L21m62o43J68m9J147
6715B39J41j475J565j155O42P82p45j24o11J74J277k54n6M42k021J153j65J626
6733A435k442K6J084l00J65p32N57j58L36L10j862J967J90p19P21j09L35j446
6751f42N31r93J590k16j027M58L09P00r57k07Q3N61m66p62R72n36P34M5r10R40
6771B07q9k29n85L5M04j83J036j283O69m18M9J005J30j291O28J95l8m82P1j125
$$ plain form
6639 -87 -216 211 -696 80 -525 -262 -365 -224 193 545 646 824 777 822 -796 -292 742 -1002 -224 950
6659 950 -658 418 -526 -58 -844 636 -370 205 245 -369 -383 -901 883 861 836 130 145 895 -623 -297
6679 -297 -561 -440 819 -503 1373 86 -870 -1267 -417 285 -985 33 -609 787 -521 -81 -156 -1110
6697 -1110 103 -1568 61 -323 497 84 -319 695 -1095 730 257 -243 78 -384 -1027 -859 -908 239
6715 239 380 -1095 470 -685 -43 739 -6 -130 -741 -567 710 456 400 842 -1179 -26 -191 1435
6733 1435 -1007 -981 103 -197 -32 -764 -207 -365 -29 281 -1581 386 576 -143 578 469 804 -642
6751 -642 -111 -1104 486 270 -757 -299 10 710 -247 -454 -371 190 -276 -1038 -66 -602 132 177 -733 207
6771 207 118 -111 -696 -661 -257 -440 596 -687 -18 -436 -387 618 748 -543 85 280 242 -240 -169 -1294
6791a294K018o5n39j03p0L33j898K338j108l55N00J35l6j76N63KP4j921J670l8
6811C0Q4n62o15P75K43M32J013o69o09r67J551j478O89L94n36j93J61m83R21J111
6831A292l07j253J307p23o25K16j67N9l13k35N02j94R0J087n78j0r73J191j132
6850g66P62K63k74m55Q18J15n61J187k019R81k44m68N08j081K514j411J47J87
6868B03r89J799l86p1JL52j55j852K002q68N33l72L32r82l36J236o56O38k95k29
6888i5l5P07O47k389K252j890J043n33n0K34n88K271j890J79J1j39R72m81L88
6907F14j916J539j647K015k248J171J060k598K151j75l90M11k39N59j108P05l53
6924d49J66j27k75J341n33o23J588j031m73J088n65j97K30J3l78N70L1o76K28
$$ plain form
6791 -1294 724 659 120 17 -53 280 -1618 720 -388 -743 -243 -108 -144 -320 243 245 319 -1602 68 30
6811 30 114 -448 -1063 -288 -45 387 1400 731 122 -845 706 -772 -83 311 -225 -418 -257 -740 181 1292
6831 1292 985 -268 1039 316 -309 -93 -260 -201 -514 -749 -247 -441 -351 736 158 148 -825 366 -766
6850 -766 -4 259 -15 -470 348 463 -98 1089 -930 51 -193 -661 -153 -1234 1280 -131 16 203
6868 203 -786 1013 627 556 557 909 754 -1098 904 36 569 197 529 -453 -789 447 -209 429 134 -95
6888 -95 -130 577 1224 -1165 1087 -803 240 -293 -343 -109 -697 1574 -316 -137 -126 -265 707 226 614
6907 614 -1302 237 -1410 605 -1643 -472 588 -2010 141 -34 -424 -13 -252 307 -801 -96 -449
6924 -449 -283 -410 -685 656 123 -500 1088 57 -416 672 107 -90 140 153 -225 345 376 -300 -72
6943g2L03k26M65m44p28R81j297j16O71N58K89n90K33j06J41J6K5J54L39R1l90
6964B97l48O53j157Q97r85L1J310j866J601m85J150j563J625o92p10K23j091J765
6982F55p58M63n2j976K679n80m71k81n48J168j342K283j729J248q96o78J719m47
7000D57R25l001J961N71j943Q2M89n62Q50l56R02j98q44P12J129j540M92M64k42
7019C48m5o43R30k15m69o4P86j24r84J506j078m62J324p17o09m5Q18q65O81K20
7039B93N85k42j334n79P35l23O02m12R43j219J069k98R17j97q04O30j731K030
7057F65p22K16M17m86L68r34J92L86j952K116l73j96M95q38O14N04l64j119N26
7076d85K18N81P1j408N88j238K024q25Q95p84L35m24j099J254M68o3Q11r87J89
$$ plain form
6943 -72 231 5 470 26 -702 279 -1018 -1134 -463 95 384 -206 27 -79 62 78 103 257 596 687 297
6964 297 -51 602 -555 342 -643 -612 698 -1168 433 -52 1098 -465 1160 468 -242 -19 -1110 655
6982 655 -103 360 308 -1668 1011 431 -40 -321 -869 299 -1043 1240 -489 759 -137 -815 904 457
7000 457 1382 -1619 342 913 -1030 -948 -459 -1021 -171 -527 375 177 -667 45 1174 -366 126 590 348
7019 348 303 -340 590 375 -94 -158 628 504 -480 1026 -52 -514 810 93 -516 -561 257 -608 73 293
7039 293 878 636 -698 -1277 -542 -865 -263 -675 268 -951 118 -180 737 540 -264 366 -1365 665
7057 665 -57 159 576 90 458 -476 -284 102 -1850 266 -107 -303 192 -646 -32 472 108 -1011 -485
7076 -485 -267 314 385 -1023 -435 -1673 351 -474 421 -363 -28 -452 -1551 -297 171 108 919 -68 121
7095A21m06p85J421Q17p32M37k39j499Q54n7Q39o69j20L17n89L04P1o80J29j19
7115e85K12O09J57p16p0l91J075n73L61L76l27R3J131r25K67n72r26J158K52M0
7135F46q52K031o5j096o40k70Q49j129M41n80O44r16P49lj412K886j006l25J346
7154A298j749J461o71q09J192n9N21j554O33p78J027M30k003R05l67J520k104
7171a107J741m0l74Q88q79M97j667Q68m9l02J89m67J643o28R93k467j9K256j381
7190c05L27q24J262j124N34M20n76P78n54N6J51l76J459j765q6m13J244l43o72
7209h07J926j521N72M83n60K76k09o21m26O36J684r15m59j58o82j97J652l07q46
7228d79O04o31k9N86j068J530j616k0m0J119l51K90L16o0J04o47R32J62k24L79
$$ plain form
7095 121 -285 -1070 351 1168 436 873 634 -865 -11 -68 771 102 -18 299 -290 14 85 -595 -466 -585
7115 -585 -373 236 393 -323 -393 -784 291 -282 79 455 128 221 1352 427 694 122 -804 354 606 646
7135 646 -206 1825 1760 664 24 -246 603 -526 -85 -665 -21 -937 -188 -191 -1603 1283 277 -48 1298
7154 1298 -451 1010 339 -470 722 663 1184 -370 263 -515 512 942 -1061 -156 -523 997 -1107
7171 -1107 634 594 220 1108 229 726 -941 -73 -122 -424 -235 -702 941 313 1306 -1161 -1180 1076 -305
7190 -305 22 -802 460 -664 -130 290 -286 492 -62 -6 145 -231 1228 -537 -623 -1036 208 -135 -807
7209 -807 1119 -402 170 653 93 369 160 -461 -887 -251 1433 518 59 -99 -781 -978 674 367 -479
7228 -479 125 -506 -535 51 -1017 513 -1103 -1123 -1163 -44 -395 -105 211 151 255 -392 540 702 478 857
7248H57k306K715k215Q05J101j045P20j297M74j24O84l98j194J668j294J277n25
7265i7Q12k20o01J014j449J238l09l47k93J25o71o40K190j150J17J48l41J112
7283F38j810K954j391K27o80J20O40o28KR76j008o38L16j07K39k50J59j45O63
7302B77j239R76M69j649J655l58R86j450q32j54J603j004K06K11q50J546o45Q80
7320F28M63j404R27j07j339J729r64N25j215J483j609r6J179j180R08M39O20j586
7338e99N71N08p58K25r74J384r24N27P45o47L0J94Kq4L90k79n46m08k03J127q21
7359e40N37n77P38k78m83J426j658K058k30j564J485j424P53j925J107m00O19
7376c56N69j012R97l17O14o54p57O14l43M31J094j400O62m79R49j351R93m2k68
$$ plain form
7248 857 -1449 1266 -949 -144 957 -88 632 -665 -191 -315 369 -29 -1223 445 -849 428 -97
7265 -97 715 495 -106 908 -541 697 388 41 -252 -127 -798 -1438 752 -398 -281 -133 -474 638
7283 638 -1172 1782 391 618 -62 58 698 70 72 1048 40 -598 -282 -389 -150 -400 -241 -386 277
7302 277 -962 14 483 -1166 489 131 1117 -333 -1165 -1319 284 -720 -514 -303 -1153 393 -252 628
7320 628 1091 -313 614 507 -832 897 -67 458 -757 726 -883 -979 200 -980 -72 367 987 -599
7338 -599 -28 480 -278 -53 -1027 357 -567 -40 705 58 88 282 284 200 590 311 -235 -643 -846 281 -540
7359 -540 -3 -580 158 -120 -603 823 -835 1223 993 -571 914 -510 243 -1682 -575 -975 -356
7376 -356 213 -799 198 -119 495 -159 -916 -302 -645 -214 880 -520 142 -337 612 -739 254 212 -56
7395e6K40l44J105q18l44M43J026J58o50j321Q58k16J054j711K12P10K58j082
7413d78r4Q93l86k59K59P65J54j647J656r24J032k734K019n26J324j531M63j81
7431a95l00Q92o25Q8o4q57J542m87N06M18j360J80J174N9j550N70L42j462J340
7450B11k40o01l78J409j212Q43R34j667J907r55L57m17r25J308k026K422o29p31
7468c90J83p95J797q90j67r19J932p02o19P39r2L99l93M01m4j48J64n10P81J65
7488H92j482J433j443P7J92J121j97o03J1n7N29j051O12M52j664Q09K82L86k68
7507C1O25L8j97l25L12m41q53P79o8K48J65L56j48j45k90N38j167J075n01j95
7527a63N55J45N80j115m39o31Q90N96q38J848k690J552J14j269O65M40J180k271
$$ plain form
7395 -56 184 -160 945 127 -217 226 1252 1410 760 -561 297 81 1135 -576 -364 346 604 -478
7413 -478 -572 321 -65 -324 -65 700 854 -793 863 -61 971 -1763 256 -270 1054 -477 -14 -195
7431 -195 -495 397 -228 -140 -204 -1061 481 -6 500 918 -442 -262 912 971 -579 -9 333 -1129 211
7450 211 -29 -630 -1008 401 -811 32 966 -701 1206 251 608 191 -734 574 -1452 970 341 -390
7468 -390 -207 -1002 795 -95 -262 -1181 751 49 -570 169 77 476 83 484 440 292 456 -54 727 892
7488 892 -590 843 -600 -523 -331 790 593 -10 1 -56 473 -578 34 486 -1178 -369 -87 299 31
7507 31 656 694 497 172 484 43 -810 -31 -99 149 314 670 522 377 87 625 -542 533 32 -163
7527 -163 392 537 1117 2 -437 -1068 -178 418 -420 1428 -1262 290 404 -865 -200 240 1420 -851
7545h51J849o06j274N16j31J282j785J868m72R2J99j142N27p26J407p35O61j346
7563f67K058j450j35J31M02j88n30P61n60L59j9m42k71M60n57Q16J21l29m19Q41
7583C82o23J87L21q01J145j14p64N76j234J626n46O72p34J76p30p47K687j475
7601Dp70J62L37k6O3J893o83p74j27m16R78m41O21j693J42J835k268P10l38P70
7621b1N57j154J606k547L635k550R11L81j566J251j440J067q66J37j38P00J33
7638I6j19J521k522J499r15J68J443j997R65l1N36m11m78k56J81J105j700J317
7656D02p31m67J250l14L99j645J520n63j49Q84j276P28K99K45j543O04J024j024
7674c57R96q07N06j126P86n76L58O00j003N9P91j496J034j347J325J08K64n83
$$ plain form
7545 -851 998 392 -882 -366 -497 785 -1000 868 396 488 687 -455 72 -654 753 18 679 -667
7563 -667 1391 -59 -194 -63 339 151 -379 382 -178 181 162 -280 -551 -91 -648 168 289 -40 -459 382
7583 382 -241 -54 267 -534 611 497 -267 309 -925 701 155 827 93 269 -461 -1208 1479 4
7601 4 -766 -604 -267 -293 -230 1663 980 206 79 -337 641 200 821 -872 -730 1105 -1163 -453 -791 -21
7621 -21 536 -618 988 -1559 2076 -474 437 818 -748 503 -937 130 -736 -599 -737 -37 96
7638 96 -23 1498 -1024 475 -440 -272 1171 -826 139 108 644 233 -245 -501 -320 785 -915 402
7656 402 -329 -796 454 140 539 -1106 414 -149 -298 586 -690 38 337 582 -961 -357 667 -357
7674 -357 639 -168 338 -788 -2 -578 -220 380 -623 -564 227 -1269 -235 -1582 -257 -149 115 -468
7692d68K82Q29q28J269j467L18q7M19K96j225J116o32P73l41p53P75n43J074L14
7711A121q15L51n57j65N80q15Q79p22N62k99K03l62j83O34o54J725k073J316j605
7730h79l60O85j00J093o56l02N55P36q56J72k83k11J545j794J221q89K5Q73r15
7749c40j03J72l80J090j189J165r93L85l4j14N22j407J896q96K98J27l46J224
7767A077n23p81j08J86L93j231J345j971J082M97M14l04Q38o41K86l71n28j5M60
7786A05r57J273M13L26k94j176J086m00M99j359J9K01j92j63M31L30j079J736
7804G99p1n3k87o43K80m25P67p30l46J494j233J570j274Q74n39L96k33j141J166
7823C71j257o28J326M32r68L69P63J30J40o94m76J155p83N45M87P6j493N16K46
$$ plain form
7692 -468 -186 643 -185 1084 -383 -65 -152 267 563 -662 454 -178 595 254 -499 276 -267 807 1121
7711 1121 306 657 100 -65 515 -300 579 -143 419 120 323 -39 -222 412 -242 1483 -590 726 -879
7730 -879 -1239 -554 -654 439 -217 -519 36 772 -84 88 -195 -406 1139 -655 566 -323 -298 575 -340
7749 -340 -443 -271 -651 439 -750 415 -578 -193 -227 -341 181 -1226 670 -226 72 199 -147 1077
7767 1077 554 -227 -335 -149 244 -987 358 -1613 -531 -34 380 76 914 273 559 188 -340 -355 105
7786 105 -852 421 834 1160 866 -310 776 376 875 -484 -465 -264 -456 -619 -188 142 -937 799
7804 799 728 675 388 -255 25 -400 367 -363 -709 785 -448 1122 -152 722 183 579 346 -795 371
7823 371 -886 -1514 -188 244 -724 -355 408 538 678 -16 -492 663 -120 425 912 988 -505 11 257
7842B57n68J148n25j507K943j435P52j085p99J384r35J474j692J192M75j000k14
7859a35o35O50o78M5J171L07j096P78K95n89k02j80J04O06k59j099N82R04j891
7878a322J443R74j395L94o49R21n61j16P04j45M13n28o29J222j268M99M03o04
7896b44l57K53P13n96J022k919K180K28o1J150o97L62j254K37m1j060J737j671
7914a018N95m29O26j32L48J66j152J037R4L31k93k67k2q2O73r77J6R32n99J616
7934A463j256Q44j965J696p05Q90M86j479K3k60K18r66Q75l1j162J512j118R48
7952A3q4N53o23j55O65r56J699j053o49L34m2J618j382k90m26J546l21j851K063
7971F59r98P2L97n02Q80j255Q79k37P76j077m6J457j178J30j20Q20m75q6l20L12
$$ plain form
7842 257 -311 837 312 -1195 1748 313 1065 -20 -819 565 -370 1104 -588 604 1079 79 -135
7859 -135 -770 -120 -798 -753 418 725 -371 407 702 113 -89 -269 -165 441 182 -917 -335 569 -1322
7878 -1322 121 1095 -300 94 -555 366 -195 -311 393 248 661 133 -496 726 -542 -43 360 -244
7896 -244 -601 -348 365 -231 791 -2128 52 280 219 1369 672 1034 -220 17 -24 -1084 653 -1018
7914 -1018 -423 -852 -226 -358 -10 156 -996 41 135 466 173 -94 -116 -198 475 -502 -486 446 -153 1463
7934 1463 207 1051 -914 782 77 967 1453 -26 -3 -263 -45 -1011 -136 -167 -1329 183 -935 13
7952 13 -71 482 -141 -296 369 -587 1112 59 -590 -256 -298 1320 -62 -352 -778 768 447 -1404 659
7971 659 -339 -267 130 -372 508 -747 132 -105 671 -406 -452 1005 -173 -43 -163 657 182 96 -224 88
7991H8m61n58p0J381j55j39m29L85q4O61M15q46n45N86l57O7j005J191r32J043
8011B36K06n37J87M63r71p20J477p14Q72M26k319J855p02M56j03n53M09N60m03
8030A25r34J471j108P36k47p86J565k630J891j164J380Q36j453N99r75M78k07
8047d23M55o28nK131k297J715n79N60j314L14Q0J58r65O94q19J457j158N94M00
8066C70q5Q85o01J07r76N86o24l28O30n23M54N55j42r68N01N0J30j221l3J807
8086E74L23j299k41M09k62J297n82R01k238Q94n45J425p27K40m59j42J540j965
8104h57M42K82M81K00r86P25q41J278k4n68P27j793O02L33J377j303J001m71q07
8123b02J207k083J833o43p96K03J82Q25q28Q67K6k63J183k022L03p28J027j24
$$ plain form
7991 88 -373 -931 -1001 380 225 86 -343 42 -42 619 1034 188 -357 229 -128 -61 -1066 125 -807 236
8011 236 442 -95 92 555 -416 -1136 341 -373 499 925 -1394 461 -241 215 112 -441 -32 528 125
8030 125 -809 662 -446 290 43 -743 822 -1808 83 -1081 299 1135 -318 281 -694 -216 -423
8047 -423 32 -596 -601 1530 -767 948 369 929 -385 -71 9 167 -798 -104 -923 534 -624 -30 370
8066 370 285 1170 569 676 -300 286 -338 -666 -36 -559 -105 450 308 -660 -159 -109 21 -1200 -1233 574
8086 574 897 -402 -643 -234 -496 801 219 1120 -1118 -224 -769 656 -71 169 -290 -432 1108 -857
8104 -857 -415 -133 348 548 -438 287 -554 724 700 132 859 -934 -332 1 1378 75 1076 605 -202
8123 -202 1005 -1078 755 112 -684 -481 -299 526 -302 565 591 328 1511 -511 -208 -936 91 -33
8141c3J039p44j50J658k773J914O3q11j2m10M55M53O86j970l55J412j544J194
8159G2j619J990m1j334O54j00N06N6k01Q9j006N90n89R03n14K15j75J14L72k63
8179b81K03j89K46J123j426J378o53P96j111j280J845N7j441J532J75l68p21p67
8197h82N02J08M85m3M81q40R83j462O11J98k3L65p59O46j082J717j372N69j055
8216h53L23J03r03K164j600Q62R76j440Q81j689J828j247L26K41m84J473j637
8233f76N12j532K170K04n31l33J11M59m43K64O70o85M20N54j346K3N69n71m83
8252f44M11J7n40J014m49O81j625J156P72j244O01N43j36m68j4O2k71J83m21R55
8272E83n84p99L40J008n70K86J66r35K061k270L80J482j074K14J0q36M18M79k24
$$ plain form
8141 -33 1006 262 112 1770 -1003 911 974 163 151 -259 196 649 1335 -635 -990 422 -1122 72
8159 72 -1547 443 402 -932 -278 -378 128 184 -17 72 -934 -344 -933 -30 -544 -329 -504 -390 -18 -281
8179 -281 -78 -267 -21 1102 -324 1054 401 1197 86 -1194 651 708 -733 799 974 606 -115 -882
8197 -882 -380 -272 213 170 651 -189 794 -668 -57 141 118 483 -276 370 -712 1005 -367 202 -853
8216 -853 -530 -427 -1330 834 -766 96 1072 -368 513 -1176 652 -595 -269 -28 -512 961 -676
8233 -676 -164 -1696 474 678 147 -186 -75 384 -59 205 875 190 610 1164 -182 -159 410 -161 -644
8252 -644 -233 -216 -756 258 -191 490 -1135 21 793 -451 150 693 557 89 75 137 -134 49 -372 583
8272 583 -1 -800 -460 548 -22 264 430 -505 1556 -714 -334 1148 74 288 298 -538 -120 359 135
8291A35p36L64j92Mq95J437J11l11J8m98P7J158o17l37o0M02j31n03J685k532
8311a421K221j039Mm3P98N5j40R82k132J098o79L20R57j784J264o75P87j686N80
8330e33Q61m40J373j762Q13m60J181p11r20R41j44k48p89O79J007j988K174k519
8348a485K175j581J354k50j026J535q14R63o23j72M62k17M14n08j296J891l12
8365E10o91o92R33j82j55l17k70P28L31M99q96N81o58k57K36N31L47j434j00J482
8385E26j177L06L74o96P42M57n24J87l9q93J227j05k24L42p87k22J229R26m20
8404A229r76J024k522J614o36J066p33j034K149j670O89l68L24j013M90J17O7
8421a83R43j331L31k52j180R49O85O64L72n89j79l49L20j86J53n24J433j406j513
$$ plain form
8291 135 -601 -237 -429 -425 -1320 117 228 -83 -65 -563 -486 672 55 -282 -342 60 -71 -574 1111 -1421
8311 -1421 800 -239 -235 -278 520 575 435 1417 -715 383 -296 24 981 -803 461 -214 573 -1113 -533
8330 -533 328 -112 1261 -501 312 -148 1033 322 -598 343 199 -49 -838 -159 848 -1140 1034 -1485
8348 -1485 690 -891 463 213 -813 722 -92 871 248 76 538 321 735 227 -1069 822 510
8365 510 -181 -873 60 -122 -277 -594 -864 -136 195 694 -202 379 -279 -536 -300 231 578 -856 -956 526
8385 526 -651 -345 29 -667 75 532 8 195 156 -737 490 385 161 503 -284 -506 723 1649 1229
8404 1229 253 1277 -1245 369 -267 799 66 -968 1181 -489 200 -168 156 -857 -367 -250 -183
8421 -183 760 -571 -240 -492 -1672 -723 -38 626 998 409 230 -119 201 15 168 -356 1077 -329 -1842
8440a842K222p87O83q78M42n8m00J069p33p66J121L08N5M38j293m03J87J159m94
8459C0O30j421J087n03P6N74n68M03k31K7O76n14L0N54q71o53K08J402r94K95
8479B37j287J905j145L26K73p23L98M11m41k0J3J296j450J01O43n34q2l74R10
8498D57p67J211j028R22k090J714p5r63J290p28Q61j211K90o0N99p42QQ8p08n7
8518i89Q57J8P75l94j420J081M92k44J24M7j287J164q41J86R25j001O59m6J53
8537B59r45J069K05j381J032m96O31p36K39M20J3N52k395Q37J841r52N50j702
8555i59J516r05K24P45m83J45o17O76l40m79P32r41q6L1R97J177j743J42j16J79
8575a05m91j0J47M88M82q87M33q52J746j385K28J364j467O57j67J412j694J18
$$ plain form
8440 -1842 380 -407 276 -602 -160 -218 -618 451 -282 -1048 73 381 436 874 -419 -822 -635 524 30
8459 30 660 -761 326 -177 -101 473 -95 308 77 104 780 266 296 850 -21 -674 -466 936 -58 237
8479 237 -1050 855 -290 36 309 -414 -16 395 -46 -66 -53 1243 -207 -106 537 3 -79 -453 457
8498 457 -310 901 -127 795 -1295 419 344 -619 671 -57 804 -407 -117 -177 422 -320 -312 -224 -932 -989
8518 -989 -132 -114 661 267 -1153 -72 420 176 300 347 -940 224 -617 -431 494 -507 152 106 259
8537 259 -686 383 588 -793 239 -257 374 -362 -123 297 310 862 -1533 -696 1145 193 743 -959
8555 -959 557 -348 -124 621 138 283 -334 342 2 -477 255 -686 -772 -741 256 1433 -310 -168 -284 -105
8575 -105 -596 -606 -459 29 511 -376 57 -795 951 -434 -206 1158 -309 348 181 1593 -101 17
8593A7J244j610j45k0L54Q20p52J21k03J485j136M41j040j57J202o20J32j350
8611a217J828K18j58j537P88J15Q68j238M77m3p72K54J312j559Q12l32Q8J96j136
8630a036P79L8L65K32L36q20q7Q34m90n81p67O2J529j332N71M29n66R40o49N50
8650C37k13q41Q26l18O01l84n92R72Q37l12M9j350K08J101p45j177K253j120k23
8669i1l34m8m09L93R90j248J184p80R1j25J36O65n45k14K17n23J415p17R34k108
8689a117R26j94L42k86m25R87n79M71j216J570n58n1J110n81k02J092q11j15j356
8708i93n4k05J044o9j17Q47n81k19Q18Q76j291o29J251k77n67l22J226j75N99
8727A162r15j420J840j54l14o91P34lN34k55o06m0L06K05j273O62Q40n53j6m79
$$ plain form
8593 17 1261 -349 -494 -514 -160 660 -92 29 -174 1311 175 616 -424 -581 621 1 133 -1217
8611 -1217 611 829 671 -866 -78 37 905 -333 144 101 -671 -417 895 -664 148 -184 -96 100 -1036
8630 -1036 -257 -219 146 378 714 -106 -193 641 151 -430 -1197 -1135 394 -938 -367 62 -504 436 -213 337
8650 337 124 -717 109 -209 392 8 -584 388 1225 913 962 -388 -180 921 176 -1001 1252 132 -91
8669 -91 -425 -473 -882 -489 501 -747 437 -343 -252 -377 -241 424 -121 -335 -118 -641 774 57 991 -1117
8689 -1117 -191 -385 -43 -329 -754 233 -346 125 -1091 479 -79 -130 980 399 197 1289 478 363 -993
8708 -993 -1047 -1252 -208 -277 -394 453 -128 -347 471 1347 56 -573 678 401 -166 -488 738 563 1162
8727 1162 247 -1173 667 513 199 -492 242 239 773 518 -88 -128 178 383 -890 -228 612 59 43 -436
8747d36q59J262j74K26J053r15P78n34o53J50K38j05j98J36k43O60j396J339m47
8766a18n87K143j818N36o20J318j348j12K24n61J744n06n85J579r69J89j054J04
8784d41L02L78J91j125J584j053J053j582k86K15q0K085k158J381n95O94k18n01
8802a56P3m04J373l29O9P9p08j364J155J092j030K67k00J65Q83k537J057N52M08
8821D45J44j913Q95J025l26p92L17n8q01J295k46k07m17J212N01n28N12j680J455
8840H33m71o20J105j634J131o93j45K76K33R03j007R19k41p22J099j001R74l50
8858E89j23n87n80k10J72J749k456J325p79J48L62q3J081k71q29J52L21M20q00
8877c99L34L12O47o92m84q62k24J824r31l36j8R23Q17j144J26n79J520k00n65
$$ plain form
8747 -436 -1295 -33 -207 19 1072 157 935 401 -252 -102 136 31 -167 -31 -274 386 -1010 329 -118
8766 -118 -705 1438 -380 156 -464 854 -494 -606 -382 -943 801 295 -290 1289 320 509 -545 -441
8784 -441 -139 239 430 -695 889 -164 889 -693 -979 -764 -844 1241 -917 464 -131 563 345 -156
8802 -156 -83 -487 886 557 626 705 -3 -1367 -212 880 -150 117 -83 82 965 -1572 -515 37 445
8821 445 589 -1324 -429 596 270 -522 -205 -263 -1064 231 -15 -222 -639 573 1074 546 1058 -622 833
8840 833 362 -258 847 -787 344 -349 -494 -218 15 918 -89 830 589 -133 966 -35 939 589
8858 589 466 -121 -701 -911 -739 1010 -1446 -121 -900 -752 -390 -473 608 337 -492 -340 -19 401 -399
8877 -399 -65 247 894 202 -282 -1144 -1368 456 -475 -811 -829 94 911 -233 -107 -686 834 634 69
8896F9L86p28P23L61j268K96j325K124j424J209r45J327p02P35j20j878J757P43
8914A340o36j221M60n54K11R70j265R70j052p1J980j414L68J47o80J593j735J895
8932A306o46j331Q49p13Q93m82M40k48K65J238j771O41k29M17j06j09k56j07L13
8951C64q03L75o44Q29L14j402N16P31K91L21p66m91k00J117q11O63q9n06J7n01
8971f75J034o21q34O83N19M35q48M35j445N39J019j078P94j46J621j968Q27n05
8989b14l5J466j214J241j673O10j525O67J424j113N67j160J567j818J296R71j987
9006i30Q24l77Q41p18J383o08r61J482q56j5O48j519K64J78J402j708J159q77
9024c88J78M74K7j93m67O64m14l61J161q59Nk90M78o30o68J445N34p46Q14r92
$$ plain form
8896 69 455 -273 450 811 -457 -161 -1486 638 -786 423 -522 805 103 838 718 -1160 597 1340
8914 1340 704 -517 -57 -611 -400 570 -695 275 -777 -848 1132 -282 86 233 -447 1146 -589 1306
8932 1306 660 -671 178 -535 358 -124 316 68 333 1571 -200 441 212 629 523 414 158 51 364
8951 364 -439 -64 -708 121 435 -967 -451 280 571 892 126 -365 -565 552 -259 404 315 -191 -174 -675
8971 -675 359 -262 -1096 -413 106 541 -307 128 -1317 -778 241 -837 -43 -189 1432 -536 291 -214
8989 -214 -249 1217 3 1244 -429 181 -1344 -677 747 -366 201 -959 608 -1210 86 1057 -930
9006 -930 -106 -483 358 -360 1023 415 -546 936 80 65 713 -806 -542 -364 1038 -670 489 -388
9024 -388 -210 264 291 98 -369 295 -119 -480 681 -178 -173 -463 15 -615 -1283 162 696 -50 764 -228
9044b28m44J65J388n63l07Q92j398K8R89J86n37m53J114r42K65k12l07R36j73
9063C99j10l59l44J029n07k78k0J252q75j00j69L62j79K00M28k231J394j33k55
9082d96R43q22J436j987R55l08J290j636L90M99q95J403q99N65j76l68K28n59
9100d37J150j243K357j984k0M92r67J391j284L14k52m31J189k55l59n46J481j042
9118d46R79j28j47P30r79o33K12k78M99O26o08l00l31P88N85l67j297J284P31
9137I20k121J373r5l9j61o29K455k089J132j341K56K5O17l99L38N5q14M70N25
9156D78O23j316p99J185n57n45J600q54J224j554R84j029J058r48m24J195j043
9173g22R34q02J397J4p48k40p43K165q86L16J8q08K9L37K04r28J133p11o82K510
$$ plain form
9044 -228 -672 -507 881 318 11 903 -495 -467 522 708 171 -282 832 -110 155 -57 -364 572 399
9063 399 289 -70 -414 615 108 -170 -190 1062 187 87 -82 280 101 301 729 -1502 -108 -241 -496
9082 -496 447 -375 1061 -926 29 -279 1011 -625 -235 264 -631 772 -127 438 262 -106 122 -437
9100 -437 713 -530 1827 -157 -177 315 -652 739 -545 -231 -483 -914 275 20 -339 -885 596 -446
9118 -446 533 405 258 988 9 -624 -412 -690 -191 435 -173 -473 -804 -16 569 202 -1095 189 920
9137 920 -1201 172 77 38 -123 -752 1703 -386 746 -595 -339 -314 303 -96 242 297 -517 -47 478
9156 478 1101 -215 -1014 171 -386 -931 669 -185 1039 -515 469 -560 498 -450 -874 321 -722
9173 -722 212 -590 807 821 73 -167 -910 1255 369 685 703 -105 -76 261 465 -463 670 -41 -723 1787
9193A787k302R39o2l82l32J305p12j343K049j924O84p2P47o22l69J002j169J406
9211F30o98L10o20j7L37j02r86J226k90j031R91J859j402J110m75j203L04l01
9229c58J5j6L11M28q80J393j293r6J241p46L30m93J32p52M88J379k019J123l26
9248a39J03N4O92m06k38J92j604J619J61j567J542j352j46R87O74l97n67K76o94
9267h10J996k082J602l93j271J515j424%q42J504l76r8J510r99J58L89l31j67
9285a19n31K090k353J734j359J216q97n39J159p78P15j597J128Q07j75l93q21
9302g13J568m98n9p92J00J493k013J178j094J570q82J33J84r81J142j5M10r66
9320b35k68N12j05Q61q39K47J170k227l96J475N82r30o1q25J325l40j32o2R64
$$ plain form
9193 1787 -515 424 362 -20 -352 953 241 -1102 947 -977 -293 -365 382 -240 -609 393 -776 630
9211 630 -68 242 -378 -395 -58 -160 -1146 80 -210 -1241 -250 1609 207 1317 842 -361 -57 -358
9229 -358 -343 -359 -48 380 -500 893 -400 -496 745 -1 329 -164 -32 -784 -296 1083 -936 187 -139
9248 -139 -36 18 710 304 66 258 -1346 273 434 -1133 409 -943 -1089 -102 572 175 -392 -116 -810
9267 -810 1186 -896 706 313 -958 557 -867 -867 -1709 -205 -581 -679 831 -168 -10 379 48 -119
9285 -119 -650 1440 -913 821 -538 678 -219 -758 401 -377 338 -1259 -131 676 501 108 -713
9302 -713 855 357 298 -494 -394 1099 -914 264 -830 740 -142 -9 175 -806 336 321 731 -235
9320 -235 -503 9 -96 765 -74 173 1343 -884 -1280 195 777 -153 -214 -1039 286 -54 -186 -248 716
9339G16j058O79M52j028m39r7J358q36j28J467m85m31p67O14l42R76r13n19K69
9358e12J099K83j729J636n86k01O05j477J452k99J45j023m78K92K84Q65j109J709
9376I56p05j082Q18J55m94q24R56O21r3p64Q11l55n13J024q70J71O68j094J540
9395I26k736J525J24N28m47j0R20j217J538j504O73m02l82M9k18R24j171O23M05
9414A48M05Q9r30J090r62J525p40j005J83m52J391r53l14L89n0J365j6j609P96
9433C50j323Q62k82R18n54k7P08k53K82j336J119K62l54J18r62K96K78N72o70
9452Do47r5J652K9j546N41M22n61q78J249L53j265J403r31P38j30j059K016j267
9471B8N20j459M87L9M20P16j234j73J883k161R11n70J785j379K50k66J000l01
$$ plain form
9339 716 -342 337 789 -239 -678 -775 583 -253 -381 1086 601 170 -597 17 -325 651 -262 -781 -512
9358 -512 587 870 -859 777 191 -10 595 -882 570 271 416 -607 -1085 -793 -509 356 -753 956
9376 956 251 -831 -13 142 -352 -1176 -220 401 308 -456 355 0 -513 511 -359 -188 480 -614 926
9395 926 -1810 -285 -161 367 -80 -90 830 -387 1151 -353 320 -82 -464 -415 -633 291 -880 -257 148
9414 148 553 642 -288 802 -160 1365 625 -380 -197 -649 742 -211 -525 -136 -186 1179 1163 -446 350
9433 350 -973 -111 -393 525 -29 -56 652 399 681 -655 464 726 372 490 -472 -176 102 674 4
9452 4 -643 -738 914 943 -603 -62 360 -201 -1079 170 523 -742 661 -270 468 338 -721 1295 28
9471 28 548 -911 -424 -385 35 751 -483 -656 1227 -934 -23 -593 1192 -187 63 -203 797 496
9489D96j471J654J97j395N32m3J837k355J398j076J232j225J002P74k075L40m
9506a82k4m09J54P39p32J178r50N90M52r70M00j073J639k1j576L25J82R23l49
9525B96N40o4l28m65j42k31J495o98o39r97N18O12j09K24j195J986j245J00P38
9544C96j29p89R36j11p07k1J244j244l47J187R45k346R05j270R29Q03l20J673
9562A734k600J504j484J155j648J869r43M05J273j933Q54o98P75m60j373J744
9578A74j470K276j197k44M49J26Q09k067J155j502J391J66J89j91m68J280p14
9595A62q54M28j616J652L63q39R27m18N8q48J586q32Q54J63q37J379o41j223O45
9614A09l37L33j293J165l7J84l61k50J172k17L02j45o61J233n39j00j062J289
$$ plain form
9489 496 -975 679 876 -519 13 -30 1807 -548 850 -226 1006 -219 783 1557 -518 -178 -182
9506 -182 -206 -615 -461 278 -454 724 -226 364 816 -154 246 -827 812 791 -785 -460 -278 645 296
9525 296 836 772 444 -21 -163 -394 1101 403 -236 -1233 -715 -103 -212 12 -1183 803 -442 -342 396
9544 396 267 -522 414 303 -404 -425 819 -425 -772 415 1360 -986 -81 -1351 -422 381 61 1734
9562 1734 -866 638 -846 309 -1339 530 -413 -8 1265 -668 186 -512 263 -197 -1570 174
9578 174 -1296 980 -217 -461 -12 114 923 -1144 11 -1491 -100 66 255 64 -404 876 162
9595 162 -692 -264 -1880 -228 135 -704 223 -195 -137 -985 601 -231 623 786 -51 1328 687 -536 109
9614 109 -228 105 -1188 -23 -60 124 -237 -487 685 468 770 625 -36 1197 658 558 -504 785
9632G85j136J23j40K34N34j84J360j939J92L58j493J545R81j274J85k71O43n53
9650e0j33p57P86o4r9J046n65Q85j252M90j47M07L90j317N70r77J002P10j129
9669b04P35n66J39n17R61o07L46n64J29P08o06O77j710K98J024q45P32m06K38
9688c8j37N18k97j516K311q13K30l75K03m25M14P36m36n88K05l63rq56O71N6N42
9709C3J38n36K38m7Q8l42P96l63l24K86K90o57q1N42L48j400J488r80n01j84R91
9730a77P41j748J420n92R77m39j301L21O51m58J55N58L06j513J601o61J492r17
9748D16j348J117j74l63N8L64l61R27Q3m35P83j401Q07j39k79K57r92J546j284
9767d18K480j433j852R29m73J196j133L67O58K69j08l88K6l70M44P41m03n88q97
$$ plain form
9632 785 -351 -228 -368 -134 400 216 1576 -363 -171 187 -1306 239 1220 -54 131 -140 503 -50
9650 -50 -183 -940 -154 -218 -317 729 164 1049 -203 287 140 547 937 -380 190 -787 215 925 -204
9669 -204 531 -35 104 -413 548 -59 287 -277 -148 560 -46 631 -1079 -781 243 -602 130 -276 -38
9688 -38 -175 343 46 -1470 841 28 258 -117 86 -339 75 811 375 -213 -8 -371 -380 -1236 -565 -509 33
9709 33 171 -365 -127 -174 -86 -428 368 5 -319 -33 257 -400 -481 61 409 -991 497 -483 -984 -1168 -177
9730 -177 564 -1184 236 -356 621 182 -1119 -798 -147 -605 -450 108 414 -1099 502 -159 1333 416
9748 416 -932 185 11 -352 -294 70 -291 636 719 284 1067 -334 473 334 55 312 -680 866 -418
9767 -418 2062 629 -1223 -294 -767 429 -704 -337 321 590 482 94 120 -250 194 935 532 -56 -953
9786i53J055J49Q32o46j68l00j29R52j106L09k40o26J95Qn1P41P80k74JR6j055
9807d30J316l44J98r0o13R54j707m1qO47j25J811j192ol85N72j649J490o38o84
9827i24N87M89m52J27J694k252J490r37p79J359j251J375q50J050j72p28K59j039
9845i54N64K65L84l70l7k0r4No18J430j229J572j613n00J478r24J603j706O29
9864a35n43J147L26k013J113m11q05J153j11N13k239K788k231K037M49j164k44
9881c70j29m43Q06k49q9O79J128j484P5p21J687j179n08Q15j049J665j395M29
9899c32J04M70L88r06r60R82l34R9n00Q33N59j452R55j76J92l32J9P11n38l49
9919e67j31J507p3l44M96q42K12J10n2q03N28Q79j297J085m23J87p90r28K238
$$ plain form
9786 -953 102 251 1083 437 269 -31 -160 792 -314 -5 -245 -871 -676 -668 -719 22 802 528 529 625 -430
9807 -430 886 542 740 650 37 991 -716 -757 -765 -118 -243 1568 376 370 -15 557 -1092 398 -240 -924
9827 -924 -337 152 -300 -173 1521 -731 759 -178 -957 402 -849 526 -324 726 554 -174 85 -954
9845 -954 -390 -125 259 -111 -148 -168 -262 -257 -875 555 -674 898 -715 -1215 263 -661 942 -764 -135
9864 -135 -678 469 795 -1218 -105 -516 -1321 -168 -279 234 -2005 783 -1448 589 1038 -126 -370
9881 -370 -499 -942 -136 -385 -474 205 1333 -151 -76 -797 890 -289 -797 18 -1031 634 -761 -332
9899 -332 -228 242 630 -276 -1236 -254 -588 -489 -989 -156 403 -1049 -94 -270 -78 -410 -391 320 -218 -567
9919 -567 -698 809 736 392 888 46 258 368 316 -487 41 920 -377 708 285 472 -318 -1246 992
9938I92q68J094q09m48Q36r03N9O89n92p47Q03n78l77J715j579N62m59N35q63
9957i38J354n93p4R24r20M63p73Q92K77j078N80n39J167j048n3O54P58j093q04
9976h44J658n93p19P48J15J160j305l12mJ038j426K50J304j163j52J034m37J10
9994D62n72J141K42j187N03O04j093q55J192p81k17o76J279o86J164j568M98L1
10012e19M49L94q05L74N51j45j506J337m45J790k235J36P44N97r47n11J229L87
10030H75q9j640R94o38o3R02k08P22n91n06M38j341J704j230J595j945j08O77
10048d52m92K003j076q5N53r46P64j79J118k243J04J169j125R42k134J690l23
10065g12J897o64m68J039k789K040q63O06o35m61J297k46J060j174o62M44O35
$$ plain form
9938 992 124 1218 409 -39 797 -106 -47 642 50 -697 106 -472 -849 866 -713 -151 -610 -75 -938
9957 -938 416 -177 -251 673 -247 216 -557 335 612 -466 114 -425 742 -306 -359 295 1053 -40 -844
9976 -844 814 221 -498 250 365 1525 220 -92 -96 942 -484 -234 1070 -93 -245 789 352 462
9994 462 -110 1031 1273 86 589 1193 100 -755 437 -344 -561 -1237 42 -644 520 -1048 -550 -519
10012 -519 -70 324 -481 -107 444 299 -1207 130 -315 1475 -760 -624 120 717 -230 -741 488 875
10030 875 786 -854 140 -498 -561 341 133 855 264 -242 196 -1145 559 -671 924 -1021 -1129 -452
10048 -452 -944 1059 -17 -102 451 -495 269 90 1208 -1035 -931 238 -887 55 -2079 -389 -712
10065 -712 1185 521 53 1092 -1697 343 -520 86 -549 -1010 287 41 1101 -73 -735 -291 344
10082C44J50j220N29Q59j681J453l10m38m33Q11J25J251l59j007N04j335J814
10099A057j634K003j123k53n05N74n66L26L54K01m60J12Q90r12K41k272J227N42
10117a98j67P17K15R1q34J32N89J4m47j118J587o42L66l01L82R19j916O21j49
10136a39K35m2R57j227l47R98j234O46j1q39L99K19J562k212J136r78j08J341
10154C56j330J224j683J225R30o84p0j60J537j743J173p84K41n12R40k12p72O59
10172C35p31QJ166j225K87K17J2q5k69Q98o29N87j143J71J048m53J08k36n65n5
10192e54P56j01r3k86r30J163l14R61j785J296j98J02o46J410q38n52O06N79j074
10211d98Q79K83j537N62j35J71j34l2n41L26P62j764J752j55j61q1l42J125N0
$$ plain form
10082 344 494 -726 -197 662 -1019 434 124 -314 -747 64 189 1440 1081 74 578 -757 1057
10099 1057 -577 1426 303 50 -455 119 -447 -121 233 434 -26 86 976 64 305 -1967 -740 -198
10117 -198 -365 352 567 658 -176 -44 545 559 112 -1006 581 -61 305 4 386 1305 -611 10 -139
10136 -139 96 54 1011 -216 -563 435 -799 -153 -164 -1003 -604 -385 1177 -1035 101 -877 -985 356
10154 356 -974 250 -1433 -208 722 38 -32 -192 1345 -398 775 -9 232 -280 660 448 -324 335
10172 335 -396 -388 778 -447 -160 57 69 -16 -285 613 -16 571 -572 -401 647 194 302 66 -499 -554
10192 -554 202 101 8 -278 -1208 -45 -359 602 -1183 113 -85 17 -629 781 -57 -609 -3 576 -498
10211 -498 381 664 -873 -311 -446 -275 -409 -441 -982 -656 106 -1658 94 -61 -222 -303 -645 480 530
10230E30Q2j180P62j035R71L90k15J74j308J17K83j91J763j559J553p99j304J629
10248F63j261J23m33J496q03o60J609m1r10q59K206r82N58L06k454K091j128J180
10266G01m33mK39j945J056o10J747o03p81J18k8n6K88M81M35j75n2m91Q57p16
10286B8j11j015M63Q00r65J205j448J449j117J187O48j569J097q25K20r01N28
10303c26K82M48q27j32O26L87j105J435r21M62j77p39M07l59Q25r47R70j873J355
10322b09J9L21N16j271J191j123J106m77k8J098k316K080p76L63M91o59K37m11
10340A52o12J721j795j42K27L86l52m3Q50r23R27j55j009M26J142j532L96L66
10358C0k87J900j813M14m33l2k36J44K37K60N79r51P0j21j03O36q46O31p70N48
$$ plain form
10230 530 612 -568 194 -841 130 520 305 479 -829 -712 -429 -620 1143 -416 1137 338 -966 663
10248 663 -598 -475 -908 588 -215 -875 734 693 -217 -1076 1130 148 706 1012 -1442 649 -479 701
10266 701 268 264 503 -1442 -386 -996 751 148 -633 -515 -543 -599 -311 170 605 430 378 -113 744 28
10286 28 -83 -1098 -635 165 -800 405 -1043 406 -711 476 1124 -445 652 -173 47 -854 -326
10303 -326 -44 404 -423 -555 71 458 -647 788 -133 329 152 -587 -180 -539 286 -661 309 -1564 -209
10322 -209 -190 131 647 -624 567 -556 550 73 45 1143 -1173 907 131 494 985 326 563 152
10340 152 -460 1261 -534 -676 -449 -63 -415 -458 392 -531 396 241 -768 -342 800 -732 -336 30
10358 30 -257 1643 -170 244 -189 -221 -457 -313 -76 184 763 -188 -118 -239 -342 294 -552 79 -691 -143
10378a43Q3K46m39o02J087O84j010R60j569j05J677j400J143j263R51K7J87j23
10396C91m84k29K08q01J632j770J715j346K888k094M38r25l4J501j257P01r49
10413d15L03m23K46O10M19L96j479M72m40L68p1R5l07R04K33j441m2J116p98l10
10433e64m32J440r11l91K368k105Q21r81J258o92m59R41j702J841j166K354j044
10450E76j138J157k21m05j08n1j143J347p99k75J232j033J305O2j276J412q30
$$ plain form
10378 -143 -60 186 -253 -855 232 916 -94 866 -703 -808 869 -531 612 -651 300 327 514 391
10396 391 -93 -322 -114 -915 717 -1053 662 -684 2204 110 548 -377 -411 1090 -167 534 -415
10413 -415 -112 -535 -289 321 740 1136 -343 129 -311 57 -14 81 -226 678 911 -530 -572 544 -254 -564
10433 -564 -996 444 -467 -858 1510 -595 226 -755 503 -189 -648 293 -1409 432 -734 1620 576
10450 576 -562 595 374 -31 -139 -190 -1333 14 -785 -1060 172 -861 444 506 -770 642 -188
$$ [...]
16383A19
##END NTUPLES=NMR FID
##END=
