##TITLE=31P_DE-80H_X3
 64 sc D2O
 26.2.2025
##JCAMPDX= 6.0         $$ Bruker NMR JCAMP-DX V2.0
##DATA TYPE= NMR FID
##DATA CLASS= NTUPLES
##ORIGIN= UXNMR, Bruker Analytische Messtechnik GmbH
##OWNER= root
$$ XWIN-NMR		Version 3.5
$$ Tue Jul 28 11:05:48 2026 Russian Standard Time (UT+4h)  Yarkov@DPX200
##.OBSERVE FREQUENCY= 81.013821
##.OBSERVE NUCLEUS= ^31P
##.DELAY= (6, 6)
##.ACQUISITION MODE= SIMULTANEOUS
##.ACQUISITION SCHEME= undefined
##.AVERAGES= 64
##.DIGITISER RES= 17
##SPECTROMETER/DATA SYSTEM= spect
##.PULSE SEQUENCE= zgpg30
##.SOLVENT NAME= D2O
##.SHIFT REFERENCE= (INTERNAL, D2O, 0, 243.863)
##AUDIT TRAIL= $$ (NUMBER, WHEN, WHO, WHERE, WHAT)
$$ ##TITLE= Audit trail, XWIN-NMR		Version 3.5
$$ ##JCAMPDX= 5.01
$$ ##ORIGIN= Bruker BioSpin GmbH
$$ ##OWNER= Yarkov
$$ C:/Bruker/XWIN-NMR/data/yarkov2/nmr/P31/2/audita.txt
$$ ##AUDIT TRAIL=  $$ (NUMBER, WHEN, WHO, WHERE, WHAT)
(   1,<2026-07-28 11:04:55.65 +0400>,<Yarkov>,<DPX200>,
      <created by zg, POWCHK disabled, PULCHK disabled
       configuration hash MD5:
       00 E9 B6 7A A2 85 ED C7 34 08 36 98 17 FE 4E 26
       data hash MD5: 32K
       53 3F 63 7C C7 04 3E B9 DB D0 22 8A 74 F8 F6 8B>)
$$ ##END=
$$ 
$$ hash MD5
$$ 89 5A 96 1B 07 36 62 70 3F 58 E2 45 2A 37 B2 0C
##$RELAX= 
##$RELAX= 
##$RELAX= 
##$RELAX= 
##$RELAX= 
##$RELAX= 
##$RELAX= 
##$RELAX= 
$$ Bruker specific parameters
$$ --------------------------
##$DU= <C:/Bruker/XWIN-NMR>
##$EXPNO= 2
##$NAME= <P31>
##$PROCNO= 1
##$TYPE= <nmr>
##$USER= <yarkov2>
##$AMP= (0..31)
100 100 100 100 100 100 100 100 100 100 100 100 100 100 100 100 100 100 
100 100 100 100 100 100 100 100 100 100 100 100 100 100 
##$AQSEQ= 0
##$AQ_mod= 1
##$AUNM= <au_zg>
##$AUTOPOS= <>
##$BF1= 81.014009
##$BF2= 200.13
##$BF3= 200.13
##$BF4= 200.13
##$BF5= 200.13
##$BF6= 200.13
##$BF7= 200.13
##$BF8= 200.13
##$BYTORDA= 1
##$CFDGTYP= 0
##$CFRGTYP= 5
##$CHEMSTR= <none>
##$CNST= (0..31)
1 1 145 1 1 1 1 1 1 1 1 1 1 1 1 1 1 1 1 1 1 1 1 1 1 1 1 1 1 1 1 1 
##$CPDPRG= <waltz16>
##$CPDPRG1= <>
##$CPDPRG2= <waltz16>
##$CPDPRG3= <>
##$CPDPRG4= <mlev>
##$CPDPRG5= <mlev>
##$CPDPRG6= <mlev>
##$CPDPRG7= <mlev>
##$CPDPRG8= <mlev>
##$CPDPRGB= <>
##$CPDPRGT= <>
##$D= (0..31)
0 1 0 0 0 0 0 0 0 0.06 0 0.03 2e-05 3e-06 0 0 0.0002 0 0 0 0 0 0 0 0 0 
0 0 0 0 0 0 
##$DATE= 1785222295
##$DBL= (0..7)
120 120 120 11 120 120 24 19 
##$DBP= (0..7)
150 150 150 150 150 150 150 150 
##$DBP07= 0
##$DBPNAM0= <>
##$DBPNAM1= <>
##$DBPNAM2= <>
##$DBPNAM3= <>
##$DBPNAM4= <>
##$DBPNAM5= <>
##$DBPNAM6= <>
##$DBPNAM7= <>
##$DBPOAL= (0..7)
0.5 0.5 0.5 0.5 0.5 0.5 0.5 0.5 
##$DBPOFFS= (0..7)
0 0 0 0 0 0 0 0 
##$DE= 6
##$DECBNUC= <off>
##$DECIM= 4
##$DECNUC= <off>
##$DECSTAT= 4
##$DIGMOD= 1
##$DIGTYP= 9
##$DL= (0..7)
0 0 52 120 120 21 21 25 
##$DP= (0..7)
150 150 150 150 150 150 150 150 
##$DP07= 0
##$DPNAME0= <>
##$DPNAME1= <>
##$DPNAME2= <>
##$DPNAME3= <>
##$DPNAME4= <>
##$DPNAME5= <>
##$DPNAME6= <>
##$DPNAME7= <>
##$DPOAL= (0..7)
0.5 0.5 0.5 0.5 0.5 0.5 0.5 0.5 
##$DPOFFS= (0..7)
0 0 0 0 0 0 0 0 
$$ [...]
##$SUBNAM1= <"">
##$SUBNAM2= <"">
##$SUBNAM3= <"">
##$SUBNAM4= <"">
##$SUBNAM5= <"">
##$SUBNAM6= <"">
##$SUBNAM7= <"">
##$SUBNAM8= <"">
##$SUBNAM9= <"">
##$SW= 400.765351723535
##$SWIBOX= (0..15)
0 1 3 0 0 0 0 0 0 0 0 0 0 0 0 0 
##$SW_h= 32467.5324675325
##$TD= 32768
##$TD0= 1
##$TE= 0
##$TE2= 300
##$TE3= 300
##$TEG= 300
##$TL= (0..7)
0 120 53 12 22 120 120 120 
##$TP= (0..7)
150 150 150 150 150 150 150 150 
##$TP07= 0
##$TPNAME0= <>
##$TPNAME1= <>
##$TPNAME2= <>
##$TPNAME3= <>
##$TPNAME4= <>
##$TPNAME5= <>
##$TPNAME6= <>
##$TPNAME7= <>
##$TPOAL= (0..7)
0.5 0.5 0.5 0.5 0.5 0.5 0.5 0.5 
##$TPOFFS= (0..7)
0 0 0 0 0 0 0 0 
##$TUNHIN= 0
##$TUNHOUT= 0
##$TUNXOUT= 0
##$USERA1= <user>
##$USERA2= <user>
##$USERA3= <user>
##$USERA4= <user>
##$USERA5= <user>
##$V9= 5
##$VALIST= <valist>
##$VCLIST= <CCCCCCCCCCCCCCC>
##$VD= 0
##$VDLIST= <DDDDDDDDDDDDDDD>
##$VPLIST= <PPPPPPPPPPPPPPP>
##$VTLIST= <TTTTTTTTTTTTTTT>
##$WBST= 1024
##$WBSW= 4
##$XGAIN= (0..3)
0 0 0 0 
##$XL= 0
##$YL= 0
##$YMAX_a= 7088
##$YMIN_a= -7034
##$ZGOPTNS= <>
##$ZL1= 120
##$ZL2= 120
##$ZL3= 120
##$ZL4= 120
##$ABSF1= 60
##$ABSF2= -190
##$ABSG= 5
##$ABSL= 3
##$ALPHA= 0
##$AQORDER= 0
##$ASSFAC= 0
##$ASSFACI= 0
##$ASSFACX= 0
##$ASSWID= 0
##$AUNMP= <proc_1d>
##$AZFE= 0.1
##$AZFW= 0.5
##$BCFW= 1
##$BC_mod= 2
##$BYTORDP= 1
##$COROFFS= 0
##$CY= 9.86611175537109
##$DATMOD= 1
##$DC= 1
##$DFILT= <>
##$DTYPP= 0
##$F1P= 182.462994727601
##$F2P= 168.069089081705
##$FCOR= 0.5
##$FTSIZE= 0
##$FT_mod= 0
##$GAMMA= 1
##$GB= 0
##$INTBC= 1
##$INTSCL= 1
##$ISEN= 30
##$LB= 1.5
##$LEV0= 0
##$LPBIN= 0
##$MAXI= 11.51145
##$MC2= 0
##$MEAN= 0
##$ME_mod= 0
##$MI= 1.244541
##$NCOEF= 0
##$NC_proc= 0
##$NLEV= 6
##$NOISF1= 0
##$NOISF2= 0
##$NSP= 1
##$NTH_PI= 0
##$NZP= 1
##$OFFSET= 243.8632
##$PC= 1.4
##$PHC0= 1589.076
##$PHC1= 109.1595
##$PH_mod= 0
##$PKNL= yes
##$PPARMOD= 0
##$PSCAL= 0
##$PSIGN= 0
##$REVERSE= no
##$SF= 81.0140731611343
##$SI= 65536
##$SIGF1= 0
##$SIGF2= 0
##$SINO= 80
##$SIOLD= 65536
##$SREGLST= <31P.CDCl3>
##$SSB= 0
##$STSI= 0
##$STSR= 0
##$SW_p= 25641.0256410257
##$SYMM= 0
##$S_DEV= 0
##$TDeff= 0
##$TDoff= 0
##$TI= <>
##$TILT= no
##$TM1= 0
##$TM2= 0
##$TOPLEV= 0
##$USERP1= <user>
##$USERP2= <user>
##$USERP3= <user>
##$USERP4= <user>
##$USERP5= <user>
##$WDW= 1
##$XDIM= 64
##$YMAX_p= 0
##$YMIN_p= 0
$$ End of Bruker specific parameters
$$ ---------------------------------
##NTUPLES= NMR FID
##VAR_NAME=  TIME,          FID/REAL,        FID/IMAG
##SYMBOL=    X,             R,               I
##VAR_TYPE=  INDEPENDENT,   DEPENDENT,       DEPENDENT
##VAR_FORM=  AFFN,          ASDF,            ASDF
##VAR_DIM=   16384,         16384,           16384
##UNITS=     SECONDS,       ARBITRARY UNITS, ARBITRARY UNITS
##FACTOR=    3.08e-05,      1,               1
##FIRST=     0,             0,               0
##LAST=      0.5045964,     0,               0
##MIN=       0,             -7034,           0
##MAX=       0.5045964,     7088,            0
$$ Real data points
##PAGE= N=1
##DATA TABLE= (X++(R..R)), XYDATA
0@%%%%%%%%%%%%%%%%%%%%%%%%%%%%%%KmNpOkkLjkNmJjJ%%jOqQj5J7j3J6k0K2k2
$$ 0 0 0 0 0 0 0 0 0 0 0 0 0 0 0 0 0 0 0 0 0 0 0 0 0 0 0 0 0 0 0 2 -2 3 -4 2 0 -2 1 0 -2 3 -1 0 -1 0 0 0 -1 5 -3 5 -10 7 -6 10 -10 12 -10
58a0K2k7L1l5M4n4O2q9M825J788l129o152l327O83M420M138K626j092n297l795
$$ -10 12 -15 16 -19 25 -29 33 -56 4769 6557 3428 -2724 -6051 -5368 -948 3190 5816 4724 -573 -4368
78d368j435K353L730L561O11l134l587l070J036K895L285J181j551j288k365K49
$$ -4368 -5803 -3450 280 3841 4452 1318 -2269 -5339 -4303 -1408 1877 3058 1507 219 -2146 -1897
94a897PJ665J194R86p09k406J644l40r78J159o73J607J34L54j187o22j761r95
$$ -1897 -1890 -225 969 1955 1246 -1160 484 144 -834 325 -348 1259 1393 1747 560 -62 -1823 -2818
112b818K382K20K662p4j338k433k712J293J181L953J714q86m245k523q49K774
$$ -2818 -436 -216 2446 2372 1034 -1399 -4111 -2818 -1637 2316 4030 3144 -1101 -3624 -4473 -1699
128a699L891J369J543l422m885j128r20N093K632M095k280l626m755k942M163
$$ -1699 2192 3561 5104 1682 -3203 -4331 -5251 -158 2474 6569 4289 663 -4092 -7034 -2871
143b871M589K931K59l963l535k290J072L993K977K725k637l003l591o85K715K874
$$ -2871 1718 4649 4908 945 -2590 -4880 -3808 185 3162 5887 3250 247 -3344 -4029 -1314 1560
159A560M15J510k409l846P65l11K075J818L45n67j254j977k87J479J318O01L0
$$ 1560 1975 3485 1076 -2770 -2005 -2316 -241 1577 1922 1355 101 -1876 -2163 -684 634 1235 1265
176A265j154o64J022j456K21J57J254j786J864J341r76m25k155m63Q11J383K787
$$ 1265 111 -553 469 -987 -766 -609 645 -1141 723 2064 1088 663 -1492 -1955 -1144 239 3026
193C026m86j341l039p3r68J915L462M00j3l287k980J0J743L474P66J124l253j934
$$ 3026 2540 1199 -1840 -1913 -2881 -966 2496 2896 2883 -404 -3384 -3374 -1631 1843 2609 3733 480 -1454
211a454j834m52M573J680J122j804j823m072q56M222K361K449n41l374k481k070
$$ -1454 -3288 -3740 833 2513 3635 1831 8 -4064 -4920 -698 1663 4112 3571 197 -2284 -4354
227d354K511K992J550J18j606k086j712j31J439L611l18j036j737j024Q98j01
$$ -4354 -1843 1149 2699 2817 1211 -875 -2587 -2718 -1279 2332 2014 978 -759 -1783 -885 -986
243i86O56J396m97o94l79O5l08O56J332m60k115J613J87L69j07q91j076N73J396
$$ -986 -330 1066 569 -125 -504 -439 -747 -91 1241 781 -1334 279 466 835 728 -163 -1239 -666 730
262G30l76J160k76j683j431R74m80J626J009P70m79l298j001Q43K086J781M03
$$ 730 354 1514 1238 -445 -1876 -902 -1382 244 1253 2023 1544 -1754 -2755 -1912 174 1955 2358
279B358J3l687j00q73J454K277K113p51k851j285j628O54K269K792k1j919j606
$$ 2358 2371 -1316 -1416 -2289 -835 1442 3555 2804 -47 -1332 -2960 -2306 -37 2755 2734 815 -791
296g91k222J341K050J776j32p39n0l419L40J100K066J220r23j485j925N64J72
$$ -791 -3013 -1672 378 2154 2022 1283 1233 -2186 -1846 -746 1320 2540 1617 132 -1793 -1229 -1057
313a057J085K214j434r44L00j000M56j46J354J88l92j294R68p65n95J044M05L37
$$ -1057 28 2242 808 -136 164 -836 -380 -526 828 1016 624 -670 298 -467 -1062 -18 387 724
331G24j769L52N66N45O18j960N63j266K332P82p79L53j584l71p90P17J696N9M50
$$ 724 -1045 -693 -127 418 1036 -924 -361 -1627 705 1487 708 1061 -523 -894 -1684 -967 729 788 1238
350A238j572p1j294o33K894k48K839k383j669j066o73K701O74J077m92j457j381
$$ 1238 -334 -405 -1699 -2332 562 314 3153 770 -899 -1965 -2638 63 737 1814 1322 -135 -1516
367a516r02K693j76J440k09m6k047m14Q14J096J644k195K73r03j390O80k56K986
$$ -1516 -2418 275 99 1539 1330 1284 -763 -1177 -363 733 2377 182 455 -448 -1838 -1158 -1414 1572
385A572j029l34j37o68j53J54J737m47j72j15j523J529m73J701k073N18k77m82
$$ 1572 543 209 72 -596 -749 -595 1142 695 523 408 -1115 414 -59 1642 -431 87 -190 -672
403f72M00M67Q96j449o42o66m2J851P07l73j89o74J41j115J861L21Q4M1j436J92
$$ -672 -272 195 1091 -358 -1000 -1666 -1708 143 850 477 288 -386 -245 -1360 501 822 906 947 -489 -297
423b97j034J019k05Q72J131J33k024j296m0J555J812K3l40r76k376O21J478N55
$$ -297 -1331 -312 -517 355 1486 1619 -405 -1701 -1741 -186 1626 1649 1309 333 -2043 -1422 56 611
441F11P72j447J137k676Q58J12K97J010j16Q0n27r87J108q96K139n74n27k220
$$ 611 1383 -64 1073 -1603 -745 -633 -336 674 558 638 111 -876 232 -664 1475 901 374 -1846
459a846Q78J613j285J67Q52K93q85J359o51J49p60q85J736q72J67M99j058J995
$$ -1846 -968 645 -640 -473 379 672 -213 1146 495 644 -116 -1001 735 -137 30 529 -529 1466
477A466k095R91j206K58K28N89J168m03l91j912J06J909q92J844l52r48j319j558
$$ 1466 -629 362 -844 -586 -358 231 1399 996 605 -1307 -1201 708 -184 1660 1308 360 -959 -2517
495b517J399K041L85p91q97j107J37j91M77J196R79M4o23j826k42J038J122m1
$$ -2517 -1118 923 1308 517 -380 -1487 -1350 -1541 -1064 132 1111 1155 532 -1294 -1536 -498 624 583
513E83M72l56k03j467m60P29J050J071j193O27j197J37j06m70J274q9n93M24r00
$$ 583 1055 699 496 -971 -1431 -702 348 1419 226 853 -344 -207 -313 -783 491 402 -191 233 -667
532f67L77n1l09O67O80N73q48q1j007M39l92J88P75l2J276q37j357m93O59J776
$$ -667 -290 -341 -650 17 697 1270 422 341 -666 -227 -619 -431 344 312 1588 751 -606 -1099 -440 1336
552A336j813J157J94j217J71j722K188N40J825n82j500j066j046m24Q38J985J267
$$ 1336 -477 680 874 -343 -172 -1894 294 834 2659 2077 577 -489 -1535 -1959 -1121 864 2131
569B131o75j195k887mJ125K068J741r02M6l218M06p52J062J792J308m2k543j22
$$ 2131 1456 261 -2626 -2630 -1505 563 2304 1402 1448 -1770 -1364 -2116 -1054 738 2046 2004 -539 -661
587f61l111K330J795J66L139k104k174r75o53J696K09K623j489J087k774m60L46
$$ -661 -3772 -1442 353 519 3658 1554 -620 -1595 -2248 -552 -343 2280 791 1878 -896 -1356 -1010
604a010j8J844j048K829l078j34O41q42l14R94O09J080q46j642o98J001j28J49
$$ -1010 -1028 816 -232 2597 -481 -615 26 -816 -1130 -136 473 1553 707 -935 -1633 -632 -760 -611
622f11J615J32k16n29j137j114J617j82O52K138q90k014r76p04L61R70L331l09
$$ -611 1004 1136 920 391 -746 -1860 -243 -425 227 2365 1475 -539 -1515 -2219 -1858 -888 2443 2134
640B134k264p22j641j19J824L604l35M13k274m106Q4J427K792K440O86j606l328
$$ 2134 -130 -852 -2493 -2612 -788 2816 2481 2894 620 -3486 -3402 -1975 817 3257 3943 2337 -991
657i91j781L6K148K845K024j667l900m21k329L379J310K538o06k043j759q31r
$$ -991 -2772 -2736 -588 2257 4281 2614 -1286 -1707 -4036 -657 653 3191 2585 542 -1217 -2048 -2057
674b057J484K109N64n03j074k328M51l97R24J503R13q04l64m09j868R58J178m0
$$ -2057 -573 1536 2100 1597 523 -1805 -1354 -1751 -827 676 1589 785 421 12 -1856 -898 280 240
692B40k28l73J904j836j041N71n31J769m00J939j149m00j315j788P73K242J594
$$ 240 12 -361 1543 -293 -1334 -763 -1294 475 75 2014 865 465 -850 -2638 -1865 377 1971
709A971R99q13l265k331j70K090L000J265K02j656k240k129J049J382L812K02
$$ 1971 2970 2157 -1108 -3439 -3609 -1519 1481 2746 2948 1292 -948 -3077 -2028 -646 3166 3368
725C368q30l111k304q27J533L690J149J110k601l911r81O85L120K248Q24j667
$$ 3368 2538 -573 -2877 -3704 -2171 1519 2668 3778 1177 -2734 -3715 -3030 90 2338 3162 1495
741A495j137k760j325K124K695K092m46k119k601j072J025K221J565J91l77j264
$$ 1495 358 -2402 -3727 -1603 1092 3184 2738 619 -1982 -3054 -2029 192 1757 1948 1571 307
757C07j715J234k103J470K080P32m71k753N06k81l04K92O18R60Q87J78k720O37
$$ 307 -1408 -174 -2277 -807 1273 2005 1534 -1219 -713 -994 -1298 -1006 -388 572 1459 1637 -1083 -446
775d46k350K412k23J200R28j039k47k299m33M94K959J265O62o17k876k537M57
$$ -446 -2796 -384 -607 593 1521 482 235 -2064 -2497 -2003 956 2221 2883 2266 -610 -3147 -2690
792b690P78M821K04Q74l515k498j975J360L376J789J754l191k286k190p51L025
$$ -2690 -1912 2909 3113 3987 472 -2026 -4001 -2641 735 2524 4278 1087 -1199 -3389 -4140 -1115
808a115K010M297p83l700l002k379J584K794L979R90k543k600j783n19J227L832
$$ -1115 895 5192 4409 709 -2293 -4672 -3088 -294 3685 4675 2132 -468 -2251 -2770 -1543 2289
824B289Q02p20o99m049Q59o40K332R10R24j214j559j96m02J479N64o19L34o64
$$ 2289 3091 2371 1672 -2377 -1518 -2158 174 1084 2008 794 -765 -961 -1363 116 680 61 395 -269
842b69P50n59m20R61k247K119j4J726n4j248r81j978J132j46K131J477r46k052
$$ -269 481 -78 -498 463 -1784 335 321 2047 1993 745 -236 -2214 -1082 -1228 903 2380 1434 -618
860f18j973M48O2K594K613L56j607l462k635R93K454K223K153j22l084l188j503
$$ -618 -2591 -2143 -2081 513 3126 3482 1875 -1587 -4222 -3229 -775 1448 3601 3479 395 -2793 -4296
877d296K266L948R75J140k098m431j921k80L581K989K422j635k555j980k720K640
$$ -4296 -2030 1918 2893 4033 1935 -2496 -4417 -4697 -1116 1873 4295 2660 105 -1875 -4595 -1955
893a955L104J851j154m38k048k695J892Q62K433n79P40k128k176P15L29K483p93
$$ -1955 1149 3000 1846 1408 -640 -3335 -1443 -581 1852 1273 2013 -115 -2291 -1576 -1247 1236 443
910D43K97j176J07o64K46N96J33j34J014n85J390Nj146j315k42J262M74J331r84
$$ 443 740 -436 -329 -993 -747 -151 -18 -152 862 277 1667 1672 526 -789 -1031 231 705 2036 1052
929A052Qk915j033K009K37J823R36O96l313k474k10L70M151R99J480k781l268
$$ 1052 1060 -1855 -2888 -879 -642 1181 2117 2813 -500 -2974 -3184 -2814 1337 2336 3816 1035 -2233
946b233q64M6L214K452K539l594k108j351j134K631K011J058M4l092k254j524
$$ -2233 -3097 -3051 163 2615 5154 1560 -548 -1899 -3033 -402 1609 2667 2711 -381 -2635 -4159
962d159K852J163K731K99k549J77l457J73K249J050K171k683l7k405R91l45K694
$$ -4159 -1307 -144 2587 2886 337 514 -2943 -2770 -521 529 2700 17 -20 -2425 -1434 -1779 915
979I15J590l047R71j239l55J051O53M63o33k74j153P23O60M08m71p36N53j278
$$ 915 2505 -542 429 -810 -1165 -114 539 1002 369 95 -1058 -335 325 733 262 -474 79 -1199
997a199K071j93L97o00j956J226j62L72R93P54m24k387j117M3L113R43q09K82
$$ -1199 872 679 1076 476 -1480 -254 -416 -44 949 1703 1279 -1108 -2225 -2182 931 1874 1065 1347
1015A347k701l64o10K442J211J793m2m277p28j183J932J787J171K089l171k698
$$ 1347 -1354 -1718 -2328 114 1325 3118 3076 -1201 -1929 -3112 -1180 607 1778 3867 696 -2002
1031b002j673J236K688P62J671k416q48l001R51K703J000J479j900n00j626l07
$$ -2002 -3675 -2439 249 1011 2682 266 -582 -3583 -2632 71 1071 2550 650 150 -1476 -1783
1047a783Q99P61K183j91j702r12o1J33N01K213k823N90J31j448J174L74P96j595
$$ -1783 -884 -123 2060 1869 167 -745 -806 -673 -172 2041 -782 -192 -61 -1509 -335 39 835 -760
1065g60P87j293Q83J082j94O51J24k002l35J374J73O12J094k593m69j55N09K092
$$ -760 27 -1266 -383 699 505 1156 1280 -722 -1057 317 490 1102 2196 -397 -866 -1021 -512 1580
1083A580m46M89j513o21j189O4K428K00J513k162k137N35P4J767P83J131j719
$$ 1580 1134 1623 110 -511 -1700 -1636 792 992 2505 343 -1794 -1259 -1185 582 1365 2496 777
1100G77j631j554N02J801J420P41o50j972q51r21P55K355J314k94k386J31j378
$$ 777 -854 -2408 -1906 -105 1315 2056 1406 -566 -1417 -2338 -1583 772 2086 1792 -594 -463 -1841
1117a841J582r06R45J246p15r43k212K404l97K894j535p56n34K32O2R54k82N02
$$ -1841 -259 -1165 -220 1026 311 -632 -2844 -440 -837 2057 522 -234 -768 -536 -474 480 198 700
1135G00j667P95j312Q84J691k67j38j527O41j64O32J319K67Q2l674K31n34J409
$$ 700 -967 -172 -1484 -600 1091 824 686 -841 -200 -364 268 1587 1854 1936 -1738 -1507 -2041 -632
1153f32J770N86k6k478r71J71R48P35J522M08p06k582m64R60N03J825J599l404
$$ -632 1138 1724 1698 -780 -1751 -1580 -632 103 1625 2033 1327 -1255 -1719 -759 -256 1569 3168 -236
1171b36P34k745K185J408k15J7q53l36j585J141k7J467K86j281J271j825K51K18
$$ -236 498 -2247 -62 1346 1131 1148 295 -41 -1626 -485 -512 955 1241 -40 1231 -594 -343 -125
1189a25L37L71k08j54j838J322J523r71R65j530n97J48N71J304m97j144q97M10
$$ -125 212 583 375 221 -1617 -295 1228 257 1222 -308 -905 -757 -186 1118 621 -523 -1420 -1010
1207a010j28Q29K069l70K48j771l71j354M88J673K418j833r51j211j343J674J243
$$ -1010 -1138 -309 1760 1390 1638 -133 -504 -1858 -1370 303 2721 888 -63 -1274 -2617 -943 300
1224C00J036L89o87j296j588j332K801J532J905j591r21j766k054K685M26J695
$$ 300 1336 1725 1038 -258 -1846 -3178 -377 1155 3060 1469 548 -1218 -3272 -587 -161 1534
1240A534q67n64n32k107J497N63J783J8p36j057j147Q11j297K455J239j010k91
$$ 1534 667 103 -429 -2536 -1039 -476 1307 1325 589 -468 -1615 -804 -2101 354 1593 583 292
1257B92j445J613m58n04O32J08J93q23Q73j017P55j1j857J581K28J367L9j274
$$ 292 -1153 460 2 -502 130 238 431 -392 481 -536 219 208 -1649 -68 160 1527 1566 292
1275B92o78j179Q54L80J025O68O55r82j947p11O54Q61R43K464k452j522l57j682
$$ 292 -386 -1565 -711 -331 694 1362 2017 1035 -912 -1623 -969 -108 835 3299 847 -675 -1032 -2714
1293b714J638J383K273L62k919j466m35J119P95J893L02j674j522j270l17J303
$$ -2714 -1076 307 2580 2942 23 -1443 -1878 -759 36 1929 2231 557 -965 -2235 -2552 -1249
1309a249J466K837r43j507k501K56k85K012K298m53J37m80k418j037j043L185
$$ -1249 217 3054 2111 604 -1897 -1641 -1926 86 2384 1931 2068 1588 -830 -1867 -2910 275
1325B75n27K207m71k496N10k453K523l78K638j993k43M62j050J170k068J852l36
$$ 275 -252 1955 1484 -1012 -502 -2955 -432 -810 1828 -165 -408 54 -996 174 -1894 -42 -378
1342c78J586N97k337K90j511Q13p67J991J152r7o52j376j095J426P74N25J331
$$ -378 1208 1805 -532 -242 -1753 -940 -1707 284 1436 1339 687 -689 -1784 -358 416 941 2272
1359B272n34j299k601L01N89K270R27J300k013k077j491Q06N17J843K185o57j295
$$ 2272 1738 439 -2162 -1861 -1272 998 1925 3225 1212 -865 -2356 -1550 -1033 810 2995 2338 1043
1376A043k541j296J129M50K889R09r20k610k767J930L25J637K256q24J79k971
$$ 1043 -1498 -2794 -1665 -1215 1674 2583 1663 -947 -3714 -1784 -1459 178 2434 1610 1789 -1182
1392a182j377L96K240J679J231j63k758j637p38J265J850k15K318j137j454k467
$$ -1182 -2559 -2163 77 1756 2987 2824 66 -1571 -2309 -1044 806 591 2909 1772 318 -2149
1408b149K64O38J297K405l54K35l339l09r24K413r3R47L4P78k888R13j953K142
$$ -2149 -1885 -1247 50 2455 2101 2336 -1003 -1312 -2236 177 84 1031 1065 1843 -1045 -132 -2085 57
1426E7KR09R00j759Q21k064K1j021K085J422L93Q3j573j433o57J450j86J984J134
$$ 57 59 968 1868 109 930 -1134 -1113 -2134 -49 1373 1766 1849 276 -1157 -1814 -364 -550 1434 2568
1445B568j232j356k293R6J287K313P50n79l17k884j001Q30J095L460j02j613j521
$$ 2568 1336 -20 -2313 -2217 -930 1383 2133 1554 1237 -1647 -2648 -1818 -723 2737 2635 1022 -499
1462d99j381j024J967J917J279J587k699k286j438l6K427K214O00J71k927j992
$$ -499 -1880 -2904 -937 980 2259 3846 1147 -1139 -2577 -2613 -186 2028 2628 2799 -128 -2120
1478b120q58J498J364L066j074j615j590p05l14J655J932Q64l60j167k849J241
$$ -2120 -2978 -1480 -116 2950 1876 261 -1329 -2034 -2348 -693 1239 2103 1743 576 -2273 -1032
1494a032P32N00J049o94J554k446k76j138O82O25J919K37j439Q1o13k09k99n15
$$ -1032 -300 200 1249 555 2109 -337 -613 -1751 -1069 -444 1475 1712 273 354 -259 -468 -767 -1282
1512a282J654j99J550k228N31j339Q5J50K127J386p63j083K37k037q5P72J627
$$ -1282 372 173 1723 -505 26 -1313 -1228 -1078 1049 2435 1672 589 826 -1211 -1296 -524 1103
1529A103J151p76m13l749M75q2L001Q58J247j156k731m18k388K890K590Q67L07
$$ 1103 2254 1478 1065 -2684 -2209 -2291 710 1568 2815 1659 -1072 -1490 -3878 -988 1602 2469 2776
1546B776l005j733p10P81J001L201K35j527j535k184N72J704R60J639n16j583
$$ 2776 -229 -1962 -2672 -1891 -890 2311 2546 1019 -516 -2700 -2128 -424 536 2175 1659 76
1562G6j132j645J295J362J963l39J346k662j690o10j43K767L93N60j446q62J23
$$ 76 -1056 -2701 -1406 -44 1919 1580 2926 264 -1426 -2036 -2179 588 981 1541 95 -767 -644
1579f44p64L73L71J796P34r50r17m48n82J67j0K010p56J849j783j221p94J562
$$ -644 -1408 -1035 -664 1132 1866 916 -1 -449 -1031 -864 -874 1136 380 2229 446 -775 -1569 -7
1597gq98J598J959j139j219j870m06q5J696K047M87o10j529k384L00N08K885M31
$$ -7 -905 693 2652 1513 294 -1576 -1982 -2067 -371 1676 2163 1553 24 -2360 -2060 -1552 1333 1764
1615A764K84j821j901k0j563L606K237J570k440k486j953n17K344J883J661m87
$$ 1764 2048 227 -1674 -1694 -3257 349 2586 4156 1716 -770 -2723 -3240 -896 987 2648 2161
1631B161j258j773j717j80J266L580J84k95k179r94j2K53J838Q69k2j746r77L36
$$ 2161 903 -870 -2587 -2767 -1501 2079 2263 1968 -211 -1205 -1217 -964 874 1743 1721 -25 -1002 -666
1649f66j57J393o85R29l90n28J46j088K96N64k24j7j099K950j966m35M59o52J385
$$ -666 -823 570 -115 814 424 -104 42 -1046 -750 -186 -410 -427 -1526 1424 -542 -977 -518 -1170 215
1668B15q88K742L1p32k203j064M56J39K330J936j706K64l465o29N21L087Q24Q80
$$ 215 -673 2069 2100 1368 -835 -1899 -1443 -1304 1026 2962 1256 1520 -1945 -2574 -2053 1034 1858 2738
1686B738j390l200j13L89R25K326J026o54k054j178j817J096K188J606r53l45
$$ 2738 1348 -1852 -1965 -1576 -651 1675 2701 2047 -7 -1185 -3002 -1906 282 1888 935 590
1702E90j403j928l39K030J826J454j713L68k530M87m55O29L476j061j334m49l11
$$ 590 -813 -2741 -3080 -1050 776 2230 517 885 -1645 -1158 -1613 -984 2492 1431 97 -352 -663
1719f63q21K2K637q84K7k45j292J27J471K88j139N71J26j37O25j302N65j531J653
$$ -663 -1484 -1462 1175 291 318 73 -1219 -1092 379 667 -472 99 225 88 713 -589 -24 -1555 98
1738I8J22O75J5r65R12k065o88Q23P52J960N09o70k213n41L51n54K977N39R20
$$ 98 220 895 910 -55 857 -1208 -1896 -1073 -321 1639 2148 1478 -735 -1276 -925 -1479 1498 2037 2957
1757B957k801j493k89L40J391J674n6p86j655j342M27L9K885J656n24k938j919
$$ 2957 156 -1337 -1626 -1286 105 1779 1723 937 -718 -2060 -1633 -1594 1291 2947 2423 -515 -2434
1774b434k09J291J978J249j48p56j691j603K231J34J801l96q17j116j711K024
$$ -2434 -2643 -1352 626 1875 1727 971 -720 -2323 -92 42 1843 1447 630 -486 -2197 -173
1790a73m02J130J65k35N1j119P29k52K98p70j95M68L29O97l50J037r25j244k18
$$ -173 -575 555 720 485 536 -583 146 -106 192 -578 -773 -305 24 721 371 1408 483 -761 -979
1809i79L6J707l90j014J530j949r2j100L543O71l70j323j369k35j473K466J735
$$ -979 -943 764 374 -640 890 -1059 -1151 -2251 1292 1963 1593 270 -1099 -1334 -2807 -341 1394
1826A394J169o87k895J24l2J075Q68J131q76j054j272m16r2L054K52n44l47j639
$$ 1394 2563 1876 -1019 -895 -927 148 1016 2147 1271 217 -1055 -1471 -1563 1491 1743 1199 852 -787
1844g87j359J310J438N28J57J23j95l339J021N28Q88J921j487l64j488n40R55
$$ -787 -2146 -836 602 1130 1287 1410 1215 -2124 -1103 -575 313 2234 747 383 -1105 -1645 -690
1861f90J235R22j621n33k34N74J072l77J630j555q39j121J709k21J179P32k113
$$ -690 545 1467 -154 -687 -921 -347 725 348 1978 423 -416 -1537 172 -49 1130 1862 -251
1878b51j817J668j153J734J771p65j146j446m58J109K050N90O90k253j813N25
$$ -251 -2068 -400 -1553 181 1952 1187 41 -1405 -1863 -754 1296 1886 2576 323 -1490 -965
1894i65p49K339N92J022j250r68j473m44P88K009J333k022p49q37p38J055K618
$$ -965 -1714 625 1217 2239 989 21 -1452 -1896 -1108 901 2234 212 -537 -1374 -2112 -1057 1561
1911A561K43q41n34r11r68O07Q43N22k98R6r85J36m2N03J520p01p06K73j394J956
$$ 1561 1804 963 429 -482 -1450 -843 0 522 224 320 -665 -529 -571 -68 1452 751 45 318 -1076 880
1931H80j317J410j080l92P86j182K001j78K79j183k870J688q59K620O54N77j064
$$ 880 -437 973 -107 -499 287 -895 1106 928 1207 24 -2846 -1158 -2017 603 1257 1834 770
1948G70j645j096Q54J367J345P49r13k585L6j446J840K327J76K84k341j503j097
$$ 770 -875 -1971 -1117 250 1595 2344 1431 -1154 -1118 -2564 -724 1603 1779 2063 -278 -1781 -2878
1965b878K396J659M13P20k489j278r42J515J67K145R03j567j548j411J499L70
$$ -2878 -482 1177 1590 2310 -179 -1457 -2399 -884 -717 1428 2331 764 -784 -2195 -696 -326
1981c26J181J307o31j893l97Q8O39K99J566p54j432o71J427n29k13J462j839R93
$$ -326 855 2162 1531 -362 -759 -671 -32 267 1833 1079 -353 -1024 403 -126 -339 1123 -716 277
1999B77l60J27Q25j402N17j376J498L31l58R66J75j08j499k18j160J736J411L58
$$ 277 -83 44 869 -533 -16 -1392 106 437 79 1045 1220 1112 -387 -605 -1765 -29 1382 1740
2017A740k29k796J07k38J260K553j19o5k007k476M53M50J641J472J154l500p59
$$ 1740 1511 -1285 -1178 -1416 -156 2397 2278 2213 206 -2270 -1817 -1367 274 1746 2900 -600 -1359
2034a359j627L25L063K74L286k054k400j830j31K612J112P60l02j286k697n69
$$ -1359 -2986 -2661 402 676 3962 1908 -492 -2322 -2453 159 1271 2031 1729 443 -2254 -2823
2050b823J208P53K372N85k269N74k023O59K7R81P49P30k617R27J62j033J769l00
$$ -2823 -1615 -862 1510 2095 -174 400 -1623 -964 -937 44 793 1523 -1094 -167 -5 -1038 731 431
2068D31J73n19k76l81j0M95O09m40K16k87P61p48j70j072J28K361o75R94o09l16
$$ 431 604 85 -191 -572 -582 -87 522 82 298 11 772 24 -146 -1218 -1090 1271 596 1590 981 665
2088F65m55j887m7J469J801P79o50k119r11o36K55K619O51M44j047j088j615o22
$$ 665 210 -1677 -1724 -255 1546 2325 1675 -444 -1355 -1991 -1736 883 1534 1978 931 -157 -1772 -2394
2106b394K356J322J391q11k850J76k679K541J455J558n79j240j626k398J965R27
$$ -2394 -38 1284 2675 1864 -986 -810 -3489 -948 507 2065 1486 246 -1380 -3778 -1813 -886
2122h86J734J698j600O11l174Lp38K816J104k92J77k628K73m05l41K635Q67m54
$$ -886 848 2546 946 1557 -1617 -1614 -2352 464 1568 1276 1453 -1175 -902 -1307 -1648 987 1854 1400
2140A400q46p70j509L41J012N4J989j234q1Q7k056O80q6L60J656L00n53j013M10
$$ 1400 554 -216 -1725 -1384 -372 -318 1671 437 356 443 -1613 -933 -1019 -659 997 1297 744 -269 141
2159A41j337P59J53P05L60Oo75j829N65j96K712R0K70P4k675j005j5K243P64J332
$$ 141 -1196 -437 -284 421 781 787 112 -1717 -1152 -1348 1364 1454 1724 1798 -877 -1882 -1897 346 1110 2442
2179B442j052r83k069p16q8K098K211M07j337q04k439q24K199J385J878j724J567
$$ 2442 1390 407 -1662 -2378 -2466 -368 1843 2250 913 109 -2330 -3154 -955 430 2308 584 2151
2196B151l289j564K006j93K767o9m24k572j98k58n60J973J395J99r73j096R5l99
$$ 2151 -1138 -2702 -696 -889 1878 1809 1385 -1187 -1385 -1643 -2203 -230 1165 1364 391 -705 -610 -1009
2214a009N11J446l35M69l19j004n05k83l15n1J707R22o80j355M09k457K853N19
$$ -1009 -498 948 613 1082 763 -241 -746 -1029 -1344 -1395 312 1234 554 -801 -392 -2849 4 523
2232E23n3P88k482m4J092j245J543j053K406J24j244j750M01N21o65K555M63l16
$$ 523 470 1258 -1224 -1268 -176 -1421 122 -931 1475 1599 355 -1395 -994 -473 -1138 1417 1880 1564
2250A564r36j860p03N71N65K097J641o78j531j298k045J427J852J335j396o7j435
$$ 1564 628 -1232 -1935 -1364 -799 1298 2939 2261 730 -568 -2613 -1186 666 2001 605 538 -897
2267h97j134J577m4J601k63k6ok664J322k229K877J692R8O76j950j768o28J065
$$ -897 -2031 -454 -498 1103 840 814 808 -1856 -534 -2763 114 1806 1904 2580 630 -1138 -1766 -701
2285g01J491o1J307q91j132k466N57N15J213O46J173j321q07j351M33K21J731
$$ -701 790 729 2036 1145 13 -2453 -1896 -1381 -168 478 1651 330 -477 -1828 -1395 -1174 557
2302E57J345K80j836j587K04o16K102q1Q68M08j847k50j394O34J77J574N80L8
$$ 557 1902 2182 346 -1241 -1037 -1653 449 368 1236 1644 -203 -453 -1847 -1213 -1036 538 1118 1156
2320A156m95j240p37M95J888Q91j542O66j497j384K18K26K297j801L137k086m93
$$ 1156 661 -579 -1316 -821 1067 1958 416 1082 -415 -1799 -1581 -1355 942 -859 2278 192 -301
2337c01j34j946K917O10M01M59j656j393j098o34K508J052p3J683k085j310J16
$$ -301 -435 -2381 536 1146 1547 2006 350 -1043 -2141 -2775 -267 785 712 2395 310 -1000 -884
2354h84q86K073R94q0M17j813m59l03R10O87J331r0j198q7k617J00J028J671J358
$$ -884 -1770 303 1297 1217 1634 -179 -638 -941 -31 656 1987 1897 699 612 -2005 -1905 -877 794 2152
2373B152j042k59k079j423J614J228J089p20J716j659j044k17j184K246O36J21
$$ 2152 1110 851 -1228 -2651 -1037 191 1280 560 2276 617 -427 -644 -1828 418 1054 1175
2389A175j966Q42m99O70j161N22J477P51m71j518k9j455J426n91J802J01k91m68
$$ 1175 -791 51 -448 222 -939 -417 1060 1811 1340 -178 -207 -1662 -236 -827 975 1076 785 317
2407C17j170o42J126k91K890p17K48k141k163J428o24K360J813k192L5j254l03
$$ 317 -853 -1495 -369 -660 2230 1513 1761 -380 -2543 -1115 -1739 621 2434 242 277 -977 -1280
2424a280M60J537j75J577J5k424j259M30J088l25J897M4k25j722j213O64J283
$$ -1280 -820 717 542 2119 2134 -290 -1549 -1119 -31 -356 1541 1585 1360 -362 -1575 -911 372
2441C72n18K530k688L59j063K35L5L31J484m43l82j074j489J472J31J239O64p65
$$ 372 -146 2384 -304 55 -1008 -773 -738 -407 1077 634 252 -822 -2311 -839 -708 531 1195 430
2459D30J66j299j11J4P41p27R80n15M31J327j915O45q27o6K81M40P47O28j383
$$ 430 596 -703 -814 -800 -59 -786 194 -321 110 1437 -478 167 -660 -726 -445 -5 742 1370 -13
2478a3J62j418K003o74K004j825J327j948j383P44K48L108j096p5j079r96r48
$$ -13 149 -1269 734 60 2064 239 1566 -382 -1765 -1021 -773 2335 1239 1164 85 -911 -1859
2495a859Q22J460K5Q65o10j462o1j053J746M39J489q68o65o12k101K101p1J324
$$ -1859 -1037 423 448 1313 703 -759 -820 -1873 -127 312 1801 933 268 -344 -2445 -344 -415 909
2513I09R63k827R88j672J191k02J966m42o08L96j258k36R59J221j289k22J62j077
$$ 909 1872 -955 33 -1639 -448 -650 1316 874 266 662 -596 -832 127 1348 59 -163 -1 -1078
2531a078l09N38J601j568j12P02p68J248q88J934n98j059j372J172J56P47o22
$$ -1078 -1387 -849 752 -816 -928 -226 -994 254 -634 1300 702 -357 -1729 -557 -401 346 -276
2548b76P35j884J692j296K54J900kk46j657m73K77Q18P96O92K47k404J190k869
$$ -276 459 -1425 267 -1029 -775 1125 1123 877 -780 -1253 -976 -158 638 1330 1577 -827 363 -2506
2566b506Q58J725J316N94q45j780j833K626M15P03P06k138k10n1L54p67R68J068
$$ -2506 -1648 77 1393 1987 1142 -638 -2471 155 570 1273 1979 -159 -369 -420 -66 -833 135 1203
2584A203p65k33j455O93J032p3J246k307j46l06J560k69R41K80p23r31q26m13
$$ 1203 438 205 -1250 -557 475 402 1648 -659 -805 -1111 449 180 1121 1401 678 -253 -1079 -1492
2602a492J343R9J858k270O46k356R05J327J32L76j917N73K00j173K062M98O76
$$ -1492 -149 -50 1808 -462 184 -2172 -1267 60 192 568 -1349 -776 -576 -1749 313 811 1487
2619A487j108k639J583j491J894R40J660j205j514m39K05L11R73K398k269n88
$$ 1487 379 -2260 -677 -2168 -274 666 2326 1121 -393 -832 -627 -316 657 3055 786 198
2635A98j529j01J881l18J200l48j555m70j682K397Q24P83J52j579j40n55N03Q22
$$ 198 -1331 -1432 449 131 1331 983 -572 -1042 -2724 -327 497 1280 1432 -147 -287 -842 -339 483
2653D83L43N75r88l69j060O12L15J235j466J19K45j516Q59R75k49K20j11j366
$$ 483 826 1401 413 44 -1016 -404 -89 1146 -320 -201 44 -1472 -613 362 113 333 222 -1144
2671a144M58J91K282j62p91j223j022L14J890J29M96l8j844m79q05J675Q38m26
$$ -1144 -686 -495 1787 1625 834 -389 -1411 -1097 793 922 1418 1380 -464 -943 -1748 -73 765 339
2689C39M53j722K9j310J741J816q27K327l252m50j779J487J122R70N56j641j000
$$ 339 792 -930 -901 -2211 -470 1346 519 2846 -406 -856 -2635 -1148 -26 944 1500 -141 -1141
2706a141r87O34J639N70K000j511j490j416J66J692P34O81m58j302j151J508l61
$$ -1141 -2128 -1494 145 715 2715 1204 -286 -1702 -1536 156 890 1571 1113 -189 -1340 168 -193
2723a93j44L41P49j251l91l04P72K84q7J192j111J021j930P72M58M60j413J713
$$ -193 -337 4 753 -498 -889 -1193 -421 -137 -224 968 -143 878 -1052 -280 178 638 -775 938
2741I38j402%J457PK39j028n5j606J435Q83k99K38j995M04l47l94L875o96k91
$$ 938 -464 -464 993 1000 1239 211 156 -1450 -15 868 569 807 -1188 -784 -1131 -1525 2350 1654 1363
2760A363j176q40J87p54J369P72O79j214q81j474L03J404R64J426j073j697j316
$$ 1363 187 -653 -466 -1220 149 921 1600 386 -495 -1969 -1666 -262 702 2128 1055 -642 -1958
2777a958k22J945K198J64m47l084M84q00Q90Q77K093M13j133k900n58K96J051
$$ -1958 -2180 -235 1963 2127 1680 -1404 -920 -1720 -830 47 2140 2553 1420 -1480 -2038 -1742 -691
2794f91J797L74k038R81j909P76M06J532K99j170n09j123J310j633J863M29L60
$$ -691 1106 1480 -558 423 -1486 -710 -304 1228 1527 357 -152 -1275 35 -1598 265 694 1054
2811A054r43K05r21L23N22j1m19k78m78J943l90N33j747q32O95q4J497L54L26
$$ 1054 111 316 -605 -282 240 229 -190 -468 -946 997 607 1140 -607 -1439 -744 -828 669 1023 1349
2830A349o04j919o32N43J100K659j335J59k054k44j596R08K704J594j144j896
$$ 1349 745 -1174 -1806 -1263 -163 2496 1161 1320 -734 -978 -2574 -1666 1038 2632 1488 -408
2846d08j462q95J212J851J551J230k401k120j731J074J778J485K194j153k405
$$ -408 -1870 -2765 -1553 298 1849 3079 678 -1442 -3173 -2099 -321 1164 3358 2205 -200
2861b00j574l28R97K195J420j972M38k373m13J019P44J448q75Q56k176Q7k50P2
$$ -200 -1774 -2102 -1105 1090 2510 538 976 -1397 -1810 -791 -47 1401 526 1382 -794 -707 -957 -885
2879h85P13J675n87K83k128J156j258M96J15O70P41j730J688j223K21o56J89O75
$$ -885 -172 1503 916 1199 -929 227 -1031 -535 -420 250 991 -739 949 -274 -53 -709 -520 155
2897A55M91O69j216P82j043k313J687J014J321J050m20l519J63l97K26J763J354
$$ 155 646 1315 99 881 -162 -2475 -788 226 1547 2597 2177 -1342 -1179 -1576 -1350 413 1767
2914A767M35k788J35j938J697Q64J256J385j030l896P27o93O68K681J219k58k035
$$ 1767 2202 -586 -451 -2389 -692 172 1428 2813 1783 -2113 -1386 -2079 -1411 1270 2489 2231 196
2931A96j389j352J392J224J053J36K50p89l340J725N8K634J83j385l71j223L80
$$ 196 -1193 -2545 -1153 71 1124 1260 1510 721 -2619 -894 -836 1798 1981 596 225 -998 -618
2948f18k96L39R04R60q27q03j80j144J780J164l10M67q28n56J5J43n54o11J163
$$ -618 -914 -575 329 1289 462 -341 -521 -1665 115 1279 969 1436 608 52 67 210 -344 -955 208
2967B08m86J251j720N45j021l07J718q03K079o85N65j791j208Q10K36J483R89
$$ 208 -278 973 -747 -202 -1223 -1530 188 -615 1464 779 1344 -447 -1655 -845 -609 874 1863
2984A863N11k036k029m89l40K759J413Kn23j497j319J55O46J796P30Q69k360j097
$$ 1863 2374 338 -1691 -2180 -2520 239 1652 1654 1131 -366 -1685 -1530 -884 912 1642 2511 151 -946
3002i46j951R12J963P2K652k248J25l097J240O17J077Q94m55m92p13j171Q17M50
$$ -946 -2897 -1985 -22 50 2702 454 579 -2518 -1278 -661 416 1310 855 363 -350 -1521 -704 -254
3020b54O77J7P61m75r02j351r9K810p15M66m59N8m09o28J35m86k83J548L52N95
$$ -254 423 440 1201 726 -176 -1527 -1626 1184 469 935 476 534 125 -503 -368 -854 -1137 411 763 1358
3040A358k767Q83p49O05J646o95O34m52m84o93j823K238p4K362j305J16r62j559
$$ 1358 -1409 -526 -1275 -670 976 281 915 463 -21 -714 -2537 -299 -373 1989 684 800 -162 -1721
3058a721J713r51J671L07K047k077k945J047m28J768m03J797r58l82k321p25J671
$$ -1721 -8 -959 712 1019 3066 989 -1956 -909 -1337 431 28 1825 867 485 -1836 -2561 -890
3075h90K69L283j660M7k072j340N47J684K176Kj797P4j581M08M38k04K149j92
$$ -890 -621 2662 1002 1049 -1023 -2363 -1816 -132 2044 2046 249 323 -1258 -850 -412 -616 1533 1341
3093A341j92k433R01p56J575O7o17R99j298P35j546J63J703o10P63r41j35K22
$$ 1341 1149 -1284 -383 -1139 436 503 -114 885 -413 322 -1224 -1061 642 32 795 -146 -281 -59
3111e9j139R47K71P99ql49j14q27p62o97J490k89J389n40L67l14p68o1J92J064
$$ -59 -1198 -251 20 819 811 462 348 -479 -1241 -1938 -448 -737 652 112 479 165 -603 -664 -472 592
3131E92J599k532J092q18o43j231J569J701k86j83j566k35n41R4K065n99R27p51
$$ 592 2191 -341 751 -67 -710 -1941 -372 1329 1043 860 -706 -941 -1482 -1388 677 78 1005 254
3149B54r34l32j42J136K86Q11o62n12p84r5Q13M99J201j091O9q43l18R94j660
$$ 254 -680 -1012 -1154 -18 268 1079 417 -95 -879 -974 -161 338 1539 448 517 -326 -644 350 -1310
3168a310J998J291j441O6k084j49J440L12N2J284m5j210j064M09M52k78J152p06
$$ -1310 688 1979 538 604 -1480 -1629 -189 123 175 1459 1414 204 -860 -451 1 -277 875 169
3186A69L56n83j203K147k037J127N5K41J104k683J419q33J149o87p89K667n51
$$ 169 525 -58 -1261 886 -1151 -24 31 272 1376 -1307 112 -721 428 -259 -1048 1619 1068
3203A068k61j154P74j704N55N26L21N06r19K54p66J7L94n70J008J20P66j488M2
$$ 1068 807 -347 427 -1277 -722 -196 125 631 -288 -34 -800 -783 -389 -959 49 169 935 -553 -511
3222e11O0O51j34N26K4r93o85m33P25J530O15r87n1m63m76l57M52J578r0m91l99
$$ -511 -451 200 66 592 616 -377 -1062 -1495 -770 760 1375 388 337 -126 -602 -959 -507 1071 981 490 91
3243I1p55m27J526m20J012M02k378J357q56l1L2Q37J669j753o9j865N43Q65K09
$$ 91 -664 -1091 435 15 1027 1429 -949 408 -448 -479 -447 390 2059 306 237 -1628 -1085 -220 -11
3262a1J270j739J49n21j09J499o63M6q65J169O6n91P11j18N65j002J68n61N5K402
$$ -11 1259 -480 -331 -852 -961 538 -125 -79 -944 225 291 -300 411 293 858 -144 24 -537 -482 1920
3282A920j935O61k37o72M23o23P54L10n10j05r47N39J16M11J98K87o56k81o76
$$ 1920 -15 646 409 -263 160 -463 291 601 91 -14 -961 -422 -306 105 303 590 -66 -347 -1023
3301a023J331J11Q70O22j563r14j69N8J087k98L5L89m47o44j110K094O80L82j429
$$ -1023 308 419 1289 1911 348 -566 -735 -677 410 112 147 536 89 -555 -1665 429 1109 1491 62
3320F2J213k364n84J567L77p5k93m43M67p90R83J056p23K48j57j556j02N80N02
$$ 62 1275 -1089 -1673 -106 271 196 -97 -540 -73 -863 120 1176 453 701 544 -1012 -1114 -534 -32
3339c2k1J525l050Q96m00O69j52J026q91n81J112r55J645j157J726Q9k632J033
$$ -32 -53 1472 -1578 -682 -1082 -413 -565 461 -430 -1011 101 -854 791 -366 1360 1449 -1183 -150
3357a50l77J165n42J083k79j530j49r87K234O45r10R45j245Q5j117K4J835O88
$$ -150 -527 638 96 1179 900 -630 -779 -1766 468 1113 203 1148 -97 -12 -1129 -1105 730 1418
3375A418l18o05q71p77J602K24J093r74n41j801r2M56L65J567Q0n35M2j846J044
$$ 1418 1100 495 -376 -1153 449 673 1766 792 251 -1550 -1642 -1186 -821 746 826 291 333 -1513 -469
3394d69j87O32J723k214Q87p08O8r1M69J307j584L97k28j130K697j031m70k6k70
$$ -469 -656 -24 1699 -515 372 -336 -268 -359 110 1417 -167 230 2 -1128 1569 538 68 42 -228
3413b28q52J142P54PJ100j891r30l01L57J119Q95l43q94j118O69Q38j79J477r1
$$ -228 -1080 62 816 823 1923 32 -898 -1199 -842 277 1172 829 -65 -1183 -514 324 145 1622 1531
3432A531j418j012K30r46J684O10J416j905r23l61p95J898K17J956j033j584m90
$$ 1531 113 -899 -669 -1615 69 679 2095 190 -733 -1094 -1889 9 226 2182 1149 -435 -925
3449i25j74J360P2J850j407K07j346j045J018m99J902K46o54q88j539J026R9K076
$$ -925 -1099 261 333 2183 776 983 -363 -1408 -390 -889 1013 1259 605 -283 -1822 -796 -697 1379
3467A379p77m08j41j465Q35m24Q95K63n4L03o74p31O33k26M64r21J341j029J655
$$ 1379 602 194 53 -1412 -577 -1001 -106 157 103 406 -268 -999 -366 -592 -128 -1049 292 -737 918
3486I18J1o65j272l11J153p24K102q91J388q03j537k39P97P01K26j86m49j679
$$ 918 929 264 -1008 -1319 -166 -890 1212 321 1709 906 -631 -870 -73 628 854 668 219 -1460
3504a460Q85n87J099M82J175k12j817n69n21N89J758P80k29j436K10k753J646
$$ -1460 -575 -1162 -63 419 1594 1382 -435 -1004 -1525 -936 822 1602 1373 -63 147 -2606 -960
3521i60O67J175J785j158k466j168L13J007J567J449j758M56k363p29K231l6J436
$$ -960 -293 882 2667 1509 -957 -2125 -1812 -805 762 2211 453 909 -1454 -2183 48 12 1448
3538A448O1r48j658o47L28J243J517j103K27r00m63L44n11K536j875O09m59k20
$$ 1448 1509 561 -1097 -1744 -1416 -173 1344 241 468 -432 -895 -551 -1062 1474 -401 208 -251 -471
3556d71J386q36O66j767J412j168J371n3J205M73l679R67j201J530K592j758O34
$$ -471 915 79 745 -1022 390 -778 593 540 1745 2218 -1461 -494 -1695 -165 2427 669 1303
3573A303j481k7r92J878m77P03M49q39j152o87L69Q02J366J812k478j605j358
$$ 1303 -178 -205 -1197 681 204 907 1356 517 -635 -1322 -953 -151 1215 3027 549 -1056 -2414
3590b414k24J729K234J160k34l407j312o34K044J255J414J6p20j546p41N69J316
$$ -2414 -2638 -909 1325 2485 2251 -1156 -2468 -3102 -1058 197 1611 1627 907 -639 -1380 -811 505
3607E05P61j28K89j072j641J047j179J970O58n87o74p56L41p47J552M02p53N50
$$ 505 1266 1138 1427 355 -1286 -239 -1418 552 1210 623 -51 -807 -466 -1213 339 741 -12 538
3625E38o42N36m38j009O88P56J0j086J213p36Q83p26o99k87O29Q34P75j93j963
$$ 538 -104 432 -6 -1015 -327 429 439 -647 566 -170 713 -13 -712 -999 -370 464 1239 1046 -917
3644i17m82M3J007J415K56J210q08k877j041J348K104%J455p54j774j037j458
$$ -917 -1399 -1356 -349 1066 1322 2532 1724 -1153 -2194 -846 1258 1258 2713 1959 185 -852 -2310
3661b310Q23K064P85P33j782q09j724N32K256J740p38j667J45k239J196J189O37
$$ -2310 -1487 577 1362 2095 313 -496 -2220 -1688 568 2308 1570 -97 48 -2191 -995 194 831
3678H31J060j285M15k719L33O70k94J736k8j6j987P35j92J7J637q49J064p22L15
$$ 831 1891 606 1021 -1698 -1365 -695 -989 747 719 703 -1284 -549 -741 -724 913 64 1128 406 721
3697G21j360O07j87k77O08J289k068K126j368r38r63K236o59L71J496j073R9k255
$$ 721 -639 -32 -219 -496 112 1401 -667 1459 91 -847 -1810 426 -233 138 1634 561 660 -1595
3715a595Q42q98J916J221k62K23j900n29j292J911J552j03J455k082j423p46j2
$$ -1595 -753 -1651 265 1486 1224 1447 -453 -982 -2274 -363 1189 1086 2541 459 -964 -1710 -1722
3732a722K828k57Q43j021j833j235j86K567L92K028o75k302r19j030K044R55K418
$$ -1722 1106 849 1692 671 -1162 -2397 -2583 -16 376 2404 1729 -573 -1492 -2522 -478 477 2895
3749B895l35k351j117j191J231k2K330j66l35j274j623J274L82J205K60n76n24
$$ 2895 2560 209 -908 -2099 -868 -890 1440 1274 939 -335 -1958 -684 -302 903 1163 587 63
3766F3j066O49K91o24O53n77r2J317O98j540o8K9m44J303p05N78O47l02l95j635
$$ 63 -1003 -354 -63 -687 -34 -611 -703 614 1312 -228 -296 -267 -711 592 -113 465 1112 810 415 -1220
3786a220P44J52K002J36j087o13o22m60m70K605m04O01q24j543r30R48o0K240
$$ -1220 -476 -324 1678 1814 727 114 -508 -968 -1438 1167 763 1364 540 -1003 -1933 -985 -1045 1195
3804A195J32R90k928n05j405K105J343L46J267k447j99r13j58J393J576Q61k796
$$ 1195 1327 2317 -611 -1116 -2521 -416 927 1273 2540 93 -106 -1019 -1177 216 1792 2653 -143
3821a43r4j734J01N43J085K077O9j502k787J607n49J713L76n94J018j215m03o45
$$ -143 -237 -1971 -1870 -1327 -242 1835 1904 402 -2385 -778 -1327 386 762 168 1186 -29 -432 -1077
3839a077K63J988r32M66j558K31P88j110J745j344J415l81J55O93j079n21n67
$$ -1077 -814 1174 242 708 -850 -619 169 -941 804 -540 875 494 649 1342 263 -258 -825
3856h25J089j78j504K398p6J179k112p06j94J89K72J011M98j747j07q45J182J071
$$ -825 264 86 -1418 980 904 2083 -29 -735 -929 -740 -468 543 1041 -706 -813 -1658 -476 595
3874E95j018K568k036q08o79l61J924N73J707k731q69J91p52J481P14P59l85p15
$$ 595 -423 2145 109 -699 -1378 -1739 185 758 2465 -266 -1135 -944 -1696 -215 499 1258 873 158
3892A58q09j867J935j6K011j08j145p45k82M9O69J172Q72o88j605n22J404n75
$$ 158 -651 -2518 -583 -599 1412 1304 159 -586 -868 -819 -150 1022 1894 1206 -399 -921 483 -92
3910i2J118Q56r23j531l99r9J21J296J39J6r01m37P84q06R05L19r97Q20j291J612
$$ -92 1026 1882 959 -572 -971 -1070 -949 347 486 502 -399 -836 -52 -858 47 366 -631 189 -1102 510
3930E10j098Q79j99M42j152J15K49J212q04N25j811Q25l41O52P41M5r18j206J434
$$ 510 -588 291 92 534 -618 -503 -254 958 154 679 -1132 -307 -648 4 745 790 -128 -1334 100
3949A00j718R44O51K57J678j249j544O42l63M25P1Q07o18M13k519J339O85M53
$$ 100 -1618 -674 -23 234 1912 663 -881 -239 -602 -177 -106 701 83 496 -2023 -684 1 454
3967D54Q64j883R97j047J80o95J447P87j475o82P1O85r78J442n99K34P53j658
$$ 454 1318 -565 432 -615 -435 -1130 317 1104 -371 -1053 -982 -297 -1275 167 -432 -198 555 -1103
3985a103J591Q9j30Q6q16J214j698L90m2N74J754j869J38j320J666l45j134J733
$$ -1103 488 577 447 533 -283 931 -767 -377 -419 155 1909 40 178 -1142 524 179 -955 778
4003G78l37n11n5M88N03j270J42K80J128j551n45N47J37K68L09p23l7j416J945
$$ 778 441 -70 -125 363 866 -404 -262 18 1146 -405 -950 -403 -266 2 311 -412 -449 -1865 80
4022H0K81m23O11n64j067J84R54P67N8r66Q59r36k73o2M11J011q98K422l491M26
$$ 80 361 -62 549 -15 -1082 -898 56 823 881 -85 774 -162 -435 -497 -86 925 27 2449 -1042 -616
4042f16O90k03p8K37N6o52q9J451j917K141K59k172J485j109J485j921L63M57
$$ -616 74 -129 -207 30 86 -566 -655 796 -1121 1020 1279 -893 592 -517 968 -953 -590 -133
4060a33M40O01j886O98N16o08J122m70O93j920P63J100j090J15J0n30l15J725
$$ -133 307 908 -978 -280 236 -372 750 280 973 -947 -184 916 -174 -59 -49 -579 -894 831
4078H31q90M25M73o91j157n9J181k058L177l7j742J233o39M38o67J04J086m20
$$ 831 -59 366 839 148 -1009 -1068 113 -1945 1232 1195 -547 686 47 485 -182 -78 1008 588
4096E88M6j882R12l11N75J404q44k70l55P6r22O94Q82q70N12q12J562j054j254
$$ 588 634 -1248 -336 -647 -72 1332 488 218 -137 -61 -983 -289 593 -277 235 -577 985 -69 -1323
4115a323K10J323J361j339l91M80j459J109K07P3j65N93J10j161P33o21M93M6
$$ -1323 -1113 210 1571 232 -159 321 -1138 -29 178 251 86 679 789 -372 361 -260 233 279
4133B79n06R06N50j075o13O86K03K12j76K03m89k00n41m28R5P40m04N92N04K26
$$ 279 -227 679 1229 154 -459 227 430 642 466 669 180 -20 -561 -989 -894 -154 -558 34 538 764
4153G64j013j8Q68j65J249j60r87j031o75P24k04L09M88J84l65l30J10p20J667
$$ 764 -249 -267 601 436 1685 1525 538 -493 -1168 -444 -648 -339 149 333 -32 -362 -252 -972 695
4172F95m65J082k29m95j682m76K240L98k16j13m23q01n78N46J022J721j330o45
$$ 695 230 1312 1083 588 -1094 -1570 670 1068 852 739 316 -485 -1063 -517 505 2226 896 251
4190B51n3j700J886k58l09J680j173k91j095N7k69J261K030j674N3n10j19l84
$$ 251 198 -1502 384 126 -183 1497 324 33 -1062 -1005 -1274 -13 2017 343 396 -114 -233 -617
4208f17J305q90Q13M45p65M42j389R7J169j411Q83m96M65j30r4On65P99L00M41
$$ -617 688 -202 611 1056 291 733 -656 -559 610 -801 82 -414 51 -79 -173 -167 -732 67 367 808
4228H08j64l05j99j440Q87j004K073M73n17l40j033L7l37J619R31L52n99k048
$$ 808 644 339 140 -1300 -413 -1417 656 1129 612 272 -761 -724 -1061 558 1489 1841 1242 -806
4246h06n37l58R82J273o8J900k059j078j844J840M16K532j8k400n79n58l09J343
$$ -806 -1343 -1701 -719 554 486 2386 327 -751 -2595 -755 -339 2193 2175 -225 -804 -1362 -1671 -328
4264c28O00J760j744Q73j352j036N39P02J185k13o27l26j9P4q99J058P11j81p3
$$ -328 272 2032 288 1161 -191 -1227 -688 14 1199 986 359 33 14 88 -811 247 958 777 704
4283G04p19L99n7p95o52J844M4n05M1j122P41m17l75R72K88K84k036J620q58l68
$$ 704 -15 384 327 -468 -1120 724 768 263 304 -818 -77 -494 -869 103 391 675 -1361 259 -599 -967
4303i67P36k62J927Q31k287p49j14j51K26J863m53R3m04j698m37O03K364m88J176
$$ -967 -231 -493 1434 2265 -22 -771 -885 -1036 -810 1053 600 693 289 -1409 -1846 -1243 1121 633 1809
4322A809p84k535O33j521J808J347J666k107j75j581q52J302J247J567P9j957
$$ 1809 1025 -1510 -877 -2398 -590 757 2423 316 141 -1440 -2292 -990 257 1824 1903 -54
4338e4n61r50O68o42J155J973l42j002j060J0K24O54L37J568j362l3m35p12J96
$$ -54 -615 -1565 -897 -1539 -384 1589 1247 245 -815 -805 -581 73 410 1978 616 583 148 -564 -368
4357c68Q35N29m17r65j26M73L29mp47J172j340L99L68L41l34j987Q15J181R20
$$ -368 467 996 579 -386 -512 -39 290 286 -461 711 -629 -230 138 479 145 -1842 -1027 154 1074
4376A074m67L82q84q46J23n07J799N48m09K87j838n16r61K008J410r0K67j516
$$ 1074 607 989 105 -741 -618 -1125 674 1222 813 1100 -738 -1254 -2215 -207 1203 1113 1380 -136
4394a36m63j041L93J770R87J131j536j583j443m89K095L04J948k133k06j183N3
$$ -136 -599 -1640 -1247 523 1510 2641 1105 -478 -1921 -2410 -315 -11 1937 -196 -402 -1585 -1532
4411a532K23J741J802p95j241n39J70n52O77O52Q40r08j847L65l87J681Q58j31
$$ -1532 -1309 432 2234 1439 198 -341 -171 -723 -46 606 1446 538 -1309 -944 -1331 350 1208 1077
4429A077o49n90j250J187J12L57M94j915J760N98q14L3o2p8K1k126J811O84j436
$$ 1077 428 -162 -1412 -225 -113 244 738 -1177 583 1181 367 400 338 260 281 -1845 -34 650 -786
4448g86J411k02p72Q9k39J359P7M63k250J09p50M90K133J707o40j054k423K70
$$ -786 625 423 -349 -260 -499 860 937 1400 -850 -741 -1491 -1001 1132 2839 2199 1145 -1278 -1008
4466a008k46N19K418O31j192j942q25o71K622O17N54m08q09l22j683N06J995J293
$$ -1008 -1254 -735 1683 2314 1122 -820 -1645 -2316 306 923 1477 1069 260 -62 -1745 -1239 756 2049
4484B049P89l194n88j670R83J795M51J537j318P7k442J338j66K61J710J93q64
$$ 2049 2838 -356 -944 -2614 -1631 164 615 2152 834 911 -1531 -193 -359 -98 1612 1805 941
4501I41k239J042k11Q61K502k207p16j070M97R69l51L34p19O76q67J525j327J431
$$ 941 -1298 -256 -467 394 2896 689 -27 -1097 -600 369 18 352 -367 309 -558 967 -360 1071
4519A071N4j619J097n21l93M26J408j245j563J061j596K631j7K16j335q22q48
$$ 1071 1125 -494 603 82 -311 115 1523 278 -1285 -224 -1820 811 794 1010 -325 -1147 -1995
4536a995Q80R93O07K0R26k266p57n75P42K270j71K193l688M2o59j85J268J998
$$ -1995 -1115 -122 485 505 1431 -835 -1592 -2167 -1425 845 674 2867 -821 -779 -1438 -1623 -355 1643
4554A643R02k158p17n13mm69J856R59n28q75j545q28J658Q86J215o94r62r29n24
$$ 1643 2545 387 -330 -843 -847 -1316 540 1499 971 96 -1449 -2277 -619 267 1482 788 -174 -1103 -1627
4573a627J252o0J321k01l61j482O0N80N70J199j72j209J94o87J136j183O67O66
$$ -1627 -375 -435 886 685 324 -1158 -1098 -518 52 1251 1079 -130 64 -623 513 -670 -3 663
4591F63k010J362l35J132o49N30j197j69P2J5J128j43N80r02j327R10o49J222
$$ 663 -1347 15 -320 812 163 693 -504 -673 -601 -586 542 399 979 77 -1250 -340 -989 233
4609B33O90L05r75L37o74r29K569o96L86j292j243M97j055J151K012P49j753J10
$$ 233 923 1228 253 590 -84 -1013 1556 860 1246 -46 -1289 -792 -1847 -696 1316 2065 312 422
4627D22o82j954K646m05J143N21j762J55j819J378J049l3O70n23o2k122Q68k00
$$ 422 -260 -2214 432 27 1170 1691 -71 84 -1735 -357 692 659 1329 806 744 -1378 -510 -710
4645g10J170M91l66O12k565O81RJ208P07r13n94o21N91P43J70Nj399J028j621
$$ -710 460 951 585 1197 -1368 -687 -678 530 1237 324 -270 -891 -300 443 613 618 -781 247 -1374
4664a374N71J872p06M65j060k08m14m1L06M68J618j745Q25j193M18l08J200M71
$$ -1374 -803 1069 363 828 -232 -440 -854 -895 -589 -121 1497 -248 577 -616 -198 -506 694 1165
4682A165j947J973k812R89J030N46M27j473O31r65P81m20m78J863M68k584J19
$$ 1165 -782 1191 -1621 -632 398 944 1371 -102 529 -436 345 -75 -553 1310 1778 -806 -687
4699f87P57L45N3O60j42m63k012m7J496J56R13j654N21j224N36j67Q90Q99p09
$$ -687 70 415 468 1128 986 523 -1489 -1536 -40 116 1029 -625 -104 -1328 -792 -959 -69 830 121
4718A21J198k755J071l21K78J287j326J110p49o36P00L27L71n6n54l50n15N75
$$ 121 1319 -1436 -365 -686 -408 879 -447 663 -86 -722 -22 305 676 620 66 -284 -799 -224
4736b24q53K243q46K21j398J4R62o40K992j907q78j23j537J512Q37M75l41N41
$$ -224 -1077 1166 320 541 -857 -843 119 -521 2471 564 -314 -437 -1974 -462 375 850 509 1050
4754A050m70k362K142K06j81J50q27j65j537J339J068N63K16r20j33j228J629
$$ 1050 580 -1782 360 566 385 535 -292 -457 -1994 -655 413 976 1192 272 139 -1089 540
4771E40j155R27N47j509K53k89K98j382K454o75j49Q49k143M42M7O15L72l62L83
$$ 540 -615 312 859 -650 -397 -686 -388 -1770 684 9 -140 709 -1434 -992 -945 -330 42 -320 63
4790F3j567R81K06P77O63j375Q18j034P75p27l30J462j790K094j331N07m2Q58
$$ 63 -1504 -523 -317 460 1123 -252 566 -468 307 -420 -750 712 -1078 1016 -315 192 150 1008
4808A008L50j850J121n77l90O57l51P67j363J073j115Q56n92J96M08k59O87k664
$$ 1008 1358 -492 629 52 -338 319 -32 735 -628 445 -670 186 -406 -210 198 -61 626 -2038
4826b038K557j706K027q78J135j062k69l63p5J760K33k89n03j360j50O83j92M31
$$ -2038 519 -1187 840 -38 1097 35 -234 -597 -672 1088 1321 1032 529 -831 -981 -298 -490 -59
4844e9l24J13O76j216J014p95M00L00M05p62k92N20M23m8K11j79j279P33O11j32
$$ -59 -383 -270 406 -810 204 -591 -191 109 514 -248 -540 -20 403 355 566 387 -892 -159 452 320
4864C20L0j103P06M01L08m41m28J809j469l73Q53m24O44n23j25k51j61l04O38
$$ 320 350 -753 -47 354 662 221 -207 1602 133 -240 613 189 833 310 185 -66 -227 -531 107
4883A07M71q15L96m51j049J900j498J306p48J200l30q90m51l28M13Q63Q24j49
$$ 107 578 -237 159 -292 -1341 559 -939 367 -381 819 489 -401 -852 -1180 -767 96 920 771
4901G71r82M34j675J152K57m3m8J208l49j761J98Q8N70M3K00O37j744k07J39P56
$$ 771 -211 223 -1452 -300 -43 -86 -134 1074 725 -1036 -838 -750 -180 -137 63 700 -1044 -1251 -1112 -356
4921c56J508l39K81m64L78j560P56L41r49J322o23R55j221n20O17p70N48L34R34
$$ -356 1152 813 1094 630 1008 -552 204 545 -404 918 295 1250 29 -491 126 -644 -96 238 1172
4940A172j358L36k41m04J050n94M5O98r04J213l246K588p66O37Q21K47r11J02
$$ 1172 -186 150 -91 -495 555 -39 6 704 -200 1013 -2233 355 -411 226 1047 1294 383 485
4958D85l59r62O90J150Q04j236j378L88m97O38K15L33R02r86j92j365N65L02J194
$$ 485 126 -836 -146 1004 1808 572 -806 -418 -915 -277 -62 271 1173 187 -5 -1370 -805 -503 691
4977F91J060j703J801l757J262l80J349J084m24N95j214k85k40k26N24p97J441
$$ 691 1751 48 1849 -1908 -646 -1026 323 1407 983 1578 364 79 -161 -387 137 -660 781
4994G81J137j422j71j038L98k80J459l62j179O9q25J690p60J786q83K6K46p56
$$ 781 1918 496 325 -713 -315 -595 864 502 -677 -608 -1433 257 -503 1283 400 426 672 -84
5012h4o32j87J896m50j70K04r61J737k270P35k49J173K29j223k19q21J259k09
$$ -84 -716 -903 993 543 373 577 -384 1353 -917 -182 -431 742 971 -252 -471 -1292 -33 -242
5030b42j1L34R25l96j504O38k50m05P70j70J237K76k179l00m71K320j962K820
$$ -242 -253 81 1006 610 -894 -256 -506 -911 -141 -311 926 1202 -977 -1277 -1748 572 -1390 1430
5048A430L46k031P89j532P30j013J095J571l05O1k852J45M06K07J002J275l87
$$ 1430 1776 -255 534 -998 -268 -1281 -186 1385 1080 1141 -1711 -1566 -1160 -953 49 1324 937
5065I37r44j011j254J967K37J580k49j386M23j961K28O91J376M35o71J06j551
$$ 937 -7 -1018 -2272 -305 -68 1512 1263 -123 300 -1661 -1433 -742 634 1069 398 504 -1047
5082a047J09L42k97J982N28j433n69q34P13J35Q58m69O75j256Km5K73L42j285
$$ -1047 -938 -596 -893 1089 1617 184 -385 -1219 -506 -371 487 18 693 -563 -561 -606 -333 9 -1276
5101a276P30N73k69J81l15M03j216P46J353k92m29J0n68j64p30L77Q41J250j148
$$ -1276 -546 27 -242 -61 -376 27 -1189 -443 910 618 189 199 -369 -533 -1263 -886 -45 1205 57
5120E7M14k048J141n45J529n3r18K723k556m47j642J501K101q62J468r01p16j449
$$ 57 471 -1577 -436 -981 548 495 -423 2300 -256 -703 -2345 -844 1257 395 1863 962 246 -1203
5138a203j303L512j659J628q64r03O19j798J660J675k90K36j578j93j565J869
$$ -1203 -2506 1006 -653 975 111 -792 -173 -1971 -311 1364 1074 1310 -268 -461 -2026 -157
5154a57J136l59j76P61o47j715N90r47K228l65K96M38j591J39L5J004j56j77M39
$$ -157 979 620 444 1205 558 -1157 -567 -1514 714 349 645 1083 -508 -369 -334 670 514 337 776
5173G76j473L63l57M54R59K02p48N75p76J80m59L73k38j09N91n84P89j91j589
$$ 776 -697 -334 -691 -237 722 924 176 751 -25 155 -304 69 -169 -278 313 -271 518 327 -1262
5192a262j13n11J813L50j97L96o40r33K49m04Q77J082o94M88j543m85j63J462
$$ -1262 -1375 -1886 -73 277 80 476 -164 -1097 -848 -1252 -375 707 13 501 -1042 -1527 -1690 -228
5210b28N26J08L85N9o52j367K16J592M79N02k079l62k58j039J468j25J608p61
$$ -228 298 406 791 850 198 -1169 -953 639 1118 1620 -459 -821 -1079 -2118 -650 -775 833 72
5228G2k77q72n96R22P36J624j376J71k69p93J189o05J224o02O10j714p57K101
$$ 72 -205 -1077 -1673 -751 -15 1609 233 404 135 -658 531 -74 1150 548 1158 -556 -1313 788
5246G88j802R75k34J830k497K69M59m26R68N25q56k33M79J104k015J193n8p15
$$ 788 -1014 -39 -273 1557 -940 -671 -212 -638 330 855 -1 -234 245 1349 -666 527 469 -246
5264b46n15J048Q80j81q81p16L71j188R16M71R66k28p95n83L26K13Q91K18J049
$$ -246 -761 287 1167 986 105 -611 -240 -1428 -512 -41 925 697 -98 -681 -355 -142 749 967 2016
5283B016j802j712O17m80J125M44J82m18K05j55k653K881L98K47j266J556j128
$$ 2016 214 -1498 -881 -1361 -236 208 390 -28 177 22 -2631 250 648 895 -371 1185 57
5300E7k003Q60O47K159j384K7o40j714J122L81J740o8n61n24n91q2j034K429j63
$$ 57 -1946 -1086 -439 1720 336 363 -277 -1991 -869 -488 1252 1184 623 99 -492 -574 -1608 821 658
5319F58m65o40J14M72r16K295o64j504N31p1J651j153LO06j419j50O37O11r39
$$ 658 193 -447 -333 139 -777 1518 854 -650 -119 -190 1461 308 311 917 -502 -652 -15 596 -343
5338c43K80M96j259j74J27J999j823J086L39k667J171l70J018Q59P70n97r87p74
$$ -343 -63 433 -826 -1000 -873 1126 -697 389 728 -1939 -768 -1138 -120 739 1509 912 -75 -849
5356h49p08K019J4N19o2l0j037j950J313J018nJ619k436l8q06P84R8R38J715j641
$$ -849 -1557 462 476 995 933 903 -134 -2084 -771 247 242 1861 -575 -613 -1419 -635 -537 401 2116 475
5376D75o16l40o40L67k05K815j537J77j042O95l03m55K06M5N92q27q30K117p29
$$ 475 -141 -481 -1121 -754 -959 1856 319 496 -546 149 -154 -609 -403 -358 234 -593 -1423 694 -35
5395c5P52O5n47j628R55J168p55Q55k86o69q66R6J618n94l48o1j74o96J163P61
$$ -35 717 782 235 -1393 -438 730 -25 830 544 -125 -991 -895 723 129 -219 -280 -454 -1150 13 774
5415G74p86Q74o86J32o38m80Q76Q57N26j640M91p60p93J761r56J466k39j512J31
$$ 774 -12 862 176 308 -330 -810 66 923 1449 -191 300 -460 -1253 508 -448 1018 779 -733 -602
5434f02j464J722K13P12N6j039j16n78J347J7J103nj031k99j223O29J539J102
$$ -602 -2066 -344 -131 581 637 -402 -518 -1096 251 268 1371 1366 335 36 -1187 -558 981 2083
5452B083j057l85J99j660N13Q47Q29j166O63o1k270J496L03P67n86r56r30n26
$$ 2083 1026 641 840 -820 -307 540 1369 203 866 805 -1465 31 334 1101 515 -441 -1371 -1897
5470a897J635m90O76J790j716j173M06J980p51J006j038j8k02j184J393p37N13
$$ -1897 -262 -752 -76 1714 -2 -1175 -769 1211 460 1466 428 410 208 -976 417 -320 193
5487A93L96q81M94r18k36J183o92R56J158k315o65L52O27J419Q41j153n64j640
$$ 193 589 -292 202 -716 -952 231 -461 495 1653 -662 -1327 -975 -348 1071 1912 759 195 -1445
5505a445O02J215o72J026n35j115L52j9J536m22O92j446J232k092L25J651j80
$$ -1445 -843 372 -300 726 191 -924 -572 -591 945 523 1215 -231 1001 -1091 -766 885 705
5522G05o28k91m75P48j40o32M92j86m28K21j50J398L42j712J161L3j175o51R91
$$ 705 77 -214 -689 59 -81 -713 -221 -407 -835 -614 -764 634 976 -736 425 458 -717 -1368 -377
5541c77J084J5R92j696r28n41N12J835l57M54j863P13j001n68L214j069J116j418
$$ -377 707 722 1714 18 -910 -1451 -939 896 539 993 -870 -157 -1158 -1726 1488 419 1535 117
5559A17K86j469J586q92M20J101n12j613R47j428J719k04Q00j226O86k7j378J205
$$ 117 403 -1066 520 -372 48 1149 637 -976 -29 -1457 262 58 858 -368 318 291 -1087 118
5577A18j08J391j44J65j572n94P31l64R28J23j327J077j538P45j22Q15l44K19
$$ 118 10 1401 1257 1422 -150 -744 -13 -377 551 674 -653 424 -1114 -369 -491 324 -20 199
5595A99k50j013J315L1K5K06q18N13K17l7j212J386l85q82R3l07R80N0O79j288
$$ 199 -51 -1064 251 282 307 513 -305 208 425 388 -824 562 177 -705 -612 -919 61 111 790 -498
5615d98k16K94n99J108M53r33K56l7K54r02N36J17K89o8m83m5j42k77N30J672
$$ -498 -714 -420 -1019 89 542 -391 -135 -172 82 -820 -284 -167 122 54 -429 -474 -616 -893 -363 1309
5635A309M7j121L26j938j49K050N67M71r49k35j179M00Q24k74K59r5L48j007m41
$$ 1309 1356 235 561 -1377 -1526 524 1091 1562 613 378 -801 -401 423 149 408 313 661 -346 -787
5654g87j09J044J943j557k32j284J083j23o90J256r74J634j447P47k88q9q4q77
$$ -787 -896 148 2091 534 302 -982 101 -22 -712 544 -430 1204 -243 504 216 127 43 -834
5672h34J258l06Q95j472J238m77p07J501j259k77J452j422Q32k230J466M83o64
$$ -834 424 118 1013 -459 779 302 -405 1096 -163 -440 1012 -410 422 -1808 -342 141 -523
5689e23J062O43o92j582L41l84M18J384o82J177j682N89j052R9R00R12K39p83
$$ -523 539 1182 490 -1092 -751 -1135 -717 667 -15 1162 -520 69 -983 -884 16 928 1167 384
5707C84j210L22k76K086N05J133k080r54n29p53Q10J360P30j236n27K43l69J87
$$ 384 -826 -504 -780 1306 1811 2944 864 -90 -619 -1372 -562 798 1528 292 -235 8 -361 -174
5725a74J130P5q48Q84m77k507J973o29J268q8j563J752j619O69j297K190j370
$$ -174 956 1031 183 1067 590 -1917 56 -573 695 607 -956 796 -823 -154 -1451 739 -631
5742f31K303j444O30p17J85J32l59K72Q50q45O23j820J520p69o51Q23p69J730
$$ -631 1672 228 858 141 326 458 99 371 1221 376 999 -821 699 -70 -721 102 -667 1063
5760A063p93N83m92r43l1M52J155r00L61l77K51n77j693J909J35R00m41j622Q49
$$ 1063 270 853 361 -582 -613 -161 994 94 455 78 329 -248 -1941 -32 103 1003 562 -1060 -211
5779b11r17Q33j96J656K30p89n51j180P44K69J024P19j110j584j40O32L98l7R90
$$ -211 -1128 -295 -491 1165 1395 606 55 -1125 -381 -112 912 1631 521 -1063 -1203 -571 -173 -210 780
5798G80k33k51j066R7Rm45K352j300P26m37j163L87j023J183L88K73o4P4q53j1
$$ 780 547 296 -770 -673 -664 -1109 1243 -57 669 232 -931 -544 -1567 -384 4 277 213 287 -566 -577
5818e77J91j05K054j360o58o42l1J245q70J649r41o85J863j068o06L60K63p51
$$ -577 -386 -491 1563 203 -455 -1097 -1128 117 -753 896 -45 -730 1133 65 -541 -181 82 -669
5836f69Q14Q34o22J279k653K04O7J685K01q68J086k569J738j884p9K976j403O0
$$ -669 145 979 357 1636 -1017 -813 -746 939 1140 272 1358 -1211 527 -1357 -1436 1540 137 197
5854A97o93q4p25m61J765q87J626r79OO26p58K48j016L148o70o92j056K60p81
$$ 197 -496 -580 -1305 -1766 -1 -888 738 -241 -235 391 -367 -119 -1135 2013 1343 651 -405 -145 -926
5873i26K87O48m4J755j521j492k44L4J601M75Q85o27j106j055n01J913p41L77
$$ -926 -639 9 -35 1720 199 -1293 -1537 -1503 98 573 1458 831 -275 -1330 -1831 82 -659 -282
5891b82N27k58K84j590K1m71K632K12j459J7K82k86j388J221J801q05j65M74j500
$$ -282 245 -13 271 -1319 -1298 -1769 863 1075 -384 -367 -85 -371 -1759 -538 1263 458 293 767 -733
5910g33N19J70J95k16P96o16M14j222L50O2j228K211n89O83k17q45L00m87J188
$$ -733 -214 -44 151 -65 731 115 529 -693 -343 -281 -1509 702 113 796 579 -266 34 -453 735
5929G35j024J239m1j083K16p09M12o98J144J702n45m1j364p34r68J556M99K12
$$ 735 -289 950 909 -174 42 -667 -255 -953 191 1893 1348 1307 -57 -791 -1759 -203 296 508
5947E08j22l87m40L78q43O88J032P71r24j066p01l88J124J257p75k32k29k21n36
$$ 508 386 -1 -441 -63 -906 -218 814 1585 661 -405 -1106 -1494 -370 887 112 -120 -349 -570 -1106
5966a106n73O73J995K3J72j354r70O02L09J125m39Pp60O36p69n6J29L37K68L33
$$ -1106 -1679 -1006 989 1012 1184 -170 -1140 -538 -229 896 457 464 -296 340 -429 -485 -356 -19 249 582
5986E82n07p28n93K234j044m88J043j2o07m60L8N80p25J133j616J390n79N78n95
$$ 582 75 -653 -1246 988 -56 -544 499 487 -120 -580 -542 38 -687 446 -1170 220 -359 219 -376
6005c76Q8P70j494R38J807j301q45k068K076M34k66M91M57l01o20J76J51P64k89
$$ -376 -288 482 -1012 -74 1733 432 -413 -2481 -405 29 -237 254 711 410 -210 -34 117 881 592
6024E92q1j25j344Q45j804K480j562J466L78j274Q1j698J867k99J433K22j529
$$ 592 511 386 -958 -113 -1917 563 -999 467 845 -429 -348 -2046 -179 -478 955 1177 -352
6041c52r1l2j86O61J49P79k90p87j025O84R59p09Q49r03J825j067q78J6Q6J032
$$ -352 -443 -475 -661 0 149 928 638 -149 -1174 -490 469 -240 609 -294 1531 464 -414 -398 -312 720
6061G20k70L44j635J058l46J205j195L84l17J090J48K42j662R74p33k48l9j87
$$ 720 450 794 -841 217 -129 1076 -119 265 -52 1038 1186 1428 -234 740 7 -241 -280 -467
6079d67O88m51J208j537o26P90J55J846j695Q16Q33j988N34n48J696p79J938k513
$$ -467 221 -230 978 -559 -1185 -395 -240 1606 -89 727 1560 -428 106 -442 1254 475 2413 -100
6097a00o34j066J451L35L10K48l23m76n94J55J34L10J553m19j405M81j715K034
$$ -100 -734 -1800 -349 -14 296 544 221 -255 -849 -694 -560 -250 1303 884 -521 -40 -1755 279
6115B79j618K296o82L51q39J77O2m57J023o78J68l12j122J339l16M25r7q89Q48
$$ 279 -1339 957 275 626 -213 -36 26 -431 592 -86 82 -230 -1352 -13 -329 96 -1 -890 -42
6134d2J70n37R84n34M3L51n29L81k58n16J643p58j371P82m77R86J70K94j066K02
$$ -42 128 -409 575 41 84 435 -94 287 29 -487 1156 398 -973 -191 -668 318 488 782 -284 -82
6154h2j303J58J213K77K85K39j055l03N54l07M39J312j392l96J0m13L61J243N70
$$ -82 -1385 -1227 -14 263 548 787 -268 -571 -17 -324 115 1427 35 -361 -351 -764 -403 840 1410
6173A410n86j22P19k213P79P92O0L34l45j322O04o26J244k51L75p67K88j034J39
$$ 1410 824 702 1421 -792 -13 779 839 1173 828 -494 110 -516 728 477 852 85 373 -661 -522
6192e22NO31Q41r52K60k071J791r55R44J992j406k79l15N07r57O29N55r17L41
$$ -522 -517 114 955 3 263 -1808 -17 -972 -28 1964 558 279 -36 471 -486 143 698 -219 122
6211A22n41L86J78L74L61q09N0p73P48M77J76m19o65P81j073K61Q53O78K56j509
$$ 122 -419 -33 145 519 880 71 121 -652 96 573 749 330 -335 446 -627 -366 487 1165 1421 -88
6231h8o9j650J984j82m48K606j372o86J66j432J606n21J767k023M4k68j0L93L25
$$ -88 -157 -1807 177 -5 -453 2153 781 95 261 -1171 435 -86 1681 -342 -298 -566 -576 -183 142
6250A42J475p62q44j46K74o77J148j67J0N78J83k009L88J187K71j090n11J33P50
$$ 142 1617 855 11 -135 139 -538 610 443 453 1031 1214 -795 -407 780 1051 -39 -550 -417 333
6269C33j84p47Q72n35N21K15j960K508j682Q88j37L09j136r4J364n97J253j397
$$ 333 149 -598 274 -261 260 475 -1485 1023 -659 229 92 401 -735 -829 535 -62 1191 -206
6287b06q15R5K49L99R03K02o38q65J178r15O81j152J722M37j670o84j6n54K131
$$ -206 -1021 -926 -677 -278 625 827 189 -676 502 -413 268 -884 838 1275 -395 -1079 -1095 -1649 482
6306D82R72j051O6M43k018J618k36o74J200p10J16j923K650j163M91n0j057J632
$$ 482 1454 403 469 912 -1106 512 276 -398 802 92 208 -1715 935 -228 263 213 -844 788
6324G88j054L04p23M12R67n03n38m8N61K90m34J173j824K89j503K292q7M75o11
$$ 788 -266 38 -685 -273 694 191 -347 -395 166 456 22 1195 -629 -340 -1843 449 362 837 226
6343B26r54K47N21o6p6k93O73q49M30j87K30J105k97n73k011K060q49jQ87o98
$$ 226 -728 -481 40 -26 -102 -395 278 -571 -141 -328 -98 1007 710 137 -1874 186 -663 -664 223 -475
6363d75J523j596N0j54k8K149j685K276j883O84k324P43O19K37J381q97l53r62
$$ -475 1048 -548 -498 -652 -680 1469 -216 2060 177 861 -1463 -720 -101 136 1517 620 267 -695
6381f95M23K01o69K338m05r40j257J86Q07L30K66j87l66j31r40Q49J83M76j236
$$ -695 -272 -71 -740 1598 1193 253 -1004 -818 -11 319 585 398 32 -99 -1039 -190 -7 469 -767
6400g67J048j69j191J926j358K60N12P30j24j518j36l43K330j257J96j063J259
$$ -767 281 112 -1079 847 -511 -251 261 991 867 -651 -787 -1130 1200 -57 139 -924 335
6417C35K87j837K151k672J206L66k00Q81J0J196j686r68O35j067J692m16N10o43
$$ 335 622 -1215 936 -1736 -530 -164 -364 517 527 1723 37 -931 -296 -1363 329 -87 423 -220
6435b20q66O07q17J602p1K274j393r98k49p55J569p68R79J60r39q33j282K617
$$ -220 -1086 -479 -1296 306 235 2509 1116 118 -131 -886 683 -85 894 1054 115 -718 -2000 617
6453F17p88O77k06M47k093O34j78J498J007K49k253J058j954J019O21L16J165
$$ 617 -171 506 300 747 -1346 -712 -890 608 1615 1864 -389 669 -1285 -266 355 671 1836
6470A836j026k31j767Q15n91O37J520q03q61R56r34M9J413j090p52J865o00p1
$$ 1836 810 579 -1188 -373 -964 -327 1193 390 -471 485 -449 -400 1013 -77 -829 1036 436 365
6488C65m36j391J512q28R98j116K48O20N40l99r83K5l5J930j687J387L81k068
$$ 365 -71 -1462 50 -778 220 -896 -648 -28 512 113 -870 -845 -880 1050 -637 750 1131 -937
6506i37O6R49q43L146k119J082j423q51l55J327M11R30K23k407k22m45P91j29
$$ -937 -871 78 -765 2381 262 1344 -79 -930 -1285 42 453 1383 1606 -801 -1023 -1468 -677 -806
6524h06J954J161j525J24k484J422q98J217K088k385M78r19q03Q18J020l41n53
$$ -806 1148 2309 784 908 -1576 -154 -1052 165 2253 -132 346 -573 -1376 -558 462 121 -432
6541d32J280p13j23q54L29J731j178O67k52o25K7J98r4N15r64J481k22n69j942
$$ -432 848 135 12 -842 -513 1218 40 707 455 -170 -143 55 -39 476 -488 993 771 202 -1740
6560a740J146k21J650m81q47J418j197m07j02j07K91K563o39j450M78M6k342J955
$$ -1740 -594 -815 835 354 -493 925 -272 -679 -781 -888 -597 1966 1327 -123 355 401 -1941 14
6578A4k3Q70n83M62j264M32M2j724K997j945K573j908l38L66n71O13p16J739q2
$$ 14 -9 861 278 740 -524 -92 -50 -1774 1223 -722 1851 -57 -395 -29 -600 13 -703 1036 954
6597I54q35k233N85J726o9J102k25j870Jp82J119N14J193k42r70L04j854K56P92
$$ 954 119 -2114 -1529 197 128 1230 1005 -865 -864 -1646 -527 -13 1180 938 -32 272 -1582 -1326 -534
6616e34L48K81L47J35j451J669j225O43qM28n82j46P23o08nj62l14K41k34J82
$$ -534 -186 95 442 577 -874 795 -430 213 205 633 51 -95 628 20 15 -147 -461 -220 -454 -272
6636b72k75K29Q61j942K674q55M86n60j34k47r08O24J160p17P45o65K41l52j425
$$ -272 -547 -318 543 -1399 1275 420 906 346 212 -35 -943 -319 841 124 869 204 445 93 -1332
6655a332J285r32J743j76M16k689J497k081J852J276q60J183j789l8r32M40K241
$$ -1332 -47 -979 764 588 1004 -1685 -188 -2269 -417 859 -1 1182 -607 -645 -1577 -1137 1104
6672A104l63K53J3k012M45k50k06Q73J289j348r5L68q68k25N4J822j650J052N88
$$ 1104 741 994 1007 -1005 -560 -810 -1016 -143 1146 -202 -297 71 -797 -1022 -968 854 -796 256 844
6691H44j597R49p08J388j078J045m88P65j529M60l96O81P37p96n35j77j1J045
$$ 844 -753 196 -512 876 -202 843 355 1120 -409 51 -345 336 1073 277 -258 -435 -446 599
6709E99q73m79O07n48J034j284K458j639l34J004l30o38L33J34o72l7O41J041
$$ 599 -274 -753 -146 -694 340 -944 1514 -125 -459 545 215 -423 -90 44 -628 -665 -24 1017
6727A017j055l58M15M6o00L53j436K077q21J034J60j596Q61j011J203j645J311
$$ 1017 -38 -396 19 65 -535 -182 -1618 459 -362 672 832 -764 97 -914 289 -1356 -45
6744d5p8m5N30M32j203R8P70m38N19n53r50L94j338J787q47J526q53j73N79j710
$$ -45 -123 -168 362 794 -409 -311 459 21 540 -13 -963 -569 -1907 -120 -967 559 -294 -467 112 -1598
6764a598J218P22K98j536r2N52n08K52J305o87M39j282O62p22P03m5o2J246j019
$$ -1598 -380 342 640 -896 -988 -436 -944 -692 613 -74 365 -917 -255 -977 -274 -319 -381 865 -154
6783a54P49j089q46J267n92R52l66N4m95L9J057k253K715j223o2M92o77O78j992
$$ -154 595 -494 -1340 -73 -665 287 -79 -25 -520 -481 576 -1677 1038 -185 -247 245 -432 246 -1746
6802a746K707k115J052K09m83M91j332K421k181K257m64k258K039p36Q91j444
$$ -1746 961 -1154 -102 107 -376 115 -1217 1204 -977 1280 816 -1442 597 -139 752 -692
6818f92Q13n35R6O08j218J791j457P8P2j4P27M6P44p86k35n8l16L33j53M21r0
$$ -692 121 -414 -318 290 -928 863 -594 -516 -444 -458 269 315 1059 273 38 -20 -336 -3 -156 265 175
6839A75o69L71j136K459q69j14k23j194J160r87P06n44J625j351R98k10j082k5
$$ 175 -494 -123 -1259 1200 331 217 -6 -1200 -40 -1027 -321 -865 760 -591 407 197 -885 -910
6857i10K191r09R1q26K369j791l73l56P43j17k35r68J294j48K2p3J31m08K21M10
$$ -910 1281 372 463 -363 2006 215 -158 -514 229 112 -123 -1091 203 55 77 4 135 -273 -52 358
6877C58k14r96J89K158k331J226r39R74l89L61p7m21k39o41J985m76j125N85j196
$$ 358 144 -852 -663 1495 -836 390 -549 425 36 397 320 -101 -340 -981 1004 528 -597 -12 -1208
6896a208J676r40J151j123J171o28m0j27j06J390k034K078p72p23M92J10j494
$$ -1208 468 -472 679 -444 727 99 59 -68 -174 1216 -818 1260 488 -235 257 367 -1127
6913a127J364r67J958j452O88j508m93K954j921M32o70K189k555M52N13n85Q94
$$ -1127 237 -730 1228 -224 464 -1044 -1537 1417 -504 -72 -742 1447 -1108 -656 -143 -728 166
6930A66l9o00N66r50K584k100O87P88j247J43M88R8j66O10j309Q71j975M12R06
$$ 166 127 -473 93 -857 1727 -373 314 1102 -145 -2 486 584 418 1028 -281 590 -1385 -973 -67
6949f7J16J113p67r75q12N63J683j637Q71p22J75O25j975J705q88J540p69J082
$$ -67 49 1162 395 -580 -1392 -829 854 -783 88 -634 -459 166 -1809 -104 -992 548 -221 861
6967H61q85m35P41r25J732j091R0L5j182J821j471K147r28p86Q69j335L63N12
$$ 861 -24 -459 282 -643 1089 -2 88 123 -1059 762 -709 1438 510 -276 593 -742 -379 133
6985A33J350n38j244R69j829J734m97J240j613O40qq06P22P8J02n17k21P44r61
$$ 133 1483 945 -299 670 -1159 575 78 1318 -295 345 337 -469 253 331 433 -84 -305 439 -522
7004e22R85n80Q16j26j340P92j001J158p42J281k18p28J57q64J168J469j173l59
$$ -522 463 -117 699 573 -767 25 -976 182 -560 721 503 -225 -68 -932 236 1705 532 173
7022A73o93M61p82Q58n67L99K64r13J006j690K95R65J058k1j193j72L55N07k09
$$ 173 -520 -59 -841 17 -550 -151 113 -800 206 -1484 -1189 -224 834 813 -380 -552 -197 310 101
7041A01L98J222j465O62j432M87M19n84O07o22k31n58k42J39M25J539q66k00N59
$$ 101 499 1721 256 918 -514 -27 392 -192 415 -207 -438 -996 -1238 -1099 -674 865 -1 -201 358
7060C58p17P54Q7K16j015Q85l44k67K43l05M31k77l55M17l62M32O5Q40j418P5
$$ 358 -359 395 482 698 -317 568 224 -43 200 -105 326 49 -306 111 -251 181 246 1086 -332 -257
7080b57P05j811K433j573J305j229Q11J03j524J395J38J761k756L06R67j997J541
$$ -257 448 -1363 1070 -503 802 -427 384 487 -1037 358 496 2257 -499 -193 774 -1223 318
7097C18j23J172j585j466J374n49J056j22J472l73j153k54p99J452J27O77j318
$$ 318 195 1367 -218 -1684 -310 -859 197 75 1547 1174 21 -233 -1032 420 547 1224 -94
7114i4p34M26j505J993n39J614K85j234q82j515K383m50R82k35o27n37Q6j29p32
$$ -94 -828 -402 -1907 86 -453 1161 1446 212 -670 -2185 198 -252 730 495 -132 -669 -583 -712 -1444
7133a444J113Q31J93l43j601J689o13O89K82l7j97p56J190r83j21l19M06k6r37
$$ -1444 -331 500 693 350 -1251 438 -175 514 796 759 562 -194 996 13 -108 -427 -21 -47 -984
7152i84J566o29M78N94k048J151k23o6q8J86M1o57O93l27J619l45P95j075j660
$$ -984 582 -47 431 1025 -1023 128 -95 -161 -249 -63 -22 -679 14 -313 1306 961 1756 681 -979
7171i79j07k93J527K49N08k67j176N77k024J203J027M83j059L68j74j500J186
$$ -979 -1086 -1379 148 397 905 638 -538 39 -1985 -782 245 728 -331 37 -137 -1637 -451
7188d51J119L00J097k744l30r08J986o19L18K172j132k72k110p7J366N7J231j829
$$ -451 668 968 2065 -679 -1009 -1917 69 -550 -232 1940 808 536 -1574 -1651 -285 -228 1003 -826
7206h26M06L87j306J137n96J477k35q6p98N50R17j370M66l43P89l59q27O36O00
$$ -826 -420 -33 -1339 -202 -798 679 444 358 -440 110 1027 -343 123 -220 569 210 -617 19 619
7225F19o77j400P44O61M81M93j53m0j557L16n64M04J197n10J452j700N9o37J284
$$ 619 -58 -1458 -714 -53 428 921 768 728 -829 -513 -1077 -673 524 14 1466 -234 -175 -812 472
7244D72p08K19Q85j115m22o4n58K306l00J7j49l14j013q75L357j405J095n40m29
$$ 472 -236 -17 868 -247 -669 -733 -1291 1015 715 732 583 269 -744 -1619 1738 333 1428 888 459
7263D59j870r10K126M61N48O98j574q09k67J3J269J651M08j402r91l64N77o84
$$ 459 -1411 -2321 -195 266 814 1512 -62 -871 -1138 -1125 144 1795 2203 801 -190 -554 23 -661
7281f61J989j126J19j197n07L10P8J480q52J103op02N96j752J332k83j33l76N39
$$ -661 1328 202 321 -876 -1383 -1073 -995 485 -367 736 730 28 624 -1128 204 -79 -212 -588 -49
7300d9K323l221M37O26q39J033j70m6K87p98k53j2K87M90R17p04Q08q85j362J243
$$ -49 2274 -947 -510 116 -723 310 140 94 381 -417 -670 -682 -395 95 1012 308 1116 231 -1131 112
7320A12j341L93K192p26p1j713J398j235N39J056P1J062j428K51k650J365O67
$$ 112 -1229 -836 1356 630 559 -1154 244 -991 -452 604 675 1737 309 560 -2090 -725 -58
7337e8J232J57j07m57k102k67J597k2J867k795J318o14j9l81r4K256j801j86N91
$$ -58 1174 1331 1224 767 -1335 -1602 -5 -27 1840 -955 363 -251 -270 -651 -745 1511 -290 -476 115
7356A15q81O75N12M75q37O82j588K19J46J0J390j039N51n54J71P68j059K84m5
$$ 115 -766 -91 421 896 59 741 -847 -628 -482 -472 918 -121 430 -124 47 815 -244 40 -5
7375eJ066q43o55q98J62K130j445Q32j139J34J060o74J407k034J339j116J94J416
$$ -5 1061 218 -437 -1335 -1173 957 -488 344 -795 -661 399 -275 1132 -902 437 -679 -485 931
7393I31n55R77j518Q52j499m42J243N95N91l70L95j325p75L50J680n07N34j406
$$ 931 376 1353 -165 687 -812 -1254 -11 584 1175 805 1200 -125 -900 -550 1130 623 1157 -249
7411b49Q38j273N71J070J59q17J18j125j229K196q1O38J71l97K82k360J016J27
$$ -249 589 -684 -113 957 1116 299 417 -708 -1937 259 178 816 987 590 872 -1488 -472 -345
7429c45J605j364P72O64r33j072R82Kq82O80Q60k111J313K1M02m77r19J254n83
$$ -345 1260 -104 668 1332 399 -673 309 311 -571 109 969 -1142 171 192 594 117 -802 452 -131
7448a31P76j829J266n42J78J234j233P8L52M38j63j146K42j88R83j42J86q63j15
$$ -131 645 -1184 82 -460 -282 952 -281 -203 149 587 424 -722 -480 -668 315 173 359 -504 -619
7467f19Q60j035J075j58M82p67k89K68m40j00O98J165k28p09J37j500J525k82
$$ -619 241 -794 281 123 605 -162 -451 -183 -623 -723 -25 1140 912 203 340 -1160 365 83
7485H3M74N60q22P63j925J792r94P98q48N04p5j183M70n45P39j14N44L0o60%j89
$$ 83 557 1117 295 1058 -867 925 -69 729 -119 385 310 -873 -403 -948 -209 -323 221 251 -409 -409 -598
7506e98k14R14k57K20P26j632Q17L28O64n32p46M10Q26r91o70J479j262J599q54
$$ -598 -812 102 -155 65 791 -841 -24 304 968 436 -310 100 926 -65 -735 744 -518 1081 227
7525B27j60k3J38J160k022Q58L65r07P82O48m65j340j15O76p55J086m87R27r62
$$ 227 67 44 182 1342 -680 178 543 -364 418 1066 601 -739 -854 -178 -933 153 -334 593 -369
7544c69p46J249r80J100q59J036q30J254j608p62J263J312R03k513Q95p81q31
$$ -369 -1115 134 -846 254 -605 431 -399 855 -753 -1515 -252 1060 1963 -550 345 -436 -1267
7561a267L64L56K381j450j08q5q30J051j170J554k17K17j288N75m66J77J562k224
$$ -1267 -903 -547 1834 384 276 191 -639 412 -758 796 579 796 -492 83 -383 -206 1356 -868
7579h68O84K18K82j28j417J714n38J78K16j472Q78N47n43P46j225J868j300J033
$$ -868 -184 34 316 188 -1229 485 -53 125 341 -1131 -253 294 -249 497 -728 1140 -160 873
7597H73j771J167j59k53K71j367J128m91R26M48j064M99j70m54R76j73m17q65
$$ 873 -898 269 110 -143 128 -1239 -111 -602 324 772 -292 207 37 -417 559 386 -31 -896
7615h96J083o82K57R94p44M68o39J488k070R88p3N84j164l69M44n88Q35q96o69
$$ -896 187 -495 -238 756 12 480 -159 1329 -741 247 174 758 -406 -775 -331 -919 -84 -980 -1649
7634a649J698m37m33m55R52N51l65M04o37Q66r81O47k91J15J915j210j143N18
$$ -1649 49 -388 -821 -1276 -324 227 -138 266 -371 495 -486 161 -130 -15 1900 690 -453 65
7652F5p01L24l65L61l92O83n30J59k79Q89j70m42J130m19l19j09R0P28l30k63
$$ 65 -636 -312 -677 -316 -708 -25 -555 -396 -675 214 44 -398 732 313 -6 -115 -25 703 373 110
7672A10m3L73p9l89P9K82j89j136O25J85R33n64l41M51p51K58k40m3M84J45J92
$$ 110 67 440 361 -28 51 333 144 -992 -367 -182 751 187 -154 297 -454 -196 -436 -479 5 150 342
7693C42O94k131O82l9J485n80j262O97j33O10r70J083J20l69k76p33R30j147K363
$$ 342 1036 -1095 -413 -452 1033 453 -809 -112 -245 365 -605 478 598 229 -47 -780 150 -997 1366
7712A366o20r09J089j041k90j672J823L94j50L66k80J59o22J9K95m6l58J506l30
$$ 1366 746 -163 926 -115 -405 -2077 -254 140 -10 356 76 235 -387 -368 -73 -119 -477 1029 699
7731F99r38P96o76L05l35j87J095r19J059n94k46n76N70P2l22j76Q81j025J759
$$ 699 -239 557 -119 186 -149 -336 759 -160 899 305 59 -517 53 125 -197 -373 508 -517 1242
7750A242r09n97N8m87Q63n84O75j318J254p03J096L6j034J764j784J009o88l23
$$ 1242 333 -264 -206 -693 170 -414 261 -1057 197 -506 590 626 -408 1356 -428 581 -107 -430
7768d30J935j530O81j105L8j67K48J015l23M20p13J094j611j386M62J636M28n85
$$ -430 1505 -25 656 -449 -411 -578 -330 685 362 782 69 1163 -448 -1834 -1372 264 692 107
7786A07j233P31r65J745P03j12r30o79J56M14O63j505K898j930l68K43p72R29
$$ 107 -1126 -395 -1360 385 1088 976 46 -633 -477 -63 600 -905 1993 63 -305 -62 -834 95
7804I5l63J116o85j014J294j59l84m21P61j186R95J58Q32l07j258P24o21R78K21
$$ 95 -268 848 163 -851 443 284 -100 -521 240 -946 49 207 1039 732 -526 198 -423 555 776
7823G76j782K096j257R81l62j177P52k48K31l86J007j165%o03P2K184p08J674
$$ 776 -1006 1090 -167 814 452 -725 27 -221 10 -376 631 -534 -534 -1137 -1065 1119 411 2085
7841B085k254k70j62J0Q64k05j1J383k198K50k31J752j66n64O5m86o7k140J826
$$ 2085 -169 -439 -601 -591 273 68 57 1440 -758 -508 -739 1013 847 283 348 -138 -205 -2345 -519
7860e19l70J941k96p75K25q89O35k86j65O25m21Q7j728J73Q87R51J106r20L05
$$ -519 -889 1052 756 -19 206 -683 -48 -334 -499 126 -295 -208 -1936 -1763 -876 75 1181 261 566
7879E66j452J69Q85r52O37L16N52j594J925j051n4k61k43J122p31J313k67j55
$$ 566 -886 -717 168 -784 -147 169 721 -873 1052 1 -53 -314 -557 565 -166 1147 880 725
7897G25o1r61M88m68J08L75q18K199k686M95o0J551n57j494K369p80l37p78l0
$$ 725 664 -297 191 -277 -169 206 -612 1587 -1099 -604 -664 887 330 -1164 1205 425 88 -690 -720
7916g20P19r15K044j088M14j773o6N99J768J092k019k67l61Q95l02K51J171o54
$$ -720 -1 -916 1128 40 454 -1319 -1385 -786 982 2074 55 -212 -573 322 20 271 1442 788
7934G88j153lq72J035j045L341j424m51q21j047K094j017J303q34K96p8o65Q02
$$ 788 -365 -368 -1240 -205 -1250 2091 667 216 -605 -1652 442 -575 728 -106 190 112 -553 249
7952B49q15J209lj445J154l67M79j395J031L7o30K63K40J03j165J445N42k103
$$ 249 -566 643 640 -805 349 -18 461 -934 97 134 -496 -233 7 110 -1055 390 932 -1171
7970a171O33k15J782k049K120j105L82n28j006K236k10P35k081n96N54m43P27
$$ -1171 -538 -753 1029 -1020 1100 -5 377 -151 -1157 1079 869 1604 -477 -1073 -519 -962 -235
7987b35J019m00M44q08j11j828J510O63J04J047j012j308q33J907j74J480p76
$$ -235 784 384 828 20 -91 -1919 -409 254 358 1405 393 -915 -1748 159 -15 1465 689
8004F89j121j76j53J74R13Q01l46p45J84r97L19N76L44L93j098Q24j310o37J108
$$ 689 -432 -608 -761 -587 326 1127 781 36 220 -777 -458 118 462 855 -243 581 -729 -1366 -258
8023b58N80j71O28K86j704R20k95L1J777k101P50j235m76J655N0l78j110J938
$$ -258 322 151 779 1065 -639 281 -14 17 1794 -307 443 -792 -1268 387 437 59 -1051 887
8041H87k043K243p04n84L01k58J51r15J126N60l72P76j681M05n43J009P09o4p31
$$ 887 -1156 1087 383 -201 100 -158 -7 -922 204 764 392 1168 -513 -108 -651 358 1067 1003 272
8060B72j014L95l60N40J316Qm96p56L07j304M13K125j012R06j292p77L34q30P40
$$ 272 -742 -347 -707 -167 1149 1157 661 -95 212 -1092 -679 1446 434 1340 48 -729 -395 -1225 -485
8079d85M14J084n76J95j128q13K66J253k58J050l13q16q46J065p45N99J686j453
$$ -485 -71 1013 437 632 -496 -1309 -1043 210 -48 1002 689 -127 -973 92 -653 -54 1632 179
8097A79N87j015k07j51J024j107J674j167j26Q55j685K142L37j720R48k77l47
$$ 179 766 -249 -456 -607 417 -690 984 -183 -309 546 -1139 1003 1340 -380 568 291 -56
8114e6J3J53k0m43p90L88J110j067J127p99Q17p12m08K77J043L74p51j077n59
$$ -56 -43 110 90 -353 -1143 -755 355 -712 415 -384 433 -279 -687 -410 633 1007 256 -821 -1380
8133a380M98O62O95M73n26l53n66j224J613k81J503j314K21k38o28P21k76O77
$$ -1380 -882 -220 475 948 422 69 -497 -1721 -108 -389 1114 -200 21 -217 -845 -124 -400 277
8151B77K69j249k41p00P99N93J320l90m19p85m82P54l6K53L43l63R82j900J075
$$ 277 546 -703 -944 -1644 -845 -252 1068 678 259 -526 -1008 -254 -290 -37 306 -57 925 -975 100
8170A00j178K229k22l85M95j699k4J55P42O93k32k40n28K71J33j444J518K85l40
$$ 100 -1078 1151 929 544 1039 -660 -684 -529 213 906 674 434 -94 177 310 -1134 384 669 329
8189C29J33n19P19j640J341r78M30l20O56n30N46J554k341j66m35J279J59j290
$$ 329 462 -57 662 -978 363 -615 -185 -505 151 -379 167 1721 -620 -786 -1221 58 217 -1073
8207a073J942p76j312M01k5R13M28o6q22J318j162r1J781j188J173j244J91j772
$$ -1073 869 93 -1219 -818 -843 70 498 432 -390 928 -234 -325 1456 268 1441 197 388 -1384
8225a384Q85N7O97O48q62J128j193j257K86J182J196p64R7K39j613J280m53R0
$$ -1384 -499 -442 255 903 41 1169 -24 -1281 -995 187 1383 619 716 955 -658 622 169 259
8243B59K00R3k47k84QN05m38K37L30m82J57m66k9K09j20P25j115P73l35M74p66
$$ 259 459 552 305 21 29 534 96 333 663 181 338 -128 -157 52 -68 657 -458 315 -20 454 -312
8264c12L88o72N25l40Q1L92k64R80j018K86j301J396m41J331J48j864J716o99
$$ -312 76 -596 -71 -411 -330 62 -202 778 -240 46 -1255 141 -300 1031 1179 -685 1031 332
8282C32m23M40K37l28o28K62q22J110o2K57j16l39o17l94K575q63J78M57n46j056
$$ 332 -91 349 586 258 -370 -108 -930 180 118 375 259 -80 -697 -1091 1484 621 799 1256 710 -346
8302c46j002J868j206R87M76j74Jj010J190j936R33N34J33L21j152k67k4M23J008
$$ -346 -1348 520 -686 301 777 603 604 -406 784 -1152 -219 315 448 769 -383 -650 -674 -251 757
8321G57q74k73j51K61K81j91P52j005L31L6n50m84K251q30o50P21j595J066L89
$$ 757 -117 -390 -541 -280 1 -190 562 -443 -112 -76 -626 -1110 1141 311 -339 382 -1213 -147 242
8340B42j970K305o32L92j070J47J260q96J562n80K9j960J029k19N13N22k279J873
$$ 242 -1728 577 -55 337 -733 -586 674 -222 1340 760 789 -1171 -142 -361 152 674 -1605 268
8358B68j224N89K62o68K740k705N57k66J83K27L02l10k05M70l50j71l77O24P31
$$ 268 -956 -367 -105 -773 1967 -738 -181 -447 -264 -37 265 -45 -250 220 -130 -301 -678 -54 677
8377F77J80j298M04k69J241q64N58o16R38j253l17M51j553J962r98J641p29p81
$$ 677 857 -441 -37 -306 935 71 629 13 951 -302 -619 -168 -1721 241 -757 884 155 -626
8395f26J121r64P61N11J89r62r48Q46q15R67n51m5Q12p15O87m91J067l54l72R8
$$ -626 495 -469 292 803 992 30 -918 -72 -887 80 -471 -516 296 -419 268 -223 844 490 118 216
8415B16j905J316N69P85K95j851M87q44R35O76p79J218j027J687l110P09r9P30
$$ 216 -1689 -373 196 981 1276 -575 -88 -932 3 679 -100 1118 91 1778 -1332 -623 -722 8
8433HN14p12M25r90N41m26M61Q5N1J53l95L69K07L8J90m58m42k43R70o29K67L67
$$ 8 522 -190 235 -755 -214 -640 -179 -94 -43 110 -285 84 291 329 519 61 -381 -624 346 -283 -16 351
8455C51o09M40J77o34J91j89O99l75P57j167P16j386J195J569j595q95N28J003
$$ 351 -258 182 359 -275 -84 -273 426 51 808 -359 357 -1029 166 1735 140 -755 -227 776
8473G76o27K36P96j317Q27j805k36J426q18N69r31J403q64J622q73Q7k36J10J27
$$ 776 149 385 1181 -136 691 -1114 -1350 76 -742 -173 -1104 299 -565 1057 184 271 35 145 272
8492B72J86k39j301J603J410j371l91k66n74O61r39Q00N77m84l77Q3P6o9J01J301
$$ 272 458 219 -1082 521 1931 560 169 -97 -671 -10 -949 -149 428 -56 -433 -350 -274 -343 -242 1059
8512A059p45P17k376j50O84J239l34J004j055J70n57q91J713o97P93o07L54M92
$$ 1059 314 1031 -1345 -1495 -811 428 94 1098 43 213 -344 -1235 478 -219 574 -33 321 813
8530H13l94k43o42R94J010j537J052j471J31K70j70L59j336J193k11J095o33p63
$$ 813 419 176 -466 528 1538 1 1053 -418 -287 -17 -187 172 -1164 29 -182 913 280 -483
8548d83R87J93p54r27J468p72n41J022k84L24P37jL34p99n04M68q61j6R89lj199
$$ -483 504 697 -57 -984 484 -288 -829 193 -91 233 970 969 1303 504 0 468 -393 -409 580 577 -622
8569f22O85j040K20J143M53R32k014P09j119J154j314K247j361l44O30j087J74
$$ -622 63 -977 -757 386 839 1771 -243 466 -653 501 -813 1434 73 -271 359 -728 -554
8586e54m01Q01N40J46M2j916J246k71J32l76R16Lj326J006p45N44J67R5P71k76
$$ -554 -955 -154 386 532 574 -1342 -96 -367 -235 -611 305 308 -1018 -12 -757 -213 -46 49 820 544
8606E44j16o1j538J641k32m21O01r20K12Q00K42j933K122r84J069j013m68N21
$$ 544 428 367 -1171 470 238 -183 418 -502 -290 510 752 -1181 941 -43 1026 13 -455 66
8624F6p26Q65j581J227K52o11N59j43n11P25q09J01M94N12j194J411n97K61j0
$$ 66 -660 205 -1376 -149 103 -508 51 -92 -603 122 -687 -586 -92 420 -774 637 40 301 291
8643B91m82J359j826O27n58M36m51O99Q01j460J078j661K97J025n87J423o45N93
$$ 291 -191 1168 -658 -31 -589 -153 -604 95 896 -564 514 -1147 -850 175 -412 1011 366 959
8661I59j349K64l05p77K276j540J461J20j666N01j455K124n32k89J448Jj120j358
$$ 959 -390 -126 -431 -1208 1068 -472 989 1109 -557 -56 -1511 613 81 -208 1240 1241 121 -1237
8679a237J210j002J319r09Q89n50m50J592k212R01J789q30J127j695R36r96M80
$$ -1237 -27 -1029 290 -619 270 -280 -730 862 -1350 -449 1340 510 1637 -58 878 -118 362
8696C62l56j86M98r42p81J115O9q84J069L43j380Q25M4o62J477j586J687j294
$$ 362 6 -180 318 -624 -1405 -290 -221 -1105 -36 307 -1073 -248 -204 -866 611 -975 712 -582
8714e82J675n47j95n17m30J33J84J2J040K35J92k166J311j079L25J579j078J033
$$ -582 1093 546 351 -166 -596 -463 -279 -267 773 1008 1200 -966 345 -734 -409 1170 92 1125
8732A125j359J90n32J12R11m9J261j697K48m40q68J770P5K64o54q94q4K43M82
$$ 1125 -234 -44 -576 -464 447 398 1659 -38 210 -230 -1098 672 747 1011 357 -537 -621 -378 104
8751A04k28K96n35R52r70K02k1K07K41o08%j029J160j6O44K64l50K99n75j242
$$ 104 -124 172 -363 589 -381 -179 -200 7 248 -360 -360 -1389 -229 -245 399 663 313 612 37 -1205
8771a205J111L19N49j714J894q39k69M39n09l81Q94Q84p97L90l0q63N86j378P98
$$ -1205 -94 225 774 -940 954 115 -154 285 -224 -605 289 1173 376 766 736 -127 459 -919 -121
8790a21Q5r51J573j56n1p2k64q63J649r18j363Q31L36k32L37m27J241q12J830
$$ -121 -36 -987 586 430 379 307 43 -820 829 -89 -1452 -621 -285 -517 -180 -607 634 -178 1652
8809A652l95m0r51k239K392k60k68M19Q01j595o14J021K55M5J63K78l54n88J57
$$ 1652 1257 1217 266 -1973 419 159 -109 310 1111 -484 -1098 -77 178 223 386 664 310 -278 -121
8828a21j315O75K158j778J463j825J124p25P10L78j45j01q96n5k32O39r39J434
$$ -121 -1436 -761 1397 -381 1082 -743 381 -344 366 744 599 498 -398 -453 -685 -46 -985 449
8846D49J362j873L72j871P21J965j977J190p52N60q04O66P76j216K468k404K52
$$ 449 1811 -62 310 -1561 -840 1125 -852 338 -414 146 -658 8 784 -432 2036 -368 -116
8863a16Q7Q59L65j316P42j722J111J067j385J585j190m60p21J459J77m71J341
$$ -116 -29 830 1195 -121 621 -1101 10 1077 -308 1277 87 -373 -1094 365 542 71 1412
8880A412j822J57j75J18R19q87J363j622k7R3l27R25k00M52K66j074q45P17j49
$$ 1412 -410 -253 -428 -310 609 -278 1085 -537 -564 -471 -798 127 -73 379 645 -429 -1274 -557 -706
8899g06k11K562k261J913j107k40J61m04J173k12R18k561l21J083M32N12m85M26
$$ -706 -917 1645 -616 1297 190 -50 111 -293 880 668 1586 -975 -1296 -213 219 731 246 672
8917F72k9k043J513m43K26l15M33P55j078k4q64K300j373P74o05m13L82K6K16
$$ 672 643 -1400 113 -330 -104 -419 14 769 -309 -333 -1197 1103 -270 504 -101 -514 -132 -106 110
8936A10K57j72m37M18m75K051j219j143J291p58j62q8j54J875k434P62o49J223
$$ 110 367 195 -242 176 -299 1752 533 -610 681 -77 -239 -327 -481 1394 -1040 -278 -927 296
8954B96j29j26N65k70p58J63j724K758J47L35q36J95j390j85J245j182J421J93
$$ 296 167 41 606 336 -422 -259 -1983 775 922 1257 421 616 -774 -959 286 -896 525 718
8972G18l4n87r06Q92j633K661N4k050J171o69P91j114P22n84R2P06n03M72j67
$$ 718 684 97 -809 83 -1550 1111 1165 -885 286 -383 408 -706 16 -568 -476 230 -273 199 32
8991C2Q93l41j055J638j291J176j632N70N78l0l58j400J016k44O87J20j782J535
$$ 32 925 584 -471 1167 -124 1052 -580 -10 568 538 180 -1220 -204 -448 239 359 -1423 112
9009A12l74L65m34L85N96p55p35N53J395j861J584J054k737M14m73J165L68N35
$$ 112 -262 103 -331 54 650 -105 -840 -287 1108 -753 831 1885 -852 -438 -911 254 622 1157
9027A157n4k285J899j734R07N2K59R80r64m03q2l58L19k4J183j561N27k81L69
$$ 1157 1103 -1182 717 -1017 -110 -58 201 1181 217 -186 -268 -626 -307 -331 852 -709 -182 -463 -94
9046i4R38j020J554j560p53P51j465K338j080J41J30k05L92m33J033p79N80o77
$$ -94 844 -176 1378 -182 -935 -184 -1649 689 -391 -250 -120 -325 67 -366 667 -112 468 -209
9064b09O15j416J825j504Q7J779n55j715n40J271Q34q04K08K47J106j075j441
$$ -209 406 -1010 815 -689 -602 1177 622 -1093 -1633 -362 472 -332 -124 123 1229 154 -1287
9081a287K124j433J800j343M45r15n96K735p68O16j565n48J28N75L89j619K714
$$ -1287 837 -596 1204 -139 306 -609 -1205 1530 762 1378 -187 -735 -607 -32 357 -1262 1452
9098A452p87q53m59m86K475j039P60L51o05j216r51J217L76j58n62J149k57k111
$$ 1452 665 -188 -647 -1133 1342 303 1063 1414 809 -407 -1358 -141 235 77 -485 664 407 -1704
9116a704J714J77n35J019n03r4m63j65k7K73M39j686J847j255J639j240R59J92
$$ -1704 10 187 -348 671 168 74 -389 -554 -581 -308 131 -1555 292 -963 676 -564 395 587
9134E87q05q8o48P49J013n98N38o70k65N05n0j202J616l53J00L06j240N64o24
$$ 587 -218 -306 -954 -205 808 210 748 78 -187 318 268 -934 682 329 429 735 -505 59 -565
9153e65R95n08j05J155j694j027J512M01J328k174J428j473p65P97J510J062j622
$$ -565 430 -78 -183 972 -722 -1749 -237 164 1492 -682 746 -727 -1492 -695 815 1877 255
9170B55M59j189Q1J012j064J286q90l86p17p4J106n8J269j161O5O4j467J789j083
$$ 255 714 -475 -394 618 -446 840 -50 -436 -1153 -1227 -121 -179 1090 -71 -6 58 -1409 380 -703
9189g03R62o35N81l52j28P50o3N0K81k01j129k50P8L14J107o46N2r31J391q36
$$ -703 259 -376 205 -147 -275 475 412 462 743 542 -587 -837 -759 -445 662 16 68 -863 528 -308
9209c08L90J050m72q89r66L14N87K83M05o9K79j3j076L54j213J368O85j26q28
$$ -308 82 1132 660 -229 -1195 -881 -294 -11 394 325 604 591 -485 -131 -1344 24 709 583 -245
9228b45p86J686n15l06M26J28j253J779k64j442K005p08j142J411k240M24M00
$$ -245 -1031 655 140 -166 260 388 -865 914 650 -792 1213 505 -637 774 -1466 -1042 -642
9245f42J315j669J071l01o83P61M84k54M22o42L22j105K12J407j265J183R4J92
$$ -642 673 -996 75 -226 -909 -148 336 82 504 -138 184 -921 -709 698 -567 616 710 902
9263I02k508J931j130J430k61m63k07J21R04j728R09J028j492J879j716O32m1
$$ 902 -1606 325 -805 625 364 -99 -306 -185 719 -1009 -100 928 -564 1315 -401 231 190
9280A90N50m21j433J219l56l38J363K24q32o62J256j463Q14L94l74p42N45P37
$$ 190 740 319 -1114 105 -251 -589 774 998 166 -496 760 -703 111 505 131 -611 -66 671
9298F71k262J352p5O75J251j162n16q58J446o82J003m67J45r92l71N20P00N13
$$ 671 -1591 -239 -314 361 1612 450 -66 -924 522 -160 843 376 521 -471 -842 -322 378 891
9316H91q56O39m86j32o58k11M90L13k79R82r60P47j542J358m88J060j289K25j51
$$ 891 35 674 188 56 -602 -813 -323 -10 -289 693 -267 480 -1062 296 -192 868 -421 -196 -347
9335c47q83J163M73j690K944j413k45P4p11J750j706J170m34m9J81L60N54j582
$$ -347 -1230 -67 406 -1284 1660 247 2 76 -635 1115 -591 579 145 96 277 637 1191 -391
9353c91J487j267k79P49m78N21j229J568j602J135j231J326L79j179J034l60l31
$$ -391 1096 -171 -450 299 -179 342 -887 681 -921 214 -1017 309 688 -491 543 183 -148
9370a48P58j060Q47L76j435J287m2n14j16K75l80Q32p0j290o9N24O82l93O20p68
$$ -148 610 -450 397 773 -662 625 583 69 -47 228 -152 680 610 -680 -749 -225 457 64 684 -84
9390h4l03J284q65N2J37j98m39J71O74j868J220J008J210q30j175L57j34k92l55
$$ -84 -387 897 32 84 221 23 -416 -245 429 -1439 -219 789 1999 1169 -6 351 217 -75 -430
9409d30M21L19Q39j511J175r43q9R40J1M28j352Rn92K76O82N76p69J267j004p87
$$ -430 -9 310 1149 -362 813 -130 -219 721 732 1160 -192 -183 -775 -499 183 759 -10 1257 253 -534
9429e34J127j60K24j558Q96Q92J93l33j098R63j571J254M84l79p4l55R8o5Q6o48
$$ -534 593 433 657 -901 -5 887 1080 747 -351 612 -959 295 779 400 326 -29 69 4 90 -558
9449e58J014M13j639J248n06L67k37J35j97J148j303K47p40J782q01K95o39N2
$$ -558 456 869 -770 478 -28 339 102 237 40 1188 -115 132 -608 1174 373 668 29 81
9467H1q67Q36l20o3K54l46L63O60j103K39k57l11Q06J316p91m31k18o62J074M94
$$ 81 -786 50 -270 -333 -79 -425 -62 598 -505 -266 -523 -834 -28 1288 497 66 -152 -814 260 754
9487G54k34j099N96j69O21n67j756K472O31N4j054j036J480n90j28o3l3O07j361
$$ 754 520 -579 17 -152 469 -98 -1854 618 1249 1303 249 -787 693 103 -25 -88 -121 486 -875
9506h75K580j436j46p37O46M1n22K12J78m56j93P86K35o48P59m76n49J286j456
$$ -875 1705 269 123 -614 32 73 -449 -237 -59 -515 -708 78 313 -335 424 -52 -601 685 -771
9525g71J222j32P8j467J113P30j893J707p71J143j422J56R1L69M17j444J046O62
$$ -771 451 319 397 -1070 43 773 -1120 587 -184 959 -463 -307 -216 153 570 -874 172 834
9543H34r47J973k107Q1n37J433j005J012j17p14j25j115J622l66k77J324j079
$$ 834 -113 1860 -247 -166 -703 730 -275 737 620 -94 -219 -1334 288 -78 -355 969 -110
9560a10P95j504j55O08J010K88l54o03j555K061p32j46J086m29Q98k050J061j27
$$ -110 685 -819 -974 -366 644 932 578 -25 -1580 481 -251 -397 689 260 1158 -892 169 42
9578D2M0P0o85L65k67l34N27P2R3j33J356n20j78p82J409l30k292J507k16M34
$$ 42 82 152 -533 -168 -435 -769 -242 -170 -77 -210 1146 626 448 -334 1075 745 -1547 -40 -256 178
9598A78J088r92j49p54J223j353R79K99j206J704k198J319j607l97K027R3K94
$$ 178 1266 274 125 -629 594 -759 220 519 -687 1017 -1181 138 -1469 -1866 161 254 548
9615E48j008Q90n69n14J296j211R09j263J04j59n46J270m53K097j748j002J559
$$ 548 -460 430 -139 -653 643 -568 341 -922 -818 -977 -1523 -253 -706 1391 -357 -1359 200
9632B00j485K389j619N24J413j906j92k58P44j52M93J068j140J77j85O07n38J142
$$ 200 -1285 1104 -515 9 1422 -484 -676 -934 -190 -342 151 1219 79 256 71 678 140 1282
9650A282j510P73J16k093J951j458J133M89o81N83q70O31j193J838j267M03N39
$$ 1282 -228 545 661 -1432 519 -939 194 683 2 585 -285 346 -847 991 -276 127 666
9667F66j864J500j527J571j24r6J2j657J517n00J212m65p15J201r23o00J226K03
$$ 666 -1198 302 -1225 346 222 126 138 -1519 -2 -502 710 245 -470 731 -192 -792 434 637
9685F37m93p05L50n17P22p40J355j13q63K16K8k09K4O40l84p62L54j010J302P11
$$ 637 144 -561 -211 -728 -6 -746 609 496 -367 -151 -123 -332 -308 332 -52 -814 -460 -1470 -168 543
9705E43M14J55r83P03j929M05K028q21l34r28J743k727P43J860o33J270k028J534
$$ 543 957 1112 129 832 -1097 -692 1336 515 181 -747 996 -1731 -988 872 239 1509 -519 1015
9723A015j504N82j243N39O09J03o03K85J6m49P7J845j849L72l24L00o46Q23R02
$$ 1015 -489 93 -1150 -611 -2 101 -502 -217 -201 -650 -573 1272 -577 -205 -529 -229 -875 -52 850
9742H50j242R14j761J055p8k14J066j86j27P48k027N12r6P95p18L99m48J30R3
$$ 850 -392 522 -1239 -184 -262 -476 590 404 277 1025 -1002 -490 -586 209 -509 -110 -558 -428 -335
9761c35k68M86K91L25p39L09Q2N19J822k119j059L02k24M84m35M28k02M31p60
$$ -335 -603 -117 174 499 -240 69 151 670 2492 373 -686 -384 -608 -124 -559 -131 -333 98 -662
9780f62K13L44j03J827j499n17M91j317J218j8R33L1p46j369J139j191M56J590
$$ -662 -449 -105 -208 1619 120 -397 94 -1223 -5 -23 910 941 195 -1174 -35 -1226 -770 820
9798H20j115K90L13p27k72R54J722k628O02j40j570J653M08O38n66j440J65O41
$$ 820 -295 -5 308 -419 -691 263 1985 -643 -41 -181 -1751 -98 310 948 382 -1058 -893 -252
9816b52m44R98k09K32o78P42j461J166j54K6M69P39r58j086j43J024J62K00r81
$$ -252 -696 302 93 325 -353 389 -1072 94 -60 -34 435 1174 216 -870 -1013 11 173 373 -608
9835f08R64j012J47o43J283M37q82L82j07J97r18J876m82q70Q57r90P04j969K173
$$ -608 356 -656 -509 -1152 131 568 -314 68 -39 158 -760 1116 634 -236 621 -369 335 -1634 539
9854E39Lj129J201p24O47p50K0J429j193M55k469J348R72j28M87j445M52r02K038
$$ 539 542 -587 614 -110 537 -213 -193 1236 43 498 -1971 -623 349 221 708 -737 -285 -1187 851
9873H51L91n06k02k67p63l77M5J066L80P76j159j44l66l53K47O5R38l72k57n03
$$ 851 1242 736 534 267 -496 -873 -828 238 618 1394 235 91 -275 -628 -381 -316 622 250 -7 -510
9893e10j64J253K79q77p9j025R07l22M35N8N82j728J871L55k230J667p33O71k54
$$ -510 -674 579 858 -19 -98 -1123 -216 -538 -103 -45 537 -1191 680 1035 -1195 472 -261 410 156
9912A56L89jj026J370j258P12N80n17j34n69O41q06J795j755L15J94o43L91j96
$$ 156 545 544 -482 888 -370 342 922 405 271 -298 343 -463 1332 -423 -108 86 -557 -166 -362
9931c62L21o0j7J09o91J318k55P45j266j94j49l30Q27N67j41l19J136k107M37
$$ -362 -41 -101 -118 -9 -700 618 363 1108 -158 -352 -501 -831 -4 563 422 103 1239 -868 -431
9950d31J371n60N70j226R21m60r52O00N36P76m08J82l74j476P28Q0J576k090N29
$$ -431 940 380 950 -276 645 185 -767 -167 369 1145 737 919 545 -931 -203 -123 1453 -637 -108
9969a08j40o90J174L32m75M01J90q40j82k57j91Q72K50P5n32m04L46l46J066L73
$$ -108 -248 -938 236 568 93 494 684 -156 -338 -595 -786 86 336 411 -121 -525 -179 -525 541 914
9989I14j454O08l14o21P66J52J656j453j472Q35M65k28J490j344L30L29j259K32
$$ 914 -540 68 -246 -867 -101 51 1707 254 -1218 -383 82 -146 1344 0 330 659 -600 -368
10007c68N94r16J447n65M7p20P05o19Q55j38J8r40M28R03j97q46P25q06L75L37
$$ -368 226 -690 757 192 239 -481 224 -395 460 322 340 -600 -172 731 534 -312 413 -393 -18 319
10027C19j096J027l13J420k545J939j271L80l30Q53R81l11n01n48L20j206J559
$$ 319 -777 250 -63 1357 -1188 751 -520 -140 -470 383 1364 1053 552 4 324 -882 677
10044F77o20P29j575M3R33l52m11L64J93O23j598q58J852n87J103L36k84j144
$$ 677 57 786 -789 -746 187 -165 -576 -212 -19 604 -994 -1852 0 -587 516 852 568 -576
10062e76n28J362l15MM23j79O10q30J7j503K354j36K40m27r80J252j593J497r5
$$ -576 -1104 258 -57 -53 370 191 801 -29 -12 -1515 839 703 943 516 -464 788 -805 692 597
10081E97l36N52j799J431j76r35J593p32K33p04K26l58J112j193L63n24L48K77
$$ 597 261 813 -986 445 269 -666 927 195 428 -276 -50 -408 704 -489 -126 -650 -302 -25
10099b5Pn52K86J67N47q28J511j928K01J014p80J73l06J067n20L98k63M91l77
$$ -25 -18 -570 -284 -117 430 -398 1113 -815 -614 400 -380 -207 -513 554 34 432 169 660 283
10118B83j786J552j170J815l98o72O87j379P10j86J089k79O17j845J04J435k547
$$ 283 -1503 49 -1121 694 296 -376 311 -1068 -358 -544 545 266 883 -962 -858 577 -1970
10135a970K147o67Q46n64n77J238j123J247q62l25P78M08M64j355L25Q53j729
$$ -1970 177 -490 356 -208 -785 453 -670 577 -285 -610 168 576 1040 -315 10 863 -866
10152h66J939k001R35O3J61j89j244J257K80l82J83K50j84L17n31p35J190o06
$$ -866 1073 -928 7 70 231 42 -1202 55 335 -47 136 386 202 519 -12 -747 443 -163
10170a63j66M74p0M64j486J370R54j612P64N03k144Q69l46K53R3J891j951J578
$$ -163 -329 145 75 539 -947 423 1377 -235 529 1032 -1112 -243 -589 -336 -243 1648 -303 1275
10188A275j466q67R88m55R27M64l27r70m2j101P83N27J72p34O6l38O46m69J406
$$ 1275 -191 -1058 -70 -525 402 866 539 -431 -473 -1574 -791 -264 -92 -826 -760 -1098 -452 -921 485
10207D85j184O36M94j15o76L12J069n83R9l85q3K53j784K233j398L40R84j619
$$ 485 -699 -63 431 316 -360 -48 1021 438 537 152 69 322 -1462 771 -627 -287 697 -922
10225i22R85n14Q77K84k48p66o85J203m87J217j085J20m02P96J159k386O70J75
$$ -922 63 -451 426 710 462 -304 -989 214 -273 944 -141 -21 -423 373 1532 -854 -184 -9
10243in25l39N61pR03m63m97J63P65j731J780lM55r70n8L71j575R23O09l65O2
$$ -9 -534 -873 -312 -319 584 121 -376 -213 552 -1179 601 598 1053 83 25 396 -1179 -256 353 -12 50
10264E0N02q80j180J416M96J016j655j28L33k71M00o10J094n77M29k2l83M28j387
$$ 50 552 -328 -1508 -92 404 1420 -235 -363 -30 -301 99 -511 583 6 435 413 30 458 -929
10283i29m85J731M7O12o10K32j112M97L54j962K564k400J690L17q60J304m97l6
$$ -929 -1414 317 364 976 366 598 -514 -17 337 -1625 939 -1461 229 546 -314 990 493 457
10301D57p25K72R1q17O20k10J98j380J904o03M52O2j113J615j435J225q07p37
$$ 457 -268 4 95 -722 -102 -312 -114 -1494 410 -193 259 321 -792 823 -612 613 -194 -931
10319i31J391n43J156j620J52Q24j041J336j143P18q80N53J28p61J072m88Q28
$$ -931 460 -83 1073 -547 -395 429 -612 724 -419 299 -581 -28 100 -661 411 -77 751
10336G51k257J577J67k94K76k5n49J44J001k84p90P65j803Q64L75k68r5L90R95
$$ 751 -1506 71 238 -56 220 195 -354 -210 791 507 -283 482 -1321 -457 -82 -350 -445 -55 940
10355I40j082K3J41j6L97j0n40J70P20j37j986J537q68J342o92J039o59L64J50
$$ 940 -142 -119 22 6 403 393 -147 23 743 606 -1380 157 -711 631 -61 978 319 683 833
10374H33k530J954n42o73Q76J58j213R02K18M9j57n48K34K86l31L64l34P87k92
$$ 833 -1697 257 -285 -958 -82 76 -1137 -235 -17 32 -125 -673 -439 -153 -484 -120 -454 333 41
10393D1o05J194K19J57p31p4M42j159J813j812O90j96M6N96r53J718k323J205
$$ 41 -564 630 849 1006 275 201 643 -516 1297 -515 175 -21 25 621 -332 1386 -937 268
10411B68q2K36p44J49j40r80J126j36O09o53j39J358j879J73J024N48q50r90J144
$$ 268 186 422 -322 -173 -313 -1293 -167 -303 306 -347 -486 872 -1007 -834 190 738 -112 -1102 42
10430D2J81k31o0N39n39O24L5j120L78N51m7N3l08j30k10J243j026m52O95m30
$$ 42 223 -8 -68 471 -68 556 591 -529 -151 400 353 406 98 -32 -242 1001 -25 -477 218 -212
10450b12L49O8l40J77L62j79q62J204j376K75k59J134L39Qk98K6jp55k29J42K44
$$ -212 137 205 -135 42 404 225 -637 567 -809 -534 -793 341 680 688 390 416 415 -340 -569 -427 -183
10471a83P86l07k84K61j030K289j670m50r4P23j19r2M95m50nl10J28M16M65k90
$$ -183 603 296 12 273 -757 1532 -138 -588 -682 41 -78 -170 325 -125 -130 -440 -312 104 569 279
10491B79q59L40K00m48J496j447J721k688K287p60j441J077L1J694q63j391J514
$$ 279 -580 -240 -40 -488 1008 -439 1282 -1406 881 121 -1320 -243 -212 1482 619 -772 742
$$ [...]
##END NTUPLES=NMR FID
##END=
