##TITLE=31P_DE-80H3_c
 D2O
 64 sc
 19.02.2025
##JCAMPDX= 6.0         $$ Bruker NMR JCAMP-DX V2.0
##DATA TYPE= NMR FID
##DATA CLASS= NTUPLES
##ORIGIN= UXNMR, Bruker Analytische Messtechnik GmbH
##OWNER= root
$$ XWIN-NMR		Version 3.5
$$ Thu Jul 23 14:43:02 2026 Russian Standard Time (UT+4h)  Yarkov@DPX200
##.OBSERVE FREQUENCY= 81.013821
##.OBSERVE NUCLEUS= ^31P
##.DELAY= (6, 6)
##.ACQUISITION MODE= SIMULTANEOUS
##.ACQUISITION SCHEME= undefined
##.AVERAGES= 64
##.DIGITISER RES= 16
##SPECTROMETER/DATA SYSTEM= spect
##.PULSE SEQUENCE= zgpg30
##.SOLVENT NAME= CDCl3
##.SHIFT REFERENCE= (INTERNAL, CDCl3, 0, 243.863)
##AUDIT TRAIL= $$ (NUMBER, WHEN, WHO, WHERE, WHAT)
$$ ##TITLE= Audit trail, XWIN-NMR		Version 3.5
$$ ##JCAMPDX= 5.01
$$ ##ORIGIN= Bruker BioSpin GmbH
$$ ##OWNER= Yarkov
$$ C:/Bruker/XWIN-NMR/data/yarkov2/nmr/P31/1/audita.txt
$$ ##AUDIT TRAIL=  $$ (NUMBER, WHEN, WHO, WHERE, WHAT)
(   1,<2026-07-23 14:42:28.73 +0400>,<Yarkov>,<DPX200>,
      <created by zg, POWCHK disabled, PULCHK disabled
       configuration hash MD5:
       00 E9 B6 7A A2 85 ED C7 34 08 36 98 17 FE 4E 26
       data hash MD5: 32K
       17 26 36 B9 88 AC B3 5B 78 06 4A 8D 33 38 E2 C5>)
$$ ##END=
$$ 
$$ hash MD5
$$ 1B 28 3C 1A 8A 10 61 0F EF 3C A8 C2 A2 DD E9 D0
##$RELAX= 
##$RELAX= 
##$RELAX= 
##$RELAX= 
##$RELAX= 
##$RELAX= 
##$RELAX= 
##$RELAX= 
##$RELAX= 
$$ Bruker specific parameters
$$ --------------------------
##$DU= <C:/Bruker/XWIN-NMR>
##$EXPNO= 1
##$NAME= <P31>
##$PROCNO= 1
##$TYPE= <nmr>
##$USER= <yarkov2>
##$AMP= (0..31)
100 100 100 100 100 100 100 100 100 100 100 100 100 100 100 100 100 100 
100 100 100 100 100 100 100 100 100 100 100 100 100 100 
##$AQSEQ= 0
##$AQ_mod= 1
##$AUNM= <au_zg>
##$AUTOPOS= <>
##$BF1= 81.014009
##$BF2= 200.13
##$BF3= 200.13
##$BF4= 200.13
##$BF5= 200.13
##$BF6= 200.13
##$BF7= 200.13
##$BF8= 200.13
##$BYTORDA= 1
##$CFDGTYP= 0
##$CFRGTYP= 5
##$CHEMSTR= <none>
##$CNST= (0..31)
1 1 145 1 1 1 1 1 1 1 1 1 1 1 1 1 1 1 1 1 1 1 1 1 1 1 1 1 1 1 1 1 
##$CPDPRG= <waltz16>
##$CPDPRG1= <>
##$CPDPRG2= <waltz16>
##$CPDPRG3= <>
##$CPDPRG4= <mlev>
##$CPDPRG5= <mlev>
##$CPDPRG6= <mlev>
##$CPDPRG7= <mlev>
##$CPDPRG8= <mlev>
##$CPDPRGB= <>
##$CPDPRGT= <>
##$D= (0..31)
0 1 0 0 0 0 0 0 0 0 0 0.03 2e-05 3e-06 0 0 0 0 0 0 0 0 0 0 0 0 0 0 0 0 
0 0 
##$DATE= 1784803348
##$DBL= (0..7)
120 120 120 11 120 120 24 19 
##$DBP= (0..7)
150 150 150 150 150 150 150 150 
##$DBP07= 0
##$DBPNAM0= <>
##$DBPNAM1= <>
##$DBPNAM2= <>
##$DBPNAM3= <>
##$DBPNAM4= <>
##$DBPNAM5= <>
##$DBPNAM6= <>
##$DBPNAM7= <>
##$DBPOAL= (0..7)
0.5 0.5 0.5 0.5 0.5 0.5 0.5 0.5 
##$DBPOFFS= (0..7)
0 0 0 0 0 0 0 0 
##$DE= 6
##$DECBNUC= <off>
##$DECIM= 3
##$DECNUC= <off>
##$DECSTAT= 4
##$DIGMOD= 1
##$DIGTYP= 9
##$DL= (0..7)
0 0 52 120 120 21 21 25 
##$DP= (0..7)
150 150 150 150 150 150 150 150 
##$DP07= 0
##$DPNAME0= <>
##$DPNAME1= <>
##$DPNAME2= <>
##$DPNAME3= <>
##$DPNAME4= <>
##$DPNAME5= <>
##$DPNAME6= <>
##$DPNAME7= <>
##$DPOAL= (0..7)
0.5 0.5 0.5 0.5 0.5 0.5 0.5 0.5 
##$DPOFFS= (0..7)
$$ [...]
##$SUBNAM1= <"">
##$SUBNAM2= <"">
##$SUBNAM3= <"">
##$SUBNAM4= <"">
##$SUBNAM5= <"">
##$SUBNAM6= <"">
##$SUBNAM7= <"">
##$SUBNAM8= <"">
##$SUBNAM9= <"">
##$SW= 501.771253377433
##$SWIBOX= (0..15)
0 1 3 0 0 0 0 0 0 0 0 0 0 0 0 0 
##$SW_h= 40650.406504065
##$TD= 32768
##$TD0= 1
##$TE= 0
##$TE2= 300
##$TE3= 300
##$TEG= 300
##$TL= (0..7)
0 120 53 12 22 120 120 120 
##$TP= (0..7)
150 150 150 150 150 150 150 150 
##$TP07= 0
##$TPNAME0= <>
##$TPNAME1= <>
##$TPNAME2= <>
##$TPNAME3= <>
##$TPNAME4= <>
##$TPNAME5= <>
##$TPNAME6= <>
##$TPNAME7= <>
##$TPOAL= (0..7)
0.5 0.5 0.5 0.5 0.5 0.5 0.5 0.5 
##$TPOFFS= (0..7)
0 0 0 0 0 0 0 0 
##$TUNHIN= 0
##$TUNHOUT= 0
##$TUNXOUT= 0
##$USERA1= <user>
##$USERA2= <user>
##$USERA3= <user>
##$USERA4= <user>
##$USERA5= <user>
##$V9= 5
##$VALIST= <valist>
##$VCLIST= <CCCCCCCCCCCCCCC>
##$VD= 0
##$VDLIST= <DDDDDDDDDDDDDDD>
##$VPLIST= <PPPPPPPPPPPPPPP>
##$VTLIST= <TTTTTTTTTTTTTTT>
##$WBST= 1024
##$WBSW= 4
##$XGAIN= (0..3)
0 0 0 0 
##$XL= 0
##$YL= 0
##$YMAX_a= 4447
##$YMIN_a= -3829
##$ZGOPTNS= <>
##$ZL1= 120
##$ZL2= 120
##$ZL3= 120
##$ZL4= 120
##$ABSF1= 60
##$ABSF2= -190
##$ABSG= 5
##$ABSL= 3
##$ALPHA= 0
##$AQORDER= 0
##$ASSFAC= 0
##$ASSFACI= 0
##$ASSFACX= 0
##$ASSWID= 0
##$AUNMP= <proc_1d>
##$AZFE= 0.1
##$AZFW= 0.5
##$BCFW= 1
##$BC_mod= 2
##$BYTORDP= 1
##$COROFFS= 0
##$CY= 9.86611175537109
##$DATMOD= 1
##$DC= 1
##$DFILT= <>
##$DTYPP= 0
##$F1P= 248.564497384935
##$F2P= -679.521563365616
##$FCOR= 0.5
##$FTSIZE= 0
##$FT_mod= 0
##$GAMMA= 1
##$GB= 0
##$INTBC= 1
##$INTSCL= 1
##$ISEN= 30
##$LB= 10
##$LEV0= 0
##$LPBIN= 0
##$MAXI= 11.51145
##$MC2= 0
##$MEAN= 0
##$ME_mod= 0
##$MI= 1.244541
##$NCOEF= 0
##$NC_proc= 0
##$NLEV= 6
##$NOISF1= 0
##$NOISF2= 0
##$NSP= 1
##$NTH_PI= 0
##$NZP= 1
##$OFFSET= 243.8632
##$PC= 1.4
##$PHC0= 4829.523
##$PHC1= -10139.12
##$PH_mod= 0
##$PKNL= yes
##$PPARMOD= 0
##$PSCAL= 0
##$PSIGN= 0
##$REVERSE= no
##$SF= 81.0140731611343
##$SI= 65536
##$SIGF1= 0
##$SIGF2= 0
##$SINO= 80
##$SIOLD= 65536
##$SREGLST= <31P.CDCl3>
##$SSB= 0
##$STSI= 0
##$STSR= 0
##$SW_p= 25641.0256410257
##$SYMM= 0
##$S_DEV= 0
##$TDeff= 0
##$TDoff= 0
##$TI= <>
##$TILT= no
##$TM1= 0
##$TM2= 0
##$TOPLEV= 0
##$USERP1= <user>
##$USERP2= <user>
##$USERP3= <user>
##$USERP4= <user>
##$USERP5= <user>
##$WDW= 1
##$XDIM= 64
##$YMAX_p= 0
##$YMIN_p= 0
$$ End of Bruker specific parameters
$$ ---------------------------------
##NTUPLES= NMR FID
##VAR_NAME=  TIME,          FID/REAL,        FID/IMAG
##SYMBOL=    X,             R,               I
##VAR_TYPE=  INDEPENDENT,   DEPENDENT,       DEPENDENT
##VAR_FORM=  AFFN,          ASDF,            ASDF
##VAR_DIM=   16384,         16384,           16384
##UNITS=     SECONDS,       ARBITRARY UNITS, ARBITRARY UNITS
##FACTOR=    2.46e-05,      1,               1
##FIRST=     0,             0,               0
##LAST=      0.4030218,     0,               0
##MIN=       0,             -3829,           0
##MAX=       0.4030218,     4447,            0
$$ Real data points
##PAGE= N=1
##DATA TABLE= (X++(R..R)), XYDATA
$$ [...]
6645 585 359 33 205 251 -385 -336 -109 -93 897 -423 294 67 608 -213 193 85 -401 287 -33 615 -501
6666 -501 -218 191 288 259 109 166 318 348 231 -16 -255 663 417 -520 -449 -1094 335 -458 -38 -104 -448 -341
6688 -341 234 406 -477 293 -149 -277 393 -46 -33 -449 329 391 -142 -660 -82 130 420 199 19 71 -501
6709 -501 -264 585 -48 171 -45 65 -781 289 -32 -202 -21 314 316 133 90 46 266 75 498 -16 -336
6730 -336 -91 -449 -305 -289 84 -81 -121 -865 -216 187 739 -204 -27 50 -156 -479 -373 -349 -435 171 -218 41
6752 41 -116 -275 -148 -100 -134 -418 -118 -38 217 -250 -256 42 485 148 553 408 -646 -118 -626 -384 -158 653
6774 653 -369 -251 -656 497 -129 -200 580 -639 -109 276 128 -390 -277 -890 33 -243 -41 53 -1063
6793 -1063 -944 -37 450 -747 -703 -40 -123 309 -614 19 30 -374 -939 261 147 -168 419 551 -387 79
6813 79 344 -99 234 26 611 19 -102 -117 421 -62 -30 150 226 340 989 -1043 -269 220 -517 512 335
6834 335 -601 -383 -566 532 338 180 552 95 -78 -142 -68 -398 -813 -23 -37 448 -4 -166 353 382 -1085
6855 -1085 -188 668 -888 -532 -349 -220 -158 -459 547 611 -205 -117 132 -640 -475 -558 477 175 -40 284
6875 284 529 891 -306 4 -416 -111 -169 82 351 229 263 570 -421 -29 -431 366 536 -132 364 233
6895 233 186 -94 383 -618 484 415 581 -378 -194 -148 197 -366 -230 203 54 -128 195 271 -466 -169 988
6916 988 -210 -299 130 -99 -559 386 -644 -174 -684 540 464 -44 -865 390 663 -98 549 10 -907
6935 -907 -469 149 -227 495 533 -603 -195 57 115 305 450 -61 10 -104 33 126 -538 123 -228 -44 -405
6956 -405 -588 -20 -4 144 -268 -537 404 446 -73 195 -54 24 -48 -515 -374 -312 -30 -522 516 -344 257
6977 257 -455 434 -241 695 251 -985 846 -837 -15 -172 110 -510 -180 -466 185 -726 -270 523 -273
6996 -273 46 245 43 -652 135 -97 -129 419 -106 -356 383 170 301 458 295 -765 1077 -99 -108 552
7016 552 357 -732 -332 -445 -90 801 224 198 393 -72 122 156 264 84 -139 110 -162 -351 -89 -330
7036 -330 473 -453 -53 456 -437 413 -583 236 -34 196 -405 43 75 37 -134 -668 58 19 1 -14 -283 481
7058 481 422 635 -263 43 198 -103 -618 297 63 -239 -78 -350 -354 -445 -101 -321 -450 363 453 -330 -193 552
7080 552 -46 -594 -177 846 -411 191 256 312 554 402 -322 -419 40 318 -1033 -2 -68 -238 658 134
7100 134 342 -178 172 -156 497 37 155 -56 0 677 -369 424 159 -482 -145 -7 -452 94 163 -131
7120 -131 193 -84 241 -408 926 -285 -260 389 153 774 146 249 -597 671 -54 43 408 -201 -135 131
7140 131 -265 935 48 -19 83 -492 -216 -203 -56 -125 344 343 298 121 -122 172 12 -101 -509 391 -34 -271
7162 -271 -39 -130 495 120 -749 -70 639 -922 478 -44 209 -997 305 -663 -284 -36 -262 78 59
7181 59 43 -774 -373 -24 367 111 -682 19 -596 274 -297 -294 60 -371 318 224 -90 -404 -197 -612 123 -96
7203 -96 201 -148 -791 -166 170 197 -236 -13 -547 214 -468 636 -44 -65 -566 196 433 -192 245 392 -112
7224 -112 -601 -470 -31 370 -237 137 683 -191 -292 242 -935 -23 487 -495 1192 -164 -491 36 -75
7243 -75 -548 486 -210 -716 -464 356 132 188 -54 -505 262 -372 -429 11 -230 196 366 -309 -45 -177 380
7264 380 148 -197 353 147 587 -351 -141 384 511 -201 79 -247 472 -219 164 688 356 -163 -139 -165 -276
7285 -276 632 199 117 65 -190 81 -312 -341 99 345 -126 34 444 -374 -100 446 -102 -53 -684 69 -50
7306 -50 629 -555 -430 -287 -536 203 455 -258 -650 260 -258 -205 126 99 117 -86 -282 352 -441 -98 -431
7327 -431 128 229 264 194 136 163 312 -273 -243 -397 -156 172 32 -203 -180 607 121 -56 -47 378 -188 141 240
7350 240 -129 477 -138 317 733 -286 612 59 -524 130 -478 -397 292 -603 -435 500 86 -349 -99 470
7370 470 103 125 -272 152 307 306 -59 398 -70 -500 862 -76 -181 606 -190 -389 323 -378 885 442
7390 442 -889 -139 -426 149 610 -17 191 680 -371 -215 90 -167 -895 227 -209 104 -158 -991 -24
7409 -24 417 11 -201 -190 -427 184 264 -534 -202 -621 -261 -1013 -163 50 -855 -377 -18 205 218 33 -259
7430 -259 -195 -203 279 -48 60 10 287 415 -465 -142 296 785 -295 249 -36 127 -85 43 324 218 308
7451 308 22 -346 -62 -61 -327 -198 36 -324 77 166 -50 378 1057 -533 483 -262 209 58 114 -3 250
7472 250 64 -534 6 252 -468 -130 -154 -540 405 -641 -183 483 128 -726 423 -325 198 159 -630 241
7492 241 605 126 521 649 -263 267 -264 -555 -166 -88 -954 -153 406 26 543 -712 69 619 41 571
7512 571 475 424 -134 735 285 -618 -13 182 -140 277 -727 -126 557 -552 15 26 669 536 324 -116
7532 -116 -187 340 267 -180 438 45 1247 -436 -501 948 399 382 -63 -114 -60 209 -670 -361 -25 4 75 -155
7554 -155 568 422 924 166 177 -255 -486 -792 420 -18 -328 241 220 -603 386 486 -474 -162 -103 -146 558
7575 558 22 404 194 -161 494 90 -33 -321 12 -353 -26 -320 -406 -59 562 -763 -659 -285 549 -530
7595 -530 -498 -296 -224 -120 92 164 293 -71 -129 -425 -587 -855 201 267 317 -736 -41 298 -628 91 625
7616 625 -232 -417 -144 -702 354 -447 86 -596 -242 -518 -279 -50 -97 59 -225 -311 180 292 -517 181
7636 181 205 -239 376 763 196 -47 -736 0 327 -28 167 581 34 -437 265 -55 -297 482 648 35
7656 35 349 -564 -385 253 -145 57 -557 -1005 682 458 -85 286 617 -285 210 319 -67 103 216 -368
7676 -368 447 232 -734 149 -179 -41 553 686 -306 37 293 8 -126 335 231 412 -96 311 -488 286
7696 286 -16 -750 -442 143 -323 -19 213 363 488 -476 510 6 390 -509 -590 -164 966 265 -122 -309
7716 -309 -631 -335 252 -122 168 69 -236 -54 -208 85 -114 208 -79 -110 -29 344 324 -173 -330 464 22
7737 22 28 -431 194 123 233 449 -970 465 -47 31 430 630 -157 -134 177 144 169 -578 874 26 -541 127
7759 127 851 -207 355 776 248 -88 -708 27 524 445 -606 848 553 -152 300 489 -470 163 175 -93
7779 -93 485 49 -194 -158 703 -86 276 193 117 462 -325 -566 381 136 -41 483 290 -236 449 -402 -378 -173
7801 -173 -599 -922 -189 -80 -54 22 -485 461 564 -1029 -270 896 -133 -103 161 -229 240 -328 -473 192
7821 192 15 35 -115 -702 455 -376 -221 -178 299 347 219 -516 464 412 -727 574 203 345 -378 -459 -560
7842 -560 150 -218 -137 -390 -390 13 -147 -348 83 -88 -523 703 -991 -161 -196 -583 -40 -100 -6 -174 -402
7863 -402 697 -439 727 111 249 723 78 290 -393 -818 -64 78 -119 -665 -89 255 62 214 -90
7882 -90 -13 -235 -453 -179 -91 369 -511 260 -405 322 166 -458 88 334 127 473 -142 -547 333 450 250
7903 250 373 228 -18 -150 98 -114 -229 77 -12 181 -122 -1046 -700 -122 362 465 97 239 277 -71 -221
7924 -221 204 -447 132 72 195 -204 -263 -394 -155 -72 -400 -270 301 516 -795 352 -305 -232 87 -801 19
7945 19 100 -456 95 -115 367 44 -226 -349 -292 133 177 422 814 92 29 -287 -409 -740 504 -851 -5
7966 -5 -308 -317 -81 -383 -47 -87 64 -65 242 -372 523 -27 -493 271 366 -95 -346 416 111 226 259 35
7988 35 -248 -856 -676 -239 184 -372 130 413 -444 32 163 43 105 324 -458 223 180 -484 -294 614 256
8009 256 -425 -269 28 290 -300 -811 -367 -1011 -481 262 -740 729 102 -792 -52 177 626 -26 -55 -459
8029 -459 -36 -144 -123 378 185 -538 -207 -40 -424 80 688 -241 -217 31 -27 -30 -628 -121 330 150 302 217
8051 217 171 -225 140 127 -267 321 -711 534 -79 -48 344 -2 -297 261 416 -80 152 33 560 316
8071 316 -717 247 -369 -431 -114 -474 722 378 -94 834 -557 -738 588 342 -294 -26 509 541 103
8090 103 -338 739 31 459 116 467 -786 182 -74 143 856 327 47 -12 22 167 -544 58 -378 612
8110 612 527 -681 438 11 39 618 -353 20 -239 -774 707 480 158 -126 957 -83 -517 685 -542
8129 -542 258 -565 218 601 -51 268 173 -573 43 211 -82 143 362 326 -588 834 326 -350 284 58
8149 58 49 -538 3 283 -706 -210 -193 -7 -88 -647 292 783 -337 -230 -568 -139 32 -135 651 733 149 516
8171 516 -88 -1035 -185 133 -176 567 64 6 -57 207 3 -24 -562 -118 273 584 -65 437 519 -184 493
8192 493 -1069 237 231 468 -280 60 -134 -437 -207 123 507 -699 -289 297 122 466 -265 25 -226 165
8212 165 -53 -354 -1068 -761 18 -241 16 425 -570 242 -208 -99 -60 45 -234 372 -201 451 556 213
8232 213 86 -32 -200 -269 137 -161 -105 61 622 376 140 181 -431 369 -629 663 -110 -380 175 14 -174
8253 -174 -39 493 -218 556 -435 -31 -288 -345 -448 -184 -847 71 352 139 636 153 141 -801 -477 410 460
8274 460 63 -308 -604 -482 105 499 150 515 296 8 -626 -591 476 -276 -381 427 -471 319 -149 -508
8294 -508 417 11 -409 -5 -84 -303 -271 -529 17 118 92 -46 284 41 45 -163 237 -191 233 -499 -234 823
8316 823 44 59 266 478 -204 209 290 -483 34 153 -110 699 -209 124 -91 107 115 -126 -233 116 -881
8337 -881 -477 130 522 -477 367 -414 -764 329 -153 -504 -879 -74 37 -16 -195 -318 -175 137 -311 -93
8357 -93 -96 -152 -260 428 870 751 -177 -408 -425 -330 -161 729 -173 -74 -583 -263 96 -474 -308 -251 -170 -302 -1177
8380 -1177 457 205 490 188 -15 29 -4 -96 13 288 -623 -458 -801 165 443 372 -315 880 247 416
8400 416 133 -227 17 -194 -23 176 249 353 -52 98 -106 237 406 -87 -23 177 -375 101 36 -372 -453
8421 -453 -23 663 226 92 -262 65 784 -16 674 570 -443 636 451 270 430 928 61 -66 181
8440 181 -55 321 -68 -364 -270 498 -112 254 -85 -405 624 723 -303 194 296 -388 897 -99 1 -7
8460 -7 48 885 -121 134 360 259 151 -94 -297 -171 -538 21 -20 -352 837 52 -145 510 109 -90 10
8481 10 -319 -25 607 -700 418 505 -72 449 -526 -363 -349 -969 -66 116 -446 191 -82 281 527 130
8501 130 -408 -25 32 -114 520 -33 -221 663 -30 -113 -131 382 72 -12 362 -398 -41 672 460 590 102
8522 102 335 732 29 -217 414 458 -600 -47 323 1 -174 -53 -175 -144 -265 -172 -215 188 512 -379 351
8543 351 -405 -290 -588 -63 37 -42 180 -169 213 -906 978 191 -184 485 -396 -69 261 -578 55 -109
8563 -109 75 -216 630 257 -17 -192 97 526 -276 -133 -259 105 -670 475 239 -197 416 602 137 610
8583 610 -327 -847 345 -282 -686 -278 288 66 -240 -225 103 -334 336 -142 169 58 -305 228 264 -533
8603 -533 -367 -541 279 28 143 -503 504 728 389 3 -443 480 -435 596 254 237 -88 160 -118 -21
8623 -21 -19 827 538 -239 204 353 288 -203 -375 12 -63 113 468 -60 -538 19 357 -26 292 -545 -134 109
8645 109 -305 284 -433 -107 -434 139 476 -107 -179 386 19 175 -41 19 -1 786 -617 436 -199 -625
8665 -625 379 66 -399 -106 -250 -183 390 -187 -511 -384 463 224 312 -930 -480 -78 -562 -276 -290 -129
8685 -129 -625 -205 527 -54 -31 311 -811 120 154 -98 148 340 94 -427 -376 317 -462 -218 -228 -640 73
8706 73 552 218 902 -189 -173 26 -296 -24 338 156 -292 -800 82 -418 -77 673 -117 -446 -104 -849
8726 -849 168 402 -745 -61 152 -127 -26 326 711 -359 -169 -574 -36 -39 -210 -171 -276 142 371 206
8746 206 685 575 -1358 -711 -366 -338 164 125 -503 205 -589 -264 -250 334 727 -45 568 58 160 -663 -24
8767 -24 531 232 366 582 234 -163 4 -88 189 5 203 -400 282 448 36 -146 -12 29 -258 276 217
8788 217 -968 453 104 -190 843 -63 -64 216 -177 263 414 184 140 309 -136 489 -314 -1053 657 -2
8808 -2 -301 679 66 6 -225 -95 -162 347 -726 -187 347 -250 -548 -278 13 187 2 -293 11 118 163
8829 163 242 -114 313 519 -30 273 -525 260 -38 22 344 358 -601 -59 -635 -694 872 -431 415 -527 340
8850 340 1 -90 47 430 -367 184 343 -50 -412 361 -213 101 -163 -717 -233 -57 596 11 629 -209
8870 -209 -133 -303 -844 341 54 -350 183 -16 -369 236 1 538 302 127 -577 -150 193 115 463 -670
8890 -670 217 -416 12 -186 159 208 -494 -36 -41 -118 134 218 23 277 37 -136 730 -312 318 -309 -423
8911 -423 36 -77 233 210 784 -891 103 -97 73 -115 1282 39 -414 -149 -126 176 268 95 627 -440
8931 -440 -25 531 573 -81 36 298 -425 -301 -64 -756 -64 220 -98 253 565 349 77 -6 -666 515
8951 515 -215 82 232 619 442 394 -76 469 132 366 47 -108 31 15 -22 -13 -180 -132 -399 -481 270 81
8973 81 223 293 -1120 425 515 308 253 -612 180 -605 11 -102 -517 -83 -666 129 188 -179 -200 -484 -313
8994 -313 135 -650 -119 -148 -361 562 39 -177 -338 8 -470 606 -262 389 671 263 50 -101 238 352
9014 352 -271 -183 701 822 71 -364 353 266 619 -300 532 210 -610 80 155 -483 7 -830 -191 244 45
9035 45 -23 225 -532 63 -189 116 -12 -169 437 -723 277 -605 -458 -60 156 805 -102 263 821 244
9055 244 -781 69 50 -867 78 373 -199 -132 -110 535 104 -726 36 -371 -34 205 661 -69 -316 87 -672
9076 -672 -308 428 -271 -153 242 -897 357 -370 -152 -155 64 -177 -310 25 -100 -217 -224 -653 574 528 -679
9097 -679 121 224 -245 16 -207 -66 -181 -540 -52 177 -170 -29 -184 -255 74 -125 276 -258 175 15
9117 15 534 -39 -355 -283 125 -288 -513 439 151 515 -579 40 121 357 59 -157 255 -475 514 319 -526
9138 -526 274 111 -7 -284 261 29 123 505 378 30 -225 122 -573 -111 -65 291 -2 -1024 -54 -338
9158 -338 8 1186 105 181 128 384 -122 -181 -398 -357 -149 -262 -261 1006 590 626 79 -535 483 -308 -666
9179 -666 -736 239 -629 693 188 175 188 -96 -387 122 659 -697 255 -985 143 578 -193 -535 -89 245
9199 245 -71 -368 207 -4 -158 353 -185 649 -209 -142 509 -221 -73 245 -526 -583 389 -288 551 393 -267
9220 -267 104 774 -323 -4 159 -14 -442 -171 -1018 415 19 -734 -162 -113 427 58 591 185 141 -137
9240 -137 28 310 584 203 149 249 809 -591 -168 -188 308 1 -272 -88 -103 93 286 532 176 72 233
9261 233 799 53 -24 -331 385 -484 222 825 -177 1009 77 -63 388 43 -202 -939 33 -30 626 452
9281 452 -102 -126 38 -157 512 -48 312 -494 -325 671 -690 38 590 -499 -167 277 407 436 94 -220
9301 -220 524 222 -254 -114 -64 228 -174 -129 165 -218 -262 153 647 64 230 -315 8 265 -24 219 -586
9322 -586 -778 -278 374 176 -417 127 -969 82 443 168 -704 359 -102 461 4 391 161 833 -23
9341 -23 -135 490 92 420 -245 -188 -625 -66 281 807 58 454 307 665 421 -220 56 -28 840 490 419
9362 419 712 391 -880 428 611 24 -396 186 551 319 420 -814 278 -331 -858 507 14 190
9380 190 -371 -348 -257 -848 467 395 -895 -902 269 -221 -331 31 9 313 -223 22 -384 124 -73 451 609
9401 609 -393 -708 -472 308 -288 -458 -703 -142 175 344 -339 -27 503 -405 186 193 -583 156 -74 -390
9421 -390 158 -624 310 -179 581 291 687 -493 -206 504 392 -265 -260 -187 -525 671 144 -412 81 -651
9441 -651 428 521 -121 -325 58 267 -448 230 -193 107 -160 104 -369 -92 758 35 479 -55 -34 -1006
9461 -1006 -351 215 241 505 558 458 358 -418 198 20 -80 81 -5 -84 -690 28 -569 88 830 -1 -9 109
9483 109 -371 173 -29 815 -101 -105 -543 -422 -232 618 -221 -540 -30 348 344 474 542 546 -26 -238 206 553
9505 553 -64 296 125 579 319 -288 224 -396 -319 -631 355 -419 -386 52 -145 -311 554 -240 666 505 -505
9526 -505 -34 -283 -260 -610 -390 924 236 -33 -107 -159 572 -284 381 -148 629 -576 -174 -232 83 363 -172
9547 -172 83 -423 -431 397 -106 -648 -550 -86 334 498 -191 422 343 -18 -496 372 -852 -336 1245 4
9567 4 168 379 -678 -149 833 755 204 295 -345 119 365 -747 152 -240 -710 120 257 -74 190 63 398
9588 398 335 106 322 281 -68 426 -290 685 367 994 36 245 -20 -150 -544 -161 -108 16 -55 338 273 296
9610 296 291 -563 -286 -326 108 213 444 220 280 -261 -96 284 125 -425 -128 -35 -530 61 18 859 66 285
9632 285 -237 -256 482 -387 410 -615 -521 584 215 130 254 93 95 -126 -543 -174 -275 22 343 -102 -379
9653 -379 223 -379 -606 -170 14 4 -312 144 -180 55 560 259 -369 197 682 75 168 -185 -213 79 -349
9674 -349 -264 -85 700 -127 -504 -531 297 -579 113 -601 -13 -258 230 -336 80 376 -46 956 -449 -730
9694 -730 510 342 51 721 -89 -279 -100 -454 346 29 -184 873 -184 -730 121 -22 177 112 -124
9713 -124 77 406 -153 342 117 237 99 -381 -439 -819 87 608 -868 163 -210 655 -27 478 621 532
9733 532 -85 -34 372 -91 170 -35 39 -312 83 -608 -102 916 955 -49 -106 -438 -197 177 -2 502 -21
9754 -21 -278 -303 -492 -455 -75 255 219 -500 -68 494 237 267 -180 -33 -336 298 -85 252 -778 222 293
9775 293 522 516 -442 -277 -378 -300 200 278 503 -165 451 -116 -286 -528 170 118 -121 199 -333 63 242 32
9797 32 -362 703 -27 544 588 -194 -129 -395 393 422 1017 -264 211 -508 -25 23 -791 -331 350 -297 344
9818 344 705 -143 492 -188 -269 74 -229 92 -172 -62 392 -310 174 811 385 415 -123 -77 85 -196 -44
9839 -44 502 474 39 -216 -920 -147 2 -216 521 -219 -271 187 175 194 -507 -182 84 465 -267 -477 -47 46
9861 46 297 -382 -108 58 827 240 -651 -15 -253 253 -1152 -263 -31 -318 371 -727 -20 -18 -398 385
9881 385 -462 70 486 -256 -327 -177 -38 227 370 -554 -159 -78 -256 -65 -253 -487 374 139 87 -46 381
9902 381 379 88 -326 -427 179 189 -163 148 -600 243 602 243 -320 369 728 -1090 -111 -480 -589 -109 -720
9923 -720 -764 429 -394 545 329 -578 -113 206 -25 -38 102 94 -512 19 91 9 -514 -14 8 -436 -179 5
9945 5 -438 -693 -14 613 -54 757 -684 -700 -33 -349 535 508 45 47 -202 -398 -21 -136 148 -664 -346 -28
9967 -28 502 607 -352 287 175 88 -254 78 -600 312 510 -244 350 179 194 131 -577 -177 163 -193 -110 -71
9989 -71 168 339 -281 -483 270 -461 -184 457 182 21 -51 -811 -188 -286 60 -277 492 350 231 -305 -145
10010 -145 190 505 -32 -401 -18 596 312 34 -465 -255 -429 -789 -235 -923 901 688 -727 -9 -903
10029 -903 146 52 -164 736 425 211 -145 -409 248 -786 -676 113 -450 -298 -352 -93 19 -271 223 317
10049 317 -521 149 -268 297 588 25 -324 827 -697 -142 952 -405 -104 181 67 -594 -229 -139 371
10068 371 -29 -98 16 595 -581 -35 82 -105 -511 -478 -380 -7 508 -568 -466 389 108 905 198 -159
10088 -159 -132 18 -125 234 17 -377 -392 -407 24 346 133 210 349 126 824 34 -931 -550 175 -446 -436
10109 -436 103 194 -886 -361 295 266 444 386 388 423 -255 335 30 -104 -201 11 -167 -82 82 -81 -191 275
10131 275 -470 -22 198 -88 -124 909 -24 -54 -109 -1068 647 200 343 9 -32 39 104 77 380 669 -87
10152 -87 -380 -580 -116 -432 371 -639 -55 -175 -74 -186 -333 -419 96 -406 -394 366 420 -318 32 66 -748
10173 -748 553 137 105 -766 170 -329 -25 -199 374 169 -996 -34 -428 81 -672 -32 -222 48 559
10192 559 147 73 -53 86 -112 50 -154 31 -135 341 107 302 -109 -531 356 -277 499 220 -394 186
10212 186 335 147 393 365 -521 51 -280 -366 -182 95 356 -339 -92 -586 33 883 -274 220 -228 -470
10232 -470 -687 627 -112 -439 -514 -703 -194 -105 -280 162 217 -172 528 -341 228 37 545 -196 650 -131
10252 -131 225 -512 623 -132 -115 -186 -136 948 -384 -237 511 -190 382 321 -150 -651 345 15 -201 243
10272 243 -235 -292 590 -459 204 -460 541 283 -698 -811 285 854 -890 57 359 -191 -435 -1079 -81
10291 -81 -243 -61 90 99 -115 -1399 402 403 -483 -903 -226 -3 391 -893 855 706 331 87 -144 -203
10311 -203 213 -16 365 -32 -582 -36 -90 -27 8 68 185 -365 -317 -57 408 742 -24 -61 50 -416 276 100
10333 100 378 3 85 -30 446 253 490 213 -638 69 545 626 -661 -181 1010 194 360 310 149 222
10353 222 -449 871 68 -61 39 118 -39 -39 527 702 -81 -432 676 -306 -1038 777 403 18 -774 -437
10373 -437 -222 758 -131 -481 431 9 -517 445 -260 517 91 -790 76 258 -12 -750 185 -512 163 298
10393 298 18 -10 516 283 42 199 -492 206 304 -291 127 -49 329 -332 523 -1111 327 -777 8
10412 8 -134 358 -347 -331 315 -242 285 23 -242 196 -1090 -121 493 -524 -332 567 -321 -853 -152 454
10432 454 -164 542 634 -89 42 -249 17 -342 284 36 159 -444 578 -365 -397 381 181 -137 924 -339
10452 -339 -501 463 -895 -662 -177 80 273 119 -548 -186 -122 -447 -62 -116 -71 -372 611 368 525 130
10472 130 -146 244 322 269 397 319 -78 -3 473 47 -207 74 142 75 778 -366 399 6 208 -801 116
10493 116 70 832 537 -574 173 349 -372 477 693 897 -221 439 -413 -584 -180 -337 364 33 -188
10512 -188 454 407 642 462 -185 147 -417 423 339 376 -284 511 205 -839 258 -162 72 921 -417 -551
10532 -551 -283 364 -372 244 -21 -301 299 -111 -1025 230 363 -303 320 -207 -848 148 187 -314 272 296
10552 296 -252 147 88 -286 292 210 -101 295 -564 354 490 -50 534 -195 284 141 206 95 299 603 -124
10573 -124 -36 62 -278 -137 38 -433 473 54 384 231 313 668 -256 -188 -139 125 -444 306 13 74 -91 16
10595 16 -382 -137 -24 171 -319 -8 412 -402 621 -828 -365 -237 -138 377 535 -404 -106 98 -223 579
10615 579 -146 -312 -396 -152 -571 173 278 -347 -866 24 224 -813 -2 -492 -86 510 -307 384 406 -613
10635 -613 -265 -127 -733 56 -15 271 370 466 207 -195 -238 -600 221 -245 224 -357 -454 27 -12 722 -287
10656 -287 397 481 -220 156 12 -671 -43 -343 -1301 276 -435 -390 -603 38 -281 -334 -165 -360 -54 575
10676 575 -803 192 -180 726 287 35 -259 -340 -388 -375 -129 311 349 -194 313 -403 374 403 -174 660 -80
10697 -80 -205 415 -145 -512 151 -170 205 -233 460 653 109 446 4 -116 -1208 232 387 175 338
10716 338 -662 -479 -308 468 78 675 -554 -91 145 404 -226 -477 217 -202 -397 -425 44 98 -91 -190
10736 -190 14 359 -59 133 61 183 -775 -607 -89 -776 29 389 -53 -708 108 89 291 283 -170 -1007 309
10757 309 436 -389 -462 110 -343 289 -237 -49 137 342 -446 783 -154 -112 38 -48 -58 -238 180 108 983
10778 983 -384 390 676 -105 308 -221 -722 -81 -37 60 10 -477 -5 171 -445 429 -123 -740 -423 677
10798 677 248 -190 1114 224 487 77 -750 -605 -209 -362 -1097 444 774 172 91 595 -117 -86 91 415
10818 415 15 -111 -185 -42 -72 -394 584 300 238 736 386 595 -316 29 -495 157 -436 167 -481 423 -339
10839 -339 120 -680 16 -134 194 332 632 5 -408 -25 -190 149 -483 -904 -353 170 -588 521 665
10858 665 -58 10 471 0 -111 692 -613 -226 121 -353 83 -722 706 254 -183 136 591 -576 -1014
10877 -1014 166 -551 165 -537 245 653 609 -131 257 46 -337 175 -398 -64 -587 288 133 437 -130
10896 -130 76 -309 -180 168 538 559 323 361 -67 543 -596 191 -236 640 804 417 275 -678 93 -440
10916 -440 -366 -113 -139 -294 -183 256 263 400 -72 -201 78 475 47 -179 16 381 273 -111 -387 139 573
10937 573 -260 770 55 175 57 432 -581 -73 14 -533 -400 -105 530 -22 187 461 550 491 538 -57
10957 -57 -75 -649 -149 102 -171 453 -76 32 212 -319 -4 615 -594 1139 458 -115 93 425 -382 229
10977 229 -396 -516 350 459 -203 -604 257 243 366 -442 -226 -103 157 264 -198 -661 -237 280 240 -275
10997 -275 -45 335 12 -90 977 -494 -288 -72 493 218 164 -409 474 -373 307 25 183 -568 307
11016 307 32 -176 87 519 -634 721 -174 -213 260 -388 489 -449 -14 183 1024 265 -359 -1016 -46
11035 -46 505 510 -848 -553 504 -627 39 321 67 810 328 376 -771 -267 -16 439 397 661 -120 -487
11055 -487 25 404 -274 711 258 -144 -163 395 424 521 523 -286 663 252 464 -479 19 30 99 405 -170 522
11077 522 469 -600 424 -53 168 -128 -109 -17 -481 -64 -94 -97 -137 -146 -347 -546 -142 199 -228 143 143 -388 -215
11100 -215 -662 -304 967 -365 206 188 198 263 -258 408 -15 157 100 -702 -91 8 122 -169 -38 -485 -381
11121 -381 -565 646 -107 -71 -469 88 464 -860 -553 79 -765 -287 -211 -137 18 712 39 -155 64 -738
11141 -738 255 387 -733 -483 306 31 154 97 -166 1018 -300 185 185 -64 229 -265 -74 465 541 267
11161 267 -445 -135 -452 222 -1008 -192 -35 249 -413 -163 -256 822 -106 -99 -273 265 719 381 262 458
11181 458 522 -212 -106 -283 45 118 -694 -497 -314 -317 67 -15 -57 216 74 -67 -308 -65 275 780 165 -131
11203 -131 32 -137 -23 258 -181 182 -28 -545 497 -334 -183 -9 675 -255 -254 107 662 149 -308 -741
11223 -741 -153 722 -668 -758 -366 17 52 234 775 -131 190 -950 584 -243 85 695 470 -2 106
11242 106 -249 163 -95 262 93 10 504 316 194 261 -883 537 -32 37 -392 95 -705 -340 438 -46
11262 -46 -75 -71 136 -108 173 750 917 -525 -383 331 -220 416 -166 -201 34 20 31 -32 283 498 568 102
11284 102 472 -40 -210 -267 244 -593 -440 231 -192 886 109 64 239 98 254 -496 -434 394 -208 -45
11304 -45 14 18 -324 -291 -719 716 -593 -295 673 501 207 -269 -408 -290 526 26 492 -221 264 181 79
11325 79 -26 -417 -476 -313 -507 -210 -531 -934 308 250 12 -585 377 133 749 -509 -1078 -410 355 -108
11345 -108 472 182 346 595 207 215 -163 100 803 -85 165 326 740 -142 -8 -27 281 23 147 598 404
11366 404 400 -656 -84 133 -211 -576 -128 -191 -268 145 121 -188 -46 -53 -21 393 377 579 264 729 -633 -541
11388 -541 623 1147 151 -36 -186 -164 40 17 -58 140 -183 -303 104 184 295 -396 160 -294 214 584 -319
11409 -319 117 630 229 329 413 66 547 549 -361 904 -340 271 444 -830 -742 -470 -92 -401 1085 -208
11429 -208 431 0 4 -113 668 -24 -543 830 -38 -725 -231 310 285 104 125 -581 239 -703 43 -112 -1271
11450 -1271 -48 -342 -52 273 -55 -460 -87 97 229 182 -781 -307 -35 -40 236 282 371 -714 -181 299
11470 299 -946 551 -341 -47 177 -883 297 439 -140 130 -485 -116 -230 372 -97 -276 305 -358
11488 -358 43 -358 -726 -162 -204 -120 593 -141 226 526 -16 30 -259 -12 632 -413 -207 -140 378 -192 -4
11509 -4 200 -680 -418 837 -510 179 -551 175 512 -830 -73 -429 23 98 588 -8 744 -691 372
11528 372 -712 -874 164 100 380 -436 -116 -296 -235 -671 -98 -144 237 -222 481 -469 552 -447 293 427
11548 427 438 -107 66 -200 620 -254 449 -141 -276 -363 263 347 19 182 279 327 502 734 -62 -57 106 89
11570 89 783 655 133 -61 151 -157 65 -27 150 507 713 -103 -282 158 -1146 -293 606 -487 540
11589 540 1162 -301 -500 503 -260 -270 -72 200 883 153 -640 328 7 -175 259 7 210 182 -512 -253
11609 -253 292 -358 -204 236 289 468 -104 -56 386 -345 -401 552 294 -793 52 -382 -307 466 -408 -1193 -147
11630 -147 319 -652 -366 167 -260 -561 12 108 -108 -117 -799 -280 -149 -154 361 -184 -13 -418 145 -252 -104
11651 -104 -203 -7 -474 313 -268 -52 -65 280 -74 5 -684 -50 138 359 61 336 -245 206 -282 -617 -65
11672 -65 482 801 -856 210 335 263 -175 349 616 -398 -174 -559 4 123 658 -182 210 -201 -406
11691 -406 818 -8 -451 704 590 -381 244 -130 -404 -94 157 -174 -250 -56 -371 344 149 999 -410
11710 -410 -528 135 -49 -47 88 -137 -997 548 -22 192 -228 302 -934 -240 -281 -641 99 665 -106 -255
11730 -255 -498 -151 10 -718 -402 -161 34 -473 -274 190 -422 -101 -193 -930 327 -474 -216 -244 197 -206
11750 -206 571 384 16 -49 261 809 29 319 -176 138 344 -317 -41 -471 -1119 -352 6 1127 852 554
11770 554 503 515 -528 -342 -190 -189 -164 182 -422 -511 523 -1085 -85 601 -82 482 489 -209 -362 -472 175
11791 175 -34 134 -480 554 677 -414 -341 267 59 165 651 772 610 715 -311 406 226 -190 293
11810 293 471 806 399 285 194 594 228 302 563 -471 -752 734 420 -972 -60 -477 -57 -438 -945
11829 -945 29 136 -132 -473 231 -441 223 304 43 -795 -631 84 -25 -571 212 294 841 307 279 378 -508
11850 -508 -210 -207 -175 700 -180 259 471 529 609 447 743 261 -742 -984 777 -274 556 -87 526 58
11870 58 476 -288 338 264 35 941 -570 -569 -376 396 121 177 20 304 180 -60 282 223 -703 388 -20
11891 -20 -8 5 8 760 -663 -908 392 108 709 327 123 -544 133 205 302 47 -232 264 396 252 99
11912 99 -354 -78 276 -111 -346 233 -494 -13 -463 -685 -30 178 -484 20 -290 815 335 -503 291 110
11932 110 496 489 -710 -1114 305 -271 -402 103 -40 -447 236 263 -277 175 24 525 -4 -197 256 1277
11952 1277 340 -196 172 -190 752 -1157 -880 -314 -663 52 579 -124 -344 -40 516 184 198 -256 -716
11971 -716 -140 402 660 617 262 -314 505 -533 241 -608 -357 163 997 -8 174 -200 -452 -75 -126 258
11991 258 376 248 1162 112 -345 -75 79 -238 149 -730 -18 252 244 632 279 -647 -62 -29 90 171 225
12012 225 413 -255 156 -531 -38 -674 -259 307 496 114 -602 165 -642 153 78 -162 513 652 -291 -513
12032 -513 112 -16 -465 216 -187 -646 226 229 -517 230 441 -102 10 192 -732 -467 -390 241 -552 251 -224
12053 -224 130 295 -591 -13 -142 430 270 610 -598 14 -680 -713 615 -81 147 169 -146 -18 409 -200
12073 -200 -412 699 -396 342 984 249 -353 -101 -90 -721 -47 -436 45 190 1 -607 843 -825 -167
12092 -167 79 281 373 -274 -630 551 -1 -31 105 -349 701 -94 -33 9 -295 -63 -369 619 924 -503
12112 -503 -106 -797 -82 222 165 -522 -312 -490 -9 -47 -70 -162 125 -98 263 -228 -487 -333 491 -568 88
12133 88 -558 47 -109 -255 876 -708 -439 -305 -33 -463 -281 -129 -101 -570 897 847 -180 -421 -531
12152 -531 343 -459 127 -869 -226 367 -589 -617 -166 -287 622 276 -197 243 158 160 192 -43 -119 127 328 241
12174 241 -71 -66 -290 -5 99 227 623 -1036 -489 -460 -177 395 90 -85 -286 -296 -172 -450 361 500 307
12195 307 343 -365 -303 240 474 385 2 5 647 125 212 -353 -723 -1058 20 -298 -350 348 316 -120 -319 -698
12217 -698 97 189 253 -303 132 149 -3 -94 -241 118 -128 -1029 583 -149 -93 552 -592 -153 -261 -368 -967
12238 -967 -566 -251 -18 135 -505 -705 -69 133 -83 473 738 154 230 39 28 -294 397 161 381 91
12258 91 -243 -189 281 -143 311 567 -97 628 -290 -84 373 -400 -119 549 -363 -636 442 50 -45 -138 83
12279 83 -250 21 35 749 444 31 765 407 -28 -296 -314 -853 19 127 -15 -582 -958 -905 245 -293 402
12300 402 -407 -149 -257 3 280 377 366 270 -348 -280 167 -412 278 354 -968 -92 -437 -1024 753 87 945
12321 945 154 22 -57 631 -313 195 602 356 -601 450 218 62 -158 179 247 195 470 40 -370 -421 -91
12342 -91 1 89 -740 -714 -385 413 -62 319 432 34 -300 -340 -54 -577 -261 246 267 -83 -512 -183 382 -355
12364 -355 -525 603 -185 -368 -593 -461 981 -226 222 391 193 -199 -109 -467 -270 184 -225 -173 220
12383 220 340 -139 -244 188 423 310 285 150 -48 118 153 225 -387 558 205 -430 -279 75 701 103 -214
12404 -214 -138 -263 -191 -648 -453 618 -708 -345 69 115 -395 -54 269 -90 -34 -12 -144 -184 -169 113 -251
12425 -251 73 -753 304 -98 -256 -381 -292 -596 558 -252 -937 -623 308 145 563 44 85 230 -63 75
12445 75 -16 -15 -231 342 -134 1053 -78 -554 -73 220 -413 672 410 69 302 620 -664 268 124 116
12465 116 133 -245 870 -26 -349 256 6 -15 -300 687 -642 -178 444 -214 94 -308 -563 28 14 572
12485 572 -76 397 202 -170 -282 -285 649 680 -403 586 477 192 -503 -391 -7 1167 -304 388 427 -1208
12505 -1208 -232 -98 -520 -621 666 -318 -200 -293 -68 -130 -288 498 241 -293 190 281 384 477 -919 -47
12525 -47 -157 97 -243 329 -157 281 249 416 560 -170 -66 -112 -28 -411 537 -14 941 412 -422 78 767
12546 767 151 444 -195 50 177 -235 163 -184 235 -183 -406 -234 -37 -249 426 114 -68 -147 -745 -171
12566 -171 -27 -33 501 414 -368 199 526 -485 18 -494 242 208 -706 535 331 -223 375 330 -183 440 942
12587 942 200 343 -514 -45 -152 356 -283 271 107 -305 -444 136 183 273 159 203 -121 523 -661 478
12607 478 -263 215 483 -299 254 -354 49 -46 239 39 377 -94 -531 -95 317 156 544 140 467 386
12627 386 -263 554 191 -215 559 -429 -455 80 -374 344 -34 -197 130 42 -283 -100 -711 -64 526 375
12647 375 567 222 113 -69 -180 787 -336 -134 -356 3 237 170 566 -288 -894 295 82 -670 708
12666 708 -959 529 476 -74 513 -27 -164 355 940 25 501 312 -356 410 -138 179 464 460 -592 292
12686 292 -193 -500 -521 608 -9 434 448 -761 162 -319 12 645 -136 -406 -19 -109 -172 134 -804 -20
12706 -20 -122 -405 -580 -944 186 -388 -244 -685 153 332 -835 -201 308 108 -446 203 -35 -647 218
12725 218 1 216 415 -599 -889 -611 39 -11 -740 401 17 -383 466 427 -250 -5 47 -856 335 60
12745 60 -272 -180 336 -203 -102 -643 -99 -371 276 424 -310 -166 1020 -5 -408 -453 183 93 -152 -662
12765 -662 -440 236 -140 521 -250 330 436 -614 -392 663 624 3 -187 -456 191 406 -600 -348 427
12784 427 -747 249 -35 -2 321 -716 94 -394 278 -820 -12 260 -203 -22 257 63 33 -457 54
12803 54 -48 77 353 767 -70 -279 -441 -235 5 -676 -468 142 100 -586 -571 259 -573 -33 97 338 295
12824 295 274 440 -623 511 712 223 -145 50 879 24 -458 -118 -117 -318 143 -628 133 339 -234 595
12844 595 -86 -69 42 293 -351 -57 789 244 348 403 -368 -564 -253 -143 76 342 -480 -592 456 100
12864 100 -174 13 748 98 110 -1008 -229 360 -189 153 143 645 504 79 -190 27 -289 -239 251 -28
12884 -28 912 592 -251 -328 -209 -1 147 -254 -455 118 313 -2 -45 -213 -13 12 267 625 153 87 142 -170
12906 -170 303 -129 -165 -251 -214 123 178 24 -302 507 282 -47 437 -31 -19 -52 22 -220 547 22 -140 707
12928 707 442 174 -191 241 39 98 -224 9 719 612 224 -680 587 336 -76 -451 -85 -328 24 -61
12948 -61 -426 30 -365 -76 -21 -744 -115 193 -271 -444 79 -31 -867 182 364 -367 -441 188 385 -810
12968 -810 244 655 24 -267 -667 90 841 -65 -39 392 -475 616 6 -117 643 400 -84 295 58
12987 58 -652 -269 303 -314 119 -309 -168 72 -167 -178 765 61 12 629 287 -72 362 517 441 -700 -7
13008 -7 38 -261 17 -291 276 -714 279 -65 -434 -750 -393 627 -917 374 86 -680 354 164 -249
13027 -249 216 -698 256 57 261 397 -466 475 180 -113 -131 -839 -115 -237 -161 117 214 183 22 603 188
13048 188 168 -766 449 92 265 419 500 -1046 253 20 -297 570 -538 35 -486 670 69 413 -500
13067 -500 538 -241 310 426 12 -106 144 375 -139 156 487 -462 -29 458 -235 28 -101 -268 -741
13086 -741 736 58 674 1177 209 -236 -569 337 29 52 26 -54 622 191 279 183 -57 -64 -669 -156 503 201
13108 201 -338 257 -139 -463 185 -767 310 545 -39 249 -53 -109 -306 -326 87 283 -393 38 -190 28
13128 28 124 216 408 -629 -70 230 -84 -298 185 -415 -207 -69 122 155 -23 46 -95 193 -512 -170 108
13149 108 -654 684 -338 -306 882 264 -101 451 1012 -581 280 258 -966 402 -305 -575 -339 -265 -327
13168 -327 463 -8 -100 326 35 -380 222 -674 -589 855 106 -256 85 333 -321 593 -442 278 -750
13187 -750 -325 626 -552 -945 -62 326 -639 471 -70 -309 -363 -72 -160 -131 -652 -405 205 -65 -165 692
13207 692 -586 140 220 287 -60 -232 397 -475 165 709 -127 484 -5 -724 173 149 -113 -918 143 -181
13227 -181 -128 -300 37 693 -292 200 -240 824 -1007 66 452 -1 490 39 519 -102 -725 585 146
13246 146 369 -101 33 -311 333 -151 61 -119 -922 -286 55 31 417 21 454 -334 126 31 13 756 493
13267 493 319 447 -58 18 214 -487 113 -111 -700 432 558 -693 -306 138 506 571 382 -722 -277
13286 -277 -314 -379 537 -397 -552 365 -536 -366 -246 -556 800 711 -7 28 909 60 240 491 32 121 -238
13307 -238 -560 -93 773 323 125 343 289 -504 -335 -336 24 21 -63 284 706 -75 -79 434 -608 106 -38 345
13329 345 -576 39 -335 -60 -276 229 99 117 -374 -590 56 181 316 -294 139 -430 -483 -24 457 -60
13349 -60 -884 402 39 -95 -30 -314 -147 448 284 -142 326 -786 82 -372 -928 89 457 386 -449 306
13369 306 639 149 433 -226 551 769 169 39 -99 368 -160 -47 41 -358 -985 195 8 376 81 245
13389 245 48 70 -313 -23 -141 301 229 -124 340 -171 6 177 -73 -421 740 371 16 -150 283 -413
13409 -413 32 426 -140 301 -193 -131 434 -490 -201 -108 139 485 216 340 -336 -166 -201 -342 342 -782
13429 -782 618 189 -80 33 235 -441 1026 292 440 166 331 647 313 526 -555 405 90 170 70
13448 70 -41 233 35 254 -380 -169 -267 -1124 -193 4 387 320 131 -24 224 1004 748 -292 -346 62 -15
13469 -15 -484 -985 513 -172 91 -331 518 -347 -345 133 -122 152 100 -396 -322 35 -306 -628 -934 143 128
13490 128 132 125 313 -954 636 -673 53 -894 433 474 113 400 460 151 118 -72 491 426 71 -230 435
13511 435 -200 294 -169 -109 -558 327 234 584 240 -944 550 -299 202 -132 -521 -518 108 -11 -70 307 161
13532 161 -438 -470 305 86 606 -301 158 -68 88 7 -572 -125 -245 196 -205 114 -107 -67 -501 161 292
13553 292 73 -249 -346 479 -350 -237 -758 -93 -304 -420 46 6 20 497 159 232 -273 -476 -24 -29 374 502
13575 502 -212 -291 -308 -324 126 442 171 -456 81 -96 512 248 -421 436 -610 -93 369 283 -393 -5 -66
13596 -66 -357 104 641 181 143 555 424 -116 160 -94 109 46 -414 -1006 371 -504 -67 508 258 -304
13616 -304 -91 -334 296 170 -285 -58 507 322 -327 862 -67 -565 31 70 693 145 -258 45 -511 197
13636 197 305 -46 -652 -127 -42 1490 -297 -503 -43 -128 -55 -147 -426 133 279 -446 396 -485 -1138 -429
13656 -429 82 336 -497 166 257 -26 415 -4 -412 -147 323 599 342 -733 104 -91 -86 -363 -185 -20
13676 -20 10 -260 -626 649 180 -257 222 380 -1013 -65 -160 303 -195 -577 400 366 392 -521 146 -99 -334
13697 -334 -267 141 469 457 375 -493 527 -166 -235 353 -243 -175 85 -537 87 -440 9 -207 623 -362 477
13718 477 3 -400 -434 444 41 104 -544 240 58 14 -710 -637 296 -38 801 323 -343 -831 500 253 -214
13739 -214 -152 317 -95 219 234 20 186 24 -249 -183 -97 88 181 514 185 -535 193 84 -58 115 747
13760 747 -187 -32 -79 -36 266 467 -534 246 373 113 129 200 -260 218 -25 292 407 842 475 724 4
13781 4 -964 -511 117 136 -117 73 568 162 -399 -578 5 453 -148 768 -80 -197 783 57 427 -38 625
13802 625 217 52 459 -301 103 3 439 351 777 16 -74 -140 -7 290 -116 -279 40 -359 21 5 -356
13823 -356 -170 -201 109 247 -38 85 221 289 659 -96 -545 609 -244 120 -74 234 -42 -257 -152 360
13843 360 -253 -402 44 -7 272 -83 -73 675 -53 -191 -183 -486 -246 128 -65 342 -234 298 -942 620
13863 620 -411 -935 58 -35 327 -52 -612 140 509 -718 -316 221 323 273 550 358 -453 397 -195 187
13883 187 347 -407 357 21 -212 554 119 184 155 -311 305 110 242 -702 -286 685 -70 -131 -327 -1245 225
13904 225 414 -441 343 -101 -628 596 177 830 65 254 -240 -213 -6 -403 615 -367 595 991 -74
13923 -74 375 -639 372 369 -43 206 561 -537 549 656 -268 -167 102 -403 -390 -36 -444 -584 -450 -873
13943 -873 485 46 80 -329 1014 151 35 -572 -79 280 557 356 152 111 -105 -746 572 292 -41
13962 -41 -121 443 188 -761 -144 -515 138 51 94 485 75 -217 827 -533 -671 -159 -331 -32 862 -456
13982 -456 461 316 -463 -66 240 -544 229 577 -460 8 592 -221 -13 427 -216 2 -547 212 389
14001 389 140 -273 13 -63 -436 118 -916 11 -113 -22 -141 592 -695 201 -118 -340 67 260 138 -295
14021 -295 406 -148 58 -438 31 148 -198 97 -1021 -330 415 219 407 -39 543 397 -995 -69 202
14040 202 364 -59 806 -624 843 417 410 307 291 408 351 -405 -379 764 580 -157 -350 215 437 252
14060 252 502 -594 -304 193 -161 395 -559 127 187 160 218 -52 -530 -565 -91 144 144 -187 -4 82 346 -36
14082 -36 264 -301 474 -317 38 -508 184 137 -756 -472 267 -389 -32 -325 -31 -460 121 375 504 847
14102 847 -140 -403 -121 150 45 165 -859 -960 -47 448 94 110 -175 189 -745 -619 308 -128 285 518
14122 518 -1134 19 345 112 657 536 184 -107 -61 -430 443 258 -793 -466 816 217 225 -110 -722
14141 -722 291 -211 -213 55 -653 363 -535 456 -260 183 -528 190 -19 697 207 -87 696 -37 -269 79
14161 79 177 164 -174 111 181 510 -353 200 -463 478 -342 0 -309 353 -410 -18 390 18 -104 644 -22
14182 -22 712 117 625 11 -720 160 -457 -21 -149 -749 44 127 298 145 -520 -627 -374 112 -992 881
14202 881 595 244 34 -185 407 52 -387 330 732 -747 396 -341 -62 193 10 670 -419 -137 -412
14221 -412 10 39 -258 -3 82 -80 523 -184 -86 44 -388 678 422 -251 -167 -102 -583 -54 363 -875 -25
14242 -25 220 -575 850 399 -439 270 -217 331 -155 399 -265 864 -11 72 262 102 646 542 698 57
14262 57 415 856 -330 -205 619 -219 -398 45 -207 282 314 254 85 -713 696 372 348 878 549 -161
14282 -161 -315 381 32 6 -1021 -155 -50 208 122 -601 366 -45 257 593 -10 -283 126 393 358 339 -46
14303 -46 -671 -109 105 -344 55 -500 163 -290 -533 -275 -51 182 91 147 -109 -445 -115 292 90 -94 -129
14324 -129 324 -606 -682 -71 75 122 791 577 117 698 -632 -100 205 131 220 -161 -640 398 -406 -425 -198
14345 -198 574 262 450 -290 196 -93 -109 324 -301 504 472 -88 -869 403 104 88 -1181 -555 52 -622
14365 -622 80 827 -316 634 -266 526 9 -235 41 -122 458 147 656 264 -189 -19 -74 497 -50 -527
14385 -527 156 328 825 448 688 -246 152 -67 -633 1098 99 -141 -707 6 17 -456 -368 -78 69 -23
14405 -23 312 -20 -547 256 200 465 -84 317 -106 -395 -199 -112 -795 2 -136 -230 -540 -141 -433 65 634
14426 634 -234 204 -509 414 -260 -275 -214 -394 35 -826 -4 8 -91 162 -1117 313 -166 -315 -922 -166
14446 -166 -217 -75 136 -209 -1054 -29 -16 -95 283 -43 552 -107 -542 554 -65 77 -36 155 98 -146
14466 -146 -216 590 206 100 207 352 23 -383 -210 -183 355 510 -177 316 -10 -745 -117 -85 577 -330 3
14487 3 116 -182 90 -188 477 241 257 242 271 -48 -647 636 -105 27 160 -104 332 -240 298 306 -379 -454
14509 -454 -322 -254 306 -260 -17 87 599 137 -26 -167 162 172 142 -88 -232 -631 98 267 -439 -331 416
14530 416 179 -453 59 -531 -822 -331 232 -261 507 275 -537 242 82 -178 -168 471 19 292 -306 423
14550 423 -148 -494 -1013 -456 -161 256 584 255 471 101 422 -80 -433 -350 376 876 349 -537 458 -91
14570 -91 563 -499 -8 -314 194 -215 -92 457 277 311 -113 -373 -36 434 -444 -560 0 -541 -353 -121
14590 -121 -378 169 222 -52 -358 -478 348 -248 -460 -885 55 393 302 519 157 -628 192 -179 -405 -7
14610 -7 -503 327 94 -132 207 749 285 274 354 303 -478 733 182 -593 38 22 -309 -344 -56 113 446 13
14632 13 -228 446 -275 -374 135 420 -1060 -930 -30 74 577 183 34 -59 1055 -344 232 456 97 435
14652 435 264 820 -180 230 -714 428 -35 203 -248 -489 1 169 -16 74 577 -25 -119 -566 -261 277
14672 277 474 -416 930 142 -430 335 480 -344 -195 -574 -92 525 344 -3 667 199 362 -432 -547
14691 -547 -114 -107 218 -81 -11 -115 343 -279 -947 -42 -81 260 -807 264 6 -543 244 261 457 235 -71
14712 -71 196 732 -90 -5 -59 -264 853 -572 -218 155 -536 -210 185 -97 40 558 570 -52 748 63
14732 63 -30 259 106 -434 118 -293 197 56 -785 -237 115 42 -454 123 -448 -694 279 -473 296 -162 -163
14753 -163 540 -239 39 791 -74 -709 -42 556 -465 129 -589 276 -503 1 84 353 178 -108 -437 331
14773 331 -443 -15 155 409 230 -150 -399 -1148 -232 111 498 696 812 -301 -187 775 127 -79 250
14792 250 -754 -312 881 -252 -335 -297 196 172 -297 252 -95 376 351 -161 -188 -85 -117 1157 -2 -187
14812 -187 53 -43 -413 -21 -106 251 154 102 -40 -513 388 138 497 30 -377 79 586 62 268 -321 -49
14833 -49 788 262 -289 60 -1 -22 -331 494 73 182 233 -70 -12 -975 56 486 -199 -1 429 348 -501
14854 -501 -314 95 -447 614 44 -176 87 -148 328 -77 -161 445 -251 -9 -92 802 806 -386 -154 -546
14874 -546 98 -375 385 -765 366 -400 547 313 345 -214 -142 41 -759 -776 427 298 -620 -456 1163
14893 1163 -589 -492 829 -961 349 -255 360 128 -306 137 166 379 -27 581 -173 -303 -144 -256 430
14912 430 517 -272 -961 520 -116 -137 -216 319 -253 654 -594 389 265 -526 -113 17 -331 276 179 -445
14932 -445 167 221 -320 -720 359 -324 -214 -5 -519 -477 -483 -260 68 -59 34 188 -115 50 -12 46 -465 -791
14954 -791 1 76 267 -582 -475 320 -123 185 146 -139 -431 423 55 240 460 -266 836 338 -388 368
14974 368 -299 -665 -235 -87 -955 -36 604 -901 -47 -288 -608 -853 -399 -95 123 90 -137 181 -105 28
14994 28 476 -105 75 -78 515 -110 61 707 461 60 -157 -323 -211 347 384 -520 341 -184 -204 -237 883
15015 883 -480 387 202 319 178 -949 -214 552 369 -109 -579 -512 269 -44 671 -42 428 -513 -331
15034 -331 -161 302 378 -101 -71 405 71 -357 215 -32 -222 -14 -754 478 -291 -593 -442 -244 -782 -157
15054 -157 -390 41 101 430 408 -228 659 -122 237 -293 -345 337 -394 -41 156 -863 -775 -765 -244 55 92
15075 92 221 -118 -563 -443 131 116 212 -155 404 -488 -548 95 504 29 467 -20 247 453 -963 -115 64
15096 64 -47 -92 -326 -1147 -380 169 -347 -304 394 -258 269 602 4 964 320 -753 291 343 -4 -101 -42
15117 -42 -784 -317 -542 488 36 731 128 248 642 -150 138 239 -233 186 119 64 264 -911 -136 -361
15137 -361 65 -593 389 -452 -249 -594 -63 -141 273 121 29 155 14 -260 -21 -798 852 -91 -518 -187
15157 -187 60 43 184 -113 -1120 244 28 -146 -702 -297 133 475 150 248 -208 -87 -756 371 -275
15176 -275 -242 305 181 -353 361 73 -190 146 435 185 523 314 65 72 -252 -594 56 -356 -213 67 -83
15197 -83 432 345 -132 844 -482 -801 -138 12 408 682 337 -370 -602 -206 -475 49 235 -697 225 69
15217 69 64 -102 440 14 -676 165 18 -576 -201 201 240 190 278 458 -332 -839 718 -57 21 -153 -86 159
15239 159 26 -824 -390 -305 438 -596 -9 -723 -326 687 -362 -181 -167 379 339 323 233 -290 291 -158
15259 -158 137 -312 -99 -82 -209 415 122 -616 -345 411 -200 206 36 181 -47 118 -496 44 844 -18
15279 -18 -451 445 33 -781 707 -32 -310 149 -895 -2 -130 256 -361 492 -297 97 468 -129 -25
15298 -25 -320 -350 171 214 -442 -174 643 1029 -177 326 -237 629 -98 -533 -241 666 191 -291 -719 206
15318 206 324 -105 -44 526 -146 15 -345 -105 60 195 -364 211 754 611 311 239 -812 -413 -749 23
15338 23 126 -288 -344 -43 663 -96 197 134 200 386 282 849 478 208 -149 -181 -609 -420 553 -56 4 -11
15360 -11 51 906 -336 366 357 424 61 -54 -159 -788 51 190 198 44 -157 -253 -235 163 233 142 311 264 133
15383 133 -219 -8 -32 165 -350 -201 518 -122 312 -484 -283 -464 305 -169 -35 304 -448 862 -101 -89
15403 -89 -257 288 -573 228 789 -422 -503 955 -987 236 269 -234 -221 -310 705 -341 233 -499 234
15422 234 327 105 46 -57 191 356 -265 -269 623 175 -163 -133 74 -326 98 -182 -162 238 -384 -472 -318 -289
15444 -289 -461 -453 -587 -1240 65 274 281 -249 -507 -36 191 -378 327 267 -568 195 -14 -277 639 27 -415
15465 -415 94 -92 258 258 182 -72 102 361 -576 -43 -563 189 -41 69 -32 -736 479 112 458 170
15485 170 564 607 88 338 498 -715 251 -37 334 316 352 -153 361 -356 19 89 -286 -963 138 -91
15505 -91 664 658 -894 -624 391 660 353 -494 557 491 816 -54 -201 -24 332 -201 119 181 477 171
15525 171 -473 -201 -396 -520 554 -289 -159 -397 664 -733 -283 646 -430 296 536 364 -81 -610
15543 -610 -552 -99 312 -121 -421 -416 -157 176 -585 195 -614 320 36 283 707 -35 -645 -184 217 166 -43
15564 -43 -422 -528 -362 174 462 123 185 1124 164 -427 -645 -209 295 175 200 876 -70 -828 254 194 -293
15585 -293 417 442 -206 141 -463 189 567 -193 52 59 355 361 -129 -220 -62 202 -10 431 125 -252 -358 995
15607 995 -416 -83 163 732 366 -334 266 -827 491 -453 34 -321 112 -318 -90 -171 1 362 -706
15626 -706 165 526 -406 -519 611 240 -693 -123 -97 428 -162 -353 -694 638 508 -3 -280 -309 -100 -827
15646 -827 93 265 50 -398 -137 -174 14 1138 158 -170 -373 42 -137 127 486 -19 295 758 45 -252
15666 -252 -441 488 133 -20 -302 -313 -270 465 973 280 399 -460 -127 84 301 81 -232 -13 427 303
15686 303 433 -623 331 -334 -490 326 89 445 472 192 -360 -657 -240 30 270 341 633 365 209 116
15706 116 241 -103 -386 138 -468 -157 745 664 -505 -90 -293 -968 -836 27 -503 -415 282 335 -265 527
15726 527 -770 -183 -171 -67 52 -201 534 -368 -254 -42 -718 385 -386 -818 -35 -113 595 8 267 87
15746 87 -104 480 -181 -19 345 344 -659 272 -77 -466 -664 -34 -491 -394 875 458 357 595 155 -578
15766 -578 -583 405 -341 -147 248 195 742 -368 383 -616 87 567 -101 -234 523 -74 110 197 -368 24 200
15787 200 219 -491 270 -997 -514 526 109 688 43 670 -475 -86 -620 318 648 -290 713 -305
15805 -305 509 -29 76 -503 501 943 -463 -103 104 8 648 -30 -48 -248 129 -115 -43 -299 386 631
15825 631 -39 -366 -129 -84 -71 -454 -73 211 140 193 370 -341 169 146 545 -198 102 183 -454 51 -436 -202
15847 -202 291 782 -221 -89 192 -124 447 78 -1 197 -173 -212 -276 41 -85 476 -380 402 -46 -800
15867 -800 -157 38 68 -71 217 -357 -111 81 -315 -464 -287 4 84 -256 346 -199 -53 -357 376 227
15887 227 -223 -115 -569 -882 822 249 62 -367 -237 -506 -259 1339 649 -258 94 -799 -77 -359 452
15906 452 352 424 -402 681 535 -411 -394 180 215 -654 -394 -564 791 21 257 251 -173 497 222 651 -151
15927 -151 -479 -172 416 801 -417 -463 126 -61 368 -240 140 -124 550 683 871 147 -289 43 376 61
15947 61 36 421 -240 11 -781 706 204 -624 -313 7 -72 28 -557 -311 519 400 -477 -528 -282 -444 439
15968 439 103 -419 -99 -863 -317 37 231 -194 128 -346 162 -311 186 17 -254 385 402 -3 500 32
15988 32 -390 14 254 49 -322 -301 -782 876 833 66 -101 -91 -483 460 -687 -9 70 -160 -15 304 148
16009 148 -327 -506 -677 -581 -450 495 -22 124 -591 -42 -97 -62 131 -504 356 -417 -53 -72 -102 -482 -62
16030 -62 -33 469 -118 -1037 335 541 1239 386 -82 342 226 -594 -357 698 288 451 -69 -483 -295 -784
16050 -784 -72 14 -963 -318 62 230 407 78 36 -279 270 -42 543 -836 -571 -323 -610 17 278 -432
16070 -432 -213 -214 -382 -760 -203 -174 45 880 -14 152 529 184 -131 212 408 -436 99 743 -65 129 -355
16091 -355 -674 -126 -27 -426 -146 -367 -302 551 -26 338 -430 -24 -377 -381 -517 119 272 -263 -217 760 103
16112 103 310 459 -356 -33 -232 -537 345 488 -112 493 -885 38 110 -396 589 -678 -147 152 48
16131 48 186 -393 -360 -56 91 523 864 -265 -20 418 493 999 -75 -569 -159 -587 -248 212 -128 -165
16151 -165 38 -298 545 -574 347 613 -17 221 886 433 -331 32 633 -126 272 -245 -374 328 792
16170 792 212 298 305 322 -452 625 -50 115 236 -157 47 -148 -572 -736 -167 455 -505 -756 -239 90 -440
16191 -440 -93 275 -424 -364 -149 -402 -65 -9 -398 1200 258 364 333 -141 405 71 367 100 -430 -111
16211 -111 -39 874 529 -63 -532 -140 -597 312 407 363 343 -251 -556 -589 -552 -609 -124 -396 351 -495 -237 -521
16233 -521 99 -258 -72 -145 434 -31 -943 -212 -528 -463 420 -437 626 23 302 425 401 322 -25 180 -176
16254 -176 183 9 526 318 186 -8 -22 -345 -422 -261 -512 271 4 212 626 244 -631 -48 70 273
16274 273 661 -449 -178 -211 -572 169 288 -771 393 -160 -474 -1220 129 400 296 625 -419 -706
16292 -706 206 406 386 505 -255 465 367 -175 210 -191 -468 739 -42 -272 88 159 -40 370 -60 215
16312 215 714 -509 -81 239 304 -156 685 -856 -49 -272 -102 317 146 168 -1297 -174 119 -498 311
16331 311 -283 471 -214 -267 -19 -711 272 470 738 -163 302 24 -109 820 252 -109 -71 127 -969 -190
16351 -190 -266 801 656 -560 -400 -104 972 -1202 170 646 -367 454 238 -79 -22 -28 -658 -1038 73
16370 73 -340 372 571 -5 454 -254 -386 577 -31 -118 14 -91 -75
16383g5
$$ Imaginary data points
##PAGE= N=2
##DATA TABLE= (X++(I..I)), XYDATA
0 0 0 0 0 0 0 0 0 0 1 -1 2 -5 9 -13 11 -13 15 -16 18 -22 23 -26 31 -33 40 -50 51 -65 74 -103 131 -191 347 -3829
34 -3829 -511 634 -263 450 1150 -255 -33 -246 -336 1278 237 511 149 -82 988 -81 -14 -291 123
53 123 -555 -241 813 -295 895 618 -122 523 -444 -412 -411 532 238 -738 428 102 -890 -4 27 470 591
74 591 207 -279 521 10 406 394 -80 550 -619 235 287 285 -185 436 401 588 -65 15 -271 411 -18 -53 -207
97 -207 -13 82 408 -211 100 468 -462 414 585 84 191 -561 -229 -501 -332 264 -339 57 -128 -648 37
118 37 -328 -24 -91 -49 322 333 66 -327 260 -407 43 236 130 110 691 -82 -72 -16 -995 64 -324 79
140 79 156 -182 463 -245 197 -666 659 269 -61 449 430 219 4 724 399 -557 711 131 -458 -632 -453
161 -453 185 -172 -386 299 115 55 504 -280 -180 256 -185 -564 -36 -153 223 -546 -660 -32 537 -365 -269
182 -269 524 -233 323 -140 -672 -85 206 -193 -220 225 -410 -199 698 -271 -227 234 -747 179 509 316 -470
203 -470 15 -644 -210 -376 -157 -75 244 93 743 -576 -235 132 -140 -470 87 -47 128 189 826 -116 -197
224 -197 -305 -803 255 -232 190 192 430 16 282 -35 -387 -31 -433 214 391 -683 -692 -109 -146 -447 305
245 305 122 -514 -425 -336 -538 53 -48 -531 -596 -87 -710 -593 -495 250 234 -192 -86 824 384 -223 367 284
267 284 -351 -237 -135 -339 -16 -69 -278 183 -433 115 226 651 -656 -797 -92 -57 -39 -209 569 -378 111
288 111 -31 -384 625 162 323 239 -78 667 408 105 -365 -215 288 51 353 -310 170 -479 -605 -692 70
309 70 -804 -778 469 -167 -822 225 -194 295 263 192 -326 183 -353 107 195 -429 -287 183 14 -301 -55
330 -55 -182 139 -170 -144 -29 462 -184 -300 503 164 403 -300 409 -39 594 -300 55 111 -28 265 168 -512
352 -512 259 655 315 400 -152 736 98 112 -735 -77 431 -489 396 -421 -72 122 -169 593 -94 -364 -87
373 -87 263 249 102 -418 117 -468 209 238 1020 69 -229 139 735 -145 295 206 -529 -120 145 -723 417
394 417 -303 -516 -421 -408 -324 -499 -482 -76 555 -113 502 179 27 -467 -668 847 -146 515 104 -520 -712
415 -712 390 191 527 -60 -240 662 -415 -45 270 306 -636 -285 -214 -652 378 340 -560 179 79 -592
435 -592 -345 -377 -661 -316 546 203 667 406 694 452 95 657 -119 -224 -348 164 -742 239 57 -476 -815
456 -815 -684 371 83 -416 -381 355 -269 -177 106 -428 150 880 -62 -192 367 -133 -545 -565 131 134 96 -240
478 -240 -18 65 378 773 -89 -508 111 -96 275 -295 810 -416 -280 -78 -114 215 361 320 279 729 72
499 72 244 671 94 -344 -179 -674 -58 533 85 -199 -266 -1076 -395 -11 -779 740 214 90 92 -151 -861
520 -861 -371 85 -485 236 4 -317 -106 -548 -621 68 -93 750 13 268 -705 206 574 -261 237 337 416
541 416 434 247 312 -243 113 -278 194 -254 86 -237 486 212 375 -670 650 -365 61 308 572 -654
561 -654 -208 -343 -177 -413 -253 304 307 90 -461 266 -460 1001 33 -763 407 215 -74 -447 76 -568
581 -568 -687 -256 206 963 15 119 -213 -21 561 283 -176 -376 111 320 -181 -127 -571 -423 491 113 -318
602 -318 -280 -273 120 -901 -293 326 141 -451 -210 -185 152 -779 234 566 -96 287 465 157 -67 -159 -10
623 -10 -37 -442 92 322 -367 -731 -215 312 -354 15 -407 -322 301 -622 508 -152 335 -164 40 -846 3
644 3 274 560 -35 497 720 88 496 -738 -436 -561 -80 -158 190 217 636 -257 190 -442 546 486 -17 351
666 351 -232 450 -236 74 390 80 606 296 235 607 210 -739 -396 -240 427 255 166 437 739 -46 208
687 208 214 121 -18 105 106 -545 683 151 12 -396 -675 132 190 1064 79 -361 590 193 -217 -200 -672 65
709 65 69 374 -51 -248 57 533 171 -577 -633 99 52 396 91 -381 264 -108 759 518 324 223 -400 -154
731 -154 170 -176 -632 -465 406 -810 109 72 -16 539 -433 -277 -113 257 -220 -590 335 382 -190 -337 -113
752 -113 144 614 -118 -374 -18 107 392 -266 -38 331 263 557 455 -115 -235 256 -391 -308 -159 -335 196
773 196 -276 -311 -186 374 508 236 -94 65 -62 -78 -538 -323 706 155 -435 -349 151 68 1022 -104 413
794 413 335 213 253 -175 456 -510 -411 -284 731 -190 -251 476 276 -136 257 309 448 522 -962 805 77
815 77 70 -125 439 -88 382 24 576 -9 363 -657 -833 -350 738 492 -43 235 33 -49 -189 -82 679
836 679 -370 406 394 -247 147 -678 236 -73 68 -382 145 65 -1174 411 76 -242 329 277 -375 496
856 496 122 66 -71 -512 -353 310 890 -737 -622 0 -960 421 -416 240 -267 450 -346 -431 -7 -786
876 -786 -48 -129 -135 883 370 4 156 360 -377 633 66 -379 734 78 -33 651 727 -84 -524 -588 -996
897 -996 645 647 373 123 -226 19 -551 -135 -465 201 185 136 23 -234 -56 -186 276 316 157 -278 33 -917
919 -917 -363 -431 -167 75 -76 -557 -311 -348 -38 -585 -312 30 -328 -679 716 345 128 -132 263 783 755
940 755 -126 -276 695 276 526 221 39 6 110 151 565 -483 131 49 -132 202 -772 92 146 -241 -87
961 -87 110 271 97 -125 116 314 51 1225 -482 290 190 -421 202 241 139 -596 -233 -360 542 174
981 174 520 259 82 -199 -471 -308 -622 -358 -73 -62 -69 -1109 70 295 -264 165 -101 -438 266 -592 494
1002 494 -23 -247 16 -2 -570 303 -141 869 183 -164 362 -102 410 429 570 291 611 -603 -12 -820
1022 -820 713 429 192 -212 650 -278 501 328 607 179 -13 12 -624 937 826 570 -171 -431 -16 -575
1042 -575 488 -140 623 335 -158 -96 52 491 -442 122 1015 -323 -916 142 599 -467 707 927 84
1061 84 -413 -39 -139 -706 -273 -215 -246 -76 -214 -551 161 -332 -305 749 124 277 663 -272 -83 -88 -23 110
1083 110 -337 46 20 -68 684 421 294 188 -234 -582 335 64 -689 -187 -343 -647 199 137 352 125 313
1104 313 104 277 237 -396 375 489 -333 13 453 99 263 -923 -51 285 92 538 -111 -224 422 29
1124 29 224 203 -304 -258 13 307 62 -221 604 -349 45 -162 -217 507 699 -628 40 593 -207 -341 -245
1145 -245 -546 -484 -33 -40 245 -374 214 117 143 773 53 -329 -521 80 883 -305 110 327 -790 -141 -108
1166 -108 333 -193 225 759 267 336 -192 341 -175 39 82 -523 170 699 109 -385 -125 -88 51 152 -64
1187 -64 258 -142 212 -547 189 -3 458 214 873 -125 138 -252 109 451 530 571 1 111 198 292 -28 28
1209 28 317 549 -165 34 -879 -150 182 -423 -398 -252 -328 26 -351 -848 -29 -649 -66 -55 493 127 136 -2
1231 -2 -726 63 377 -651 -527 -43 -12 209 -932 387 -335 50 -229 143 -189 9 206 352 -6 -99
1251 -99 -292 -163 371 -645 634 -384 103 -508 -116 472 -404 -246 43 499 1003 -410 73 -192 415
1270 415 354 -534 -123 30 -213 -403 -350 488 -232 390 27 -758 300 -363 -934 -302 57 884 176 -1025
1290 -1025 927 -109 733 87 743 279 162 941 -384 514 64 -188 422 348 371 -96 94 -482 247
1309 247 -44 122 -607 -993 -798 125 -10 -242 -207 -142 521 -177 -214 -251 -101 -889 744 68 -135 -841 662
1330 662 -231 -453 424 -517 225 -234 201 -90 154 573 875 407 -316 -338 -156 222 497 792 809 509 39
1351 39 -641 648 212 -120 440 719 45 -62 -23 -590 387 91 -66 -15 443 235 266 -72 606 609 -215 291
1373 291 192 -677 -172 -249 -49 -229 247 -7 -223 700 -188 -226 -43 -43 -144 3 -159 -271 -108 -145 513 140
1395 140 218 -783 -223 -110 503 -247 -665 286 105 247 -137 -82 -498 630 -581 343 843 -179 226
1414 226 612 -103 540 70 -352 98 -103 -335 -510 213 -91 225 -635 -225 286 -72 1085 -270 174
1433 174 -845 -852 13 581 -60 58 -290 565 406 -547 -137 -486 -705 400 26 69 -232 321 384 12 -270
1454 -270 -515 -342 69 656 -241 -204 811 -863 -227 343 -100 -199 -388 161 684 127 456 -380 -231 -305
1474 -305 -205 223 -68 -126 -305 277 -168 154 -597 -562 448 15 -1169 64 531 -39 69 -88 -245 -241
1494 -241 670 -238 21 -153 -914 -94 115 -27 -314 47 150 -369 148 -249 588 560 173 -414 194 295
1514 295 -24 739 -560 -122 -950 54 1331 -24 -295 295 -348 113 136 -652 321 -299 -642 38 -458
1533 -458 -646 152 184 -141 -606 631 -478 487 211 672 534 -52 -564 -16 -389 -68 -301 108 59 -792
1553 -792 359 -430 439 -291 340 393 -256 -57 9 321 50 154 290 -110 576 495 -433 360 97 152 -172
1574 -172 17 319 -313 -111 -373 311 -338 222 49 -92 -840 750 230 387 311 -528 56 -516 -109 -162
1594 -162 427 211 -12 -84 -89 -13 257 373 -413 -55 505 -305 -248 -1010 -39 163 -630 81 -626 152 251 -19
1616 -19 -509 -14 330 54 598 -649 -50 595 -131 475 403 511 396 301 -274 252 407 223 -211 150 -266
1637 -266 827 -182 -949 173 -820 -165 62 -564 198 135 -280 -214 308 482 27 254 176 -376 981 -174
1657 -174 222 77 315 -448 184 -438 -85 -16 -611 -404 -409 -345 634 55 -337 -131 -199 58 -490 -300 -618 339
1679 339 663 186 -215 314 -46 -268 -49 501 340 -262 303 -42 604 -541 -79 134 -90 -439 51 129
1699 129 272 -263 4 415 -299 65 473 426 626 50 502 216 -909 703 -598 60 703 431 -69
1718 -69 -1030 -179 188 -148 -9 293 -382 -611 487 -120 -397 -240 136 78 250 -36 1023 -3 -453 329
1738 329 -88 -274 58 849 -488 155 806 123 118 501 -100 335 390 227 178 -90 105 337 206 -276 -301
1759 -301 -119 90 235 -582 206 481 -895 51 560 391 729 387 28 367 555 861 531 295 173 8
1779 8 -131 -488 -74 473 -790 -396 -332 269 4 20 -378 202 -84 -708 -216 192 232 -462 159 -726 156
1800 156 169 764 46 448 -796 -140 -157 230 -866 255 105 3 364 -863 -123 1078 -834 -561 -100
1819 -100 -36 474 440 -815 307 -615 5 -157 -1187 641 117 -445 -564 106 -158 -409 247 -487 -376
1838 -376 380 241 88 353 -203 -622 59 63 -477 -109 8 -244 -283 385 56 1007 83 -212 104 586 609
1859 609 657 -136 -184 -562 -952 -322 87 462 -172 535 -140 62 -958 -46 257 300 12 341 -299 176 412
1880 412 -153 160 -304 -250 92 72 243 -270 10 144 -111 -529 -35 -243 161 -587 397 -411 243 48 -49
1901 -49 123 -732 270 599 229 557 -134 110 231 55 -335 -277 -31 -388 244 612 -202 -491 280 -8
1921 -8 -66 -135 -93 -122 158 -557 -373 -147 -52 -465 -122 1069 60 801 645 284 -154 -51 -348 113 16 -547
1943 -547 -474 181 -860 -133 -317 -165 882 -739 -393 -127 -406 -550 1001 -364 267 554 -211 -69 -357
1962 -357 -502 -528 -171 601 -430 64 55 -130 34 224 237 180 -190 346 506 -404 402 1213 583 -44 22 -903
1984 -903 -336 605 -90 105 5 -297 -321 655 612 106 229 277 49 91 657 143 -284 -102 -252 -142 -410
2005 -410 505 -116 -246 193 106 553 347 353 -228 933 166 437 461 663 470 5 -409 -233 792 503 -293
2026 -293 -516 -171 148 80 -523 522 196 -86 321 222 332 -152 -256 -527 227 -459 244 520 -159 -88 -209
2047 -209 -452 410 240 615 -428 157 453 -18 -62 -103 -806 -243 868 -10 448 -434 -380 -121 -7 -766
2067 -766 116 -332 -240 653 -563 224 572 -279 -130 -504 -4 185 -93 87 -219 406 72 -445 252 -527
2087 -527 49 -217 49 647 -683 -505 140 -22 -438 -355 -35 -133 355 9 -40 251 841 114 93 505 71
2108 71 191 209 217 -151 -440 -792 -208 -266 -365 -7 -518 48 -105 588 802 -149 -309 828 -77 -407 124 546
2130 546 -89 -4 -332 -378 -329 520 537 479 -269 465 740 515 156 8 -423 194 -4 -678 115 -469 219 -954
2152 -954 410 -575 -535 270 -328 -815 -577 -243 -295 994 168 733 -408 306 98 -199 197 -402 448 153
2172 153 -208 743 -235 -22 -355 464 -78 293 -2 -308 259 -263 133 14 353 323 42 -290 -775 133
2192 133 -246 -149 307 -213 610 109 -12 690 212 -443 726 102 30 771 -135 251 286 -154 329 160 94
2213 94 -589 -492 -624 -150 382 97 -5 -830 430 -526 665 -39 -248 -117 -970 204 246 -182 -396 850
2233 850 -517 25 -62 -31 -25 -226 -96 587 -207 -76 378 199 -234 -174 -23 249 -50 -417 -152 519 -51
2254 -51 118 349 590 -109 791 332 -573 448 336 -110 19 411 28 377 -108 656 68 -562 -243 954
2274 954 251 -59 276 -610 609 -65 -658 -25 -179 -43 169 390 -512 209 318 769 659 -233 322 -394
2294 -394 -87 -184 170 -429 -61 152 119 173 510 -36 -93 226 303 -303 630 -319 -309 216 -485 125 -1089 128
2316 128 403 -459 -13 -625 166 692 470 294 -130 -213 289 -838 239 262 -5 533 230 275 266 710 204
2337 204 -313 356 -641 353 301 115 513 82 -675 206 439 -2 212 471 262 651 4 569 99 719
2357 719 -430 606 573 306 531 -52 154 -78 -702 -181 11 -360 514 -410 -300 13 -262 -518 300 -288
2377 -288 166 189 337 -356 599 -396 247 -251 142 557 -409 351 356 -290 390 -221 320 -51 -660 -260 -326
2398 -326 -160 334 65 -204 103 217 102 94 -165 122 -198 65 -672 -124 7 -368 -50 417 -18 24 -183
2419 -183 -109 330 -139 -348 -92 126 150 622 -18 -166 855 -79 -621 29 -194 -339 -233 541 431 -344
2439 -344 -42 -747 -421 -407 264 194 -129 345 -763 261 310 -205 -347 632 457 -539 708 -99 -267 324
2459 324 -561 -443 719 -68 -557 -247 15 9 976 104 46 920 -421 -178 582 -337 -68 -393 -129 710
2479 710 176 -174 -63 -223 39 -774 210 78 249 -265 -282 112 451 363 381 -297 -322 468 -639 49 277
2500 277 -302 -849 -410 214 -92 -380 294 -280 230 150 -74 631 -452 -272 439 -253 -237 765 -192 258
2520 258 89 -407 -441 135 -290 -15 395 -167 808 -478 618 14 -356 580 -287 -231 681 -769 -167 -214
2540 -214 516 372 -275 859 125 -621 -99 136 610 410 199 -242 -400 -593 -499 16 -552 77 -53 -414
2560 -414 -269 689 549 212 -75 -267 -613 -479 490 -200 -297 619 430 243 -474 703 452 -661 -112 -154
2580 -154 103 -190 23 -47 -332 -294 303 8 826 -195 26 108 -48 245 -270 -210 181 247 -176 -152 255 -155
2602 -155 126 -102 -529 -284 134 -343 555 -336 -244 150 90 569 -164 -1 -522 -381 -296 -667 -283 531 140
2623 140 334 -957 -131 -140 15 -12 -409 153 -223 690 53 421 624 33 177 -79 -515 955 -481 -574
2643 -574 -125 92 -240 -291 57 -127 -633 478 445 -21 379 460 445 365 -523 609 -192 -207 157 54 23 -95
2665 -95 212 410 525 574 -334 17 171 -512 101 187 -320 488 623 -203 193 -532 37 296 -244 260 872
2686 872 88 338 640 -525 -61 230 565 269 569 -511 125 526 23 414 815 -1095 103 -147 -128
2705 -128 486 144 -717 1034 104 -574 5 -409 -134 -14 659 -419 114 -202 112 533 6 -15 241 -451
2725 -451 387 291 -66 -421 327 22 -123 -57 -436 633 475 -185 -177 -414 -90 816 -261 -288 299 -137 -132 -55
2747 -55 187 -406 430 17 -594 -170 -555 -737 191 249 -542 440 -750 220 -398 275 -426 210 -222 -104
2767 -104 589 250 -694 -26 -158 -288 -182 -81 14 -176 -867 -60 13 79 28 -1236 331 432 71 333 106
2788 106 -212 53 120 53 429 752 314 -172 257 -102 -167 260 -313 310 265 819 -1147 139 -433 -660 351
2809 351 -510 224 -109 -865 -384 771 556 702 -281 230 333 -221 673 692 -225 49 -85 -384 -260 235
2829 235 30 -413 274 324 -223 -495 -492 340 183 103 312 -64 -607 -42 150 330 -571 -149 100 -243 -693
2850 -693 -246 -819 179 403 708 714 159 -201 239 -36 28 -289 -738 118 992 130 -149 769 -656 -701 224
2871 224 -34 -253 -191 -486 392 88 -693 -240 269 -258 -202 -127 -85 948 -188 92 45 145 -260 -450 103
2892 103 -443 220 25 466 198 452 78 -197 -576 765 -102 -358 -115 889 51 -287 568 166 415
2911 415 30 319 -56 16 344 850 -341 -222 69 616 243 -25 188 381 -145 -316 221 329 121 -803
2931 -803 73 934 -18 -533 425 -162 460 606 438 -823 423 -658 -33 274 227 382 -61 30 240 -424
2951 -424 -307 116 137 372 -11 -729 -371 115 494 230 241 15 -202 -321 -23 -587 205 -549 -621 15 337
2972 337 -252 -19 -539 -69 -204 -532 40 102 -366 120 -6 -348 -329 209 641 186 -271 -304 -272 44 -235
2993 -235 460 -142 -256 581 83 -16 -18 475 -164 109 636 -661 451 -248 -739 648 318 90 523 49
3013 49 -519 480 702 0 319 -378 400 -666 627 814 -217 -249 14 -218 -365 469 43 -386 -193 -317
3033 -317 -264 188 -361 -60 75 271 678 -88 -4 90 -214 -106 455 342 -843 -358 594 13 -365 763
3053 763 -253 -105 251 591 -388 423 121 -86 -179 -599 -41 340 -309 110 502 252 140 -80 -147 508
3073 508 1067 33 914 624 -755 -61 924 137 189 -568 -225 467 -477 -686 5 -134 -340 -56 244 -198
3093 -198 156 291 -158 413 281 117 -266 -295 331 -28 -148 -78 -133 499 -432 631 -393 271 531 -23
3113 -23 64 -511 946 360 10 -309 -26 -434 -46 -77 -307 186 239 -459 -251 203 371 339 435 381 -560 375
3135 375 441 80 108 -79 -921 147 -75 197 -31 707 -535 -70 -33 -36 -21 505 -320 -582 -313 70 189
3156 189 84 -587 -207 -64 443 72 -399 101 654 192 -125 514 64 -780 130 438 244 223 -439 260
3176 260 48 -675 -216 -444 -430 166 168 92 -233 -156 200 269 274 -318 -560 336 -774 1168 -210 208 645 -206
3198 -206 277 147 -157 -102 658 284 136 424 121 147 -727 742 47 286 -85 3 228 -487 81 -327 -22
3219 -22 10 -104 91 -87 878 194 217 -337 -509 59 -111 293 -225 460 -635 -651 646 -35 -349 -226 -64
3240 -64 -111 383 -67 -711 -212 79 -380 543 -362 -625 -35 415 -560 -204 -15 -460 324 631 609 566 327
3261 327 -476 -154 22 -161 -43 -629 789 605 -80 -255 499 123 782 -251 -177 290 -265 -236 -394 -739
3281 -739 -477 -121 238 -242 346 -403 77 -269 -110 356 87 -828 -406 338 -235 830 433 242 540 -575
3301 -575 -397 -749 -94 -159 566 -100 664 90 -301 114 -269 -183 -237 886 -417 -685 -66 -17 431 871 534
3322 534 231 99 -249 131 423 -258 -122 -397 -106 583 -763 -440 -107 327 320 -265 -40 312 -305 -529
3342 -529 -698 -268 -179 217 232 108 -354 678 -110 176 -120 -369 152 372 -1043 -412 55 -387 434 -330
3362 -330 -109 -606 643 480 -170 158 -811 439 -526 733 -792 -245 -361 -875 -1024 -50 -385 -264 -309
3381 -309 -79 -75 -998 266 -29 -134 -106 251 386 -151 -141 -821 -127 469 -492 -80 604 143 -558 -78 113
3402 113 258 -49 -339 281 -661 -65 263 -255 329 640 181 -267 53 398 -366 496 286 -20 488 -20
3422 -20 466 -207 183 391 617 -270 188 414 -288 1130 744 -70 313 596 421 121 -430 -65 566 -114
3442 -114 551 868 303 -153 -1015 -1138 39 122 -948 -67 99 179 -579 -285 363 309 284 -342 16 322 523
3463 523 -175 773 120 247 -193 95 237 460 247 435 -388 -264 -415 419 -938 -399 -518 298 -7 158
3483 158 378 290 18 -530 -537 58 -100 428 -256 -179 -996 -143 -70 -524 302 283 208 766 -74 549 -152 -210 508
3506 508 369 -254 244 -182 555 -370 -591 85 15 -404 -335 221 340 -313 -341 22 -161 311 594 -233 -8
3527 -8 123 74 273 185 15 32 -424 -304 119 106 623 345 283 -84 -167 -139 156 -438 37 508 495 342 -353
3550 -353 -142 -88 474 165 -168 113 -341 -859 -604 81 -468 -148 359 -163 345 -97 -24 453 94 604 -253
3571 -253 89 -107 258 -495 386 -313 116 -521 275 941 348 1064 89 358 -92 -379 -311 -42 737 446
3591 446 83 -356 -51 445 -149 355 -224 -298 -120 -733 86 -82 292 -68 -176 -257 -507 70 -419 -282 45
3612 45 -187 -141 -105 163 -259 295 -260 3 -486 508 42 161 286 -430 585 -34 372 487 362 25 -190
3633 -190 -29 -98 -294 13 -708 474 -551 908 -618 -479 -475 34 12 -259 -100 -199 -113 1181 603 485
3653 485 224 734 195 -512 7 -288 -580 -389 359 497 840 671 -523 34 191 -551 149 -42 -265 136
3673 136 33 103 369 -118 -307 -156 117 551 -458 326 602 -138 -59 -136 -114 -482 272 -125 89 24 -150
3694 -150 -488 -713 794 -222 -129 -120 -14 37 -138 -444 -67 561 318 16 84 0 232 -101 -563 134 -10
3715 -10 504 58 691 430 24 510 -363 -249 -115 279 -318 -163 -506 228 -1 172 349 1002 -29 712
3735 712 -41 280 -733 -179 -495 236 636 -741 215 292 -475 -137 132 -394 233 -282 -806 -124 330 607
3755 607 -26 -141 -626 404 143 699 -254 653 -265 381 418 -1234 1176 -751 541 -401 89 526 138
3774 138 -727 -560 -204 -478 -51 210 -688 55 -222 -988 181 -323 87 46 -235 -360 -108 -19 494 489 215
3795 215 362 265 -14 -127 -354 -734 -170 -307 -374 -323 671 79 -899 424 -1025 -90 19 -100 360 -206
3815 -206 -454 -1144 237 297 247 -453 -336 -657 -66 680 263 145 13 -249 522 5 290 229 -295 435 453
3836 453 222 172 475 -336 -535 245 296 -601 374 -322 45 304 -951 -423 422 662 175 -565 -332 14
3856 14 -141 149 123 280 22 -373 -357 393 349 -132 -211 206 -4 -781 381 -345 585 861 298 -363 704
3877 704 202 -702 -201 210 -172 -218 -407 626 367 -183 3 340 -76 16 326 -488 -194 -117 549 571 267
3898 267 9 423 -52 -631 -81 -312 -479 164 -246 -72 183 477 -301 257 -466 -704 -420 -399 955 215
3918 215 -529 -282 -184 -335 -49 445 590 346 405 -142 6 228 -713 170 410 247 503 342 -387 -364 -506
3939 -506 786 137 243 -477 -561 231 -227 214 122 165 36 209 -145 570 116 131 111 214 494 -257 -359
3960 -359 304 523 368 699 -138 648 -678 -330 -229 -209 -339 55 -386 485 589 88 549 530 -386 242
3980 242 -168 444 961 432 -471 227 26 11 6 181 141 78 -1233 99 257 255 796 -465 86 108 379 -174
4002 -174 -352 557 574 -238 -125 -120 852 539 -166 298 651 -30 218 -305 -989 109 443 -371 -417 -93 -136
4023 -136 -718 -503 -78 -39 -678 -536 -34 -53 76 116 8 -59 129 89 -65 -255 836 -241 415 105 242
4044 242 366 -97 -207 208 199 -434 40 -487 -33 -121 402 620 -238 943 -861 -633 -307 -926 103 -606
4064 -606 266 347 -430 369 -113 -606 380 -474 -308 -74 469 167 -786 50 11 -852 393 -378 299 -154
4084 -154 -166 347 463 -80 48 -230 26 784 32 238 73 -412 -369 109 143 -618 -482 72 368 450 -108
4105 -108 104 -221 -783 -152 144 -364 122 -29 -304 402 -90 238 -554 -109 955 -284 -131 -195 34 231
4125 231 1 -718 144 -195 -439 480 66 550 -138 -261 -290 -660 -201 -643 -820 -304 -42 144 -506 -67
4145 -67 665 167 -544 -91 195 -145 -263 336 349 75 -671 149 -291 379 421 -358 -46 -411 220 496 54
4166 54 447 383 -229 448 -132 -191 112 -193 734 153 266 600 -208 -4 221 -83 580 169 -289 325 -421
4187 -421 -324 662 -98 -646 805 260 600 748 77 313 -329 94 316 -35 452 477 0 -203 -43 -193
4207 -193 56 177 574 612 540 727 205 -881 17 96 435 -67 558 279 208 11 -21 371 30 380 -721
4228 -721 49 187 -190 48 134 -45 -132 748 361 -241 -196 -426 8 190 -335 -427 -197 -813 9 553 389
4249 389 -157 716 98 243 499 59 536 -597 93 -164 -248 -388 382 -274 227 66 -39 -354 329 292
4269 292 97 319 179 -46 755 -59 160 -244 -199 -247 -171 486 100 -371 388 -207 149 163 -225 308 -86
4290 -86 -181 340 -125 541 78 -412 861 -313 103 -11 100 -88 -144 -24 -278 235 -115 250 390 27
4310 27 -208 52 -190 -188 -69 -73 -11 494 -429 -833 -171 -316 -394 131 266 218 643 -215 -518 -54 -561 -186 -229
4333 -229 -103 295 183 -282 -941 -219 -572 -370 230 -271 593 452 -423 -428 230 235 -18 -367 214 354 677
4354 677 -343 -194 -245 309 14 -59 -350 130 -314 -359 180 206 -89 91 84 430 761 -396 -185 643 -627
4375 -627 351 -207 -519 -258 96 244 130 345 -1054 157 509 120 162 504 76 -278 -204 -445 -537 79
4395 79 266 39 437 75 229 211 -1077 -904 -529 -44 379 277 -131 8 -622 -14 -78 -527 -249 -424 -172
4416 -172 -55 -279 -481 211 -499 -444 -442 -222 -789 336 -172 181 -171 386 104 303 325 -151 320 588 -295
4437 -295 -71 120 -514 -164 19 269 399 -357 356 -212 -243 -205 104 -197 -84 450 -144 -293 -194 136 434
4458 434 -219 -699 -802 -518 -248 63 545 384 -560 137 710 -300 980 -606 292 365 687 72 92 168
4478 168 159 291 -286 -192 523 -102 -389 152 222 -15 576 -472 -322 103 -400 550 223 22 -205 -212 -192 792
4500 792 206 -348 -239 -129 -61 30 -50 -162 -273 291 341 -224 -231 -203 34 39 298 -125 232 -682 -130 87 -105
4523 -105 281 -237 -197 9 -395 182 18 -123 233 -474 -81 -637 555 375 291 124 -556 472 -2 18
4543 18 158 183 -325 3 278 -60 -34 267 -538 782 -325 376 50 -24 -498 -85 189 -575 -115 -566 494
4564 494 -264 304 -287 36 1015 7 635 122 78 208 131 -41 -454 154 -501 175 12 582 1440 -94
4584 -94 -404 711 -14 -354 -440 95 117 67 -305 -76 842 516 -371 409 -154 541 -241 -33 430 -55 -641
4605 -641 473 12 -220 -194 -102 -957 -717 51 -571 94 553 -292 708 771 -380 -112 17 548 260 172
4625 172 353 365 -210 -880 -37 -234 -128 -8 61 805 54 122 12 134 370 -120 66 -52 536 567 -1119
4646 -1119 -192 -720 -451 391 247 -913 947 -543 -424 777 -930 -664 117 -345 -155 13 -282 -31
4664 -31 522 -554 92 -266 -176 192 79 140 -653 695 -189 29 -694 179 331 -244 -119 -37 93 -120 412
4685 412 513 -281 423 262 22 197 265 205 -844 671 -379 214 352 -145 -246 539 -165 158 651 -675
4705 -675 -80 607 -281 70 -753 -216 380 172 -781 0 460 -139 651 -213 450 604 -211 41 -340 600
4725 600 79 164 662 -623 928 -296 -108 -103 348 431 343 -297 407 245 -211 -352 154 -321 201 203 -760
4746 -760 202 262 -182 -54 -396 -184 149 -196 -551 -34 39 122 577 -151 -254 778 -161 355 727 -478
4766 -478 -12 194 -242 18 -224 -52 -118 33 -354 -578 -10 -9 683 -478 6 -314 35 81 -254 326 -408
4787 -408 173 -217 -66 498 116 -277 451 -275 142 -88 -463 -411 142 -30 -572 86 3 -424 121 132 149
4808 149 -162 -78 -771 483 287 -17 -84 486 -80 39 -539 1010 1016 -654 -3 -530 86 215 -49 -395
4828 -395 -407 330 -272 264 -190 909 -221 465 691 76 716 -372 400 420 -130 278 404 264 892 10
4848 10 -422 377 281 -125 380 51 -490 318 -581 28 -149 -282 50 -58 451 404 -56 292 519 -514 -210
4869 -210 161 275 -781 -99 521 -283 -504 191 -699 -229 485 -107 29 545 -579 -125 -366 -315 -67 96
4889 96 -523 186 -103 498 179 -415 -602 989 -336 386 -76 74 460 -454 417 -228 13 -302 273 56
4909 56 107 63 918 90 -585 -447 -70 -158 260 -564 -239 -602 -168 -770 -277 -171 309 -253 103 -27 339
4930 339 1072 238 -414 -237 -603 -221 -1067 -165 162 17 189 -695 430 387 -373 8 -52 867 -34 238
4950 238 775 -77 -261 -65 513 -111 20 860 456 533 -1095 862 365 -358 504 -557 -176 19 -76 -394
4970 -394 435 -670 -569 377 24 -151 555 99 115 283 -136 629 113 261 -4 -145 257 -12 256 -746
4990 -746 150 -61 -52 286 192 -795 -282 -56 389 -86 -580 393 399 -3 -137 -64 0 353 -443 -129 -13 -236
5012 -236 371 -424 289 -434 139 933 499 -76 -282 7 29 2 115 109 73 185 -259 -119 235 -194 -158 -723
5034 -723 2 167 -184 -94 -360 79 49 165 -579 -786 -573 -75 -5 650 498 5 -101 -242 147 253 484
5055 484 29 775 248 14 -24 -61 686 -251 -233 -508 343 300 466 244 486 -285 -1080 244 629 -231 -44
5076 -44 -260 78 1027 294 -724 878 55 -278 228 85 92 -19 -483 -812 -285 -325 276 215 195 -24 -465
5097 -465 622 288 471 241 -268 249 -346 -275 1001 -564 -192 -252 -120 -428 97 359 -340 28 -489 -140
5117 -140 919 -329 -175 -170 -202 -46 104 -382 -378 796 532 -371 47 118 -104 415 -226 364 410 -66 -141 247
5139 247 -54 598 -189 -109 -451 323 523 7 101 -107 247 31 -680 656 45 -591 74 -128 172 229 -15
5160 -15 15 -28 -169 -265 -277 -335 -99 -85 -740 848 -375 177 -74 547 51 -236 99 -181 -462 -24 -34 11
5182 11 376 176 417 22 -423 383 303 -316 -76 964 -667 650 599 228 -188 364 230 294 726 -319
5202 -319 875 146 -236 -293 224 177 -86 641 445 628 -271 -181 792 418 -130 -250 285 -152 140 -397 703
5223 703 681 -73 -407 1185 214 -80 475 -359 -19 54 -620 655 -321 233 235 -777 271 -323 -378 -3
5243 -3 -72 354 -284 -547 -847 480 -62 80 287 558 580 98 56 -153 426 34 -753 -2 523 42 102 -97
5265 -97 693 316 111 39 -550 36 151 -64 280 199 516 -330 643 -34 274 113 367 607 -132 818 777
5286 777 -410 149 380 -282 -85 293 436 -298 -129 116 307 986 -806 -9 -23 -398 347 71 358 -400
5306 -400 115 86 500 538 -278 -299 -74 -244 394 336 -58 328 -216 -775 -53 519 -64 31 -528 82 44 -535
5328 -535 212 147 45 332 -112 162 -193 -30 -340 -320 502 12 -205 354 -118 -152 1129 -157 516 -377
5348 -377 -1033 115 -68 -313 -342 -16 -67 -385 515 -118 -66 540 -428 40 -217 -385 -214 -226 -499 -101 -144
5369 -144 571 -393 -508 934 602 48 108 -131 -152 507 -308 35 1009 282 -179 -425 301 -378 58 544
5389 544 -31 -106 -110 -232 -57 10 277 -373 -150 -300 352 13 -184 758 -350 -131 188 -633 -361 475 -307
5410 -307 286 -127 -817 -143 512 113 -776 27 292 -43 194 560 602 -549 -287 118 -543 -84 -176 732
5430 732 127 -373 598 721 -119 259 237 -275 397 -55 470 262 371 -417 2 -605 577 1165 164 333
5450 333 258 90 470 -131 -450 -8 -84 -868 -413 -405 -32 -261 -210 765 308 174 -3 226 -464 -336 581 221
5472 221 -128 136 -546 -174 542 489 149 961 93 25 391 171 441 -238 -457 44 -465 521 -383 -686 354
5493 354 -122 696 573 -828 131 316 -303 -83 -527 152 152 126 42 223 101 -39 -677 -178 405 -489 -25
5514 -25 211 298 -165 127 -810 -14 1006 -321 -716 136 246 -198 714 -875 -314 -529 288 -50 -235 162
5534 162 -799 -49 -222 39 -106 453 -477 0 -389 -238 -435 822 478 413 100 316 55 1 -472 1026
5554 1026 1184 321 -58 -1132 -255 649 -206 100 541 -343 -26 -506 303 120 -219 -164 335 -16 -293 -27
5574 -27 193 557 -478 35 -191 20 -570 327 129 -533 -212 -562 -283 -70 293 -45 598 92 -114 -284
5594 -284 309 -644 546 224 -69 253 322 -315 69 -259 -430 705 -205 121 -372 283 -28 -24 -266 343
5614 343 -474 -294 108 156 287 -569 -303 302 107 48 436 382 -214 -533 176 225 -328 -767 387 335 121
5635 121 829 321 -4 -6 -755 -143 502 360 97 505 -428 -367 200 -218 -177 527 -694 166 -135 -352 163
5656 163 -222 86 140 -344 -778 553 63 -552 430 309 -590 801 231 -563 -238 -132 38 659 -354
5675 -354 13 133 446 -5 71 92 -273 285 26 -155 -74 -48 249 -93 227 -554 593 329 -200 -120 -635
5696 -635 326 643 18 -16 63 66 564 134 -286 -91 557 -628 -47 164 1000 -114 4 293 26 0 -48
5717 -48 468 -218 317 205 283 -778 280 -317 252 3 -130 -221 -142 165 91 -127 184 -153 -6 519 -235
5738 -235 117 56 -218 294 299 -230 27 -52 553 473 264 215 -62 -681 -216 275 445 -908 456 -669 -208
5759 -208 -657 -154 162 -479 334 -150 -487 -190 325 863 261 -422 -499 -594 613 -100 469 319 522 104
5779 104 -17 -5 237 -377 563 -293 547 -39 -411 -106 284 -266 -179 211 -425 371 -19 331 -78 -299 -341
5800 -341 -219 -918 217 -192 119 84 508 -562 -230 216 347 -729 360 -132 -17 -800 -666 968 796
5819 796 -1133 199 -384 -540 257 -607 -263 -273 -90 -323 752 -146 523 72 -277 96 110 -419 270 79
5839 79 64 -56 308 -78 677 242 -149 475 -121 1 23 -334 -522 207 6 -308 203 -284 -399 -192 -404
5860 -404 501 198 -454 -37 -348 483 -406 -38 174 418 -162 -357 1031 -248 410 100 -59 -210 -375
5879 -375 408 129 -62 -56 -339 326 -66 -459 -15 -714 364 -143 839 695 427 269 -697 -684 -396 -429 -145
5900 -145 -42 -724 370 535 -154 316 -442 -745 -25 -753 -359 -94 49 -586 -670 173 55 307 87 103
5920 103 -65 317 -22 -402 -992 -651 338 -139 -142 -386 191 -371 779 640 145 800 285 -137 268 289 481
5941 481 254 -681 -270 197 -446 265 -44 533 -284 387 15 517 -740 -627 -474 -67 83 207 -887
5960 -887 -740 298 -17 326 520 153 538 1397 -4 91 480 434 146 71 -405 -420 -498 99 282 334 162
5981 162 251 84 -525 704 -4 10 -11 -917 -58 -229 -479 409 296 84 -371 311 -14 273 134 -13 -259
6002 -259 461 478 599 -591 -304 -58 -693 273 49 147 1 -587 -261 82 -87 -1140 -381 316 568 -508
6022 -508 409 59 -966 -393 -558 75 88 462 -145 351 176 -530 546 -427 -253 -13 -382 -1059 820
6041 820 -751 -594 73 -603 -53 -720 -688 -147 65 -523 792 369 188 -726 22 632 -514 514 -356
6060 -356 -308 -225 -308 129 -160 88 -380 465 101 932 401 33 -8 -227 -1034 -571 321 -382 100 125 312 491
6082 491 271 -390 -15 -135 -75 -534 242 -547 -15 -231 92 89 -473 -1076 120 252 151 254 -469 -183 486
6103 486 953 348 -450 54 -682 -105 46 -71 -541 -117 -334 150 191 106 -163 -817 -839 171 202 42 764
6124 764 121 6 560 173 274 79 -324 -497 -316 205 15 -247 719 80 -927 -432 -558 634 -114
6143 -114 -474 788 730 -12 110 137 -374 177 -146 -656 -171 17 -845 202 -242 334 -473 -1045 15 407
6163 407 -487 120 -597 -114 837 -31 -185 55 -190 -523 726 545 76 -209 -348 -357 -218 -83 -589 30
6183 30 277 212 169 209 -705 -172 194 -219 -523 495 -459 310 -256 -148 439 152 341 101 25 72 572 470
6205 470 -63 76 -581 305 773 105 119 -263 244 46 185 -126 -386 -743 -176 -128 -413 -43 129 -162 234
6226 234 -51 333 699 128 306 -196 60 414 140 762 -365 257 356 409 405 593 137 -591 -63 371 -488
6247 -488 15 4 36 240 189 27 555 170 606 243 -836 -440 -11 -508 942 62 56 -249 594 30 -362
6268 -362 182 -496 611 -413 -15 746 -312 -30 -116 -135 233 -251 48 8 -129 -453 288 490 87 120
6288 120 321 -20 -538 232 113 -635 566 -345 -496 125 -323 62 -488 -272 252 394 51 395 400 66
6308 66 247 -464 -594 205 -423 -762 834 -749 124 38 194 -204 -212 -145 183 -930 177 -263 225 110
6328 110 -547 -450 929 565 -858 226 189 -51 666 -150 -368 339 -408 340 -330 13 778 349 -296 655
6348 655 -390 411 -338 32 533 -821 -27 -506 241 -489 350 -26 268 -97 -65 140 -280 607 -50 113
6368 113 71 450 745 -29 -359 -111 -387 70 -338 244 -879 -216 -293 303 146 -584 -207 457 227 -557
6388 -557 -43 -345 254 409 -783 -343 -165 -434 -152 287 -313 597 -93 -191 -218 613 353 -947 75 -440
6408 -440 805 -143 405 504 35 -432 493 -732 -679 515 86 -473 -445 -22 -389 68 -1067 -333 376 250
6428 250 -63 293 -776 -130 94 93 -750 -28 262 -305 516 -63 133 -30 57 -220 -237 -72 -416 -571 48
6449 48 -50 715 -633 280 411 -139 235 -531 -467 857 -278 -425 542 -91 -253 454 -221 877 -384
6468 -384 -10 -201 -14 -209 923 -340 -114 164 -503 302 78 -157 -88 -277 90 -169 -729 33 68 -558
6488 -558 -542 -195 -512 230 -369 -46 -181 -80 -97 -22 202 -407 -132 -85 -16 -78 -325 -126 -13 -40 -148 -333
6510 -333 -249 48 -10 -209 12 -275 -754 540 -32 -7 618 109 817 -137 -73 -781 435 -630 424 459
6530 459 422 181 715 102 730 717 236 -135 -351 1218 -441 -343 -803 51 25 -385 47 -276 -88 -74 -20
6551 -20 -20 -205 363 -758 871 464 175 -345 -142 -610 607 -543 445 -23 -59 -285 -985 62 75 -80
6571 -80 -199 509 447 -295 33 390 55 -167 284 -60 -299 463 -789 72 468 108 -256 379 -92 -371
6591 -371 -8 6 205 411 -255 39 83 -166 -101 -925 63 443 -640 18 376 -166 95 -355 126 -609 812
6612 812 230 -359 247 538 51 -103 108 -260 274 243 -320 641 -43 -717 53 -314 -573 608 217 -403
6632 -403 190 -352 -56 70 -498 36 475 -701 592 -352 -841 -200 206 -673 266 255 -556 241 -178 -412
6652 -412 385 168 262 -190 -214 -86 -228 123 -577 -188 -450 -766 453 162 -512 830 399 542 507 -385
6672 -385 -365 595 -280 -73 337 -313 610 817 -714 456 202 -900 412 -322 555 -8 557 -53 172
6691 172 0 -632 -341 14 226 632 -28 38 -234 286 -447 743 -322 516 55 -595 49 294 423 -116
6711 -116 709 -128 -274 724 -405 203 11 -267 8 -16 -355 207 -140 63 -89 -64 988 -148 -9 476
6731 476 447 450 204 24 -71 599 -108 -1109 -99 290 -387 142 37 497 151 -197 -566 185 64 153 239
6752 239 -123 367 234 -86 -212 284 131 85 293 70 668 273 -155 -61 -115 409 642 -64 597 226 -22
6773 -22 311 98 178 679 -181 330 -90 558 -215 -477 751 124 40 -620 -395 376 -273 -1268 -320 277 -8
6794 -8 484 134 -695 291 116 272 -123 -305 314 264 -283 105 -161 5 -308 -439 -109 97 338 -59 998
6815 998 164 170 -249 -279 229 -182 643 131 -432 -620 78 -383 93 116 -137 245 337 191 -634 305 -270 -1025
6837 -1025 -343 -179 -287 -23 107 618 -97 94 -281 172 -263 10 575 805 -115 814 258 -93 112 752
6857 752 242 91 196 602 107 -503 -373 238 443 344 999 434 -279 -55 -204 95 336 -254 203 125 -194
6878 -194 -70 -718 -670 428 251 529 -51 741 -53 -120 -288 100 129 357 233 783 565 -471 -144 -493
6898 -493 -377 -197 478 187 690 617 -648 -363 -189 -155 -501 -161 -328 866 186 -590 606 89 636 808
6918 808 -602 825 634 89 111 172 -335 365 82 -368 632 -430 -350 -254 517 496 495 520 321 92 -139
6939 -139 -93 -106 54 -531 -240 -11 884 75 342 -109 -379 -260 -252 240 -34 -853 107 106 166 543 39 -96
6961 -96 683 -189 -396 503 -127 364 373 -60 301 -286 -289 -357 -285 22 -22 1 -219 8 104 0 -242 -454 10
6984 10 -660 -54 -478 -251 678 188 -539 -149 11 143 -229 -81 -382 -575 871 -273 -380 -306 -496 -79
7004 -79 -313 569 103 -813 465 -131 -448 721 366 62 500 -76 -39 37 -445 -205 837 220 -845 199
7024 199 -106 -536 278 245 399 590 -173 436 -122 -73 441 591 -345 413 343 -31 -364 418 -232 -35 481
7045 481 639 23 217 -893 626 -104 -276 339 -527 -278 -317 48 -195 -560 -587 27 2 241 12 137
7065 137 -193 137 320 -364 640 181 -632 169 962 533 161 139 -118 -44 83 8 -189 -60 824 -96 585
7086 585 -961 -703 -560 -488 17 119 -151 441 90 -214 150 -23 407 -142 678 71 225 60 112 122 -521
7107 -521 -585 -198 -448 -575 417 160 -781 722 136 -608 620 572 -542 -118 356 -376 -289 323 -487 1202
7127 1202 -440 -798 194 -511 -14 -17 52 557 204 -97 -345 24 -32 107 150 -33 563 -746 -235 -35 349
7148 349 -120 58 -877 -483 -209 207 253 -85 183 -342 1018 -787 -233 453 -423 321 -34 -392 -461 116
7168 116 -582 -139 410 -966 -90 164 -97 185 -69 -277 53 493 64 -151 330 -100 239 -459 -405 -145
7188 -145 -311 -321 -75 -328 -940 508 -340 128 169 260 270 -347 235 -676 193 640 91 251 118 -429 67
7209 67 241 -355 -284 118 -130 727 -469 -501 224 810 655 165 -450 -147 -465 -115 -367 -123 936 157
7229 157 325 -42 -32 -206 80 172 252 -213 -480 32 657 -14 598 -328 -355 549 -185 -237 504 -230 -537 662
7251 662 -140 -57 366 513 -428 -161 -13 -349 352 -155 70 -147 -224 387 -806 131 -29 -373 -418 255 -555
7272 -555 -42 -356 -141 -278 -65 55 4 46 251 531 512 76 -452 158 -402 -161 -166 -830 397 711 -534
7293 -534 -169 441 -388 -508 219 201 -137 -356 152 -218 -89 634 -345 418 -116 525 46 -210 957 123
7313 123 217 -226 49 359 -529 -432 -366 -70 174 -50 -21 -285 389 632 123 834 20 -134 429 155 339
7334 339 245 -29 509 186 37 -429 232 -449 207 -269 -214 -667 576 263 418 -169 221 156 285 49 124
7355 124 95 -35 287 361 -179 182 -141 82 496 12 581 -119 154 85 11 -141 -454 -846 -353 -258 -307 133
7377 133 -280 -180 -304 52 -751 290 -354 -741 -236 -332 -260 -149 -698 -314 50 -142 -232 269 -43 5 356
7398 356 -591 31 562 300 -528 497 48 369 62 -266 351 133 -311 138 -746 -556 26 -571 1134
7417 1134 462 12 802 115 -19 -328 388 752 -282 507 -253 108 -174 164 310 482 165 30 -87
7436 -87 163 432 780 -641 -56 434 -400 139 343 -513 296 -50 322 905 -341 -169 477 -22 -140 477
7456 477 172 156 225 614 -303 116 -351 -464 464 -1410 428 -275 -473 476 -372 672 50 769 132 417
7476 417 5 -513 -80 755 638 -122 -44 -295 368 -445 -621 -120 -171 -176 44 281 86 -407 563 -270 -504
7497 -504 -131 -406 -102 358 105 373 2 -340 259 165 -248 520 471 -196 510 -225 -252 669 741 -253 300
7518 300 -189 592 332 -789 -79 135 -515 344 349 -550 199 204 -297 -10 57 -68 465 -674 -264 183 -74
7539 -74 -97 -105 -71 -204 331 -15 -20 390 95 -614 31 342 366 -199 790 -193 -191 485 99 -179 -1 322 187
7562 187 -539 -158 -157 -254 -362 283 530 -473 139 143 -325 253 -594 -723 -253 -729 446 783 -153 -536 -171
7583 -171 -350 -482 -382 -69 83 -76 265 -85 29 -55 -427 545 441 406 946 -270 248 384 101 691
7603 691 -156 -764 156 133 -473 -119 -261 124 341 -246 58 441 -786 -747 336 505 -892 -537 818
7622 818 868 416 402 -85 641 -710 153 296 150 548 -206 99 -382 -29 -44 75 -40 -171 -391 -147 -569
7643 -569 350 -191 -178 290 63 -28 -172 253 -670 560 40 -447 626 -61 -475 527 -977 -46 -301
7662 -301 -27 105 -654 -272 55 107 176 -463 690 -252 -542 1121 -408 -172 140 -157 576 261 218 -250
7682 -250 253 20 18 -508 -646 277 -278 -486 65 -508 147 478 261 557 3 297 120 -605 -205 -66 -395
7703 -395 -613 623 203 -79 37 -511 873 -165 285 298 635 123 -291 -436 -292 -341 -145 479 -160 97
7723 97 247 346 154 676 315 -128 357 95 -219 670 -221 186 630 283 484 702 -788 -656 790 175
7743 175 -160 -184 84 -164 633 -673 -533 355 -866 750 -394 -47 335 252 87 295 147 -309 -6
7762 -6 58 391 517 541 105 -272 188 241 -793 -211 -707 74 822 634 -543 278 -487 309 -22 206 -225
7783 -225 24 254 207 587 116 -75 -461 259 -396 53 2 300 896 858 197 -249 463 -117 -761 65 -212
7804 -212 178 142 680 -264 315 -520 45 -157 -510 183 699 677 -99 -3 273 200 -70 363 213 -98 164
7825 164 -914 292 -133 -407 301 -496 -337 -58 -7 -112 553 221 52 -3 436 91 -475 -212 -14 381
7845 381 -395 127 158 120 -131 -86 145 -122 -127 314 536 -214 -274 -491 -114 -943 -297 12 -715 192 601 -695
7867 -695 167 409 -538 218 -89 -335 -244 49 -952 214 -23 421 391 -311 101 555 6 0 442 43 -605
7888 -605 235 -393 333 107 123 581 -237 -274 89 -110 151 306 483 -288 226 513 -770 623 -480 -641
7908 -641 93 -768 -417 -352 -82 144 -214 -406 219 -147 -129 394 -526 -5 -138 223 -395 -190 -339 263 901
7929 901 10 -22 644 -106 -600 507 128 322 291 -814 166 584 -498 -333 -273 -221 -772 -114 -129 71 123
7950 123 539 -328 -703 356 -70 109 -116 -855 -231 357 402 -262 153 62 -38 -474 -378 218 -77 126 -86
7971 -86 -131 194 -214 324 162 -67 -10 -445 384 696 -465 270 -70 768 -427 -700 -180 92 -48 789
7991 789 401 324 -414 -149 -260 -507 203 -468 -589 359 -929 -472 355 -301 584 -349 -229 120 531 150
8011 150 371 32 -7 -101 60 21 540 -847 -118 -252 509 342 248 -176 -402 -307 -48 1007 -537 -649 55
8032 55 49 -673 -818 131 285 448 335 -241 218 507 -128 527 -332 427 67 -615 -256 -200 -256 -316 -70 -170
8054 -170 258 181 -607 -887 75 -309 -903 -83 355 -453 303 -506 -410 26 450 355 408 -216 274 -328 40
8075 40 79 632 689 126 -229 -33 -365 284 -131 351 738 -287 -486 -7 -432 -325 182 -87 595 66 -559
8096 -559 146 199 -349 -438 745 -970 116 -24 -12 -388 -389 103 -303 595 386 63 31 -61 -409 77 338
8117 338 708 295 -88 -92 -428 -867 -354 151 362 -48 357 201 -142 57 283 -538 -77 1044 -336 148
8137 148 817 392 628 -113 -453 -345 110 302 -653 148 219 -697 185 570 -276 112 112 -423 261 -818 -54
8158 -54 -68 386 165 -116 -225 -455 450 27 -525 101 -276 -278 423 -206 271 -105 -493 -350 -338 -486 -165 560
8180 560 711 58 614 -555 220 -704 -37 360 884 -293 29 -221 -375 -213 518 -355 -758 -280 -585
8199 -585 46 -39 599 835 645 104 476 585 -370 90 720 -60 -572 198 186 -122 616 -38 -392 225 -282
8220 -282 -282 -191 -48 782 -31 77 -171 169 -464 -179 -419 -54 429 368 -367 4 -718 585 -17 -518 320
8241 320 -87 329 254 -394 267 -270 -7 -442 476 1149 -348 339 606 -780 -518 -1096 68 188 850
8260 850 88 338 -281 -664 159 213 164 134 -145 508 429 -3 -183 178 -4 -796 669 223 -360 168 -20
8281 -20 823 -11 475 11 779 -235 110 -34 416 -477 -1 96 -1 179 2 -328 -132 -399 -142 -176 404
8302 404 544 -560 29 -48 -173 303 377 -258 235 448 -280 262 12 185 -117 490 415 39 95 458 -901
8323 -901 122 327 -807 576 179 -216 426 -133 -182 338 712 46 -237 79 -32 -455 -179 10 -45 -154
8343 -154 -113 611 86 978 339 3 -231 27 60 443 123 -560 414 83 628 678 -888 -627 606 1
8363 1 100 -272 -264 38 616 -184 -432 21 -207 832 187 542 -101 148 809 -164 -97 -65 81 763 -86 -488
8385 -488 -286 1 751 -100 -199 -77 -758 40 -54 54 -179 -746 193 -263 -135 362 -400 -70 -291 379 -19
8406 -19 519 475 160 -500 101 -111 -173 -900 -636 48 11 693 -233 704 -439 -568 -592 97 77 349 -1052
8427 -1052 1044 314 -448 -348 158 79 217 327 -274 363 -341 284 -536 -549 198 -32 834 480 -408 431
8447 431 129 -74 675 -50 -1098 78 -298 -1050 -428 429 395 162 469 122 295 -628 -122 -425 -22 653
8467 653 -117 51 -92 514 107 -13 -17 -17 -258 407 437 216 508 118 -519 298 250 9 -123 320 -673 523
8489 523 116 -712 -262 -393 -728 141 -277 583 58 513 -719 -50 -76 795 117 716 643 147 -176 163
8509 163 282 -634 -443 -73 -883 -19 323 576 898 -331 -267 256 168 911 -136 -434 -318 -338 -316 -39 795
8530 795 -591 154 790 -663 -430 -699 -339 -155 148 278 228 -550 -351 365 -31 -90 -170 851 354 -198
8550 -198 798 -252 580 -267 -692 56 -495 -86 458 550 196 -1148 -263 -82 -1001 187 214 -189 -703 -376
8570 -376 371 68 253 540 351 197 855 673 -689 -440 425 -565 348 -458 180 -35 -99 347 318 155
8590 155 55 721 -498 229 414 -206 704 80 -719 95 -30 -25 -49 -369 45 382 533 73 -623 -191 -169
8611 -169 -217 92 216 -314 -277 -374 609 -529 -242 -900 -491 -320 -107 107 -487 328 -802 -58 -353 -291 -26
8632 -26 321 172 -318 -274 314 80 -52 -552 737 32 -1087 350 363 -840 -551 -104 -259 262 320 219
8652 219 12 34 41 -494 -346 14 600 -10 277 -201 -724 -478 427 -199 -670 -236 -631 -97 -174 -219 318 -648
8674 -648 -253 441 120 -116 -420 516 -128 -312 -10 -530 -216 302 -328 162 420 -156 -492 260 -109 619
8694 619 287 -529 509 320 185 197 67 610 137 237 67 177 254 -451 -14 313 -54 232 48 238
8714 238 1020 209 254 2 -604 -220 819 114 416 294 236 543 232 349 -241 -117 24 379 -468 -761
8734 -761 -88 135 20 -829 140 -19 221 -215 -194 205 -232 -47 -623 -63 -440 439 179 449 -94 -81 84
8755 84 682 479 210 -567 -238 213 388 762 -38 197 -172 -334 648 -325 -196 -463 5 -91 365 -74 -262
8776 -262 -486 -707 652 827 -44 190 -25 417 -108 10 512 404 447 195 98 -23 83 -431 -489 -327 -370
8797 -370 203 59 237 102 183 -30 597 -957 396 -404 -767 113 332 371 461 221 -291 -260 207 677 45
8818 45 521 -416 -253 239 -313 -271 675 -101 284 -203 87 411 -207 -87 89 -419 -115 300 -424 266 92
8839 92 -553 91 551 -682 -233 338 103 378 11 -175 -34 431 449 -68 -582 40 -59 148 -5 34 73
8860 73 -31 433 -668 -25 167 779 141 168 236 110 -475 -567 178 -27 257 276 -389 -77 -33 148 -206 317
8882 317 -213 307 -216 -407 291 142 63 -602 -727 -326 -186 -41 -132 -375 -90 302 -404 97 -517 -463 69
8903 69 156 36 -233 587 71 -35 726 -573 66 -27 3 -240 -335 -7 118 91 -49 433 -774 233 -416
8924 -416 75 -260 -79 371 -377 47 398 -777 -122 -15 -364 -604 847 -323 -231 140 -287 762 771 258
8944 258 -588 -373 -259 189 -56 -202 -66 -666 101 -406 5 376 377 -656 73 -167 312 -52 299 -68
8964 -68 -313 -70 -828 513 20 -271 -68 -261 -731 793 -1085 208 -226 -449 118 -621 -237 -216 -202 -82
8984 -82 174 -575 602 391 276 -22 -58 -243 -291 320 -111 165 -413 -114 -407 564 -459 591 564 -312
9004 -312 -5 601 519 329 -66 -20 578 128 -212 207 -418 204 -566 -398 287 -564 365 307 236 -90 174
9025 174 -333 81 382 -500 -309 205 -527 600 345 -194 -42 217 -329 -271 455 -101 -202 122 -794 400
9045 400 18 275 556 -337 -966 136 -32 184 259 263 58 -6 -429 102 -216 182 60 0 -28 -686 -237 -441
9067 -441 -13 496 795 84 186 -84 -66 -32 -497 -74 -472 229 -256 -475 -145 5 -133 -336 -37 -169 -357
9088 -357 46 -412 -286 -65 198 -425 139 -725 -486 290 -412 -355 -666 3 178 -477 -589 -119 -156 413 -166
9109 -166 -215 -601 221 344 54 488 89 321 258 -358 -132 -179 74 -591 618 -750 -416 -392 -167 532 -29
9130 -29 563 647 349 86 97 -274 377 -140 72 -146 -9 -8 -754 525 349 -370 -298 147 297 -488 401 245
9152 245 -222 -94 345 327 714 -432 186 116 -100 -18 191 22 -174 157 336 333 -46 -460 140 -3 -774
9173 -774 66 -496 -918 135 -110 -604 -995 97 -843 159 -290 -614 314 -184 -33 298 -149 464 343
9192 343 -242 -17 563 -299 -334 747 -150 442 149 -136 -304 -335 -531 55 -345 -144 -355 -467 -275 273
9212 273 84 181 700 -71 -228 -284 -13 152 260 273 426 -193 -286 -390 43 -232 -401 340 -278 395 86
9233 86 -361 -57 -105 666 -254 240 -11 918 -498 -208 910 -99 4 173 171 -208 831 -253 161 397
9253 397 -93 592 286 170 478 -412 419 678 306 835 884 182 128 -486 5 -419 367 -268 -336 -206 196
9274 196 -27 -368 571 558 -501 343 6 -264 -440 322 207 -318 284 -93 -87 -787 -60 -433 -516 -103 1018
9295 1018 123 507 221 -165 -537 506 232 -461 -354 -802 57 115 137 -272 485 493 -128 -140 254 176 -594
9316 -594 -215 275 381 250 -56 240 -356 -689 -562 364 919 -343 -308 214 -524 -64 554 142 395 -82
9336 -82 1 625 723 -131 -181 47 570 497 655 -421 321 -872 -374 795 -166 -83 -426 427 -672 -81 -469
9357 -469 -844 -218 553 -289 56 -587 -356 -273 249 -141 -391 3 741 -496 240 583 -396 -719 -216 592
9377 592 -29 178 477 188 -614 540 -248 -512 -135 -383 140 393 396 -985 892 -126 -451 97 -160
9396 -160 -233 84 229 361 307 -327 873 -109 -514 -202 -191 406 -38 -463 -255 47 234 283 521 -281 152
9417 152 -552 -793 -383 -544 -181 176 55 -78 -740 -316 -20 274 361 -201 230 -109 -224 123 -772 -55
9437 -55 120 -157 -416 -19 440 22 -105 492 -455 447 -219 107 287 303 -23 179 -27 -36 175 -1033 -479
9458 -479 160 293 -35 276 -840 44 111 -747 28 91 333 42 93 -473 142 751 -301 696 -497 168
9478 168 846 125 -195 113 303 -374 -308 523 534 -86 -277 -884 720 -438 -907 1133 -520 -44 131
9497 131 -22 -230 -136 1308 -205 -156 -130 615 72 -293 -479 403 309 -628 237 96 327 595 -144 -609 144
9518 144 604 161 -580 296 354 -299 127 2 476 596 68 606 -592 -198 565 -74 -275 -255 -314 102 -51
9539 -51 88 -176 -264 -181 -308 406 -17 -44 -40 -326 95 -314 -3 772 -256 233 -454 86 129 194 345 -19
9561 -19 280 123 -841 -658 -416 50 563 -380 -42 148 283 177 361 -218 63 159 383 -201 -189 -376 -419
9582 -419 858 -248 -181 -44 -43 255 -232 282 394 -907 -5 472 387 -94 -127 -65 -564 885 81 308 -55
9603 -55 -271 -70 -337 635 -329 -416 -281 -214 -910 149 74 291 -245 -371 354 305 272 -92 -491 -75 -274 96
9625 96 376 -40 524 -182 83 193 124 169 215 -358 -307 374 -274 94 -25 319 29 305 -77 580 34 359
9647 359 -254 -770 259 71 471 -86 -305 482 -301 -318 -444 -56 -741 -337 493 -288 363 -283 181 -177
9667 -177 456 -652 -173 368 24 -187 -686 94 -132 1005 -60 -34 43 32 -789 241 42 -166 -120 376
9687 376 481 445 196 -396 -177 495 323 48 -818 178 -200 -464 -77 297 -435 183 -198 633 499 306
9707 306 -152 15 -19 -8 -275 -121 -432 73 620 -717 44 -350 -314 150 244 103 265 545 585 212 -627
9728 -627 576 146 -337 147 24 593 357 365 470 364 105 345 175 20 -326 -282 109 -797 713 384
9748 384 -105 118 327 -266 -237 -165 -809 -149 215 -49 221 -20 72 248 666 -622 586 228 -1327 -354
9768 -354 -194 -95 -69 -83 -283 356 -252 -6 658 -38 -361 183 -177 -314 399 -112 -240 134 -292 -480 62
9789 62 517 524 -506 -32 468 -654 -274 -348 -309 -38 268 -810 382 597 260 136 381 -1225 151 346
9809 346 283 524 -147 -152 253 -224 -446 -113 286 -159 -211 -174 210 -311 -858 -31 131 959 -127 -449 -275
9830 -275 -115 569 539 -206 54 -43 -144 -429 -363 -555 603 481 -259 488 -79 237 802 844 -331 21 -83
9851 -83 -404 1323 -241 -512 296 -297 18 246 -443 68 314 -654 691 96 -201 401 679 -22 -280
9870 -280 -148 148 -219 372 42 -482 20 193 357 148 -307 236 1236 -197 -813 68 -146 -210 -144 607
9890 607 -476 398 -494 -51 5 -306 -186 638 -392 -12 577 120 -195 219 -440 439 166 -79 294 225
9910 225 389 -555 -98 -22 166 -257 -445 174 -210 -1292 121 128 -753 -237 422 -203 611 -393 -403 -1
9930 -1 -712 -254 -126 -268 -25 759 -697 356 54 -530 178 48 351 -100 91 -102 -370 -102 167 -330
9950 -330 211 546 30 -45 -304 -166 -159 502 -624 381 -340 -125 362 -339 668 337 -180 335 -462 -446
9970 -446 966 226 -76 -398 29 -226 241 123 402 -265 142 -715 -218 -16 16 601 -1 -343 332 775
9990 775 76 -162 796 -50 519 36 -26 -154 -536 -406 -72 48 167 3 -12 724 -496 -52 259 -428
10010 -428 -269 102 259 -233 510 -302 -140 926 102 211 -341 7 366 1084 134 -573 -261 -274 -77 -172
$$ [...]
16383A68
##END NTUPLES=NMR FID
##END=
