##TITLE=31P_DE-80H_X3
 64 sc D2O
 26.2.2025
##JCAMPDX= 6.0         $$ Bruker NMR JCAMP-DX V2.0
##DATA TYPE= NMR FID
##DATA CLASS= NTUPLES
##ORIGIN= UXNMR, Bruker Analytische Messtechnik GmbH
##OWNER= root
$$ XWIN-NMR		Version 3.5
$$ Thu Jul 23 14:51:39 2026 Russian Standard Time (UT+4h)  Yarkov@DPX200
##.OBSERVE FREQUENCY= 81.013821
##.OBSERVE NUCLEUS= ^31P
##.DELAY= (6, 6)
##.ACQUISITION MODE= SIMULTANEOUS
##.ACQUISITION SCHEME= undefined
##.AVERAGES= 64
##.DIGITISER RES= 17
##SPECTROMETER/DATA SYSTEM= spect
##.PULSE SEQUENCE= zgpg30
##.SOLVENT NAME= D2O
##.SHIFT REFERENCE= (INTERNAL, D2O, 0, 243.863)
##AUDIT TRAIL= $$ (NUMBER, WHEN, WHO, WHERE, WHAT)
$$ ##TITLE= Audit trail, XWIN-NMR		Version 3.5
$$ ##JCAMPDX= 5.01
$$ ##ORIGIN= Bruker BioSpin GmbH
$$ ##OWNER= Yarkov
$$ C:/Bruker/XWIN-NMR/data/yarkov2/nmr/P31/2/audita.txt
$$ ##AUDIT TRAIL=  $$ (NUMBER, WHEN, WHO, WHERE, WHAT)
(   1,<2026-07-23 14:50:59.25 +0400>,<Yarkov>,<DPX200>,
      <created by zg, POWCHK disabled, PULCHK disabled
       configuration hash MD5:
       00 E9 B6 7A A2 85 ED C7 34 08 36 98 17 FE 4E 26
       data hash MD5: 32K
       9D 1A F0 B3 CA 3F A5 77 D5 8C A7 1D EE 20 5B 40>)
$$ ##END=
$$ 
$$ hash MD5
$$ 9A F4 C9 16 E8 2C 71 BA E6 DB 7E 61 04 9F 23 61
##$RELAX= 
##$RELAX= 
##$RELAX= 
##$RELAX= 
##$RELAX= 
##$RELAX= 
##$RELAX= 
##$RELAX= 
$$ Bruker specific parameters
$$ --------------------------
##$DU= <C:/Bruker/XWIN-NMR>
##$EXPNO= 2
##$NAME= <P31>
##$PROCNO= 1
##$TYPE= <nmr>
##$USER= <yarkov2>
##$AMP= (0..31)
100 100 100 100 100 100 100 100 100 100 100 100 100 100 100 100 100 100 
100 100 100 100 100 100 100 100 100 100 100 100 100 100 
##$AQSEQ= 0
##$AQ_mod= 1
##$AUNM= <au_zg>
##$AUTOPOS= <>
##$BF1= 81.014009
##$BF2= 200.13
##$BF3= 200.13
##$BF4= 200.13
##$BF5= 200.13
##$BF6= 200.13
##$BF7= 200.13
##$BF8= 200.13
##$BYTORDA= 1
##$CFDGTYP= 0
##$CFRGTYP= 5
##$CHEMSTR= <none>
##$CNST= (0..31)
1 1 145 1 1 1 1 1 1 1 1 1 1 1 1 1 1 1 1 1 1 1 1 1 1 1 1 1 1 1 1 1 
##$CPDPRG= <waltz16>
##$CPDPRG1= <>
##$CPDPRG2= <waltz16>
##$CPDPRG3= <>
##$CPDPRG4= <mlev>
##$CPDPRG5= <mlev>
##$CPDPRG6= <mlev>
##$CPDPRG7= <mlev>
##$CPDPRG8= <mlev>
##$CPDPRGB= <>
##$CPDPRGT= <>
##$D= (0..31)
0 1 0 0 0 0 0 0 0 0.06 0 0.03 2e-05 3e-06 0 0 0.0002 0 0 0 0 0 0 0 0 0 
0 0 0 0 0 0 
##$DATE= 1784803858
##$DBL= (0..7)
120 120 120 11 120 120 24 19 
##$DBP= (0..7)
150 150 150 150 150 150 150 150 
##$DBP07= 0
##$DBPNAM0= <>
##$DBPNAM1= <>
##$DBPNAM2= <>
##$DBPNAM3= <>
##$DBPNAM4= <>
##$DBPNAM5= <>
##$DBPNAM6= <>
##$DBPNAM7= <>
##$DBPOAL= (0..7)
0.5 0.5 0.5 0.5 0.5 0.5 0.5 0.5 
##$DBPOFFS= (0..7)
0 0 0 0 0 0 0 0 
##$DE= 6
##$DECBNUC= <off>
##$DECIM= 4
##$DECNUC= <off>
##$DECSTAT= 4
##$DIGMOD= 1
##$DIGTYP= 9
##$DL= (0..7)
0 0 52 120 120 21 21 25 
##$DP= (0..7)
150 150 150 150 150 150 150 150 
##$DP07= 0
##$DPNAME0= <>
##$DPNAME1= <>
##$DPNAME2= <>
##$DPNAME3= <>
##$DPNAME4= <>
##$DPNAME5= <>
##$DPNAME6= <>
##$DPNAME7= <>
##$DPOAL= (0..7)
0.5 0.5 0.5 0.5 0.5 0.5 0.5 0.5 
##$DPOFFS= (0..7)
0 0 0 0 0 0 0 0 
$$ [...]
##$SUBNAM1= <"">
##$SUBNAM2= <"">
##$SUBNAM3= <"">
##$SUBNAM4= <"">
##$SUBNAM5= <"">
##$SUBNAM6= <"">
##$SUBNAM7= <"">
##$SUBNAM8= <"">
##$SUBNAM9= <"">
##$SW= 400.765351723535
##$SWIBOX= (0..15)
0 1 3 0 0 0 0 0 0 0 0 0 0 0 0 0 
##$SW_h= 32467.5324675325
##$TD= 32768
##$TD0= 1
##$TE= 0
##$TE2= 300
##$TE3= 300
##$TEG= 300
##$TL= (0..7)
0 120 53 12 22 120 120 120 
##$TP= (0..7)
150 150 150 150 150 150 150 150 
##$TP07= 0
##$TPNAME0= <>
##$TPNAME1= <>
##$TPNAME2= <>
##$TPNAME3= <>
##$TPNAME4= <>
##$TPNAME5= <>
##$TPNAME6= <>
##$TPNAME7= <>
##$TPOAL= (0..7)
0.5 0.5 0.5 0.5 0.5 0.5 0.5 0.5 
##$TPOFFS= (0..7)
0 0 0 0 0 0 0 0 
##$TUNHIN= 0
##$TUNHOUT= 0
##$TUNXOUT= 0
##$USERA1= <user>
##$USERA2= <user>
##$USERA3= <user>
##$USERA4= <user>
##$USERA5= <user>
##$V9= 5
##$VALIST= <valist>
##$VCLIST= <CCCCCCCCCCCCCCC>
##$VD= 0
##$VDLIST= <DDDDDDDDDDDDDDD>
##$VPLIST= <PPPPPPPPPPPPPPP>
##$VTLIST= <TTTTTTTTTTTTTTT>
##$WBST= 1024
##$WBSW= 4
##$XGAIN= (0..3)
0 0 0 0 
##$XL= 0
##$YL= 0
##$YMAX_a= 7576
##$YMIN_a= -7531
##$ZGOPTNS= <>
##$ZL1= 120
##$ZL2= 120
##$ZL3= 120
##$ZL4= 120
##$ABSF1= 60
##$ABSF2= -190
##$ABSG= 5
##$ABSL= 3
##$ALPHA= 0
##$AQORDER= 0
##$ASSFAC= 0
##$ASSFACI= 0
##$ASSFACX= 0
##$ASSWID= 0
##$AUNMP= <proc_1d>
##$AZFE= 0.1
##$AZFW= 0.5
##$BCFW= 1
##$BC_mod= 2
##$BYTORDP= 1
##$COROFFS= 0
##$CY= 9.86611175537109
##$DATMOD= 1
##$DC= 1
##$DFILT= <>
##$DTYPP= 0
##$F1P= 182.462994727601
##$F2P= 168.069089081705
##$FCOR= 0.5
##$FTSIZE= 0
##$FT_mod= 0
##$GAMMA= 1
##$GB= 0
##$INTBC= 1
##$INTSCL= 1
##$ISEN= 30
##$LB= 1.5
##$LEV0= 0
##$LPBIN= 0
##$MAXI= 11.51145
##$MC2= 0
##$MEAN= 0
##$ME_mod= 0
##$MI= 1.244541
##$NCOEF= 0
##$NC_proc= 0
##$NLEV= 6
##$NOISF1= 0
##$NOISF2= 0
##$NSP= 1
##$NTH_PI= 0
##$NZP= 1
##$OFFSET= 243.8632
##$PC= 1.4
##$PHC0= 1611.076
##$PHC1= 109.1595
##$PH_mod= 0
##$PKNL= yes
##$PPARMOD= 0
##$PSCAL= 0
##$PSIGN= 0
##$REVERSE= no
##$SF= 81.0140731611343
##$SI= 65536
##$SIGF1= 0
##$SIGF2= 0
##$SINO= 80
##$SIOLD= 65536
##$SREGLST= <31P.CDCl3>
##$SSB= 0
##$STSI= 0
##$STSR= 0
##$SW_p= 25641.0256410257
##$SYMM= 0
##$S_DEV= 0
##$TDeff= 0
##$TDoff= 0
##$TI= <>
##$TILT= no
##$TM1= 0
##$TM2= 0
##$TOPLEV= 0
##$USERP1= <user>
##$USERP2= <user>
##$USERP3= <user>
##$USERP4= <user>
##$USERP5= <user>
##$WDW= 1
##$XDIM= 64
##$YMAX_p= 0
##$YMIN_p= 0
$$ End of Bruker specific parameters
$$ ---------------------------------
##NTUPLES= NMR FID
##VAR_NAME=  TIME,          FID/REAL,        FID/IMAG
##SYMBOL=    X,             R,               I
##VAR_TYPE=  INDEPENDENT,   DEPENDENT,       DEPENDENT
##VAR_FORM=  AFFN,          ASDF,            ASDF
##VAR_DIM=   16384,         16384,           16384
##UNITS=     SECONDS,       ARBITRARY UNITS, ARBITRARY UNITS
##FACTOR=    3.08e-05,      1,               1
##FIRST=     0,             0,               0
##LAST=      0.5045964,     0,               0
##MIN=       0,             -7531,           0
##MAX=       0.5045964,     7576,            0
$$ Real data points
##PAGE= N=1
##DATA TABLE= (X++(R..R)), XYDATA
$$ plain form
0 0 0 0 0 0 0 0 0 0 0 0 0 0 0 0 0 0 0 0 0 0 0 0 0 0 0 0 0 0 0 0 0 0 4 -7 7 -11 13 -12 14 -13 14 -13 15 -20 24 -25 26 -28 32
49 32 -38 38 -38 45 -51 55 -71 70 -82 100 -119 137 -165 214 -298 448 -861 7438 7489 1767 -4322 -7531
71 -7531 -5434 206 6574 6153 4688 -3480 -6567 -6057 -313 4460 5698 4784 -353 -5737 -6294 -2186
87 -2186 2260 6874 5659 498 -3825 -6520 -4475 2313 6106 6702 1885 -2710 -5757 -5758 -693 4434
103 4434 6748 3991 -931 -5009 -5791 -1100 4241 5982 4457 929 -5392 -5777 -2809 1581 6916 4380
119 4380 1532 -2763 -5831 -2518 -74 4337 4716 3275 -1702 -5127 -4884 -1738 3068 4233 3142 -664
135 -664 -4674 -4714 -1674 2201 4994 3963 1116 -3227 -3592 -3630 525 3975 4097 1296 -2311 -4414 -3641
152 -3641 -1027 2904 5257 3221 -2503 -4147 -3095 -1057 2040 4755 3211 -1148 -2129 -3661 -1856
$$ packed form
0@%%%%%%%%%%%%%%%%%%%%%%%%%%%%%%%%Mj1J4j8K4k5K6k7K7k7K8l5M4m9N1n4O0
49C2p0P6p6Q3r6J06j26J41j52J82k19K56l02L79n12P46j309Q299N1n722o089l209
71g531K097N640O368m21j465q168l087N10N744M773J238r14n137n384n57M108
87b186M446M614j215n161m323k695K045O788L793N96m817m595l047jN065N127
103D434K314k757m922m078p82M691N341J741j525l528o321l85K968M390N335k536
119D380k848m295l068L313K444M411L79j441m977l425K43L146M806J165j091l806
135f64m010m0L040L875K793j031k847m343l65l8M155L450J22k801l607k103P73
152c641K614L931K353k036n724j644J052K038L097K715j544m359r81j532J805
$$ plain form
167 -1856 1556 3054 3657 965 -3204 -4262 -2342 1151 3183 3864 786 -893 -3836 -2352 -204 2447
183 2447 3551 1604 -1081 -3799 -2936 -669 2475 3283 1151 -225 -3001 -3422 -1984 358 3795 1608
199 1608 1254 -2106 -2935 -1704 699 2689 1990 643 -2337 -3513 -2102 -212 2167 3771 1581 -693
215 -693 -2411 -2599 -26 2080 2014 602 -1170 -2323 -2204 -2049 1707 2184 2754 -951 -2800 -2059 -1855 225
233 225 2422 3140 839 -3191 -2844 -1988 958 2399 2102 903 -1061 -2010 -3198 -890 2259 3728 2422
250 2422 -1693 -2806 -3291 1361 2362 2990 2226 -1549 -3253 -2186 -853 1938 3047 3162 -1046 -1437
266 -1437 -3047 -1927 1043 3709 2189 861 -1034 -5264 -924 148 2659 3702 2073 -484 -3288
281 -3288 -3168 -532 2202 4165 1992 -1263 -3733 -4191 -596 1114 4129 1790 279 -2348 -5168 -1906
$$ packed form
167a856L412J498O03k692m169j058J920L493K032O81l078j679k943J484K148K651
183B447J104j947k685k718Q63K267L144Q08k132j376k776m21J438K342L437k187
199A608l54l360q29J231K403J990o99j347k980j176J411J890K379J604k190k274
215f93j718j88K573K106o6j412j772j153J19J55L756M77N70l705j849P41K04K080
233B25K197P18k301m030L47Q56K946J441k97j199j964r49j188K308L149J469j306
250B422m115j113m85M652J001O28p64l775j704J067J333K791J109J15m208l91
266a437j610J120K970K666j520j328j895m230M340J072K511J043j629k557k804
281c288J20K636K734J963k173l255k470m58L595J710L015k339j511k627k820L262
$$ plain form
297 -1906 1509 3555 2962 962 -2246 -3982 -2270 -1056 4067 4609 2395 -2375 -3933 -4774 -1751 1677
313 1677 3791 4426 253 -3548 -3806 -2561 1696 3818 3770 1239 -2836 -3869 -3179 1174 2556 3622
329 3622 2287 -1323 -3943 -3649 -694 3198 4422 2462 894 -3015 -5215 -945 1408 3509 3759 722
345 722 -2128 -3630 -1562 1296 2448 4477 2137 -1525 -4960 -3111 -1208 4047 3160 1799 -309 -4240
361 -4240 -3150 -911 1690 4694 3018 1100 -3399 -4441 -2435 11 4256 3917 1865 -1656 -3273
376 -3273 -3307 -881 3333 4172 2622 -206 -4463 -4526 -1327 2117 3316 2856 -374 -2058 -3196 -2033 645
393 645 2647 3809 650 -2322 -3200 -2513 -882 3363 4051 1825 -1012 -3979 -2953 72 1415 3226
409 3226 2123 -889 -2545 -3304 -140 496 2916 3191 1371 -2183 -3196 -1545 -673 2615 3112 892
$$ packed form
297a906L415K046n93k000l208j736J712J214N123N42k214m770j558q41L023L428
313A677K114O35m173l801k58J245M257K122m8k531m075j033O90M353J382J066
329C622j335l610k620K94K955L892J224j960j568l909k200M270K353K101K50l037
345G22k850j502K068K858J152K029k340l662l435J849J903N255q87j361k108l931
361d240J090K239K601L004j676j918m499j042K006K446M245l39k052l521j617
376c273l4K426M214Q39j550k828m257o3L199L444J199m60l230j684j138J163K678
393F45K002J162l159k972q78O87J631M245O88k226k837k967J026L025J343J811
409C226j103l012j656p59L164O36K420K75j820l554j013J651Q72L288M97k220
$$ plain form
425 892 -1130 -4269 -2622 694 2144 2649 429 81 -3324 -3009 -1053 1069 2610 2126 392 -1569
441 -1569 -1225 -1722 241 1304 1429 627 -1656 -2432 -2134 1316 1904 1143 1542 -1399 -1934 -1358 -916 1735
459 1735 1418 2127 -556 -2285 -2332 -419 1972 2611 2092 -313 -1522 -1491 -881 867 1775 949 885 -1527
477 -1527 -689 -404 1189 2245 1662 -167 -1074 -1029 -828 -284 155 1897 984 -1171 -1358 -1119 -28 871
495 871 1090 621 -359 -1094 -2421 614 1184 2124 1477 -264 -186 -2706 -231 469 2414 1577 -539 -1159
513 -1159 -2016 -771 724 1105 1554 -157 -862 -3108 -744 -1137 1436 2487 -130 -172 -2225 -798 207
530 207 424 1658 516 -19 -1860 -960 -835 753 2461 1084 768 -1835 -1461 -452 481 693 93 781
548 781 -1364 -2829 -2153 497 1857 2068 2104 -1052 -1988 -1729 -834 1108 2064 1672 -1438 -2206 -2149 -580
$$ packed form
425H92k022l139J647L316J450N05k220l48l405L15J956K122J541m84j734j961
441a569L44m97J963J063J25q02k283p76K98L450N88p61L99k941n35N76M42K651
459A735l17P09k683j729m7J913K391O39n19k405j209L1O10J748R08q26o4k412
477a527Q38K85J593J056n83j829r07M5K01N44M39J742r13k155j87K39J091Q99
495H71K19m69r80p35j327L035N70R40o47j741P8k520K475P00J945q37k116o20
513a159q57J245J495L81M49j711p05k246K364l93K573J051k617m2k053J427J005
530B07K17J234j142n35j841R00J25J588J708j377l16k603L74J009R33K12o00O88
548G81k145j465O76K650J360K11L6l156r36K59Q95J942R56l92l110p68N7J569
$$ plain form
566 -580 1502 1179 1947 -800 -2054 -1732 -816 1330 2258 1915 -1038 -869 -2192 -1948 721 2289 1872 208
584 208 -1005 -2683 -2438 263 1703 1910 2248 38 -2250 -2309 -440 653 3559 2075 -143 -1481 -1953
601 -1953 -1772 965 1569 1888 -135 -1520 -2560 -2364 206 2178 2740 740 -261 -2216 -1698 -630 1241
618 1241 3324 2025 -106 -2782 -1639 -2099 695 1907 2489 644 -2378 -1968 -1655 -243 1487 2270
634 2270 1431 -2474 -1586 -1727 -2037 2075 1588 1603 -986 -1927 -2205 -408 1050 2108 2330 -501 -1648 -2534
652 -2534 -1490 1217 803 2097 285 -300 -1148 -2582 809 1564 2808 2400 -1493 -593 -2605 -518 -8
669 -8 2201 2084 966 -1278 -1675 -1889 299 1371 1990 -24 -815 -2180 -1750 -369 1876 1364 396 -303
687 -303 -1206 -1591 219 594 1721 1297 116 -583 -1781 -1008 -335 736 2021 -837 -1484 -1837 -1891 435
$$ packed form
566e80K082l23P68k747j254L22R16K146R28l43k953J69j323K44K669J568m17j664
584B08j213j678K45K701J440K07L38k210k288n9J869J093K906j484k218j338m72
601a953J81K737O04L19k023j385j040J96K570J972N62k000j001j955N18J068J871
618A241K083j299k131k676J143m60K794J212N82j845l022M10L13J412J730P83
634B270q39l905Q88j41l10M112m87J5k589r41k78J797J458J058K22k831j147q86
652b534J044K707m14J294j812n85q48j434L391P55J244m08l893R00k012K087N10
669hK209j17j118k244l97k14K188J072O19k014p91j365M30J381K245n12r68o99
687c03r03l85J810L75J127m24j181o99j198P73O73J071J285k858o47l53n4K326
$$ plain form
705 435 1784 1858 1249 -915 -1533 -2139 -483 -299 672 1288 -259 -338 -540 -617 460 1210 1110 49 -434
724 -434 -439 -1358 1687 895 2042 404 -257 -466 -378 528 -346 1157 -385 -148 -996 -1255 14 -734 1419
743 1419 829 -55 -585 -1134 -320 -260 1211 754 772 -245 -1250 -50 -58 1711 -55 534 -315 -1330 -420
762 -420 172 1540 -163 520 -811 835 -306 -146 733 -327 659 -481 -667 -741 541 548 117 204 -1160
781 -1160 -968 -654 -390 -20 111 -261 56 -1061 -963 -1094 1054 828 372 -88 -592 -521 -447 8 1812 983
801 983 -231 -729 -723 340 919 -311 523 319 -1585 -1399 -423 -197 1494 983 1280 -164 -793 -471 -523
820 -523 478 906 1323 -1191 -1569 -669 -674 808 785 1870 192 -258 -1040 -370 1383 1561 519 -87 139
839 139 -929 -442 155 34 1608 -432 -292 -1847 -1208 -372 -141 2176 -663 1135 -1338 -1241 -406 2013
$$ packed form
705D35J349P4o09k164o18o06J656J84R71O16j547p9k02p7J077P50j00j061m83
724d34nr19L045p92J147j638o61k09Q8R06q74J503j542K37q48k59J269p48K153
743A419n90q84n30n49Q14O0J471m57J8j017j005J200qJ769j766N89q49j015R10
762d20N92J368j703O83j331J646j141J60Q79j060R86j140j86p4J282Pm31Q7j364
781a160J92L14K64L70J31l72L17j117R8j31K148k26m56m60n04P1P4M55J804q29
801I83j214m98OJ063N79j230Q34k04j904J86R76K26J691n11K97j444o29L22n2
820e23J001M28M17k514l78R00nJ482k3J085j678m50p82O70J753J78j042o06K26
839A39j068M87N97j21J574k040J40j555O39Q36K31K317k839J798k473R7Q35K419
$$ plain form
857 2013 1005 408 863 -350 -1360 -284 437 1159 -358 46 -584 -2581 -344 464 1327 1787 -174
874 -174 499 -361 -826 1184 1707 1236 -274 -537 -300 -576 -192 542 835 2052 509 -1080 -833 -803 734
893 734 1516 214 627 -719 -859 -1642 1321 988 0 723 -369 -115 -627 -333 -157 1290 1013 -150
911 -150 -592 -278 -252 160 573 1024 -193 -175 -1309 -314 -262 236 1296 -225 118 -558 25 -672 1175 1155
931 1155 -239 567 -1122 -1190 620 94 2158 725 340 -242 -2161 -979 -270 911 1374 1246 -683
948 -683 -629 -206 -313 758 -260 1993 163 246 -852 -409 622 85 278 280 -1153 -450 -13 1392 -32
967 -32 812 -445 -1028 321 -985 355 433 1070 279 -457 -304 -511 477 69 157 759 540 -155 -188 -1152
987 -1152 -774 426 850 -1060 -865 -566 13 167 480 575 -215 149 -499 -963 -282 -270 596 -454 70 -376
$$ packed form
857B013j008n97M55j213j010J076P21P22j517M04o30j997K237Q08Q63M60j961
874a74O73q60m65K010N23m71j510k63K37k76L84P34K93J217j543j589K47L0J537
893G34P82j302M13j346j40p83K963l33r88P23j092K54n12K94J76J447k77j163
911a50m42L14K6M12M13M51j217J8j134R95N2M98J060j521L43o76N83o97J847k0
931A155j394Q06j689o8J810n26K064j433l85n82j919J182P09J181M63j28j929
948f83N4M23j07J071j018K253j830Q3j098M43J031n37J93Kj433P03M37J405j424
967c2Q44j257n83J349j306J340P8O37p91p36J53k07R88m08Q8O02k19o95l3r64
987a152L78J200M24j910J95K99N79J54L13R5p90L64o48m64O81J2Q66j050N24m46
$$ plain form
1007 -376 -237 302 -19 1063 -456 -169 -177 -130 861 -106 706 -503 -644 441 1643 750 63 95 86 -210
1027 -210 -523 -1175 -96 -1013 199 -91 -227 -679 -410 575 -205 719 -739 154 363 -451 -325 -48 686
1046 686 -263 -454 -197 -946 1157 -931 169 79 -523 -422 439 -873 211 980 -213 258 -627 -833
1064 -833 556 -313 765 20 143 266 -530 352 -202 1131 373 -91 168 -513 -379 366 160 9 -193
1083 -193 290 -1047 -807 -516 960 936 266 -449 -365 -416 -389 -896 798 -6 -358 -540 -509 -695 -362 381 -239
1104 -239 1440 -98 436 -993 398 389 -777 -284 -129 -94 -1340 -807 366 296 1292 -536 -171 -1160 167
1123 167 144 223 2245 113 -1087 -661 -675 1093 440 1414 -323 -1324 93 -296 -592 -46 1600 841
1141 841 -287 -926 -1185 -324 691 1581 1069 845 138 -5 -481 944 1656 421 19 -406 -723 -1097 -600
$$ packed form
1007c76J39N39l21J082j519K87qM7R91r67Q12j209j41J085J202q93o87L2rk96
1027b10l13o52J079r17J212k90j36m52K69R85p80R24j458Q93K09q14J26K77P34
1046F86r49j91K57p49K103k088J100r0o02J01Q61j312J084P69j193M71q85k06
1064h33J389q69J078p45J23J23p96Q82n54J333p58m64K59o81J34P45k06j51k02
1083a93M83j337K40K91J476k4o70p15Q4n1K7n07J694q04l52j82L1j86L33P43o20
1104b39J679j538N34j429J391rj166M93J55L5j246N33J173p0R96j828L65r89J327
1123A67k3P9K022k132j200M26j4J768o53R74j737j001J417l89k96N46J646p59
1141H41j128o39k59Q61J015Q90n12k24p07j43m76J425P12j235m02m25l17l74M97
$$ plain form
1160 -600 413 843 563 -324 -491 -500 -58 966 630 -40 1203 -281 -1105 49 -875 1626 1330 -266
1178 -266 -1878 -480 -521 17 -444 283 889 -672 370 -669 254 1544 1001 1553 -354 -755 -1668 -1117
1196 -1117 331 386 1007 786 69 -1374 145 -156 597 49 -102 -174 -311 496 -178 1008 923 -140 -644
1215 -644 -654 -721 -294 -394 527 38 -303 -788 -218 735 -1040 986 185 167 -480 -1600 388 -45 1083
1234 1083 801 237 -448 -635 -138 -440 1284 -479 -582 -535 -841 381 -335 508 992 943 672 430 -214
1253 -214 31 1232 -185 459 -801 513 -632 -354 406 859 -44 1183 -60 -916 -857 68 1276 1751
1271 1751 578 13 -887 -1509 390 503 484 -354 -654 601 -671 -108 591 236 656 -619 -432 -223
1289 -223 -176 -319 1171 308 -831 -842 -1165 396 137 -724 334 -250 -583 -1045 -270 94 -262 856 1102
$$ packed form
1160f00J013M30k80q87j67rM42J024l36o70J243j484q24J154r24K501k96j596
1178b66j612J398m1N38m61P27O06j561J042j039R23J290n43N52j907m01r13N51
1196a117J448N5O21k21p17j443J519l01P53n48j51p2j37Q07o74J186q5j063n04
1215f44j0o7M27j00R21m89l41m85N70R53j775K026q01j8o47j120J988m33J128
1234A083k82n64o85j87M97l02J724j763j03M7l06J222p16Q43M84m9k71k42o44
1253b14K45J201j417O44j260J314j145K78P60M53r03J227j243q56N9R25J208M75
1271A751j173n65r00o22J899J13j9q38l00J255j272N63O99l55M20j275J87K09
1289b23M7j43J490q63j139j1l23J561k59q61J058n84l33m62P75L64l56J118K46
$$ plain form
1308 1102 559 -675 -782 -982 350 1838 172 952 -308 -77 -95 -767 1162 840 349 -369 779 -531
1326 -531 -791 968 110 912 -704 -1227 45 -847 675 342 518 -659 -1394 -741 513 1116 511 584
1344 584 -538 -1711 -873 27 1203 329 977 288 -932 9 43 1341 1267 216 620 -1093 -1115 -857 1196
1363 1196 100 609 24 -697 -675 -1337 -289 374 877 407 166 -567 -1389 211 679 1940 1150 306 598
1382 598 -524 -38 327 71 1130 -324 -912 -1643 -418 -493 1525 1544 -1082 -370 -1156 -1077 242 905 1315
1401 1315 339 60 -1000 -843 -879 -552 1896 185 595 -364 -1260 -301 302 1766 484 1642 -1114 -1054
1419 -1054 -1046 -416 1182 1881 1317 151 -996 -511 400 931 -386 1059 -237 -497 -2046 -1251 463 849
1437 849 683 -484 296 -1290 -1184 796 1528 689 716 -1311 29 -1548 68 944 1254 744 -400 -1289
$$ packed form
1308A102n43j234j07k00J332J488j666P80j260K31j8o72J929l22m91p18J148j310
1326e31k60J759q58Q02j616n23J272q92J522l33J76j177p35O53J254O03o05P3
1344E84j122j173Q38R00J176q74O48o89j220R41L4J298p4j051M04j713k2K58K053
1363A196j096N09n85p21K2o62J048O63N03m70k41p33q22J600M68J261p90q44K92
1382E98j122M86L65k56J059j454n88p31J225p5K018J9k626P12p86P9J319O63M10
1401A315r76k79j060J57l6L27K448j711M10r59q96R59O03J464j282J158k756O0
1419a054QO30J598O99n64j166j147M85R11N31j317J445j296k60j549P95J714L86
1437H49j66j167P80j586J06J980P32q39K7k027J340j577J616Q76L10n10j144q89
$$ plain form
1455 -1289 -68 -323 -56 2262 -277 7 67 -1466 -621 110 1980 1392 -213 -127 -282 -95 -345 910
1473 910 1795 -108 376 -980 -1052 -203 929 951 -162 -598 -1412 1 -258 549 1103 811 -37 -396 -1032
1492 -1032 -791 -191 624 306 -328 -489 24 -344 335 1049 1249 1122 216 1023 -236 -393 616 749 847
1511 847 209 -121 -1064 -1133 579 -330 432 -1134 -1049 321 -1179 1187 618 1581 1125 -131 -929 -81 -279
1530 -279 -251 643 675 -617 -532 269 -274 -51 866 474 -622 -830 -645 -162 -234 1617 923 188 -147 -1745
1550 -1745 -728 511 594 108 1121 -1052 -503 506 -326 1114 1466 394 972 -1549 -778 -478 -503 856
1568 856 70 386 -1265 -733 -599 135 991 487 939 52 -83 221 -69 1086 348 407 -140 -238 -411 -24
1588 -24 577 -337 756 -1302 -952 -1056 -760 747 676 241 -72 -214 -1038 233 737 -440 714 146 -250
$$ packed form
1455a289J221k55K67K318k539K84O0j533Q45P31J870n88j605Q6j55J87k50J255
1473I10Q85j903M84j356p2Q49J132K2j113m36q14J413k59Q07N54k92q48l59o36
1492a032K41O00Q15l18o34j61N13l68O79P14K00j27r06Q07j259j57J009J33R8
1511H47o38l30r43o9J712r09P62j566Q5J370j500K366n69R63m56j256p98Q48j98
1530b79K8Q94L2j292Q5Q01n43K23R17l92j096k08J85M83p2J851o94p35l35j598
1550a745J017J239Q3m86J013k173N49J009q32J440L52j072N78k521P71L00k5J359
1568H56p86L16j651N32J34P34Q56n04M52q87j35L04k90J155p38N9n47r8j73L87
1588b4O01r14J093k058L50j04K96J507p1m35l13j42q24J271N04j177J154n68l96
$$ plain form
1607 -250 -267 -665 1577 218 921 1433 -337 -869 -1198 447 802 1508 58 -558 -373 -1812 -690 288
1625 288 1594 282 43 -511 -998 149 429 710 201 765 345 -931 -227 -46 1750 489 -289 -874
1643 -874 -412 -474 364 853 868 -118 -628 -937 -1082 -513 1136 589 -54 -314 -2247 -7 -588 305 1630
1662 1630 1068 459 -661 -795 -972 335 1258 490 788 -462 -754 -825 200 1440 667 331 -6 -112
1680 -112 -714 -114 960 609 284 -622 -293 -805 -1743 769 602 1197 686 -531 -532 -2118 254 931 1259
1699 1259 515 -565 -545 -1027 -574 -75 2077 -154 -657 -873 -471 -10 747 1046 619 593 -1184 -1528 -1280
1718 -1280 -1428 1249 384 116 -833 -1271 -947 -1310 758 671 -79 176 -1369 -641 -1571 -682 323 -65 -284
1737 -284 -1044 282 -867 977 834 -529 144 -818 -823 -676 113 1174 707 1084 -395 -868 -608 -432 602
$$ packed form
1607b50j7l98K242j359P03N12j770n32l29J645L55P06j450o16J85j439J122R78
1625B88J306j312k39n54m87J147K80K81n09N64m20j276P04J81J796j261p78n85
1643h74M62o2Q38M89J5r86n10l09j45N69J649n47o43k60j933K240n81Q93J325
1662A630n62o09j120j34j77J307R23p68K98j250k92p1J025J240p73l36l37j06
1680a12o02O00J074l51l25r06L29n12r38K512j67N95n11j217jj586K372O77L28
1699A259p44j080K0m82M53M99K152k231n03k16M02M61P57K99m27k6j777l44K48
1718a280j48K677q65k68r49m38L24l63K068q7p50K55j545P28r30Q89J005l88k19
1737b84p60J326j149J844j43j363O73r62nJ47P89J061m67L77j479m73K60J76J034
$$ plain form
1756 602 64 1717 415 -1231 -1439 -479 364 531 1211 -272 -768 -1402 -803 -596 423 1116 726 -121
1774 -121 -1382 88 -1020 443 1205 -75 -411 -1066 -1551 470 161 1197 -136 78 -235 -348 1037
1791 1037 -687 939 -259 -690 -1417 -1412 -290 -1033 1286 1274 627 -535 -493 57 -167 658 92 103 118 124
1811 124 -614 -860 1535 913 1514 -918 -1056 -1008 -655 764 -38 627 325 -1429 -640 -617 -307 -174 1158
1830 1158 389 -131 -788 -1251 -709 -345 764 195 -32 -1206 -484 319 1165 -366 771 -82 -347 -628
1848 -628 690 307 485 880 166 -74 -941 -520 337 -929 1415 -830 -676 -543 -642 125 -344 389 -150
1867 -150 -503 -1902 -640 484 -856 1436 426 -291 501 -667 274 215 732 450 -297 -101 -255 -255 -840
1886 -840 1005 -293 830 -366 -541 411 -232 571 -443 515 -700 -1120 58 130 1174 140 599
$$ packed form
1756F02n38J653j302j646k08R60Q43J67O80j483m96o34N99K07J019O93l90q47
1774a21j261J470j108J463P62j280l36o55m85K021l09J036j333K14l13j13J385
1791A037j724J626j198m31p27NJ122p43K319j2o47j162M2N50k24Q25n66J1J5O
1811A24p38k46K395o22O01k432j38M8L53J419q02O65l02j754P89K3L10J33J332
1830A158p69n20o57m63N42L64J109n69k27j174P22Q03Q46j531J137q53k65k81
1848f28J318l83J78L95p14k40q67M21Q57j266K344k245J54J33r9P67m69P33n39
1867a50l53j399J262J124j340K292j010p17P92j168R41n9N17k82p47J96j54%n85
1886h40J845j298J123j196j75R52o43Q03j014R58j215m20J178P2J044j034M59
$$ plain form
1903 599 -1604 -576 227 -1388 1318 -371 627 719 -124 -622 -1568 -201 1000 1583 -90 -646 -970 -284
1921 -284 505 504 774 759 -782 -562 -1070 -373 33 1227 577 -757 1113 -802 -326 -324 284 1553 365
1940 365 689 -555 -853 -766 -580 795 61 -627 -734 -1138 -1377 782 638 706 -271 -859 -1317 -734 1048
1959 1048 948 534 246 -1513 -1458 -644 -664 2335 143 81 -240 -215 -945 14 -87 557 1230 -59 -1438
1978 -1438 -435 70 1808 694 823 359 -770 9 -868 711 492 926 271 -755 -28 -1920 1165
1995 1165 273 1405 -187 -821 -416 -146 1163 112 792 1626 27 -1054 589 507 -45 1222 625
2012 625 -549 254 -815 -292 851 1398 651 2 304 -1870 719 -192 -463 712 -118 -933 -1575 -332
2030 -332 -294 806 461 321 465 -1252 -1636 858 385 788 232 1037 -781 -1147 936 1322 439 870 604
$$ packed form
1903E99k203J028Q03j615K706j689R98R2q43m98r46J367J201N83j673n56l24O86
1921b84P89jK70j5j541K20n08O97M06J194o50j334J870j915M76KO08J269j188
1940C65L24j244k98Q7J86J375p34o88j07m04k39K159j44O8r77n88m58N83J782
1959A048j00m14k88j759N5Q14k0K999k192o2l21K5p30R59j01O44O73j289j379
1978a438J003N05J738j114J29m64j129P79q77J579k19M34o55j026P27j892L085
1995A165q92J132j592o34M05K70J309j051O80Q34j599j081J643q2n52J267n97
2012F25j174Q03j069N23J143N47p47o49L02k174K589r11k71J175q30q15o42J243
2030c32L8J100l45j40J44j717l84K494m73M03n56Q05j818l66K083L86q83M31k66
$$ plain form
2049 604 504 -310 -1545 -655 1212 107 -290 -126 -937 -817 -957 136 1292 50 -1008 -1031 -428 -806
2067 -806 1248 340 433 -17 -233 -219 575 416 8 146 376 -251 -274 -798 104 -479 334 -119 -30 617 -1487
2088 -1487 946 -444 116 691 1468 250 -987 85 -267 449 566 840 826 -422 -610 -504 -429 200
2106 200 107 425 -1468 414 343 335 -181 -249 1125 -450 -962 -946 1200 174 -58 -636 -680 -1221 582 -222
2126 -222 -110 -24 639 -845 -1435 -721 677 -299 419 587 751 -136 697 -356 443 477 718 -270 325 -283
2146 -283 368 42 -854 876 423 -460 -1497 489 23 -654 141 -70 -642 -91 -669 1597 864 856 -38
2165 -38 -436 -700 -1639 -26 253 924 -425 -918 -214 -1771 207 152 1524 -405 36 1088 -521 937
2183 937 -387 -195 834 82 305 -804 9 -377 543 500 562 -268 -107 -16 -173 676 363 -771 -360 -928
$$ packed form
2049F04j00q14j235Q90J867j105l97J64q11J20j40J093J156j242j058k3O03l78
2067h06K054r08R3m50k16J4P94j59m08J38K30o27k3n24R02n83Q13m53Q9O47k104
2088a487K433j390N60N75P77j218j237J072l52P16J17K74j4j248j88J06P5O29
2106B00r3L18j893J882p1qn16o8J374j575n12J6K146j026k32n78m4n41J803q04
2126b22J12Q6O63j484n90P14J398r76P18J68J64q87Q33j053P99L4K41r88N95o08
2146b83O51l26q96J730m53q83j037J986m66o77P95k11n72N51n78K266p33qq94
2165c8l98k64r39J613K79O71j349m93P04j557J978n5J372j929M41J052j609J458
2183I37j324J92J029p52K23j109Q13l86R20m3O2q30J61R1j57Q49l13j134M11n68
$$ plain form
2203 -928 -376 -235 1120 382 -57 -622 -493 -276 -781 130 923 53 647 -717 -208 -70 433 587 791
2222 791 1138 -1122 -36 -825 897 12 -20 1533 -102 -118 48 -765 159 1249 1272 -318 -38 -386 83
2241 83 -67 656 247 -390 -383 -102 -1665 -144 439 166 40 -823 -956 -604 -227 -447 842 -541 -220 -35
2261 -35 -574 -301 1267 740 823 367 -687 -1280 688 -685 451 503 380 455 -1051 -226 -1086 2064 993
2280 993 135 212 -982 -1009 -230 741 7 -727 -338 -350 114 -981 -398 686 190 -327 -1127 -47 -370 612
2300 612 125 985 473 854 213 46 471 -9 -63 -11 29 550 22 226 1366 884 520 -301 -943 -475 -1337
2321 -1337 190 -498 -98 30 -1030 -1037 214 626 -877 438 332 -449 -606 -1273 4 -876 981 488
2339 488 -424 174 -666 154 -127 -130 542 175 -121 -992 891 273 333 561 -298 -709 -504 -1381 -1188 136
$$ packed form
2203i28N52J41J355p38m39n65J29K17n05R11P93q70N94j364N09J38N03J54K04
2222G91L47k260J086p89J722q85l2J553j635j6J66q13R24J090K3j590K80l48M69
2241H3j50P23m09o37PK81j563J521N83k73j26q63j33L52L77k20J289j383L21J85
2261c5n39K73J568n27Q3m56j054n93J968j373J136N2j23P5j506Q25q60L150j071
2280I93q58P7j194k7P79R71p34p34L89j2M64j095N83J084m96n17q00J080l23R82
2300F12m87Q60n12L81o41j67M25m80n4N2M0N21n28K04J140m82l64q21o42M68q62
2321a337J527o88M00J28j060pJ251M12j503J315j06p81j57o67J277q80J857m93
2339D88r12N98q40Q20k81lO72l67k96q71J883o18O0K28q59m11K05q77J93J324
$$ plain form
2359 136 -209 491 -136 -736 -432 579 1762 281 -306 181 -213 1184 -640 332 228 -555 95 -344
2377 -344 -258 -951 382 -623 301 -483 192 -175 167 869 -5 161 122 253 -378 -677 -1 -290 435 1385
2397 1385 -936 520 -1566 -510 126 1165 947 -613 -53 129 -362 -718 -472 320 602 -24 -968 -117
2415 -117 434 107 981 -170 -117 481 -145 -55 -770 -297 -1015 -160 -88 -314 178 -84 1592 -123 157 -477
2435 -477 -133 -100 -361 56 -677 414 -1185 -445 297 478 217 488 -725 -89 -1295 -251 -595 163 -521
2454 -521 693 -13 -45 -547 -1443 790 -752 -89 684 14 83 -887 -71 173 -574 -131 -908 -117 -661 -81
2474 -81 -435 505 253 -406 42 -875 522 74 -446 -202 -146 501 -897 7 115 523 63 630 -224 216
2494 216 417 396 -238 1077 -243 493 -302 383 -1330 -958 210 -836 142 743 206 80 645 270 -1066
$$ packed form
2359A36l45P00o27o00L04J011J183j481n87M87l94J397j824R72j04p83O50m39
2377c44Q6o93J333j005R24p84O75l67L42P02q74J66l9J31o31k99O76k89P25R50
2397A385k321J456k086J056O36J039k18j560N60J82m91l56K46P92K82o26r44Q51
2415a17N51l27Q74j151N3N98o26R0p15M73p18Q55P2k26M92k62J676j715K80o34
2435d77L44L3k61M17p33J091j599P40P42J81k61K71j213O36j206J044l44P58o84
2454e21J214p06l2n02q96K233j542O63P73o70O9r70Q16K44p47M43p77P91n44N80
2474h1l54R40k52o59M48r17J397m48n20K44N6O47j398R04J08M08m60N67q54M40
2494B16K01k1o34J315j320P36p95O85j713L72J168j046R78O01n37j26N65l75j336
$$ plain form
2513 -1066 164 -1298 -1153 -22 -848 1236 357 1766 -111 -529 494 -663 253 -485 -200 -177 -1022
2530 -1022 414 -285 936 -344 524 -306 -789 927 -671 225 182 614 -386 -40 -201 310 753 -848
2548 -848 -6 773 -257 1329 -701 295 -572 -680 716 -677 569 -97 151 1029 896 -300 -520 -489
2566 -489 -556 -748 935 -451 250 -361 700 -384 -278 534 -1354 1298 -309 353 -426 691 -706
2583 -706 102 -143 -1793 244 50 -342 605 815 957 -175 -220 155 -138 226 189 456 -221 -16 -720 -122
2603 -122 -488 393 132 611 834 -526 -1021 -527 -533 363 529 1186 -154 -22 301 -379 -373 2 66 -125 -1469
2624 -1469 -274 227 781 41 -15 -852 -559 -339 151 -139 437 576 384 795 709 86 -350 -765 348 -489
2644 -489 -257 -89 -1679 241 -253 -51 145 -260 767 331 -413 -46 424 -714 1543 319 -1463 402
$$ packed form
2513a066J230j462J45J131q26K084q79J409j877m18J023j157R16p38K85K3q45
2530a022J436o99J221j280Q68q30m83J716j598Q96m3M32j000L46j61N11M43j601
2548h48Q42P79j030J586k030R96q67j08J396j393J246o66K48Q78j33j196k20L1
2566d89o7j92J683j386P01o11J061j084J06Q12j888K652j607O62p79J117j397
2583g06Q08k45j650K037j94l92R47K10J42j132m5L75k93L64l7K67o77K05p04N98
2603a22l66Q81k61M79K23j360m95M94oQ96J66O57j340J32L23o80OL75O4j91j344
2624a469J195N01N54p40n6q37K93K20M90k90N76J39j92M11q6o23m36m15J113q37
2644d89K32J68j590J920m94K02J96m05J027m36p44L67M70j138K257j224j782J865
$$ plain form
2662 402 -339 461 -628 -276 583 -1112 854 -705 -680 376 -274 398 -687 229 -257 -729 -471 -401 9
2681 9 -464 175 191 819 54 191 137 -919 -177 823 -188 631 -103 475 41 -736 71 -1002 -617 -163
2701 -163 -728 440 660 11 -201 410 120 390 444 589 -716 -272 418 -550 -131 349 -434 208 -72 55
2721 55 216 -350 -216 -424 -144 -1013 123 614 664 -13 88 698 -940 -603 -713 301 534 -979 834
2740 834 -164 714 117 1151 481 68 -280 -246 341 465 239 498 -1145 91 -813 99 -646 694 307
2759 307 -298 124 -1700 916 505 190 -49 -151 143 257 367 72 -772 545 -382 686 -782 -38
2777 -38 -416 425 556 285 310 -427 -269 -437 285 657 -132 -292 -399 -670 183 -171 -207 648 400 46 -326
2798 -326 -705 -72 506 -210 1073 -129 160 271 162 1394 -547 290 -399 -185 854 -1016 -627 565
$$ packed form
2662D02p41Q00j089L52Q59j695J966j559K5J056o50O72j085R16m86m72K58P0M10
2681Im73O39J6O28p65J37n4j056P42J000j011Q19p34N78m34p77Q07j073L85M54
2701a63n65J168K20o49k12O11k90K70N4J45j305M44O90r68M19M80p83O42k80J27
2721E5J61n66J34k08K80q69J136M91N0o77J01O10j638L37j10J014K33j513J813
2740H34r98Q78n97J034o70m13l48L4N87J24k26K59j643J236r04R12p45J340l87
2759C07o05M22j824K616m11l15k39j02K94J14J10k95q44J317r27J068j468P44
2777c8l78Q41J31k71K5p37J58j68P22L72p89j60j07k71Q53l54l6Q55k48l54l72
2798c26l79O33N78p16J283j202K89J11j09J232j941Q37o89K14J039j870L89J192
$$ plain form
2816 565 -553 -1110 424 -87 -256 -62 -56 585 418 -28 -187 -478 -3 -30 -494 -587 566 -111 -708 -538
2836 -538 -23 142 -106 114 1050 -763 41 -182 -94 -805 69 1190 -28 -174 -658 1052 -328 -871 96
2855 96 -789 274 -494 -644 615 -480 173 -225 1423 -659 973 -58 515 8 -564 619 100 208
2873 208 94 605 659 -674 -229 -191 504 19 -164 1793 -263 567 -1264 -436 993 -629 148 -145 117
2892 117 -104 -932 284 -274 369 -216 385 44 621 1 -596 123 -1031 -635 743 -955 985 90
2910 90 -672 83 -295 821 466 -559 -724 -665 922 517 179 277 950 112 503 94 -241 1384 -922
2929 -922 198 -1712 -30 640 -812 -609 -1339 -15 -93 188 -829 -1332 942 476 191 -99 -542 -251
2947 -251 255 -743 15 665 -88 211 223 -741 17 -857 478 -991 127 793 525 -221 -932 72 -453
$$ packed form
2816E65j118n57J534n11j69J94OO41j67m46j59k91M75k7m64r3J153o77n97J70
2836e38N15J65k48K20R36j813Q04k23Q8p11Q74J121j218j46m84J710j380n43R67
2855I6q85J063p68j50J259j095O53l98J648k082J632j031N73n07n72J183n19J08
2873B08j14N11N4j333M45L8O95m85j83J957k056Q30j831Q28J429j622P77k93K62
2892A17k21q28J216n58O43n85O01l41N77o20n97P19j154L96J378j698J940q95
2910I0p62P55l78J116l55j025j65N9J587m05l38R8O73q38L91m09l35J625k306
2929i22J120j910J682O70j452K03p30J324p8K81j017n03K274m66k85k90m43K91
2947b51N06r98P58O50p53K99J2r64P58q74J335j469J118O66k68p46p11J004n25
$$ plain form
2966 -453 273 28 -963 535 34 629 362 155 519 341 -8 -1086 200 -958 -1 473 -323 -534 -1156
2985 -1156 -253 460 -460 989 766 594 150 778 808 -630 1788 -438 -236 176 -112 -192 -66 -169 -1255
3004 -1255 -637 -315 -712 569 894 -556 -489 -80 -1109 317 -10 -445 652 53 70 645 -113 -234 -1270
3023 -1270 659 19 -372 388 -372 -204 -868 645 -83 331 -129 -634 1245 -455 1144 -960 136
3040 136 -117 186 1103 -449 1356 540 -403 237 -1263 -82 -745 342 820 -122 -32 -932 -228 -969 146
3059 146 672 377 -887 409 270 -393 733 -768 292 -91 -16 -312 -1131 -710 -213 -94 512 -163 -95
3078 -95 -1217 -521 -581 255 567 86 -199 686 252 -399 -1084 108 -966 1156 152 419 153 -391 -143
3097 -143 -1214 -455 663 489 -1365 -544 -194 92 314 -385 -26 980 -372 1009 42 -171 -87 -127 -15
$$ packed form
2966d53P26k45r91J498n01N95k67k07L64j78l49j078J286j158R57M74p96k11o22
2985a156R03P13r20J449k23j72m44O28L0j438K418k226K02M12k88q0J26j03j086
3004a255O18L22l97J281L25j450O7M09j029J426l27m35J097n99J7N75p58j21j036
3023a270J929o40l91P60p60J68o64J513p28M14m60n05J879j700J599k104J096
3040A36k53L03R17j552J805q16r43O40j500J181o63J087M78r42R0r00P04p41J115
3059A46N26k95j264J296j39o63J126j501J060l83P5k96q19M21M97J19O06o75O8
3078i5j122O96o0Q36L12m81k85Q85m34o51o85J192j074K122j004K67k66n44K48
3097a43j071P59J118j74j854Q21L50K86K22o99L59J006j352J381r67k13Q4m0J12
$$ plain form
3116 -15 346 162 -1674 1047 -219 646 673 -819 319 473 339 -128 249 814 -344 78 -337 132 362
3135 362 -59 321 -923 773 -750 552 273 -268 715 -494 -684 -958 600 869 7 823 -1014 -1069
3153 -1069 -905 -449 301 -710 743 -952 1159 -190 -247 -1591 -31 -129 648 196 -920 -232 -34 -271
3171 -271 754 169 -119 -1373 438 499 -634 232 -1704 186 443 -324 -276 -152 -620 24 -191 -599 -86
3190 -86 837 500 -821 -334 253 -56 -284 843 -349 -800 662 -314 -361 -542 569 -291 824 1358 -528
3209 -528 -652 -864 -263 -339 -606 174 -219 -199 -644 211 -792 695 55 -205 154 27 299 -1392 1033
3228 1033 144 740 820 -413 416 -676 -290 -367 -436 367 -1252 -1030 -543 -224 405 -99 -280 254 345 -635
3248 -635 -216 -572 212 -1038 -404 159 -1108 968 760 -289 184 -1039 936 209 -581 1012 -166
$$ packed form
3116a5L61j84j836K721j266Q65K7j492J138J54j34m67L77N65j158M22m15M69K30
3135C62m21L80j244J696j523J302k79n41R83j209j90k74J558K69q62Q16j837n5
3153a069J64M56P50j011J453j695K111j349n7j344J560r8P77m52j116O88J98k37
3171b71J025n85k88j254J811O1j133Q66j936J890K57p67M8J24m68O44k15m08N13
3190h6R23l37j321M87N87l09k28J127j192m51J462r76m7j81J111q60J115N34j886
3209e28j24k12O01p6k67P80l93K0m45Q55j003J487o40k60L59j27K72j691K425
3228A033q89N96Q0j233Q29j092L86p7o9Q03j619K22M87L19O29n04j81N34R1r80
3248f35M19l56P84j250O34N63j267K076k08j049M73j223J975p27p90J593j178
$$ plain form
3265 -166 -28 -535 -111 -666 486 -134 -940 149 138 110 -462 -193 742 97 923 67 174 -327 -878 134
3285 134 44 939 -129 -2 -418 -159 1141 534 111 175 -755 96 692 711 462 -102 -480 379 103 -357
3305 -357 1087 -887 -487 -235 -348 -924 435 727 -1265 589 320 -371 209 -309 324 1227 48 820
3323 820 322 -659 49 -197 403 225 -1161 87 -179 -601 1070 -156 1067 -364 914 362 -1232
3340 -1232 -7 -272 185 898 407 -1069 -452 623 -806 402 25 -743 -849 -1243 201 -958 931
3357 931 -294 555 719 1 698 -555 -932 9 -654 811 -646 405 594 -308 -73 170 185 -780 -167
3376 -167 -216 -348 346 94 -618 -733 -505 8 -427 338 -430 1522 -525 672 451 -549 402 381 -599
3395 -599 -337 -103 276 -540 774 -332 186 169 -762 190 -824 -550 -1619 -213 698 -714 940 -197
$$ packed form
3265a66J38n07M24n55J152o20q06J089j1k8n72K69R35o45Q26q56J07n01n51J012
3285A34r0Q95j068J27m16K59J300o07m23O4r30Q51N96J9k49n64l78Q59k76m60
3305c57J444j974M00K52j13n76J359K92j992J854k69o91N80n18O33R03j179P72
3323H20m98r81P08k46O00j78j386J248k66m22J671j226J223j431J278n52j594
3340a232J225k65M57P13m91j476O17J075j429J208l77p68j06l94J444j159J889
3357I31j225Q49J64p18O97j253l77R41o63J465j457J051J89r02K35K43J5r65O13
3376a67m9j32O94k52p12j15K28N13m35P65p68J952k047J197k21j000R51k1r80
3395e99K62K34L79q16J314j106N18j7r31R52j014K74j069J406R11j412J654j137
$$ plain form
3413 -197 302 64 58 357 114 508 -801 701 -877 349 -50 -430 1058 -245 543 -307 -270 -467 -1470
3432 -1470 889 28 1380 -47 457 -463 -102 227 -2 387 1315 435 158 -93 708 -236 521 -450 -248
3451 -248 306 -220 -104 100 623 -1219 188 -654 819 615 -178 122 -521 740 329 -405 174 34 568
3470 568 -256 658 1450 -336 874 -62 -907 -253 281 1083 730 172 392 175 486 18 704 -287 12
3489 12 -701 109 92 -972 82 546 -249 -623 4 -230 21 240 -1336 718 621 -201 560 111 456 -607
3509 -607 -966 -301 -396 -855 249 306 -532 -684 856 346 911 264 -112 -44 -1208 -51 -688 94 98 1204
3529 1204 -39 106 29 505 293 -182 -45 -266 -1367 718 -917 1023 906 475 -326 -492 -547 1154
3547 1154 548 -328 -185 271 -190 -309 141 869 -133 1116 -1239 34 620 -1206 1050 74 -481 468
$$ packed form
3413a97M99k38oK99k43L94j309J502j578J226l99l80J488j303P88q50L7j97j003
3432a470K359q61J352j427N04r20L61L29k29L89R28q80k77k51Q01r44P57r71K02
3451b48N54n26J16K04N23j842J407q42J473k04p93L00o43J261m11p34N79j40N34
3470E68q24R14P92j786J210r36q45O54N34Q02l53n58K20k17L11m68O86r91K99
3489A2p13Q10j7j064J054M64p95l74O27k34K51K19j576K054r7q22P61m49L45j063
3509f07l59O65r5m59J104N7q38j52J540n10N65o47l76O8j164J157o37P82MJ106
3529A204j243J45p7M76k12m75J37k21j101K085j635J940j17m31q01j66n5J701
3547A154o06q76J43M56m61j19M50P28j002J249k355J273N86j826K256r76n55R49
$$ plain form
3565 468 751 309 -464 176 -575 -65 274 -665 406 160 706 -485 225 144 -893 -702 837 565 -338
3584 -338 1034 601 -21 175 -482 62 825 674 1211 -118 -229 -736 104 -149 -55 -77 737 340 323 615
3604 615 1474 -532 463 721 -154 489 -634 436 -228 -956 485 25 41 585 124 315 1155 238 -251
3623 -251 -356 -716 19 350 -653 -477 183 -1210 -707 -280 792 -113 131 -367 -270 365 -228 -233 -291 -352 207
3644 207 -64 25 -777 86 -231 253 774 -527 -342 -170 -420 -70 540 649 1052 412 172 -188 -17 -523
3664 -523 -40 -289 42 -454 -776 365 34 495 403 115 -341 937 323 -716 1044 -13 -399 -618 276
3683 276 -199 88 631 737 -97 1134 -428 126 -141 -396 94 -350 -704 -1047 -188 -1294 238 1336
3701 1336 13 133 -79 673 61 -448 938 47 674 -973 940 278 678 1205 119 1420 -506
$$ packed form
3565D68K83m42p73O40p51N10L39r39J071k46N46j191P10q1j037J91J539k72r03
3584c38J372m33o22J96o57N44P63j51N37j329j11n07Q40k53R4k2Q14l97j7K92
3604F15Q59k006R95K58q75O43j123J070o64p28J441m60J6N44m61J91Q40r17m89
3623b51j05l60P35L31j003J76O60j393N03M27J072r05K44m98R7O35n93nn8o1N59
3644B07k71Q9q02Q63l17M84N21j301J85J72k50L50O10J09M03o40k40l60J71n06
3664e23M83k49L31m96l22J141l31M61r2k88m56J278o14j039J760j057l86k19Q94
3683B76m75K87N43J06q34J231j562N54k67k55M90m44l54l43Q59j106J532J098
3701A336j323J20k12P52o12n09J386q91O27j647J913o62M00N27j086J301j926
$$ plain form
3718 -506 -46 -714 -8 469 715 1011 -656 503 -18 22 1070 -567 -62 -670 -1 -311 574 831 3
3737 3 312 -903 -106 284 -164 -4 -593 715 411 -571 357 -368 212 -93 -24 -33 -308 -185 446 595 552
3758 552 -153 30 -4 -1321 -103 -122 -227 -530 254 -383 -181 118 -362 -133 696 825 -50 29 -930 -45
3778 -45 -423 760 -76 -118 -718 -433 -105 -157 77 -14 14 442 -654 1089 207 -546 532 -206 841 374
3798 374 928 943 -498 -825 -211 571 -380 288 -558 -213 -299 -229 -506 -340 113 592 77 -192 267 -109 152
3819 152 -543 -39 31 1121 350 -992 632 -210 -343 581 1059 -162 779 -564 -117 2 -549 -498 102
3838 102 720 -1079 -234 -713 -109 -37 -143 1055 469 730 -379 589 -153 919 1123 -252 -187 -402 38
3857 38 222 -721 -684 456 329 -350 -254 -19 308 -406 855 -132 845 387 65 325 -217 -253 -331 705 -1400
$$ packed form
3718e06M60o68P06M77K46K96j667J159n21M0J048j637N05o08O69l10Q85K57q28
3737CL09j215P97L90m48J60n89J308l04r82R28p25N80l05O9rk75J23O31J49m3
3758E52p05J83l4j317J218j9j05l03P84o37K02K99m80K29Q29J29q75P9r59Q85
3778d5l78J183q36m2o00K85L28n2K34r1K8M28j096J743q82p53J078p38J047m67
3798C74N54J5j441l27O14P82r51O68q46L45q6P0k77J66M53M79n15k69M59l76K61
3819A52o95N04P0J090p71j342J624q42j33R24M78j221R41j343M47J19n51N1O00
3838A02O18j799Q45m79O04P2j06J198n86K61j109R68p42J072K04j375O5k15M40
3857C8J84r43L7J140j27o79R6K35L27p14J261r87R77m58l22K60n42l6p8J036k105
$$ plain form
3878 -1400 -57 -518 517 335 -915 -689 292 -773 299 -145 133 -175 831 -168 560 -137 317 -142
3896 -142 -909 543 -561 791 -374 518 122 -929 1047 -953 69 348 -80 163 -582 1462 -603
3913 -603 -1206 242 326 162 -648 831 -236 275 -489 -715 1068 15 -313 -721 1 -93 847 -1082 221
3932 221 1045 280 362 1115 261 34 -179 -510 -217 567 -289 -194 -607 -298 1133 700 383 -841 -1001 -922
3952 -922 527 -740 -31 -120 79 146 1167 -1896 -653 260 416 886 -45 -48 188 -510 561 -157 -128 -957
3972 -957 94 -1127 776 625 -105 168 -28 -214 -646 -633 -132 -37 -224 29 -247 188 -1170 168 -144
3991 -144 -521 133 452 121 -776 -54 452 1312 707 242 599 -775 331 -475 -9 -285 546 65 727
4010 727 639 -456 647 -1345 672 1072 301 255 215 641 -435 590 -173 -14 937 -75 77 400 35
$$ packed form
3878a400J343m61J035j82j250K26R81j065J072m44K78l08J006r99P28o97M54m59
3896a42p67J452j104J352j165Q92l96j051J976k000J022K79m28K43p45K044k065
3913f03o03J448Q4j64q10J479j067N11p64k26J783j053l28m08P22r4R40j929J303
3932B21Q24p65Q2P53q54k27k13l31K93P84q56R5m13L09J431m33l17j224j60P9
3952i22J449j267P09q9J99O7J021l063J243R13J56M70r31lK36o98J071p18K9q29
3972i57J051j221J903j51p30K73j96j86m32J3N01R5j87K53k76M35j358J338l12
3991a44l77O54L19l31q97P22N06Q60o05m65L57j374J106q06M66k76Q31m81O62
4010G27q8j095J103j992K017M00p71m6m0M26j076J025p63J59R51j012J52L23l65
$$ plain form
4029 35 -129 -942 -429 -165 1104 395 -502 728 -98 -246 683 769 606 281 -102 -182 -583 -17 520 -225
4049 -225 -353 581 -465 521 -1 36 -4 1076 29 355 533 -528 -460 -249 -205 502 -662 376 -387
4068 -387 182 -13 272 338 112 408 -427 153 125 -468 202 -425 211 -756 1032 -92 -939 746 -727
4087 -727 245 -64 -281 382 283 148 -1542 -18 -1296 142 1591 -24 497 -940 1108 171 67 57
4105 57 -52 723 101 638 515 996 -478 -32 243 -683 513 8 180 -288 -621 308 -815 473 640
4124 640 1221 -468 -15 569 220 568 -14 -279 540 -900 305 121 1108 630 -874 501 -316 5
4142 5 651 -684 -817 -266 751 -182 149 277 807 1273 -64 -163 441 -468 -400 1163 562 -1278 -1003 -530
4162 -530 852 444 -3 -10 140 504 611 -697 345 -342 841 -79 -695 -886 -595 -419 -114 485 -1326
$$ packed form
4029C5j64q13N13K64J269p09q97J230q26j48R29Q6j63l25l83q0m01N66N37p45
4049b25j28R34j046R86n22L7m0J080j047L26J78j061O8K11M4P07j164J038p63
4068c87N69j95K85O6k26K96q35N80k8n93O70o27O36r67J788j124q47J685j473
4087g27R72l09k17O63r9j35j690J524j278J438J449j615N21j437K048r37j04j0
4105E7j09P75o22N37j23M81j474M46K75r26J196n05J72m68l33R29j123J288J67
4124F40N81j689M53N84l49L48n82k65Q19j440J205j84R87m78j504J375q17L21
4142EO46j335j33N51J017r33L31J28N30M66j337r9O04r09O8J563o01j840K75M73
4162e30J382m08m47pJ50L64J07j308J042o87J183r20o16j91K91J76L05N99j811
$$ plain form
4181 -1326 101 -832 -254 88 -15 243 193 937 -504 -111 609 317 175 528 31 -35 37 -734 444 1145
4201 1145 -339 1546 -665 414 -238 -107 905 -457 -411 288 81 548 -117 -1048 -135 208 611 207
4219 207 752 -187 26 -462 891 -751 -568 45 -1221 74 1006 -59 -481 -348 -495 -807 -541 111
4237 111 683 -18 237 1173 171 587 -1123 415 -566 -732 -389 -767 980 448 560 660 -1289 777
4255 777 -59 -807 349 -237 1704 -616 -563 179 -354 229 66 49 -140 540 -698 -289 75 -65 735
4274 735 252 799 -366 -1172 -84 -783 -422 446 852 -554 -390 606 266 471 -61 908 -167 -411 388
4293 388 -1099 500 -692 596 -182 489 124 -3 1234 -1101 169 19 414 316 -1563 -140 31
4310 31 -1167 -698 -509 -218 -335 370 -89 -94 654 -935 601 316 -1182 -297 -1482 80 -420 -307 -779
$$ packed form
4181a326J427r33N78L42j03K58n0P44j441L93P20k92j42L53m97o6P2p71J178P01
4201A145j484J885k211J079o52J31J012j362M6O99k07M67o65r31R13L43M03m04
4219B07N45r39K13m88J353j642J83O13j266J295R32j065m22J33j47l12K66O52
4237A11N72p01K55R36j002M16j710J538r81j66L43l78J747n32J12J00j949K066
4255G77q36p48J156n86J941k320N3P42n33N83j63j7j89O80j238M09L64j40Q00
4274G35m83N47j165q06J088o99L61Q68M06j406J64R96l40K05n32R69j075k44P99
4293C88j487J599j192J288p78O71l65j27J237k335J270j50L95r8j879J423J71
4310C1j198M69J89K91j17P05m59nP48j589J536k85j498Q85j185J562n00J13m72
$$ plain form
4329 -779 -37 169 204 426 -69 338 256 768 -47 159 -3 -1561 -164 605 -392 -195 -612 52 -20 -288
4349 -288 726 -219 -80 301 -242 -213 209 -320 -1223 446 497 282 241 1570 -331 -265 -1526 644 -234
4368 -234 -438 161 62 239 -61 -214 -141 -115 -755 -1056 -332 -310 441 847 299 993 -31 769 -287 -936 -42
4389 -42 -577 112 -560 -300 426 -144 578 228 372 -1446 -19 -475 -1536 -346 -365 46 -642 -241 612
4408 612 157 262 -92 398 118 454 -665 -748 795 -267 595 -1034 -198 -84 -186 170 -887 262
4426 262 854 193 140 -1118 404 -185 137 1106 -1388 589 -668 -427 -169 -289 1147 -525 999 -316
4444 -316 1013 -801 494 200 -988 113 -60 -284 -518 -344 522 341 60 250 240 -2 -163 -37 -283
4463 -283 109 -281 87 -96 -1000 194 -152 507 -490 675 -117 -319 542 -793 560 -185 -99 -272 355
$$ packed form
4329g79P42K06L5K22m95M07q2N12q15K06j62j558J397P69r97J97m17O64p2k68
4349b88J014r45J39L81n43K9M22n29r03J669N1k15m1J329j901O6j261K170q78
4368b34k04N99r9J77l00j53P3K6o40l01P24K2P51M06n48O94j024Q00j056o49Q94
4389d2n35O89o72K60P26n70P22l50J44j818J427m56j061J190j9M11o88M01Q53
4408F12m55J05l54M90k80L36j119q3J543j062Q62j629Q36J14j02L56j057J149
4426B62N92o61n3j258J522n89L22R69k494J977j257K41K58j20J436j672J524j315
4444c16J329j814J295k94j188J101j73k24k34J74Q66j81k81J90j0k42j61J26k46
4463b83L92l90L68j83r04J194l46O59r97J165p92k02Q61j335J353p45Q6j73O27
$$ plain form
4482 355 772 -507 -732 -1390 -722 391 114 342 -99 287 -283 -87 -1113 -962 485 -567 455 -900
4500 -900 -198 209 -354 297 489 -258 -222 401 -436 -468 626 -1316 564 -418 257 -1492 -86 797 -321
4519 -321 872 271 -697 -151 357 -476 1293 634 364 779 -91 -896 -140 -390 -1024 752 208 -658 120
4538 120 360 -199 -1271 -679 39 728 388 1196 368 -746 661 -665 903 598 -225 -472 -763 232
4556 232 -404 405 -647 578 -461 -225 139 291 -66 -865 654 1503 -1800 108 118 -844 162 -306
4574 -306 -561 -202 229 -452 -190 -364 21 -891 -720 996 -305 -166 -44 -832 -1337 -573 854 215 1257
4593 1257 861 548 -704 -492 530 -692 400 -972 364 541 25 -328 -1286 -676 -515 23 195 -805
4611 -805 -8 -174 532 -90 -303 31 160 -185 -543 -264 80 -600 -277 -777 458 150 -541 796 -717
$$ packed form
4482C55M17j279k25o58O68J113k77K28m41L86n70J96j026J51J447j052J022j355
4500i00P02M07n63O51J92p47L6O23q37l2J094j942J880r82O75j749J406Q83j118
4519c21J193o01r68N46N08q33J769o59k70M15q70q05P56k50o34J776n44q66P78
4538A20K40n59j072N92P18O89l40Q08q28j114J407j326J568l05q23k47k91R95
4556B32o36Q09j052J225j039K36L64J52l57p99J519Q49l303J908J0r62J006m68
4574c06k55L59M31o81K62j74L85r12J71J716j301J39J22p88n05P64J427o39J042
4593A257l96l13j252K12J022j222J092j372J336J77n16l53r58O10J61N38J72j000
4611h05P97j66P06o22k13L34J29l45l58K79L44o80L23n00J235l08o91J337j513
$$ plain form
4630 -717 -688 477 852 -817 -208 -941 -364 17 161 167 741 -585 639 -847 569 -1213 239 1044
4648 1044 -59 1144 -452 -588 -944 324 671 -315 222 417 116 -143 839 139 -313 -172 -418 1448
4666 1448 -711 766 -45 -206 779 -494 -711 -17 -1061 581 320 966 -383 1052 -349 239 611
4683 611 -367 1673 -145 74 -102 212 -277 598 -16 -878 214 -386 -913 631 35 405 352 -181 -215
4702 -215 591 -72 -178 139 -183 293 1043 -359 675 -1765 465 161 426 679 442 663 161 -64 -197
4721 -197 -209 527 207 -216 -138 -480 -323 92 -598 -449 323 -376 297 157 -930 275 -347 293 -405 -582
4741 -582 149 371 834 487 140 105 493 826 413 260 558 661 -484 435 532 -619 -103 -1129 -434 339
4761 339 -490 -416 -659 -193 -91 -477 -720 -99 399 -504 -425 -625 450 -338 755 -162 -1065 766 -1015
$$ packed form
4630g17K9J165L75j669O09p33N77L81J44ON74j326J224j486J416j782J452Q05
4648A044j103J203j596j36l56J268L47r86N37J95l01k59R82p00m52J41k46J866
4666A448k159J477q11j61R85j273k17O94j044J642k61O46j349J435j401N88L72
4683F11r78K040j818K19j76L14m89Q75o14q62J092o00n27J544n96L70n3n33l4
4702b15Q06o63j06L17l22M76P50j402J034k440K230l04K65K53k37K21n02k25j33
4721a97j2P36l20m23P8l42J57M15o90J49P72o99O73j40j087J205o22O40o98j77
4741e82P31K22M63l47l47l5L88L33m13j53K98J03j145R19R7j151N16j026O95P73
4761C39q29P4k43M66J02l86k43O21M98r03P9k00J075p88J093r17r03J831j781
$$ plain form
4780 -1015 -78 -103 592 791 -665 564 334 -129 -967 373 -498 619 354 464 -627 4 811 136
4798 136 -209 837 254 312 -990 265 249 -910 30 -686 145 178 278 1260 -647 -1010 345 -1208 1054
4817 1054 246 216 -1061 1533 718 278 665 214 -83 -98 -112 -582 224 12 -1021 434 -1199 413 -236
4836 -236 638 286 -509 175 -412 -316 33 -276 -1010 -553 -121 -1290 -820 -221 98 806 101 517 -496 795
4856 795 -376 1282 1402 -271 -410 -271 1809 -610 -400 418 -408 401 -1108 275 298 -251 535 -1317
4874 -1317 217 319 -39 -884 313 215 490 1190 533 227 1159 -169 325 0 371 486 -182 393 -341
4893 -341 625 -918 -22 203 585 298 -418 387 -88 -178 -1031 -777 324 -236 -370 -398 802 -328 457
4912 457 1538 572 -163 -56 -46 -144 1548 258 -1222 -194 580 315 -469 374 86 460 303 407 102
$$ packed form
4780a015R37k5O95J99j456J229k30m63q38J340q71J117k65J10j091O31Q07o75
4798A36l45J046n83N8j302J255j6j159R40p16Q31L3J00R82j907l63J355j553K262
4817A054q08l0j277K594q15m40L87m51k97j5j4m70Q06k12j033J455j633J612o49
4836b36Q74l52p95O84n87R6L49l09p34M57M32j169M70N99L19P08p05M16j013J291
4856G95j171J658J20j673j39J39K080k419K10Q18q26Q09j509J383K3n49P86j852
4874a317J534J02l58q45J197r8K75P00o57l06R32j328M94l25L71J15o68N75p34
4893c41R66j543Q96K25L82k87p16Q05m75r0q53K54J101n60j34k8J200j130P85
4912D57J081r66p35J07J0r8J692j290j480J028P74k65p84Q43k88L74j57J04l05
$$ plain form
4931 102 675 146 -281 349 -179 -527 -13 863 -461 187 1150 1012 -562 455 -260 -667 1148 453 -126
4950 -126 194 647 195 -792 -1215 -379 558 667 81 -108 -69 429 -547 -192 -284 46 573 -933 255 -622
4970 -622 406 -505 -338 95 -1333 523 -173 -476 279 -890 833 -9 -603 454 -398 -898 327 37
4988 37 -208 220 -18 106 768 275 -568 -397 394 -223 -6 503 -637 -157 -314 -37 430 76 206 -55
5008 -55 -218 -860 -267 -748 270 265 -479 1112 91 -1606 -599 -553 847 358 27 -581 -19 146 98 186
5028 186 -533 392 178 454 859 -561 492 -1268 286 867 -600 722 607 353 -112 639 781 -261
5046 -261 884 -595 -267 -572 -429 -82 -1002 7 -459 573 -1239 21 128 -625 -34 -1155 1397
5063 1397 317 420 -161 437 -415 -620 912 530 -703 -332 -1022 -300 -1155 505 -719 636 -287 389
$$ packed form
4931A02N73n29m27O30n28l48N14Q76j324O48R63j38j574J017p15m07J815o95n79
4950a26L20M53m52r87m23Q36R37J09n86j89L9M98r76L55r2L30N27j506J188q77
4970f22J028r11J67M33j428J856o96l03P55j169J723q42n94J057q52n00J225k90
4988C7k45M28k38J24O62m93q43J71P91o17K17N09j140M80j57K77M67l54J30k61
5008e5j63o42N93m81J018np44J591j021j697J007M6J400m89l31o08N62J65m8Q8
5028A86p19R25k14K76M05j420J053j760J554N81j467J322j15k54m65P51J42j042
5046b61J145j479L28l05J43L47r20J009m66J032j812J260J07p53N91j121K552
5063A397j080J03n81N98q52k05J532l82j233L71o90P22q55J660j224J355r23O76
$$ plain form
5081 389 -601 322 437 75 598 -196 -407 227 -705 -359 -564 431 848 -231 603 -129 1100 577 -449
5100 -449 1057 -196 377 305 212 517 964 694 -37 -252 -170 504 390 -899 844 -633 596 -335 -37
5119 -37 344 799 93 -45 343 -139 -347 1017 -395 -289 -461 62 662 369 275 -933 723 -90 323
5138 323 -220 1258 -592 -512 -54 -1084 581 -652 -206 165 -262 1081 -254 308 8 198 119 -598
5156 -598 956 261 455 105 -347 261 -563 380 -1165 657 419 101 581 -355 1007 -757 -780 -98 264
5175 264 229 718 551 -432 899 505 -717 -55 30 19 -95 -943 436 527 -56 -697 -230 249 107 -374
5195 -374 730 -110 88 -537 727 -23 677 -196 -225 526 1594 -673 -897 331 863 441 -1074 -32
5213 -32 769 -34 291 -453 30 -39 -115 -832 191 -179 -501 -166 -871 599 27 174 323 -1433 -988 -399
$$ packed form
5081C89r90R23J15l62N23p94k11O34r32L46k05R95M17j079Q34p32J229n23j026
5100d49J506j253N73p2r3L05M47k70p31k15Q2O74j14j289J743j477J229r31K98
5119c7L81M55p06j38L88m82k08J364j412J06j72N23O00k93r4j208J656q13M13
5138C23n43J478j850Q0M58j030J665j233M46L71m27J343j335N62l00J90p9p17
5156e98J554o95J94l50m52O08q24R43j545J822k38l18M80r36J362j764k3O82L62
5175B64l5M89j67r83J331l94j222O62Q5j1j14q48J379R1n83o41M67M79j42m81
5195c74J104q40J98o25J264p50P00q73k9P51J068k267k24J228N32m22j515J042
5213c2Q01q03L25p44M83o9p6p17J023l70l22L35p05J470n72J47J49j756M45N89
$$ plain form
5233 -399 -150 743 -980 1496 -401 459 -94 103 371 -276 1155 -488 -446 -393 62 315 -431 1183 -915
5252 -915 793 -28 383 -324 -358 26 -178 -31 -688 -1069 1577 897 1144 -198 -310 650 110 -354 -917
5271 -917 1634 1241 182 4 -238 131 170 454 -1095 -215 -592 -252 368 93 69 419 -718 6 -1118
5290 -1118 174 -1188 511 -151 -308 242 -116 -315 -246 -655 299 -589 -54 309 -125 -510 753 998 -194
5309 -194 967 -586 393 596 1254 49 76 579 -1234 42 1167 -452 825 -1066 1280 477 -40
5326 -40 -31 -187 50 477 -349 49 796 79 -765 623 424 1507 717 251 513 -969 349 -445 504 -542
5346 -542 -839 -179 523 463 356 -66 -623 599 463 -6 -286 -775 315 -399 257 -356 -1271 -442 -277 1056
5366 1056 -117 342 -73 -84 946 378 881 19 -260 -441 -94 314 587 85 394 155 554 -766 1761
$$ packed form
5233c99K49Q93j723K476j897Q60n53J97K68o47J431j643M2N3M55K53p46J614k098
5252i15J708q21M11p07l4L84k04J47o57l81K646o80K47j342j12R60n40m64n63
5271i17K551l93j059j78k42L69L9K84j549Q80l77L40O20k75k4L50j137P24j124
5290a118J292j362J699o62j57N50l58j99O9m09R54q88N35L63m34l85J263K45j192
5309a94J161j553R79K03O58j205K7N03j813J276J125j619J277j891K346q03n17
5326d0Rj56K37M27q26L98P47p17q44J388j99J083p90m66K62j482J318p94R49j046
5346e42k97O60P02o0j07m22n57J222j36m69k80m89J090p14O56o13r15Q29J65J333
5366A056j173M59m15j1J030n68N03q62k79j81L47M08K73n02L09k39L99j320K527
$$ plain form
5385 1761 144 -161 -307 995 469 -1200 444 -845 -894 210 467 752 -417 597 -694 -606 356
5402 356 96 1073 -150 -686 127 149 144 -303 425 200 626 -576 -388 -514 -75 -118 -324 227 641 -192 241
5423 241 -531 1566 -349 -241 -45 523 702 -602 145 -396 1538 -157 -140 621 106 508 173 905 -326
5442 -326 833 321 -186 -84 3 317 -712 311 1 -740 785 -167 624 -586 134 -251 277 2242
5460 2242 1139 455 -374 -169 -342 -475 515 -67 179 -88 491 509 -631 1002 960 -820 -390 648 120
5479 120 474 80 -995 272 -167 -456 -410 96 -552 172 373 -1122 -1123 942 -371 -224 -285 241 -705 29
5499 29 1273 -663 -572 570 -187 443 725 -652 499 955 365 -749 116 -699 537 -1119 -209 960
5517 960 -799 -566 -98 -61 -950 -79 -1044 -690 268 -134 109 -862 -516 523 -786 587 -1343 285
$$ packed form
5385A761j617l05j46J302n26j669J644j289m9J104K57K85j169J014j291Q8R62
5402C56k60R77j223n36Q13K2nm47P28k25M26j202J88j26M39m3k06N51M14q33M33
5423B41p72K097j915J08J96N68J79j304P47n41J934j695J7P61n15M02l35P32j231
5442c26J159n12n07J02Q7L14j029J023l10p41J525r52P91j210P20l85N28J965
5460B242j103o84q29K05j73j33R90n82K46k67N79J8j140J633m2j780M30J038n28
5479A20L54l94j075J267m39k89M6N06o48P24K01j495jK065j313J47o1N26r46P34
5499B9J244j936R1J142p57O30K82j377J151M56n90j114Q65q15J236j656R10J169
5517I60j759K33M68L7q89Q71r65L54R58m02K43r71L46J039j309J373j930J628
$$ plain form
5535 285 868 232 -1023 -291 1201 -1736 207 279 353 445 -980 247 176 540 540 212 252 269 102 -802 1278
5556 1278 -28 -152 552 -447 -647 -320 -291 90 44 1068 -411 67 125 971 654 -404 180 -394 -832
5575 -832 -628 -222 -815 -339 894 -181 395 141 241 -482 134 1074 -203 -164 -1220 75 -256 -1104 -670
5594 -670 355 401 -436 -156 -267 -136 24 -472 529 477 25 241 37 -691 616 553 233 523 -484 448
5614 448 -173 -94 -447 515 -937 432 -1401 -649 156 -505 502 -385 73 -379 271 -210 842 851 -1262
5633 -1262 518 -934 1473 -126 251 -296 -515 1107 -594 -276 128 -119 262 -821 963 -255 505
5650 505 -151 -725 304 -529 1300 -58 215 -132 106 96 628 -658 -598 -45 -113 -579 333 -650 198 -1111
5670 -1111 804 -853 -950 799 -284 294 -662 -103 228 122 519 900 -222 -156 -732 25 84 -573 -479
$$ packed form
5535B85N83o36j255P32J492k937J943P2P4R2j425J227p1L64%l28M0J7j67r04K080
5556A278j306j24P04r99k00L27K9L81m6J024j479M78N8Q46l17j058N84n74m38
5575h32K04M06n93M76J233j075N76k54J00p23O16R40j277L9j056J295l31q48M34
5594f70J025M6q37K80j11J31J60m96J001n2m52K16k04p28J307o3l20K90j007R32
5614D48o21P9l53R62j452J369j833P52Q05o61J007q87M58m52O50m81J052Rk113
5633a262J780j452K407j599L77n47k19J622j701L18M04k47L81j083J784j218P60
5650E05o56n74J029q33J829j358K73l47K38j0N32j286O0N53o8m66R12r83Q48j309
5670a111J915j657r7J749j083N78r56N59L31j06L97L81j122O6n76P57N9o57R4
$$ plain form
5689 -479 307 -58 692 463 201 357 -17 986 747 129 57 983 705 17 -505 -40 82 450 -352 1039
5709 1039 70 -586 167 -1020 147 -449 859 -102 1020 -812 200 690 -221 962 -188 320 -786
5726 -786 51 769 -354 883 500 -229 673 561 428 -288 318 260 237 1039 -207 350 144 195 -1604 -268
5746 -268 324 103 -489 667 -319 365 -46 9 -1051 860 202 554 660 -25 -401 -1459 513 -862
5764 -862 -59 -527 -609 213 164 -205 -457 -90 432 462 -453 -129 872 140 -60 -9 -168 461 458 -320 30 731
5786 731 653 -1387 1221 -1207 -401 23 -178 -156 -232 495 561 -514 207 584 707 341 186 -352 296 -145
5806 -145 -361 69 -56 824 592 53 1151 -248 137 -2087 697 -487 198 -44 -546 1099 -1137 -827
5824 -827 -572 -339 380 -1544 -705 -77 415 114 -1105 112 -638 611 -750 574 -1188 79 -511
$$ packed form
5689d79P86l65P50k29k62J56l74J003k39o18p2R26k78o88n22M65J22L68q02J391
5709A039r69o56P53j187J167n96J308r61J122j832J012M90r11J183j150N08j106
5726g86Q37P18j123J237l83p29R02j12j33p16O06n8k3Q02j246N57k06N1j799J336
5746b68N92k21n92J156r86O84m11N5j060J911o58L52J06o85l76j058J972j375
5764h62Q03m68q2Q22m9l69k52L67N22L0r15L24J001p32k00N1j59O29lp78L50P01
5786G31p8k040K608k428Q06M24k01K2p6P27O6j075P21L77J23l66j55n38O48m41
5806a45k16M30j25Q80k32n39J098j399L85k224K784j184O85k42n02J645k236L10
5824h27K55K33P19j924Q39O28M92l01j219J217p50J249j361J324j762J267n90
$$ plain form
5841 -511 350 293 -100 -10 -573 -681 -10 938 1117 574 217 326 366 25 -1337 671 -456 209 -177 -204
5861 -204 713 202 550 -163 -659 766 117 563 -77 460 -737 -270 -423 -580 -180 -1258 877 -248
5879 -248 -628 367 -569 -4 568 1309 -330 -200 -290 -759 45 -887 247 482 -450 638 -593 170 -734
5898 -734 907 165 615 16 -626 -24 -768 -101 -766 351 692 13 -344 -55 243 158 81 221 262 -172
5918 -172 -125 1066 115 -335 299 -1017 334 -487 17 830 -586 684 -537 557 -56 -109 -335 -237 383
5937 383 -424 -23 500 -27 -275 -628 -1353 188 -5 -563 -37 -170 -377 402 -19 564 344 145 454 -1265
5957 -1265 898 -503 186 -26 -176 957 -460 -326 70 -373 509 689 409 -42 77 94 -42 630 -229
5976 -229 241 1383 -191 -584 -92 1036 77 649 -370 -131 -104 250 509 216 265 -715 -915 -176 205
$$ packed form
5841e11Q61n7l93R0n63j08O71R48J79n43l57J09M0l41j362K008j127O65l86k7
5861b04R17n11L48p13m96J425o49M46o40N37j197M67j53j57M00j078K135j125
5879b48l80R95r36N65N72P41j639J30r0m69Q04r32J134K35r32J088j231P63r04
5898g34J641p42M50n99o42O02p44O67o65J117L41o79l57K89K98q5p7J40M1m34
5918a72M7J191r51m50O34j316J351q21N04Q13j416J270j221J094o13n3k26R8O20
5937C83q07M01N23n27k48l53p25J541j93n58N26j33k07P79m21N83k20j99L09j719
5957a265K163j401O89k12j50J133j417J34L96m43Q82J80k80m51J19J7j36O72q59
5976b29M70J142j574l93M92J128r59N72j019K39K7L54K59k93M9r80k00P39L81
$$ plain form
5995 205 404 -134 10 731 1240 -124 -458 30 -651 768 -734 -579 566 -1403 -294 248 525 -746
6013 -746 -89 411 -125 -25 -668 1071 -413 -262 1179 -1409 94 -539 -174 -432 1418 126 -999
6030 -999 673 -1035 477 -997 -773 648 -112 117 -1242 86 -198 24 27 -474 -337 590 350 -211
6048 -211 -63 -817 683 1066 104 -28 239 375 282 -423 115 -169 98 -130 -351 -240 -898 250 877 3
6068 3 -429 735 -407 312 630 -25 -101 236 -227 278 -310 447 208 493 839 -377 1030 -219 398
6087 398 -1159 586 533 178 -179 -616 -390 -533 -786 -593 123 -438 -23 368 34 912 1777 201 -858
6106 -858 -445 174 645 204 767 435 77 -530 185 44 705 -4 -324 167 -981 -98 29 -479 292 -1120
6126 -1120 151 -170 -1473 285 -205 288 -1210 1637 -451 794 268 -360 -491 -861 -381 324 518
$$ packed form
5995B05J99n38J44P21N09j364l34M88o81J419j502J55J145j969J109N42K77j271
6013g46O57N00n36J00o43J739j484J51J441k588J503o33L65k58J850j292j125
6030i99J672j708J512j474K24J421p60K29j359J328k84K22Ln01J37R27k40n61
6048b11J48p54J500L83r62j32K67J36r3p05N38k84K67k28k21J11o58J148O27q74
6068Cm32J164j142P19L18o55p6L37m63N05n88P57k39K85L46j216J407j249O17
6087C98j557J745n3l55l57m37K26j43k53J93P16n61M15L91l34Q78Q65j576j059
6106h58M13O19M71m41N63l32l58o07P15j41O61p09l20M91j148Q83J27n08P71j412
6126a120J271l21j303J758m90M93j498K847k088J245n26o28j31l70M80P05J94
$$ plain form
6143 518 -115 -392 1247 516 -173 157 -474 -305 31 -677 468 -696 -763 373 302 -126 -252 696 -496
6162 -496 91 -474 42 -689 242 -82 161 -45 -381 436 -1078 114 -679 740 289 -1350 157 -912
6180 -912 251 597 -365 583 126 106 562 560 317 199 -536 -573 927 236 172 -773 -375 497 104 817 156
6201 156 731 591 -117 77 -644 944 20 -356 276 -396 -753 42 -343 -447 106 -270 -83 285 425 -718
6221 -718 -579 257 -100 -240 1073 -354 689 219 -1111 951 -1492 -287 68 -196 -565 -430 1338
6238 1338 -482 1024 744 510 682 -640 1396 339 386 -136 -504 -148 -542 702 -503 -162 4 214
6256 214 -1539 -121 -147 15 583 -77 662 104 -407 -252 296 -316 721 -454 1233 -553 31 -535
6274 -535 -106 -168 -350 404 -504 -161 226 431 17 -502 184 -270 291 -88 -1048 -98 -846 191 -1124 169
$$ packed form
6143E18o33k77J639p31o89L30o31J69L36p08J145j164o7J136p1m28j26R48j192
6162d96N87n65N16p31R31l24K43k06l36Q17j514J192p93J419m51j639J507j069
6180i12J163L46r62R48m57k0M56kk43j18p35l7J500o91o4r45L98Q72l93P13o61
6201A56N75j40p08J94p21J588r24l76O32o72l57P95l85j04N53l76J87L68J40j143
6221g18J39Q36l57j40J313j427J043m70j330K062k443J205L55k64l69J35J768
6238A338j820J506k80k34J72j322K036j057M7n22l68L56l94J244j205L41J66K10
6256B14j753J418k6J62N68o60P39n58n11J55N48o12J037j175J687j786N84n66
6274e35M29o2j82P54r08L43L87K05m14n19O86m54N61l79r60R50p48J037j315J293
$$ plain form
6294 169 -179 -50 331 -126 1124 111 142 304 100 31 -979 -292 -653 857 -455 532 -75 -1417 443
6313 443 -134 971 469 80 -38 -80 1057 -773 -440 -615 1101 728 309 -129 -1255 409 235 -78
6331 -78 265 -29 50 -413 696 -144 43 -155 -264 136 -639 809 346 559 -418 -134 732 -419 -503 549
6351 549 358 475 -413 431 1047 -105 11 -368 325 -132 313 80 -417 -262 -855 1078 666 1184 505
6370 505 -317 73 -204 838 -189 -163 -400 -15 337 -487 -495 -698 45 843 -426 124 -195 506 -1191 -361
6390 -361 -1259 -322 -21 -357 146 186 -113 -741 -589 122 -294 -350 -609 337 -59 -941 -462 -953 -84 -362 594
6411 594 341 485 -575 -588 763 -161 -190 119 -860 -211 -671 -567 165 52 -82 832 1324 57 821 -939
6431 -939 -65 -108 108 37 -712 98 -788 -483 -196 -88 822 -456 -519 -85 -169 397 -104 600 603 -450 84
$$ packed form
6294A69l48J29L81m57J250j013L1J62k04o9j010O87l61J510j312R87o07j342J860
6313D43n77J105n02l89j18m2J137j830L33j75J716l73m19m38j126J664j74l13
6331g8L43k94P9m63J109q40J87j98j09M00p75J448m63K13r77K84Q66j151q4J052
6351E49j91J17q88Q44O16j152J16l79O93m57M45k33m97J55n93J933m12N18o79
6370E05q22L90k77J042j027K6k37L85L52q24qk03P43P98j269N50l19P01j697Q30
6390c61q98R37L01l36N03M0k99o28J52P11m16n6k59R46l96q82M79m91Q69k78R56
6411E94k53J44j060j3J351r24k9L09r79O49m60J04P32j13j34R14M92j267P64j760
6431i39Q74m3K16p1p49Q10q86L05K87J08R10j278o3M34q4N66n01P04Lj053N34
$$ plain form
6452 84 -106 -57 -638 -275 -364 -106 893 -89 925 -123 1258 -230 -644 647 -22 1058 381 519 454
6471 454 217 -313 290 -183 457 1167 -150 -335 845 -504 957 254 186 291 138 59 -1594 910 -1616
6490 -1616 638 505 -1152 1060 -973 -624 -637 -331 246 218 34 -971 137 -3 -430 -486 -1117 1579
6508 1579 -1440 805 272 309 279 274 -184 -221 -581 -53 182 692 -192 613 -1048 673 -1090 -38 184
6527 184 -495 463 -648 927 -712 -937 384 -548 854 -1256 714 191 -523 -228 -1374 198 75
6544 75 72 566 111 -878 400 1373 527 -455 -469 -891 -106 -593 522 431 377 -513 402 -179 38 500 633
6565 633 65 66 332 -425 -971 530 -1176 -30 760 -223 761 -177 -44 544 537 290 -3 734 -572 904
6585 904 -186 -1123 387 -279 742 -559 233 394 76 562 -301 126 211 768 927 180 -52 -870 1261
$$ packed form
6452H4j90M9n81L63q9K58R99r82J014j048J381j488m14J291o69J080o77J38o5
6471D54k37n30O03m73O40P10j317j85J180j349J461p03o8J05j53p9j653K504k526
6490a616K254j33j657K212k033L49j3L06N77k8j84j005J108j40m27n6o31K696
6508A579l019K245n33L7l0nm58l7l60N28K35N10q84Q05j661J721j763J052K22
6527A84o79R58j111J575j639k25J321r32J402k110J970n23p14K95j146J572j23
6544G5lM94m55r89J278R73q46r82j4m22P85m87J115r1n4q90R15n81K17M62J33
6565F33n68JK66p57n46J501j706J146P90r83R84r38J33N88pk47k93P37j306J476
6585I04j090r37J510o66J021j301P92J61l18M86q63M27Q5N57J59p47k32q18K131
$$ plain form
6604 1261 563 511 -361 116 412 -589 -576 -630 280 -462 -88 994 467 11 -168 -212 1084 -334 -249 273
6624 273 393 -4 524 -436 77 739 -574 243 -14 -212 312 -1173 -508 209 175 800 -129 -275 -590 422
6644 422 315 -730 645 -48 157 -740 25 -433 398 85 1231 -95 69 -877 29 673 -979 646
6662 646 849 466 -152 -1090 -1248 594 -558 252 -403 317 775 229 -784 -322 582 100 802 -69 -456
6681 -456 55 554 -148 -247 146 181 525 444 274 -781 -717 -637 351 -161 -25 173 447 -112 -13 -36 -478 -166
6703 -166 -1035 1384 -777 358 -987 118 661 -880 -311 -865 -21 -420 510 -452 12 466 -190 -244
6721 -244 548 -369 163 166 -1047 -458 158 -441 -251 119 -59 -307 390 -418 170 -665 -525 -383 -1080 687
6741 687 -73 -960 -340 671 -73 357 1057 46 809 -617 268 41 451 -730 -731 239 -970 68 -783
$$ packed form
6604A261o98n2q72M77K96j001J3n4R10p42L74J082n27m56j79m4J296j418Q5N22
6624B73J20l97N28r60N13O62j313Q17k57j98N24j485O65P17l4O25r29j46l15J012
6644D22j07j045J375o93K05q97P65m58Q31l13J146j326J64r46R06O44j652J625
6662F46K03l83o18r38j58J842j152Q10o55P20M58n46j013M62R04m82P02q71l87
6681d56N11M99p02r9L93L5L44q1j70j055O4Q0R88n12J36J98K74n59R9k3m42L12
6703a66q69K419k161J135j345J105N43j541N69n54Q44l99R30r62M64M54o56n4
6721b44P92r17N32Lj213N89O16n99J90L70j78k48O97q08N88q35J40J42o97J767
6741F87p60q87O20J011p44M30P00j011P63j426Q85k27M10j181jR70j209J038q51
$$ plain form
6760 -783 177 -906 -451 633 -44 -530 -1005 -185 -627 176 227 -731 402 -1312 198 391 -466 1270
6778 1270 -211 428 -93 -151 1084 -1319 145 -745 -357 413 979 -92 -700 719 492 -204 -255 1260
6796 1260 714 -752 214 -723 2 -377 -933 733 -507 1223 -521 241 -748 572 422 -387 -281 -303
6814 -303 977 -274 -174 483 977 390 919 -388 100 -115 838 -714 -829 520 409 513 -727 19
6832 19 217 358 -36 119 249 -1112 292 -669 -513 342 -1695 494 -1077 222 -38 329 158 37
6850 37 -291 -948 959 187 -271 -388 -666 -6 -454 -248 -361 60 508 -453 381 -709 326 -757 332
6869 332 311 -439 617 -124 -57 96 -340 1023 134 35 -521 269 -582 -199 547 274 1510 -772 387
6888 387 -775 645 998 -250 535 -619 -228 125 -246 731 255 418 -401 174 410 18 -650 -441 788
$$ packed form
6760g83R60j083M55J084o77m86m75Q20m42Q03N1r58J133j714J510J93q57J736
6778A270j481O39n21n8J235k403J464q90L88P70N66j071o08J419k27o96n1J515
6796A260n46j466R66r37P25l79n56J666j240J730j744P62r89J320j50q09J06k2
6814c03J280j251J00O57M94n87N29j307M88k15R53j552j15J349j11J04j240P46
6832A9J98J41l94J55J30j361J404r61J56Q55k037K189j571J299k60L67j71j21
6850C7l28o57J907p72m58j17k78O60m48K06j13M21M48r61Q34j090J035j083J089
6869C32k1p50J056p41O7J53m36J363q89r9n56P90q51L83P46k73J236k282J159
6888C87j162J420L53j248P85j154L91L53l71R77m76J63q19N75K36l92o68K09J229
$$ plain form
6907 788 -661 47 49 -969 255 1 340 -1012 1173 -175 -576 1088 -622 537 -635 -295 529
6924 529 449 692 555 -261 700 -773 -612 -24 336 -313 1457 207 -84 530 224 342 2 448 -333
6943 -333 -115 320 76 650 -663 -730 264 -282 310 -450 154 -611 809 -500 -568 -182 306 -1093 272
6962 272 70 166 587 1808 606 -468 63 193 1026 -114 10 -784 553 177 -125 342 -979 576
6980 576 -14 -551 596 -82 386 468 326 -378 672 -344 98 900 109 1351 -109 981 -417 233
6998 233 1180 -685 63 295 178 537 21 47 -12 122 450 -574 417 -619 733 -318 421 1589 735
7017 735 829 1402 305 -768 772 -316 288 -348 -327 1197 551 311 -486 -962 -80 114 416 438 -31
7036 -31 -212 -685 -36 12 -173 706 404 -151 -856 507 -245 -89 20 545 672 306 544 -287 606 -310
$$ packed form
6907G88j449P08Kj018J224k54L39j352K185j348m01J664j710J159j172L40Q24
6924E29q0K43j37q16R61j473J61N88L60o49J770j250k91O14l06J18l40M46p81
6943c33K18M35k44N74j313o7R94n46N92p60O04p65J420j309o8L86M88j399J365
6962B72k02R6M21J221j202j074N31J30Q33j140J24p94J337l76l02M67j321J555
6980E76n90n37J147o78M68Q2j42p04J050j016M42Q02p91J242j460J090j398O50
6998B33R47j865P48K32j17L59n16K6n9J34L28j024R91j036J352j051P39J168q54
7017G35R4N73j097j073J540j088O04o36K1J524o46k40p97m76Q82J94L02K2m69
7036c1j81m73O49M8j85Q79l02n55p05J363p52J56J09N25J27l66K38q31Q93r16
$$ plain form
7056 -310 -855 1054 -246 29 920 -609 -49 -380 1284 -316 892 984 -55 -355 -34 329 -263 396
7074 396 -185 767 633 369 181 -191 -461 288 686 -135 -1120 136 -331 301 276 661 424 -157 1460 -207
7094 -207 252 423 530 163 515 329 -508 -482 -96 769 -9 -381 220 -2038 456 608 77 -121 -188 308
7114 308 -89 559 -75 383 -104 150 816 -465 321 -338 -1501 -427 -255 503 72 -405 -177 483 855
7133 855 -201 444 1196 -95 -284 89 346 454 324 -35 -616 278 42 -465 -165 561 194 83 189
7152 189 -603 -266 7 -886 932 131 -164 -602 -634 -244 611 841 837 257 352 1252 -647 55 -159 321 517
7173 517 -788 737 -294 1099 -1112 -279 -109 -711 148 -531 -452 987 52 529 305 505 15 -250
7191 -250 -639 939 924 -468 926 302 -215 -531 -1197 -71 -85 455 -389 899 522 294 612 -739 309
$$ packed form
7056c10n45J909j300K75Q91j529N60l31J664j600J208R2j039l00L21L63n92O59
7074C96n81R52j34k64j88l72k70P49L98q21r85J256m67O32k5L85k37n81J617j667
7094b07M59J71J07l67L52j86q37K6L86Q65p78l72O01k258K494J52n31j98o7M96
7114C08l97O48o34M58m87K54O66j281P86o59j163J074J72P58m31m77K28O60L72
7133H55j056O45P52j291j89L73K57J08j30l59n81Q94k36n07L00P26l67j11J06
7152A89p92L37K73q93J818q01k95m38l2L90Q55K30mn80R5R00j899P02k14M80J96
7173E17j305J525j031J393k211Q33J70o02Q59o79P9J439r35M77k24K00m90k65
7191b50l89J578j5j392J394o24n17l16o66J126j4N40q44J288l77k28L18j351J048
$$ plain form
7210 309 -643 100 -242 468 -546 78 168 -90 227 168 -830 555 701 -756 685 -319 -382 -772 193
7229 193 452 -263 98 -330 -182 226 -556 -495 -407 -495 -33 -38 -1035 -100 344 341 463 -710 402 133 -552 399
7251 399 38 317 -459 453 -921 815 -478 -762 -1323 -859 641 228 851 -486 -185 639 -203 1432
7269 1432 -577 880 -173 465 818 16 625 -561 666 -499 452 -908 -921 -160 48 947 -1245
7286 -1245 117 623 148 361 -6 -183 -690 -126 972 192 -206 354 343 -862 -26 -123 592 -1222 126
7305 126 174 707 -688 -142 -486 -399 22 -1006 31 2 819 -283 800 137 179 984 452 -557 -408
7324 -408 -231 -304 -320 265 -481 75 -987 602 -561 -209 744 -1105 1375 1225 -553 317 100 -225 -441
7343 -441 602 300 1007 -405 -2 516 -752 1213 839 426 819 -105 713 -268 496 596 -552 -230
$$ packed form
7210C09r52P43l42P10j014O24R0k58L17n9r98J385J46j457J441j004o3l90R65
7229A93K59p15L61m28J48M08p82O1Q8q8M62nr97R35M44lJ22j173J112k69o85R51
7251C99l61K79p76R12j374J736j293k84n61M64J500m13O23j337L01Q24q42J635
7269A432k009J457j053O38L53q02O09j186J227j165R51j360j3P61K08Q99k192
7286a245J362N06m75K13l67j77n07N64J098p80l98N60j1j205Q36r7P15j814J348
7305A26M8N33j395N46l44Q7M21j028J037k9Q17j102J083o63M2Q05n32j009J49
7324d08J77p3j6N85p46N56j062J589j163L52R53j849K480j50j778Q70k17l25k16
7343d41J043l02P07j412M03N18j268J965l74m13L93r24Q18r81P64J00j148L22
$$ plain form
7361 -230 -372 -52 -995 -45 -472 99 -780 -1720 337 -321 -71 -434 584 -144 -161 160 -70 1339 248
7380 248 121 235 92 -479 91 -610 670 523 -447 -548 708 -749 -192 57 -597 -423 758 -238 -1179
7399 -1179 770 533 -868 -191 459 95 125 -51 1184 -115 -925 -112 359 -453 764 511 -349 69
7417 69 221 459 -126 -326 550 -1519 36 -262 -907 960 61 -566 -396 -386 151 -80 -378 -264 295 -761
7437 -761 303 -32 -221 304 -284 198 -1747 -17 -1079 676 263 -643 -463 -13 -85 170 -240 -435 -918
7456 -918 520 -232 184 -675 114 -518 471 324 49 832 -538 129 -781 -1124 538 -213 1061 360 10
7475 10 -44 -333 -447 -401 128 -50 757 39 -901 502 308 -26 -607 -436 -767 -1442 -71 -711 -615 361 -322
7496 -322 444 -208 -7 -548 297 134 3 857 42 193 -29 612 187 -73 469 -641 430 339 -39 497
$$ packed form
7361b30j42L20r43R50m27N71q79r40K057o58K50l63J018p28j7L21k30J409j091
7380B48j27J14j43n71N70p01J280j47r70j01J256j457N57K49o54J74J181r96r41
7399a179J949k37j401O77O50l64L0j76J235j299q10Q13M71q12J217k53q60M18
7417F9J52K38n85k00Q76k069J555k98o45J867q99o27J70J0N37k31k98J14N59j056
7437g61J064l35j89N25n88M82j945J730j062J755m13r06J80M50p2K55m10j95m83
7456i18J438p52M16q59P89o32R89j47k75P83j370O67r10l43J662p51J274p01l50
7475A0n4k89j14M6N29j78Q07p18r40J403j94l34n81J71l31o75J371o40R6R76o83
7496c22P66o52K01n41Q45j63j31Q54q15J51k22O41m25k60N42j110J071r1l78N36
$$ plain form
7516 497 -132 -92 -246 247 -307 -74 24 -496 -156 -799 701 -366 -852 772 -26 445 -390 371 -9 -767
7536 -767 1270 -1176 919 -348 24 66 -304 927 -1083 -1163 -79 205 -689 -1071 80 414 -282 -270
7554 -270 5 -503 850 147 -1282 1511 626 52 166 -1253 -670 -797 229 -46 283 -352 -712 1848
7572 1848 -115 485 628 545 -39 -138 -315 -586 1302 -284 266 158 -355 409 429 464 223 -100 247 139
7592 139 1041 -169 -253 -28 491 519 -712 -588 -1082 21 -529 -1193 287 -954 -186 -61 169 -1019 -640
7611 -640 68 -815 260 -48 -418 499 114 -33 172 -464 -382 167 534 -513 549 299 -988 672 518
7630 518 371 114 233 595 -54 247 -586 699 549 -78 1103 554 -209 266 873 -683 158 710 672
7649 672 -169 -356 463 -173 564 -66 -105 342 -225 910 201 -154 -605 -272 -378 -376 -232 -160 330 -148 488
$$ packed form
7516D97o29M0j54M93n54K33R8n20L40o43J500j067m86J624p98M71q35P61l80p58
7536g67K037k446K095j267L72M2l70J231k010q0J084K84q94l82J151L34o96J2
7554b70K75n08J353p03j429K793q85n74J14j419N83j27J026k75L29o35l60K560
7572A848j963O00J43q3n84r9j77k71J888j586N50j08n13P64K0L5k41l23L47j08
7592A39R02j210q4K25N19K8j231J24m94J103n50o64J480j241P68J25K30j188L79
7611f40P08q83J075l08l70R17l85j47K05o36Q2N49L67j047J062k50j287J660j54
7630E18j47k57J19L62o49L01q33J285j50o27J181n49p63M75O07j556Q41N52l8
7649F72q41j87Q19o36P37o30l9M47n67J135p09l55m51L33j06KJ44P2M90m78O36
$$ plain form
7670 488 -320 841 801 -858 633 -86 7 399 -216 526 -622 1318 -754 907 76 -761 -301 -680
7688 -680 408 -65 -93 743 -65 590 -609 878 1006 406 44 -172 -707 -1134 -404 36 745 152 -1488
7707 -1488 145 180 -77 508 -9 278 -522 718 523 -312 -295 54 277 -782 -680 452 -456 1229 -184
7726 -184 992 -559 556 -230 -733 141 -382 892 -1464 -263 -54 -1095 -574 -795 -231 800 551
7743 551 -483 -312 696 215 -175 -524 333 -509 -319 -333 212 1321 -621 -249 -400 -218 516 670 -237
7762 -237 -968 -327 -263 -210 946 112 -863 -189 -491 403 -53 1134 267 -192 -623 172 138 -304 336 -178
7782 -178 -463 -199 -431 -57 -933 1087 -147 218 -305 287 -585 -638 -104 -710 -13 5 -652 -228 -263 46
7802 46 -106 -521 -376 929 -171 795 -634 -195 -127 1029 147 791 -404 227 -351 -77 794 -1544 390
$$ packed form
7670D88q08J161m0j659J491p19R3L92o15P42j148J940k072J661q31q37M60l79
7688f80J088m73k8Q36q08O55j199J487J28o00l62k16n35m27P30M40P09n93j640
7707a488J633L5k57N85n17K87q00J240j95q35J7L49K23j059J02J132r08J685j413
7726a84J176j551J115p86n03Q74n23J274k356J201K09j041N21k21N64J031k49
7743E51j034J71J008m81l90l49Q57q42J90j4N45J109j942L72j51J82P34J54r07
7762b37p31O41O4N3J156q34r75O74l02Q94m56J187q67m59m31P95l4m42O40n14
7782a78k85K64k32L74q76K020j234L65n23N92q72n3N34o06O97J8o57M24l5L09
7802D6j52m15J45J305j100R66j429M39O8J156q82O44j195O31n78K74Q71k338J934
$$ plain form
7821 390 673 30 -460 -425 103 -390 821 -235 652 -375 -272 532 36 -405 -453 132 -110 -6 31 -493
7841 -493 280 49 901 465 -484 307 228 506 -369 326 303 -383 -199 -723 177 -325 -302 -1244 410 164 -102
7862 -102 -79 361 -598 -657 -145 995 -569 -224 -119 -428 826 -346 410 -516 744 -399 -330 1083 -463
7881 -463 447 405 1016 -212 -462 -150 1165 243 370 797 305 1107 -850 50 1319 -662 -148 -808 -176
7900 -176 -49 -368 -760 -265 426 633 -551 938 136 -92 239 -594 60 -816 526 -599 264 248 -476
7919 -476 -273 -1085 14 -289 804 387 155 415 -1292 126 -934 741 -694 -944 1388 -718 529
7936 529 -293 -48 484 188 -250 -983 796 85 367 9 -363 621 -204 383 -1193 -701 -249 -259 554 -905
7956 -905 -50 -488 -322 -385 -1216 558 149 226 344 375 -251 434 -894 -1095 902 557 -216 580 164 856
$$ packed form
7821C90K83o43m90L5N28m93J211j056Q87j027J03Q04m96m41m8N85k42J04L7n24
7841d93P73k31Q52m36r49P91p9K78q75O95k3o86J84n24R00n02K3r42J654k46k66
7862a02K3M40r59n9N12J140j564L45J05l09J254j172P56r26J260j143O9J413j546
7881d63R10m2O11j228k50L12J315r22J27M27m92Q02j957R00J269j981N14o60O32
7900a76J27l19l92M95O91K07j184J489q02k28L31q33O54q76J342j125Q63j6p24
7919d76K03q12J099l03J093m17k32K60j707J418j060J675j435k50K332k106J247
7936E29q22K45N32k96m38p33J779p11K82l58l72R84q25N87j576M92M52j0Q13j459
7956i05Q55m38J66o3q31J774m09P7J18L1o26O85j328k01J997l45p73P96m16O92
$$ plain form
7976 856 -159 -376 -370 -1166 766 -573 -450 497 77 23 -797 -411 -580 -142 -545 1225 2 -461 264
7995 264 -793 579 -295 369 -381 128 473 252 74 -722 686 80 -666 1101 -219 107 -79 -605
8013 -605 -472 -313 -36 149 -92 -197 -242 287 -474 308 470 -380 -897 -1198 175 -298 -440 145 153 -571 -23
8034 -23 58 -347 -715 -1090 -315 385 -208 666 -70 36 -1232 -184 305 -739 27 100 771 333 179 -331
8054 -331 -24 -112 -742 314 -335 -484 458 1087 796 -95 1064 -405 13 489 -746 3 -867 629 -429
8073 -429 123 -304 405 326 -167 142 -813 184 232 661 19 157 254 133 151 343 -452 776 -723 105 -482
8094 -482 -611 -903 201 -104 35 -164 435 -323 287 -702 -758 357 799 919 821 348 108 -176 838 -288
8114 -288 522 20 634 -506 1121 -460 -373 1281 -303 289 -226 121 -1238 -651 -321 132 577 -421
$$ packed form
7976H56j015k17Op96J932j339J23R47m20n4q20L86j69M38m03J770j223m63P25
7995B64j057J372q74O64p50N09L45k21j78p96J408o06p46J767j320L26j86n26
8013f05J33J59K77J85k41j05m5N29p61P82J62q50n17l01J373m73j42N85Qp24N48
8034b3Q1m05l68l75P75P00n93Q74p36J06j268J048M89j044P66P3O71m38j54n10
8054c31L07q8o30J056o49j49R42O29k91q91J159j469M18M76j235P49q70J496j058
8073d29N52m27P09p9m93L09r55R97M8M29o42J38R7j21J8J92p95J228j499Q28n87
8094d82j29k92J104l05J39j99N99p58O10r89n6J115M42J20r8m73k40k84J014j126
8114b88Q10n02O14j140J627j581Q7J654j584N92n15L47j359N87L30M53M45r98
$$ plain form
8132 -421 165 434 -443 -726 -699 777 285 690 -290 -1163 -583 -934 209 -232 23 761 143 -634 -1335 -320
8152 -320 -410 591 -200 -725 113 565 -551 -436 212 -412 673 503 320 -630 103 -407 875 299 1733
8171 1733 -416 -224 83 349 1206 272 -99 -1169 709 786 -166 1112 -1367 330 289 914 1020 -593
8189 -593 233 -623 326 364 -99 343 -58 -366 -540 -335 -279 755 122 -1096 1466 -163 -244 -515 -475 172
8209 172 119 423 -745 178 801 -918 -509 -856 -461 -440 205 -643 21 339 -231 417 255 -598 95 -136
8229 -136 532 -9 -7 154 1060 -1060 -3 -417 -42 -532 608 -407 576 881 1738 529 554 896 47
8248 47 -128 329 170 -569 18 94 394 85 -465 571 636 -298 -377 378 620 -140 132 -192 202 -625 -312
8269 -312 190 602 -1093 92 52 -943 -203 702 -178 1036 573 -260 -456 -479 1976 -37 39 104 685 313
$$ packed form
8132d21N86K69q77k83K7J476m92M05r80q73N80l51J143m41K55P38o18p77p01J015
8152c20r0J001p91n25Q38M52j116J15O48o24J085j70j83r50P33n10J282n76J434
8171A733k149J92L07K66Q57r34l71j070J878P7r52J278k479J697m1O25J06j613
8189e93Q26q56R49L8m63M42m01l08j74K05N6J034o33j218K562j629q1k71M0O47
8209A72n3L04j168R23O23j719M09l47L95K1O45q48O64L18n70O48j62q53O93k31
8229a36O68n41KJ61R06k120J057m14L75m90J140j015R83L05Q57j209K5L42q49
8248D7j75M57j59p39N87P6L00l09n50J036O5r34p9P55K42p60K72l24L94q27L13
8269c12N02M12j695J185m0r95P40R05q80J214m63q33j96k3K455k013P6O5N81l72
$$ plain form
8289 313 -747 423 -35 314 616 393 -169 34 -484 -665 -96 -15 699 933 -64 658 -183 29 90 -70
8309 -70 341 -608 578 937 115 -73 723 710 563 174 -410 -341 -933 439 15 -946 -238 1 -520 -369
8329 -369 -591 865 144 986 -69 -542 31 -362 -675 -644 1016 -499 -142 814 209 -528 -166 -94 -339
8348 -339 550 -427 969 -295 116 1 -579 486 78 -348 -1044 -957 1185 438 -617 -845 -499 -274 -3
8367 -3 554 119 -1124 451 -744 -840 -412 -659 322 -315 281 -303 -696 -670 651 39 -177 -148 -378 74
8387 74 -117 -848 54 -733 512 -667 572 -356 -362 -106 -530 -120 -975 557 -486 -227 -313 -144 1931
8406 1931 -152 1016 -191 -798 -589 -967 199 -885 -76 -780 -679 -329 -52 327 179 839 -708 44
8424 44 701 -981 1160 552 148 -1312 -961 -655 392 301 236 173 -390 873 -403 208 1198 -276 478
$$ packed form
8289C13j060J170m58L49L02k23n62K03n18j81N69Q1P14K34r97P22q41K12O1j60
8309g0M11r49J186L59q22j88P96j3j47l89n84O9n92J372m24r61P08K39n21J51
8329c69k22J456p21Q42j055m73N73l93l13L1J660j515L57R56o05p37L62P2k45
8348c39Q89r77J396j264M11j15n80J065m08m26o96Q7K142p47j055k28L46K25K71
8367cN57m35j243J575j195r6M28k47R81o37N96n84l93K6J321o12k16K9k30M52
8387G4j91p31R02p87J245j179J239r28oK56m24M10q55J532j043K59q6J69K075
8406A931k083J168j207o07K09l78J166j084Q09p04J01L50K77L79j48O60j547P52
8424D4O57j682K141o08m04j460L51L06J047r1o5o3n63J263j276O11R90j474P54
$$ plain form
8443 478 -61 67 581 -1297 587 190 -373 201 -574 228 -806 -520 50 -814 200 -94 440 -5 -485
8462 -485 399 1058 102 -382 591 756 522 -404 52 448 -368 327 431 56 368 -519 -561 -1645 13 -548
8482 -548 1092 -208 -226 536 224 -711 604 230 110 -352 195 -651 -980 419 -73 48 -495 578 -784
8501 -784 437 326 385 184 -1321 157 1478 405 -622 349 909 -557 -65 -871 -86 -898 -707 667
8519 667 -991 389 2 386 449 147 77 -70 -631 453 980 -1040 38 316 -729 655 -757 299
8537 299 94 -264 -874 1508 -585 -611 -227 -1423 364 112 421 -9 -428 -111 469 -362 528 -282 -30
8556 -30 -156 -249 64 -252 -196 -939 -793 -378 -1265 502 580 628 -235 -77 395 -1665 127 -458 694 293
8576 293 46 -824 -479 43 -381 486 53 49 -329 -576 -266 234 172 -906 -156 -556 153 1287 -77 -895
$$ packed form
8443D78n39J28N14j878J884l97n63N74p75Q02j034K86N70q64J014k94N34m45m80
8462d85Q84O59r56m84R73J65k34r26M56L96q16O95J04l75L12q87m2j084J658n61
8482e48J640j300j8P62l12r35J315l74j20m62N47q46l29J399m92J21n43J073j362
8501g84J221j11N9k01j505J478J321j073j027R71N60j466M92q06P85q12J91J374
8519F67j658J380l87L84O3l02p0j47n61J084N27k020J078K78j045J384j412J056
8537B99k05l58o10K382k093k6L84j196J787k52L09m30m19L17N80q31Q90q10K52
8556c0j26r3L13l16N6p43J46M15q87J767P8M8q63J58M72k060J792n85J152m01
8576B93k47q70L45N22m24Q67m33ml78k47L10N00o2j078P50m00P09J134j364q18
$$ plain form
8596 -895 -873 57 -446 284 -308 41 -21 -514 676 915 -63 618 31 846 918 97 159 26 632 -360 -434
8617 -434 613 931 254 -898 933 -383 610 -697 -493 635 147 305 -533 -469 -408 -348 -130 -504 995
8636 995 -683 -280 -108 -673 555 -780 1313 468 -133 -803 -548 432 -963 626 -415 18 -106 -34
8654 -34 524 -487 981 -692 -705 673 381 1349 964 258 -1270 -1140 253 -597 -520 234 -169 -298 435
8673 435 -1167 -610 145 346 -260 885 -575 691 -644 198 -430 -647 525 -491 -280 -163 -276 -365
8691 -365 -906 116 340 -98 105 -466 -1415 -300 -489 -1151 -737 -233 1153 -59 505 689 -8 929 -739
8710 -739 1937 -440 -367 181 -103 1001 -846 893 -411 182 -115 -404 -38 94 -179 -297 -241 -63 141
8729 141 58 555 -155 -689 -383 752 177 1076 -905 -599 -797 -429 157 -175 955 -544 -173 -49 617
$$ packed form
8596h95K2R30n03P30n92L49o2m93J190K39r78O81n87Q15P2q21O2j33O06r92p4
8617d34J047L18o77j152J831j316R93j307K04J128m88J58q38O4O1O0K18l74J499
8636I95j678M03J72n65J228j335K093q45o01o70K55R80j395J589j041M33j24P2
8654c4N58j011J468j673j3J378k92R68l85p06j528J30J393q50P7P54m03j29P33
8673D35j602N57P55K01o06J145j460J266j335Q42o28k17J172j016K11J17j13q9
8691c65n41J022K24m38K03n71r49J115j89o62M14N04J386j212N64J84o97R37j668
8710g39K676k377P3N48k84J104j847J739j304N93k97k89L66J32k73j18N6J78K04
8729A41q3M97p10n34L06J135n75Q99j981L06j98L68N86l32J130j499L71J24O66
$$ plain form
8748 617 547 319 -609 273 1242 246 -502 1054 -766 771 286 340 -48 -1008 -372 -1198 332 245 -179 115
8768 115 -161 308 -286 775 -287 310 -221 -653 -238 -402 -65 180 -183 -458 -742 -334 -58 -791 228
8787 228 -27 -78 -476 802 879 85 17 -1066 933 -61 465 558 -387 780 -285 -121 -394 -361 -578 -84
8807 -84 360 -563 160 -754 599 -919 -616 151 -459 1353 -1361 861 -122 -639 557 324 8 104 345
8826 345 -1321 -391 393 -399 136 -475 -751 -290 -625 910 -409 570 -590 -67 -40 173 -360 -882 309
8845 309 -211 -638 -185 -207 1030 -385 -362 -592 -242 -445 -1103 650 544 246 449 -593 335 -828 65
8864 65 1088 938 614 474 825 -36 -13 221 322 1179 -1272 493 -594 74 -624 -1655 425 -149 -382
8883 -382 -403 303 -20 -79 448 -456 228 -6 1299 430 135 326 -842 1326 -213 163 -615 161 -274
$$ packed form
8748F17p0k28r28Q82R69r96p48J556j820J537m85N4l88r60O36q26J530q7m24K94
8768A15k76M69n94J061j062N97n31m32M15j64L37K45l63k75k84M08K76p33J019
8787B28k55n1l98J278P7p94o8j083J999r94N26R3r45J167j065J64k73L3k17M94
8807h4M44r23P23r14J353j518L03P67o10J812k714K222r83n17J196k33l16R6K41
8826C45j666R30P84p92N35o11k76M61l35J535j319R79j160N23K7K13n33n22J191
8845C09n20m27M53k2J237j415K3k30L50k03o58J753j06k98K03j042R28j163Q93
8864F5J023j50l24j40L51q61K3K34J01Q57k451J765j087O68o98j031K080n74k33
8883c82k1P06l23n9N27r04O84k34J305q69k95J91j168K168j539L76p78P76m35
$$ plain form
8902 -274 270 465 -580 -39 -415 -330 436 -351 1612 -54 -401 -95 791 498 -25 1170 -1038 864
8920 864 -231 46 299 71 -57 -1168 393 -81 -606 -391 149 196 -408 -605 -397 -571 -570 -101 86 94 812
8941 812 -320 -892 835 -560 189 -817 -306 225 -457 316 151 524 -921 675 608 309 -863 -948
8959 -948 1092 -62 -326 -243 -933 1719 -429 -52 -214 449 11 -244 -41 -833 -389 -1064 1528 564 -12
8978 -12 338 -1063 -362 -499 -1231 14 400 889 -520 -54 860 -388 183 398 632 -377 -490 170 -606
8997 -606 572 -645 75 -251 -430 1374 -34 423 -791 268 205 91 202 -218 474 -698 870 823
9015 823 -1087 -297 316 -95 -1157 239 1114 -195 372 214 281 -2166 -394 -915 145 589 -1044 626
9033 626 -828 372 153 260 84 -108 16 -811 548 -146 -133 448 -1108 1705 -819 -22 385 813
$$ packed form
8902b74N44J95j045N41l76Q5P66p87J963j666l47L06Q86k93n23J195k208J902
8920H64j095K77K53k28j28j111J561m74n25K15N40M7o04j97K08j74JM69J87QP18
8941H12j132n72J727j395P49j006N11N31o82P73j65L73j445J596o7k99j172q5
8959i48K040j154k64Q3o90K652k148L77j62O63m38k55K03p92M44o75K592r64n76
8978a2L50j401P01j37p32J245L86M89j409M66R14j248N71K15K34j009j13O60p76
8997f06J178j217P20l26j79J804j408M57j214J059o3j14J11m20O92j172J568m7
9015H23j910P90O13m11j062J396Q75j309N67j58O7k447J772n21J060M44j633J670
9033F26j454J200k19J07j76j92J24q27J359o94J3N81j556K813k524P97M07M28
$$ plain form
9051 813 -1900 -233 364 38 519 -23 -558 -1031 -847 198 209 -84 850 163 -867 133 223 1212 -369
9070 -369 271 -120 743 -1302 -347 602 -376 433 -966 -453 -503 -1179 732 233 -130 69 865 -622 -1008
9089 -1008 -313 -217 -70 -164 46 -689 100 -466 235 -83 -46 -283 -390 -1203 372 124 988 242 797 -844
9109 -844 617 792 -376 732 -547 -420 -79 -154 1015 536 675 167 460 -1156 -141 1239 -220
9126 -220 604 -319 73 172 81 600 -57 729 -679 -457 215 -696 1035 -747 -3 637 -760 -514 -441 46
9146 46 1129 664 -915 41 -101 -285 -689 180 84 -639 -454 -477 -1228 39 -363 206 119 -550 -82 -178 -444
9167 -444 476 -299 588 94 231 299 868 439 1620 486 -151 334 -1171 50 -473 -299 714 -112 64
9186 64 -2118 703 -663 616 65 -336 -128 22 -21 -259 619 -972 20 96 -391 5 -798 728 -499
$$ packed form
9051H13k713J667N97l26M81n42n35m73J84J045J1k93R34o87j030J000R0R89j581
9070c69O40l91Q63k045R55R49r78Q09j399N13n0o76J911m99l63J99P96j487l86
9089a008O95R6J47r4K10p35P89n66P01l18L7k37j07q13J575k48Q64p46N55j641
9109h44J461J75j168J108j279J27L41p5J169m79J39n08K93j616J015J380j459
9126b20Q24r23L92R9r1N19o57P86j408K22O72r11J731j782P44O40j397K46P3M87
9146D6J083m65j579R56j42j84m04Q69r6p23J85k3p51J267m02N69q7o69M68r6k66
9167d44R20p75Q87m94J37O8N69m29J181j134o37M85j505J221n23J74J013q26J76
9186F4k182K821j366J279n51m01K08J50m3k38Q78j591R92P6m87L96q03J526j227
$$ plain form
9205 -499 -229 522 -243 706 -126 -16 -58 -573 -577 564 -776 403 -602 80 -36 82 629 -578 316
9224 316 -381 -903 -150 249 169 768 81 -1017 63 207 5 -747 -1384 635 192 293 -327 300 317 855
9244 855 237 145 783 -184 -635 -138 1063 241 -295 -766 -573 -1013 286 -171 699 -622 -812 -137 -38 1171
9264 1171 438 202 -375 899 -1196 399 379 -91 1116 235 964 -845 446 101 -508 84 -370 20
9282 20 -334 617 881 -802 441 -619 829 -182 198 236 -158 677 20 501 -1190 -422 227 -1052
9300 -1052 864 381 -504 -300 129 -857 -680 450 -253 -455 -836 -67 -633 -196 -882 153 -371 -200 286
9319 286 -409 -424 156 -353 588 531 -1230 685 -955 605 -146 776 194 382 411 -131 -634 -546 155 -555
9339 -555 -826 580 536 563 328 -276 -40 -138 992 -601 -143 -1104 -138 258 -817 1257 -858 43 -687
$$ packed form
9205d99K70P51p65R49q32J10m2n15mJ141j340J179j005O82j16J18N47j207Q94
9224C16o97n22P53L99q0N99o87j098J080J44k02p52o37K019m43J01o20O27J7N38
9244H55o18r2O38r67m51M97J201q22n36m71J93m40J299m57Q70j321j90O75R9J209
9264A171p33k36n77J274k095J595k0m70J207q81P29j809J291l45o09N92m54L90
9282B0l54R51K64j683J243j060J448j011L80L8l94Q35o57M81j691P68O49j279
9300a052J916m83q85K04M29r86J77J130p03k02l81P69n66M37o86J035n24J71M86
9319B86o95j5N80n09R41n7j761J915j640J560p51R22n82J88K9n42n03Q8P01p10
9339e55k71J406m4K7k35o04K36r8J130j593M58r61R66L96j075K074k115R01p30
$$ plain form
9358 -687 -764 -408 -348 791 -169 -438 -196 310 579 -275 594 -765 407 -78 -395 143 -1221 -192 346
9377 346 464 520 -314 312 -390 430 713 260 354 -1261 417 -1030 -223 311 -569 391 -499 697 -644
9396 -644 158 -108 300 -726 -1832 58 -1153 1144 -258 635 160 546 550 -274 -277 -487 -117 332 -535
9415 -535 -400 -224 -752 1214 -37 -352 -53 179 -716 -66 177 -603 -178 -928 275 -325 474 -114 107
9434 107 701 710 853 -180 -252 -1102 -664 -540 -84 -366 602 -914 -432 -479 371 -192 -103 -268 -21 -70 -694
9455 -694 479 -14 255 -529 192 -1099 141 305 -339 211 -714 -646 703 -769 228 -484 555 42
9473 42 78 55 -344 894 -184 -162 375 -112 638 53 998 130 300 136 -41 -216 371 -545 -767 177 -1024
9494 -1024 184 -737 603 -268 267 172 418 -132 95 -236 -23 -24 -893 1112 598 -866 -1187 -309 -78
$$ packed form
9358f87p7L56O0J139r60k69K42N06K69q54Q69j359J172m85l17N38j364J029N38
9377C46J18N6q34O26p02Q20K83m53R4j615J678j447Q07N34q80R60q90J196j341
9396f44Q02k66M08j026j106J890j211K297j402Q93m75L86Mq24lk10L70M49q67
9415e35J35J76n28J966j251l15K99K32q95O50K43p80M25p50J203o00P99n88K21
9434A07N94RJ43j033p2q50M38J24M56k82R68j516M82m7Q50n63Q9j65K47m9o24
9455f94J173m93K69p84P21j291J240J64o44N50r25O8J349j472R97p12J039n13
9473D2L6k3l99J238j078K2N37m87P50n85R45q68J70j64j77j75N87r16k22R44j201
9494a024J208r21J340q71N35r5K46n50K27l31K13jq69K005n14j464l21Q78K31
$$ plain form
9513 -78 506 810 -214 373 -633 -254 -1232 -988 926 348 682 106 102 408 -83 800 -19 986 -835
9532 -835 -966 59 -553 611 -285 39 -962 -209 -59 -99 987 520 271 489 -453 -284 142 867 -606
9551 -606 -149 390 -334 978 -22 44 -474 477 -687 38 670 -56 1152 -305 94 -86 -366 -280 -1374
9570 -1374 1247 225 1080 -327 65 633 -1069 946 653 -340 -235 -285 1423 234 296 499 1452 377
9588 377 -362 -689 -762 -1059 -422 -171 -233 942 -43 -438 370 -524 298 -307 -612 340 -440 474 372 980
9608 980 650 -739 -1013 -746 163 14 358 -24 -965 -591 -461 -803 118 6 -324 535 1407 269 604
9627 604 885 -336 -422 -680 -740 281 -781 464 -554 597 -427 606 701 322 544 742 -40 693
9645 693 751 247 -416 732 1014 731 129 -595 26 -957 432 -1121 1011 -156 -356 -198 -33 598 -956
$$ packed form
9513g8N84L04j024N87j006L79r78K44J914n78L34n76mL06m91Q83q19J005j821
9532h35j31J025o12J164q96L24j001P53J50m0J086m67k49K18r42J69M26P25j473
9551f06M57N39p24J312j000O6n18R51j164P25O32p26J208j457L99j80k80Q6j094
9570a374K621j022Q55j407L92N68j702K015k93r93J05n0J708j189O2K03R53j075
9588C77p39l27p3k97O37K51o2J175r85l95Q08q94Q22o05l05R52p80R14j02O08
9608I80l30j389k74K67R09j49L44l82r41L74J30l42R21j12l30Q59Q72j138L35
9627F04K81j221q6k58o0J021j062J245j018J151j024J033R5l79K22J98p82P33
9645F93N8n04o63J148K82k83o02p24O21r83J389j553K132j167k00J58J65O31j554
$$ plain form
9664 -956 29 -705 157 504 -1459 881 -155 986 -354 1491 122 -415 -47 -325 570 -525 506
9681 506 849 188 -919 -1142 -473 118 1311 -55 52 758 -158 364 -896 -465 483 -179 100 113 415
9700 415 307 -964 355 153 -144 -873 1093 -311 -347 559 -584 149 -340 -1430 -845 314 41 -900
9718 -900 -687 42 -928 -386 -81 356 357 671 494 -316 -104 -403 -136 -140 506 653 -577 -149 -84 -252 315
9739 315 118 -576 -101 -51 -439 833 -914 -668 879 -950 109 -183 1355 21 797 924 -1067 -355
9757 -355 -837 1073 -965 909 -112 593 68 -717 -306 -335 721 -291 -179 1315 -768 190 -229 -56
9775 -56 169 532 -96 -1351 978 440 324 465 71 656 -559 1455 402 -918 356 92 -853 -40
9793 -40 301 -146 -448 63 339 -351 -387 673 537 109 -364 133 1085 182 257 -555 -10 341 11 50 -341
$$ packed form
9664i56R85p34Q62L47j963K340j036J141j340J845j369n37L68k78Q95j095J031
9681E06L43o61j107k23O69N91J193j366J07P06r16N22j260M31R48o62K79J3L02
9700D15j08j271J319k02k97p29J966j404l6R06j143P33m89j090N85J159k73r41
9718i00K13P29r70N42L05M37JL14j77q10K12k99K67mO46J47j230M28O5j68N67
9739C15j97o94M75N0l88J272j747K46J547j829J059k92J538j334P76J27j991P12
9757c55m82J910k038J874j021P05n25p85M11k9J056j012J12J494k083R58m19J73
9775e6K25L63o28j255K329n38j16J41l94N85j215K014j053j320J274k64r45Q13
9793d0L41m47l02N11K76o90l6J060j36m28m73M97R52r03P5q12N45L51l30L9l91
$$ plain form
9814 -341 777 -629 -820 566 198 -779 122 299 -754 246 32 108 -116 -111 53 -419 -412 1217 -317
9833 -317 -632 767 -831 225 -811 1584 593 -68 868 -1161 412 -757 -130 343 1408 94 24
9850 24 692 -811 1017 246 -1373 28 -164 762 -686 343 -119 -62 -316 -831 874 -180 526 -304
9868 -304 -136 -1035 498 575 202 930 -594 968 -686 -47 95 -482 706 -85 579 -92 423 199 -708
9887 -708 37 663 56 642 -333 1165 303 336 190 297 655 0 812 -168 -378 4 934 -164 265 1275
9907 1275 -651 -10 123 -495 -180 178 145 -599 -108 1210 -449 270 -730 89 -86 441 45 -379 451
9926 451 -857 -716 609 -585 1021 786 71 118 612 7 209 108 -1091 650 284 -128 149 -282
9944 -282 474 -473 834 -547 -74 -644 45 964 -144 500 191 53 -378 105 -60 -75 283 457 471 460
$$ packed form
9814c41J118j406j91J386l68r77R01J77j053J000k14P6k24NJ64m72PJ629j534
9833c17l15J399j598J056j036K395r91o61R36k029J573j169O27M73J065j314p0
9850B4O68j503J828p71j619J401j92R26j448J029m62N7k54n15J705j054P06q30
9868c04J68q99J533P7l73P28j524J562j654O39J42n77J188p91O64o71N15k24r07
9887g08P45O26o07N86r75J498q62L3j46J07L58o55Q12r80k10L82R30j098M29J010
9907A275j926O41J33o18L15L58l3p44M91J318j659P19j000Q19j75N27l96m24Q30
9926D51j308J41J325j194J606k35p15M7M94o05K02j01j199J741l66m12K77m31
9944b82P56r47J307j381M73n70O89R19j108O44l09j38m31M83j65j5L58J74J4j1
$$ plain form
9964 460 -1008 -82 -598 610 -205 101 -1139 331 323 -126 1421 -400 271 154 277 155 -196 802 -746
9983 -746 98 752 235 338 -76 434 -587 240 276 348 -479 -351 120 -316 305 -234 -626 -127 -133 678 304
10004 304 -383 646 -127 -144 -164 140 -125 -630 1259 364 124 -101 1 -693 -460 593 -1215 -203 257
10023 257 -846 512 -775 -478 -1127 1239 -1948 -455 -503 -989 -387 360 50 -305 385 550 -475 1318
10041 1318 -1152 641 849 212 -533 -180 503 -657 -374 -422 -357 1424 -977 310 -651 -473 256 266
10059 266 -210 -376 1143 -123 88 -1064 442 -100 173 -143 214 -136 -351 1063 -498 -791 -29 370
10077 370 694 263 42 683 -760 926 960 -870 203 -545 -968 -1311 -714 -439 655 -626 728 -85
10095 -85 -296 -104 262 -47 654 -531 959 38 -894 -122 -702 412 -345 -481 -970 905 -890 -125
$$ packed form
9964D60j468R26n16J208q15L06j240J470qm49J547j821O71j17J23j22l51R98j548
9983g46Q44O54n17J03m14N10j021Q27L6P2q27J28M71m36O21n39l92M99oQ11l74
10004C04o87J029p73j7k0L04k65n05J889q95k40k25J02o94K33J053j808J012M60
10023B57j103J358j287K97o49K366l187J493m8m86O02P47l10l55O90J65j025J793
10041A318k470J793K08o37p45L53O83j160K83m8O5J781k401J287r61J78P29J0
10059B66m76j66J519j266K11j152J506n42K73l16L57l50k15J414j561k93P62L99
10077C70L24m31k21O41j443J686L4j830J073p48m23l43N97K75J094j281J354q13
10095h5k11J92L66l09P01j185J490r21r32P72n80J114p57j36m89J875j795P65
$$ plain form
10113 -125 887 -382 334 419 -180 -147 23 1248 -125 72 -479 -86 69 -506 453 -386 761 339 -989
10132 -989 -231 -371 541 -202 692 168 -21 14 -359 -93 -612 72 -842 -557 749 -749 1321 -414 815
10151 815 -100 -143 -143 -603 33 -671 -269 -178 -612 867 380 1126 177 -201 -135 275 163 118 1166 -994 -124
10172 -124 -293 -67 702 -274 -779 -226 483 -949 -116 678 -586 355 -616 -169 526 -189 1201 -573
10190 -573 445 921 967 -388 524 -51 413 36 -497 322 -191 230 -12 -561 -112 -1118 448 56 -421
10209 -421 -718 -926 -181 484 215 882 -16 1271 268 -750 -1024 -78 157 88 -522 235 43 -457 -1237
10228 -1237 -146 -725 520 -340 -224 383 -491 1002 -446 902 -854 -95 205 -208 137 396 760
10245 760 529 168 334 196 102 -561 399 -297 -409 97 -1731 515 531 -566 548 -263 353 391 1283
$$ packed form
10113a25J012j269P16Q5n99L3J70J225j373J97n51L93J55n75R59q39J147m22j328
10132i89P58j40R12p43Q94n24j89L5l73K66n19O84r14K85J306j498K070j735J229
10151H15r15m3%m60O36p04M02R1m34J479m87P46r49l78O6M10j12m5J048k160Q70
10172a24j69K26P69r76n05N53P09j432Q33P94j264R41r71M47O95p15J390j774
10190e73J018M76M6j355R12n75M64l77n33Q19n13M21k42n49M49j006J566l92m77
10209d21k97k08P45O65k69O67q98J287j003j018k74R46K35o9o10P57j92n00p80
10228a237J091n79J245q60J16O07q74J493j448J348j756P59L00m13L45K59L64
10245G60k31l61J66j38r4o63R60o96j12N06j828K246J6j097J114q11O16L8Q92
$$ plain form
10264 1283 -886 234 -185 -993 -626 -459 917 -95 305 192 -635 650 533 559 352 -514 -146 -598
10282 -598 113 807 856 -352 -396 916 -352 1393 -435 816 53 -209 1913 111 684 742 -99 -543
10300 -543 -912 -653 372 29 -1276 -30 -287 -485 736 -431 -759 211 107 -127 -814 -778 -1081 -34
10318 -34 61 -822 -211 -682 504 222 578 1063 -889 986 -457 -613 -513 -159 -268 815 396 -907
10336 -907 1327 -482 -819 180 -373 674 -1304 -439 -504 956 305 -497 -262 194 418 -794 -405 -1180
10354 -1180 -284 19 -1041 -130 -186 758 -100 -229 336 -910 752 -471 -403 -695 331 -409 278 1213
10372 1213 -621 763 455 65 586 -550 759 -716 137 472 -330 -143 128 621 523 373 187 139
10390 139 160 114 636 1184 -774 -301 -216 593 -424 -207 490 -75 -639 -591 -132 -997 102 -18 579 931
$$ packed form
10264A283k169J120m19q08L67J67J376j012M00j13q27J285j17K6k07q66L68m52
10282e98P11O94M9j208m4J312j268J745j828J251p63k62K122j802N73N8q41m44
10300e43l69K59J025l43j305J246k57j98J221j167l28R70j04k34o87L6l03J047
10318c4R5q83O11m71J186k82L56M85j952J875j443j56J00L54j09J083m19j303
10336i07K234j809l37R99n53J047j978Q65o5J460o51q02K35M56K24j212L89p75
10354a180Q96L03j060R11n6R44q58j29N65j246J662j223O8k92J026p40O87R35
10372A213j834J384l08l90N21j136J309j475Q53L35q02J87K71M93r8j50j86m8
10390A39K1m6N22N48j958M73Q5Q09j017K17O97n65n64M8M59q65J099j20N97L52
$$ plain form
10410 931 -989 -63 40 277 412 183 -1 15 392 451 488 363 134 324 -1080 706 486 52 291 -72
10430 -72 -207 -784 1242 -742 171 -101 -16 834 -1532 323 -821 414 -533 -1268 98 -861 -288 -1511
10448 -1511 646 -456 -362 -512 237 209 476 -969 849 -480 -463 -821 -168 -370 5 463 -1051 353
10466 353 121 516 -194 114 283 -639 654 112 333 -194 -322 762 -1231 209 -69 382 346 717 5
10485 5 -51 -864 77 -276 -499 -130 852 301 -266 1262 -28 676 448 -228 -1198 574 -287 322 259 45
10505 45 -131 -303 -39 -1198 116 83 -230 317 -209 248 266 -727 -95 -493 -64 -728 565 -838 -90
10524 -90 216 -88 583 -189 -113 -406 -685 391 124 640 241 -401 906 -55 -168 -37 -60 -245 198 -827
10544 -827 -652 420 172 333 -434 -775 432 169 390 -753 328 -565 297 -908 -492 590 -227 258
$$ packed form
10410I31j920R26J03K37J35k29j84J6L77N9L7j25k29J90j404J786k20m34K39l63
10430g2j35n77K026j984R13k72Q5Q50k366J855j144J235r47p35J366r59N73j223
10448a511K157j102R4j50P49k8K67j445J818j329J7l58O53k02L75M58j514J404
10466C53k32L95p10L08J69r22J293n42K21n27j28J084j993J440k78M51l6L71p12
10485En6q13R41l53k23L69R82n51n67J528j290P04k28o76r70J772q61O09o3k14
10505D5j76j72K64j159J314l3l13N47n26M57J8r93O32l98M29o64J293j403P48
10524i0L06l04O71p72P6k93k79J076k67N16l99o42J307r61j13J31k3j85M43j025
10544h27J75J072k48J61p67l41J207k63K21j143J081q93Q62j205M16J082q17M85
$$ plain form
10562 258 57 170 -8 55 -656 -552 916 872 -445 330 -343 -220 -89 130 -599 -263 577 -555 -201
10581 -201 -383 -2 -181 573 249 -793 577 -558 34 -209 22 165 -5 100 85 294 199 -195 413
10600 413 283 203 621 37 347 -964 -99 -683 -154 -114 -135 -253 -670 943 390 -721 363 39 442
10619 442 -808 891 -593 335 962 -1243 1376 73 797 -1468 625 -32 -620 10 -835 1271 -236
10636 -236 459 216 -261 -433 -637 -575 832 -26 943 -438 -489 -267 1087 -829 390 -977 -617 -599 -626
10655 -626 970 -222 -525 160 -627 694 -391 280 -784 -536 -48 192 -813 -906 129 228 -903 381
10673 381 -588 884 603 325 638 -707 -318 -1487 825 347 -330 1112 36 399 -234 580 -178 481
10691 481 -30 -840 584 -310 895 -841 -1082 -192 -861 -357 -165 1009 -75 -79 1496 -1185 179 377
$$ packed form
10562B58k01J13j78O3p11J04J468m4j317P75o73J23J31K19p29L36Q40j132L54
10581b01j82L81j79P54l24j042J370j135N92k43K31J43j70J05j5K09r5l94O08
10600D13j30q0M18n84L10j311Q65n84N29M0k1j18m17J613n53j111J084l24M03
10619D42j250J699j484R28O27k205K619j303P24k265K093o57n88O30q45K106j507
10636b36O95k43m77j72k04O2J407q58R69j381n1K22J354j916J219j367L60J8k7
10655f26J596j192l03O85p87J321j085O71j064K48M88K40j005r3J035R9j131J284
10673C81r69J472k81k78L13j345L89j169K312m78o77J442j076L63o33Q14p58O59
10691D81n11q10J424q94J205j736k41Q90o69N04J92J174j084mJ575k681J364J98
$$ plain form
10709 377 528 -70 118 339 407 149 -113 -226 118 -430 896 33 123 -597 -287 1218 115 -271 -60
10728 -60 -4 -149 90 190 -799 973 -409 324 -1027 -390 230 225 1115 -644 -7 -1249 -1500 754 -247
10747 -247 21 -581 689 418 -81 467 -527 480 -207 -793 -48 -1041 -248 -275 976 426 536 532 -1175
10766 -1175 -258 -1300 -581 823 -134 -578 177 64 920 -672 899 98 -721 -99 86 -608 -227 -454
10784 -454 -1298 351 -340 -50 -885 -220 268 -488 40 394 120 -75 -493 -199 49 264 -229 832 377
10803 377 526 -96 430 852 -905 809 933 531 -131 -423 408 -12 578 313 257 438 -216 -809 -894 103
10823 103 -362 196 429 -165 526 188 -805 -374 59 -413 -403 14 -454 506 807 -79 72 -491 1365 -625
10843 -625 -507 45 -217 -747 -597 -58 576 -794 -902 -431 859 -622 -486 -213 654 379 643 -470
$$ packed form
10709C77J51n98J88K21O8k58k62j13L44n48J326q63R0p20L10J505j103l86K11
10728f0N6j45K39J00r89J772j382P33j351O37O20nQ90j759O37j242k51K254j001
10747b47K68o02J270k71m99N48r94J007o87n86P45r93P93k7J251n50J10mj707
10766a175R17j042P19J404r57m44P55j13Q56j592J571q01q19O22J85o94L81k27
10784d54q44J649o91K90q35O65M88p56N28L54k74j95m18K94K48K15m93J061m55
10803C77J49o22N26M22j757J714J24m02o62k92Q31m20N90k65n6J81o54n93q5R97
10823A03m65N58K33n94O91l38r93M31M33m72J0M17m68R60L01q86J51n63J856j990
10843f25J18N52k62n30J50N39O34j370j08M71J290j481J36K73Q67k75K64j113
$$ plain form
10861 -470 -299 229 320 1030 630 646 1239 -923 429 122 -90 643 -595 1055 -482 813 101 -450
$$ packed form
10861d70J71N28R1P10m00J6N93k162J352l07k12P33j238J650j537J295p12n51
$$ [...]
16383f00
##END NTUPLES=NMR FID
##END=
