##TITLE=31P_DE-80H_X3
 64 sc D2O
 26.2.2025
##JCAMPDX= 6.0         $$ Bruker NMR JCAMP-DX V2.0
##DATA TYPE= NMR FID
##DATA CLASS= NTUPLES
##ORIGIN= UXNMR, Bruker Analytische Messtechnik GmbH
##OWNER= root
$$ XWIN-NMR		Version 3.5
$$ Tue Jun  2 16:40:58 2026 Russian Standard Time (UT+4h)  Yarkov@DPX200
##.OBSERVE FREQUENCY= 81.013821
##.OBSERVE NUCLEUS= ^31P
##.DELAY= (6, 6)
##.ACQUISITION MODE= SIMULTANEOUS
##.ACQUISITION SCHEME= undefined
##.AVERAGES= 64
##.DIGITISER RES= 17
##SPECTROMETER/DATA SYSTEM= spect
##.PULSE SEQUENCE= zgpg30
##.SOLVENT NAME= D2O
##.SHIFT REFERENCE= (INTERNAL, D2O, 0, 243.863)
##AUDIT TRAIL= $$ (NUMBER, WHEN, WHO, WHERE, WHAT)
$$ ##TITLE= Audit trail, XWIN-NMR		Version 3.5
$$ ##JCAMPDX= 5.01
$$ ##ORIGIN= Bruker BioSpin GmbH
$$ ##OWNER= Yarkov
$$ C:/Bruker/XWIN-NMR/data/yarkov2/nmr/P31/2/audita.txt
$$ ##AUDIT TRAIL=  $$ (NUMBER, WHEN, WHO, WHERE, WHAT)
(   1,<2026-06-02 16:40:20.37 +0400>,<Yarkov>,<DPX200>,
      <created by zg, POWCHK disabled, PULCHK disabled
       configuration hash MD5:
       00 E9 B6 7A A2 85 ED C7 34 08 36 98 17 FE 4E 26
       data hash MD5: 32K
       94 98 A1 58 EE 44 D2 02 D9 CA B4 23 29 70 90 36>)
$$ ##END=
$$ 
$$ hash MD5
$$ 57 36 50 C9 24 D3 99 7F B5 F6 6B 33 C8 B8 E7 EA
##$RELAX= 
##$RELAX= 
##$RELAX= 
##$RELAX= 
##$RELAX= 
##$RELAX= 
##$RELAX= 
##$RELAX= 
$$ Bruker specific parameters
$$ --------------------------
##$DU= <C:/Bruker/XWIN-NMR>
##$EXPNO= 2
##$NAME= <P31>
##$PROCNO= 1
##$TYPE= <nmr>
##$USER= <yarkov2>
##$AMP= (0..31)
100 100 100 100 100 100 100 100 100 100 100 100 100 100 100 100 100 100 
100 100 100 100 100 100 100 100 100 100 100 100 100 100 
##$AQSEQ= 0
##$AQ_mod= 1
##$AUNM= <au_zg>
##$AUTOPOS= <>
##$BF1= 81.014009
##$BF2= 200.13
##$BF3= 200.13
##$BF4= 200.13
##$BF5= 200.13
##$BF6= 200.13
##$BF7= 200.13
##$BF8= 200.13
##$BYTORDA= 1
##$CFDGTYP= 0
##$CFRGTYP= 5
##$CHEMSTR= <none>
##$CNST= (0..31)
1 1 145 1 1 1 1 1 1 1 1 1 1 1 1 1 1 1 1 1 1 1 1 1 1 1 1 1 1 1 1 1 
##$CPDPRG= <waltz16>
##$CPDPRG1= <>
##$CPDPRG2= <waltz16>
##$CPDPRG3= <>
##$CPDPRG4= <mlev>
##$CPDPRG5= <mlev>
##$CPDPRG6= <mlev>
##$CPDPRG7= <mlev>
##$CPDPRG8= <mlev>
##$CPDPRGB= <>
##$CPDPRGT= <>
##$D= (0..31)
0 1 0 0 0 0 0 0 0 0.06 0 0.03 2e-05 3e-06 0 0 0.0002 0 0 0 0 0 0 0 0 0 
0 0 0 0 0 0 
##$DATE= 1780404019
##$DBL= (0..7)
120 120 120 11 120 120 24 19 
##$DBP= (0..7)
150 150 150 150 150 150 150 150 
##$DBP07= 0
##$DBPNAM0= <>
##$DBPNAM1= <>
##$DBPNAM2= <>
##$DBPNAM3= <>
##$DBPNAM4= <>
##$DBPNAM5= <>
##$DBPNAM6= <>
##$DBPNAM7= <>
##$DBPOAL= (0..7)
0.5 0.5 0.5 0.5 0.5 0.5 0.5 0.5 
##$DBPOFFS= (0..7)
0 0 0 0 0 0 0 0 
##$DE= 6
##$DECBNUC= <off>
##$DECIM= 4
##$DECNUC= <off>
##$DECSTAT= 4
##$DIGMOD= 1
##$DIGTYP= 9
##$DL= (0..7)
0 0 52 120 120 21 21 25 
##$DP= (0..7)
150 150 150 150 150 150 150 150 
##$DP07= 0
##$DPNAME0= <>
##$DPNAME1= <>
##$DPNAME2= <>
##$DPNAME3= <>
##$DPNAME4= <>
##$DPNAME5= <>
##$DPNAME6= <>
##$DPNAME7= <>
##$DPOAL= (0..7)
0.5 0.5 0.5 0.5 0.5 0.5 0.5 0.5 
##$DPOFFS= (0..7)
0 0 0 0 0 0 0 0 
$$ [...]
##$SUBNAM1= <"">
##$SUBNAM2= <"">
##$SUBNAM3= <"">
##$SUBNAM4= <"">
##$SUBNAM5= <"">
##$SUBNAM6= <"">
##$SUBNAM7= <"">
##$SUBNAM8= <"">
##$SUBNAM9= <"">
##$SW= 400.765351723535
##$SWIBOX= (0..15)
0 1 3 0 0 0 0 0 0 0 0 0 0 0 0 0 
##$SW_h= 32467.5324675325
##$TD= 32768
##$TD0= 1
##$TE= 0
##$TE2= 300
##$TE3= 300
##$TEG= 300
##$TL= (0..7)
0 120 53 12 22 120 120 120 
##$TP= (0..7)
150 150 150 150 150 150 150 150 
##$TP07= 0
##$TPNAME0= <>
##$TPNAME1= <>
##$TPNAME2= <>
##$TPNAME3= <>
##$TPNAME4= <>
##$TPNAME5= <>
##$TPNAME6= <>
##$TPNAME7= <>
##$TPOAL= (0..7)
0.5 0.5 0.5 0.5 0.5 0.5 0.5 0.5 
##$TPOFFS= (0..7)
0 0 0 0 0 0 0 0 
##$TUNHIN= 0
##$TUNHOUT= 0
##$TUNXOUT= 0
##$USERA1= <user>
##$USERA2= <user>
##$USERA3= <user>
##$USERA4= <user>
##$USERA5= <user>
##$V9= 5
##$VALIST= <valist>
##$VCLIST= <CCCCCCCCCCCCCCC>
##$VD= 0
##$VDLIST= <DDDDDDDDDDDDDDD>
##$VPLIST= <PPPPPPPPPPPPPPP>
##$VTLIST= <TTTTTTTTTTTTTTT>
##$WBST= 1024
##$WBSW= 4
##$XGAIN= (0..3)
0 0 0 0 
##$XL= 0
##$YL= 0
##$YMAX_a= 2665
##$YMIN_a= -7034
##$ZGOPTNS= <>
##$ZL1= 120
##$ZL2= 120
##$ZL3= 120
##$ZL4= 120
##$ABSF1= 60
##$ABSF2= -190
##$ABSG= 5
##$ABSL= 3
##$ALPHA= 0
##$AQORDER= 0
##$ASSFAC= 0
##$ASSFACI= 0
##$ASSFACX= 0
##$ASSWID= 0
##$AUNMP= <proc_1d>
##$AZFE= 0.1
##$AZFW= 0.5
##$BCFW= 1
##$BC_mod= 2
##$BYTORDP= 1
##$COROFFS= 0
##$CY= 9.86611175537109
##$DATMOD= 1
##$DC= 1
##$DFILT= <>
##$DTYPP= 0
##$F1P= 182.462994727601
##$F2P= 168.069089081705
##$FCOR= 0.5
##$FTSIZE= 0
##$FT_mod= 0
##$GAMMA= 1
##$GB= 0
##$INTBC= 1
##$INTSCL= 1
##$ISEN= 30
##$LB= 1.5
##$LEV0= 0
##$LPBIN= 0
##$MAXI= 11.51145
##$MC2= 0
##$MEAN= 0
##$ME_mod= 0
##$MI= 1.244541
##$NCOEF= 0
##$NC_proc= 0
##$NLEV= 6
##$NOISF1= 0
##$NOISF2= 0
##$NSP= 1
##$NTH_PI= 0
##$NZP= 1
##$OFFSET= 243.8632
##$PC= 1.4
##$PHC0= 1604.601
##$PHC1= 73.15952
##$PH_mod= 0
##$PKNL= yes
##$PPARMOD= 0
##$PSCAL= 0
##$PSIGN= 0
##$REVERSE= no
##$SF= 81.0140731611343
##$SI= 65536
##$SIGF1= 0
##$SIGF2= 0
##$SINO= 80
##$SIOLD= 65536
##$SREGLST= <31P.CDCl3>
##$SSB= 0
##$STSI= 0
##$STSR= 0
##$SW_p= 25641.0256410257
##$SYMM= 0
##$S_DEV= 0
##$TDeff= 0
##$TDoff= 0
##$TI= <>
##$TILT= no
##$TM1= 0
##$TM2= 0
##$TOPLEV= 0
##$USERP1= <user>
##$USERP2= <user>
##$USERP3= <user>
##$USERP4= <user>
##$USERP5= <user>
##$WDW= 1
##$XDIM= 64
##$YMAX_p= 0
##$YMIN_p= 0
$$ End of Bruker specific parameters
$$ ---------------------------------
##NTUPLES= NMR FID
##VAR_NAME=  TIME,          FID/REAL,        FID/IMAG
##SYMBOL=    X,             R,               I
##VAR_TYPE=  INDEPENDENT,   DEPENDENT,       DEPENDENT
##VAR_FORM=  AFFN,          ASDF,            ASDF
##VAR_DIM=   16384,         16384,           16384
##UNITS=     SECONDS,       ARBITRARY UNITS, ARBITRARY UNITS
##FACTOR=    3.08e-05,      1,               1
##FIRST=     0,             0,               0
##LAST=      0.5045964,     0,               0
##MIN=       0,             -7034,           0
##MAX=       0.5045964,     2665,            0
$$ Real data points
##PAGE= N=1
##DATA TABLE= (X++(R..R)), XYDATA
0 0 0 0 0 0 0 0 0 0 0 0 0 0 0 0 0 0 0 0 0 0 0 0 0 0 0 0 0 0 0 -1 2 -2 0 2 1 -1 0 2 -1 -1 -1 0 -4 4 2 -5 -1 2 -4 4 0 2 -5 4 -7 11 -5 7 -7
59 -7 11 -14 14 -27 47 -73 184 -7034 749 497 -590 -1416 -1216 -892 -675 954 -243 2120 -766 175 -833
80 -833 -176 -277 -923 1962 414 378 -1217 -707 -97 572 1934 -460 900 76 358 -272 -67 289 872
99 872 248 166 -533 -947 -233 -1043 -1153 192 452 906 -543 -656 -106 -875 -85 913 943 1246 260 -868
119 -868 -876 -981 747 150 912 -442 297 -415 -510 110 -886 1248 1524 129 -33 -1129 384 -972 1020
138 1020 -451 80 27 -284 621 -915 49 -679 688 401 -167 -293 -1479 -718 -469 -148 1067 807 663
157 663 -861 -632 -1624 -316 109 -660 337 -246 1097 -311 70 -852 359 1128 -374 -127 -165 623 -566
176 -566 -446 378 102 355 -4 -281 -73 -77 -36 -1560 754 -643 -45 364 -306 -159 41 -54 234 408 -584
197 -584 235 62 -1239 89 448 604 838 37 333 -105 165 -537 -220 872 128 60 -238 655 210 -834
217 -834 640 272 1132 205 -497 231 75 368 -89 -227 489 45 167 -1152 -679 -730 -547 -28 35 830
237 830 -1082 773 -82 -693 510 -607 1030 -751 846 -428 -50 393 -488 1364 -859 1071 -838
254 -838 -42 -83 -1203 1517 147 1156 290 -622 42 -236 1084 -681 152 -3 1175 65 -799 -372
272 -372 -1872 938 -930 -228 284 -291 877 -1004 -394 -1111 294 636 -766 80 -839 138 -230 44
290 44 755 908 1080 -806 77 392 1074 -522 175 -508 -289 -11 -225 -756 -309 544 171 955 302 -29
310 -29 516 -85 -448 647 1801 915 -119 -689 945 -833 14 172 -668 488 -783 88 -462 -281
328 -281 480 40 510 -460 779 -717 110 394 -1659 1138 -189 1436 906 60 904 273 376 -1210
346 -1210 -273 -557 746 -72 -23 -268 -181 1093 570 -175 663 21 887 -1521 1308 -672 -672 832 -466
365 -466 645 -707 909 -400 -574 167 547 1208 140 192 -623 1162 663 -125 1242 -904 238 -427
383 -427 -248 42 -938 -150 526 989 -652 -980 -147 -653 -35 -144 -479 39 248 -334 511 3 -638 805
403 805 -360 -692 -97 157 -448 -1014 235 416 397 962 -854 -456 -581 -977 849 -515 683 912 159
422 159 451 -757 -112 -210 479 218 444 208 -749 -151 -696 1380 -163 43 198 -1311 110 -1114 -174
441 -174 -38 167 1104 -161 138 -438 361 -602 -707 -258 -9 24 -885 338 281 585 -114 -893 226 -949
461 -949 572 -543 443 513 302 449 -381 -58 -651 619 -552 -190 822 -407 852 -275 -1110 952
479 952 -476 553 870 85 655 211 193 -493 250 -624 -208 955 -296 -32 335 871 287 414 403 358
499 358 -742 170 530 -430 -888 168 -195 173 -1055 710 246 60 -489 -396 301 248 860 246 -273 600
519 600 102 -106 -372 -491 30 10 926 -1731 -311 -127 287 432 -1693 917 153 1452 -825 -8 333
538 333 -860 1492 -310 1511 -793 -48 -1126 1356 1144 -1082 1174 -491 24 -484 -274 677 -375
555 -375 1193 -657 475 27 -220 18 -611 1701 -874 -667 -164 -213 487 -189 1006 177 316 266 275 -181
575 -181 -738 -585 -423 -235 643 -275 -368 -762 272 -747 1020 -102 621 892 -603 95 -1507 871
593 871 -278 -239 49 431 125 586 -304 165 45 -286 406 614 810 -628 605 257 403 520 -713
612 -713 -97 -794 -238 -153 -741 398 -73 734 -1302 1017 -488 151 -570 -900 1005 -984 1254 -641
630 -641 -792 120 -1160 575 -1764 1375 118 1050 -1317 796 1466 -789 448 -453 -406 274 -184 -79
648 -79 -1351 192 -1121 1008 41 108 1399 270 1052 311 -385 -99 89 300 -1127 439 -1953 254
666 254 141 708 982 -450 472 203 -336 84 -415 66 -278 648 -560 -1044 529 174 -707 -183 -13
685 -13 301 740 -76 -241 465 726 -109 -208 -232 -268 409 43 -79 158 49 -692 -285 -1452 -708 142 99 -79
707 -79 349 -157 -593 313 22 16 310 -511 -541 -1078 791 26 -1068 711 -624 -268 -993 310 -689 -521
727 -521 992 -288 1585 -1272 -233 114 177 1124 -881 208 -1129 146 445 -423 733 -777 1737
744 1737 -1240 518 794 -1085 450 -793 515 -89 789 -47 131 -456 434 882 -1092 693 -508
761 -508 548 1349 -1081 348 -304 -989 -379 298 1155 -282 62 -1365 -320 -569 -589 -98 577 138 32
780 32 215 -132 -171 1188 62 -172 -199 836 -527 483 327 -20 746 -183 -448 565 33 632 170
799 170 -75 330 -755 1374 1 -547 -482 -573 812 -452 763 -1020 1045 -20 -1371 1234 -2029
816 -2029 -693 -587 390 -84 -1029 763 -678 1307 -138 72 376 -39 -734 -708 44 -725 -265 330 -377
835 -377 -51 -1322 461 665 77 365 -722 273 -229 475 175 811 -112 343 -6 -1033 -742 -705 447
854 447 -441 547 419 -537 368 -139 -976 -527 277 -855 -378 -292 -186 -204 -659 446 797 288 728 -441
874 -441 65 206 1141 -740 419 -590 -809 -352 381 -105 305 0 -819 813 196 470 52 989 108
893 108 93 346 399 662 -463 151 206 -694 -182 180 167 -499 -400 -849 400 1000 -536 -30 -982 -638 393
914 393 -195 695 -139 730 -707 -77 -460 -30 1970 -238 1418 -284 -107 1239 142 -390 57 472
932 472 -6 680 -616 582 184 -406 582 -298 337 -805 919 161 -1111 1245 -1648 204 335 136
950 136 498 -336 -165 -1786 526 16 431 467 -20 944 100 125 -598 609 295 -450 669 -187 -282 124
970 124 160 1163 -613 13 299 -555 -890 269 -565 -912 629 -154 894 762 -1170 197 -169 -537
988 -537 373 -805 -65 -1154 -281 -39 -906 69 14 469 75 554 -396 -150 1242 -435 593 -788 -480
1007 -480 -259 200 1390 -148 567 -292 49 -326 -1670 852 -1656 717 -522 316 -32 -457 816
1024 816 -981 283 -506 896 -905 -773 -6 -441 1065 -1112 336 44 -607 386 -77 199 -1184
1041 -1184 1272 477 -124 -387 -87 1035 722 306 656 -132 654 -785 338 111 710 60 714 -9
1059 -9 19 431 -298 -571 422 -371 -712 -550 1217 -470 -649 358 -400 -1231 -819 56 750 217 -129 -591
1079 -591 639 221 142 573 -770 1027 -237 -686 -344 -553 96 -1023 373 235 548 910 418 1253
1097 1253 -235 720 26 -297 -17 -530 -67 346 -267 -781 89 958 -325 338 -227 522 -183 764 -293
1116 -293 -436 121 -766 1197 -213 407 34 85 510 -398 84 -1257 330 -847 576 -1661 -971 161
1134 161 -956 163 -791 310 259 -1041 496 -1343 -171 -472 39 -199 48 671 -609 1037 -88
1151 -88 717 -190 138 735 209 -372 -451 -212 -574 -630 577 -333 54 1137 -336 -445 -772 646 -218 46
1171 46 -463 339 172 964 1169 645 -314 734 -104 -557 200 -544 593 -1264 280 -781 -134 559 -77
1190 -77 1265 -237 374 -174 499 421 -454 -581 -904 1417 -2160 -880 -551 402 1150 -88 -480 -411 407
1209 407 -20 -548 829 -46 56 -83 205 71 78 1042 -242 1669 -339 70 330 422 913 -408 673
1228 673 -2289 12 -161 -499 32 -629 538 576 -18 374 45 -153 251 880 -292 170 -424 -86 648
1247 648 9 -3 -959 275 -275 22 -469 156 -257 -638 -538 675 -58 478 133 -238 822 -856 -252
1266 -252 404 730 -214 22 292 220 -68 -942 276 -865 646 -394 -552 799 474 -494 -470 93 699
1285 699 -1432 541 -178 813 -1408 -572 187 -783 -261 -667 518 1181 -797 526 273 530 -81 191
1303 191 -44 -758 47 1053 1442 -400 1182 135 -1344 1015 220 710 -1032 617 -878 -282 346
1320 346 -397 429 -1446 338 -1394 -221 -13 -616 -367 -398 129 119 -1219 788 -205 -65 -493 1500
1338 1500 204 -95 1545 -171 196 -1030 -66 161 -310 -422 323 -187 -183 611 257 -337 -540 101 378
1357 378 71 -14 939 -87 -92 -1214 707 798 -756 -341 -760 518 154 661 731 10 213 -209 -915 -337
1377 -337 234 137 -636 244 -1252 255 -113 -243 1048 -985 696 -719 560 -152 -90 -677 -234 282
1395 282 -424 741 -87 348 -491 -233 197 -1100 -137 -882 122 -149 -595 629 -1067 1602 -520 -510
1413 -510 -663 -288 884 -960 522 -684 361 -338 -93 129 -1498 540 -830 941 -311 110 655
1430 655 662 -322 -1220 -351 -172 -729 1409 -1037 -389 -938 -513 -220 -1336 697 -315 -1740 -26 161
1448 161 -492 -371 497 -1055 -228 -9 743 366 659 -1148 -239 -236 -89 -433 -693 1052 -280 772 -769
1467 -769 -499 -701 -652 -233 -642 491 766 979 -557 546 1059 -205 551 -1239 309 -1421 1887 -1278
1485 -1278 -578 1197 -349 677 -241 -116 166 -563 1141 429 84 -321 1550 -223 -24 822 -160 993
1503 993 -1711 239 -606 958 704 -230 -689 -1438 616 -933 -309 1479 -948 80 -637 1504 -796
1520 -796 188 -442 -1206 901 -1208 895 357 -460 701 508 151 -112 469 -549 168 -376 -919 370
1538 370 570 568 -814 -1519 -1117 -68 818 -308 -262 -293 433 260 342 650 -370 -655 -32 599 -261 -479
1558 -479 -152 -58 221 69 91 1027 -289 -174 393 -833 159 -393 351 -308 -1409 653 -495 535 -112
1577 -112 -490 290 754 925 -800 101 -827 -53 -884 -409 1724 97 851 -478 1192 -215 485 501
1595 501 -1324 1124 -1000 1103 91 499 69 897 1409 -1101 998 289 501 -3 -1356 1387 -1037
1612 -1037 647 71 380 -564 -1523 1257 -746 -147 90 243 -1150 250 -169 361 -19 -323 256 607
1630 607 -1098 -673 -501 316 -473 -394 -999 -615 1058 -1250 -602 -878 -528 -531 304 408 45 731 -45 -491
1650 -491 -234 580 1088 -180 -882 298 -1168 411 -321 -169 827 -272 869 567 1102 -152 123 -262
1668 -262 -20 910 -791 506 213 -904 634 -870 604 -1103 365 -478 39 843 641 -45 -953
1685 -953 1125 279 503 52 -1114 788 599 1625 -330 528 1248 -1268 331 -1882 1005 -355 911
1702 911 75 -971 860 -1286 1214 -1114 1042 -529 -1095 237 -395 598 -1733 567 -443 22
1718 22 703 -553 -53 -933 -121 -1039 -345 507 -956 -108 -1009 -523 40 566 710 611 696 -533 -69 -607
1738 -607 306 258 -416 349 1124 91 -127 -321 -305 405 901 1199 751 -405 -28 165 1011 -1277 29
1757 29 -604 -365 256 -202 698 -772 960 -983 721 190 -378 5 -292 569 -429 194 146 -254 979
1776 979 -1024 87 -231 352 13 347 -55 -580 675 -289 445 -477 -246 93 -621 -45 -1622 715
1794 715 -498 -646 -108 -513 700 -960 898 -1189 554 595 -815 1142 -1015 134 -157 511 -379
1811 -379 -343 1259 -1514 1537 -840 170 -328 226 706 -340 331 -439 118 141 -747 -466 -384 523 -849
1830 -849 458 73 685 787 -108 -33 167 -620 -683 556 -69 -450 -85 -335 137 578 1115 902 61 -520
1850 -520 684 -547 612 -1034 -580 -140 -520 -179 -232 862 257 966 -715 -551 4 -1221 124 657
1868 657 101 -633 306 539 -24 548 -456 158 -33 836 190 -691 1188 -84 -35 31 323 989 -1229
1887 -1229 202 -1022 399 -807 -305 946 -623 1272 -656 619 -226 -1003 750 -593 588 -2512
1903 -2512 942 -391 -532 507 -1216 3 -405 8 -71 -157 525 -744 1142 -1556 1053 712 70
1920 70 1215 -923 549 468 58 -115 68 511 150 97 -444 -43 854 727 535 -91 245 683 -591 546
1940 546 207 727 387 -433 265 -367 -1275 -621 -214 -1317 -1047 -272 136 910 -176 1190 228 258 15
1959 15 -312 739 -697 -538 640 -372 292 -1041 309 -1521 586 -601 -523 1260 -266 330 -371
1976 -371 441 -59 -263 707 -50 501 866 -11 704 -526 583 -362 -289 -731 625 728 -438 364 -76
1995 -76 1260 363 -314 472 -1549 387 8 760 -245 -81 1051 -600 546 287 1192 -335 568 -318
2013 -318 -505 1179 -222 331 105 173 -773 7 -1184 225 1158 -335 284 227 -194 525 -4 452 580
2032 580 -57 380 -512 299 243 -839 697 814 209 98 -882 -408 -609 954 -675 539 -315 -611 725
2051 725 -428 580 -534 1171 -362 163 183 -918 420 664 293 631 145 516 -139 772 -1967 -760
2069 -760 337 244 -524 50 -250 -400 -447 -606 -85 -65 -66 -716 -265 165 -357 1595 52 -174 640 -1599
2089 -1599 342 130 -115 549 -225 698 -784 1818 -666 -262 -290 -42 286 -128 1328 -488 -287 320
2107 320 -901 707 -1047 109 -321 190 334 -223 -193 -990 796 -685 -903 -736 -25 -478 -268 194
2125 194 -181 -171 393 -383 -565 409 -133 -262 -1337 353 -670 -126 928 -1829 1252 -303 -65 7
2143 7 -38 292 -1421 798 95 -539 -370 -2 553 -897 -259 -1018 719 -339 262 470 -1095 292 -521
2162 -521 335 474 691 153 -1043 724 -1021 1470 -846 -346 255 268 440 -1168 -249 -979 939 -489
2180 -489 32 303 -370 515 -1778 1179 91 -728 1804 -805 770 -1469 -1167 -34 -349 -525 -1375
2197 -1375 580 59 717 -101 -162 813 -308 704 -405 620 537 716 -158 -310 177 -95 -103 143 1168
2216 1168 328 261 1145 -698 550 142 -374 556 1049 253 -155 646 124 -45 -375 96 -283 315 -17
2235 -17 -310 89 146 153 -1068 1096 -1053 1119 -1149 1276 595 -966 -15 -305 1047 -933 785 400
2253 400 -1332 210 -372 471 -776 403 449 -988 1771 -697 1365 -1134 1991 705 -421 725
2269 725 -640 733 -508 625 -497 -1199 252 -714 949 -1767 265 -276 -606 278 -414 1094 -1216
2286 -1216 219 -295 -147 296 365 405 98 494 -578 100 225 -380 138 -525 -114 -261 -259 -9 246 295 -1378
2307 -1378 -134 -867 -999 -137 -510 802 -163 794 -363 -464 1121 541 48 159 121 200 -68 -314 -489
2326 -489 500 -369 -1011 731 27 731 -782 -663 -33 -89 1599 566 -124 -784 -62 -107 -315 -105 4
2345 4 189 944 390 761 -183 203 246 438 -334 -142 337 -261 1535 -717 598 904 -692 1408 -1720
2364 -1720 795 -621 58 -77 -898 1301 -1813 -138 -951 122 -509 -357 28 -638 781 155 447
2381 447 21 -121 477 -444 917 -748 -76 182 201 487 -500 383 -1149 711 -393 154 -47 -81 267
2400 267 550 1182 454 -37 229 613 -141 512 -39 117 357 -6 -516 -85 270 -306 -107 8 -501 -229
2420 -229 -1098 153 227 294 828 162 581 -706 -61 434 219 32 595 300 619 876 -367 84 -401 -102
2440 -102 548 -509 416 -1526 1051 400 674 -562 23 1195 -1200 1380 -426 -809 -127 -227 79
2457 79 -572 -394 -555 1040 -307 193 670 -532 745 -1270 873 -731 -514 1132 -1840 708 -670
2474 -670 207 67 -87 1091 -757 357 365 -13 -323 -746 329 -409 -390 -162 -537 -1396 225 143 -411 -289
2494 -289 462 690 1083 2025 -132 -812 -234 -207 -171 552 -34 1107 37 -171 109 -303 521 -299 -340 -31
2514 -31 211 -90 965 740 317 -16 108 -1 475 -507 586 -371 111 -298 -367 301 -1271 709 -184
2533 -184 -378 123 353 875 -1581 413 -220 223 -637 -137 -85 -1132 911 -364 292 85 -481 110 -750
2552 -750 -21 -661 -295 725 1167 656 -1267 1047 -1400 -193 -510 648 -455 -1022 713 -971 875
2569 875 180 -962 932 1092 325 -464 771 -564 218 1066 -1614 843 -998 877 -1058 180 711
2586 711 -929 231 -171 313 234 259 -36 -234 -677 365 98 -422 -190 515 -822 961 -598 -558 -248
2605 -248 -335 -545 -355 -238 -94 -339 -117 -793 330 800 372 804 411 842 -913 222 -745 -556 509
2624 509 -1468 -713 542 17 143 -1229 1625 511 482 -979 -42 -420 -1412 1171 -1239 643 -864
2641 -864 662 -316 -613 813 -73 1015 -1819 806 659 -84 -273 306 91 -1559 388 1218 -1264
2658 -1264 -497 -981 606 -1162 1003 -232 172 -257 -534 439 -1272 1304 681 -130 -263 -1350 -76
2675 -76 -150 365 149 425 659 -625 -1372 148 810 -2 362 499 -368 409 -818 565 811 -1171 607
2694 607 -471 516 -834 -305 16 1462 -792 -18 -248 -224 67 496 -1210 1089 577 -130 290 -225
2712 -225 623 1253 179 258 -177 24 -445 811 -654 -74 -170 -342 928 55 584 -1137 453 1467
2730 1467 -329 628 -517 145 -723 88 474 55 2059 -1424 -95 -881 270 -966 199 195 -466 -2
2748 -2 -132 1397 -863 -676 -93 -109 313 -828 108 -456 202 635 -1576 822 -498 990 -569 -271
2766 -271 -813 -1732 409 84 -80 -897 -938 -587 -71 1010 -281 -78 4 842 994 -1128 393 -377 541
2785 541 20 -104 698 -682 -331 -1709 -119 609 -486 654 11 -1547 760 -1312 -42 -97 -423
2802 -423 -81 -446 599 -939 528 -147 1252 199 -106 131 -460 364 415 -181 -670 -365 750 -271
2820 -271 308 -1134 583 -1208 63 -44 -1360 1697 -16 733 30 237 -89 -493 1454 33 -65
2837 -65 -192 550 972 -401 884 -792 1238 -740 -1060 259 -87 1333 605 -350 -503 -165 -622 -608
2855 -608 636 -360 237 -1414 -574 -594 -195 699 483 1204 -791 -199 593 -21 930 -450 757 -351
2873 -351 -489 168 -1122 260 -349 205 -732 619 841 -1415 1650 -1372 1241 485 410 442 774 900
2891 900 38 -10 -434 -575 159 -704 273 292 -673 -197 -709 403 283 -195 -215 182 -345 952 563 -196
2911 -196 -476 1375 -555 987 -551 572 -765 -322 64 -869 258 -84 77 1353 -1430 661 -424
2928 -424 1160 -980 -362 -219 -1008 53 -204 -351 -745 -152 305 253 1839 -1329 -215 -427 978 -585
2946 -585 176 168 -1328 1478 -1760 161 -1028 1497 296 -996 754 -1166 690 -97 -120 -560 -279
2963 -279 -675 -733 342 -1060 819 230 339 27 -321 717 55 -233 199 233 536 53 925 -264 -475
2982 -475 296 806 -20 -277 286 1080 1424 291 819 217 -292 -277 -230 -338 1422 660 -72 215 -338 790
3002 790 -1035 1197 -220 218 1091 -852 719 -689 428 741 714 69 -801 -80 -331 298 -1148 -418
3020 -418 1595 581 841 -73 1382 -743 -262 915 -58 928 -549 1013 -149 167 -106 -1425 51
3037 51 -407 465 -1102 -176 168 -955 842 304 213 -696 -12 -374 -368 755 -790 715 -562 70 544
3056 544 -1872 942 -1525 729 -531 71 -776 -422 807 17 67 -1402 676 494 -434 -482 -459 42
3074 42 240 -1370 1499 -1079 817 -648 -104 619 -961 -1075 -564 720 -348 -205 -253 -425 -418 -58 -558
3093 -558 234 -99 -216 89 367 403 162 677 -635 -61 284 -326 -86 -31 323 -835 705 363 -157 -355
3113 -355 -460 1219 -1580 614 -1374 -15 -1059 131 656 -1042 -141 -428 -45 302 278 102 -193 475
3131 475 -1115 627 -170 203 -552 -1297 877 -1098 821 346 86 783 -1896 501 -347 1025 18
3148 18 -400 335 -696 859 -1889 -579 -147 703 -210 -814 1589 -970 1219 217 520 180 454 175
3166 175 -457 738 49 1377 492 156 158 -258 208 7 33 601 782 -679 -67 -625 1180 139 227 -595
3186 -595 -230 1130 1038 617 -380 -87 120 954 159 -660 943 -448 684 -200 6 111 87 291 -638
3205 -638 632 173 462 467 -850 569 -935 134 290 197 551 -1023 638 -1344 -265 -617 -493 110
3223 110 -641 1918 -1873 1306 810 821 530 579 1042 -508 71 -1160 -353 -47 -1256 750 -416 1269
3241 1269 -687 18 898 -938 173 -1186 -73 487 37 1105 -488 503 -1461 339 41 -502 1089
3258 1089 321 560 -528 910 409 446 -820 710 -82 -251 501 109 -654 -508 539 357 -118 33
3276 33 -305 147 967 785 -156 310 393 1028 566 -874 167 402 -161 -690 721 -624 701 547 86
3295 86 -451 881 1501 -1329 374 579 -104 1215 -530 -64 -285 597 -981 717 -462 419 794 -723
3313 -723 -339 -930 751 928 -930 622 -271 811 208 1458 175 -804 -745 -1313 248 -365 35 -623
3331 -623 -421 838 -867 1084 -1031 -157 -296 -214 1042 -638 1090 -165 -65 -1270 114 328 -419
3348 -419 865 71 -6 238 -692 754 21 -154 -1157 -160 248 -128 324 -1650 -369 -196 151 198 -366
3367 -366 -1145 68 -117 514 -247 -77 -391 356 -188 -71 761 359 -165 -458 -28 375 835 503 -327 -273
3387 -273 -24 -411 810 -96 1494 -158 -395 -270 -709 -170 240 659 -349 424 -641 -60 -313 -730
3405 -730 894 -972 177 -1052 100 355 -1194 456 -143 -250 -250 535 -299 -137 423 -2310 402 -750
3423 -750 658 241 797 503 -272 1056 248 432 -677 -66 599 -337 -247 -1500 488 461 633 897 -852
3442 -852 560 -407 441 -169 691 497 113 124 -785 492 -28 -437 387 -448 664 -530 -18 -302 347
3461 347 208 -656 277 -847 -387 471 118 419 635 923 -1014 -186 1076 204 -925 134 -651 228
3479 228 898 900 778 179 97 -1143 131 -474 364 817 -86 257 -819 123 -50 339 112 275 -61 422
3499 422 671 -758 35 -700 -104 -419 -1911 281 -1452 1287 -1390 -212 118 -1115 465 -42 251
3516 251 -279 -616 447 -731 1161 -906 -416 810 -349 339 -341 151 -857 956 133 209 -1069
3533 -1069 -308 1172 -1190 316 -710 -300 516 -162 195 564 -69 562 260 76 -159 525 -475 -333
3551 -333 -250 133 192 70 689 294 409 371 -268 -634 690 366 -325 49 -834 131 -889 -233 263 -268
3571 -268 717 1496 -246 330 -131 -936 -27 -422 -482 -348 813 -907 725 456 -325 192 -183 869 220
3590 220 -312 -506 1095 1 -485 -26 -36 -760 -281 941 1424 -616 996 -863 -639 616 -1337 570
3608 570 -601 1249 -1276 -50 306 -705 956 -540 631 -442 -738 -110 -1284 -215 -956 -357
3624 -357 -761 1226 -61 -1547 948 -331 28 -349 -724 591 -1071 824 -176 1006 280 579 -38
3641 -38 -180 998 304 35 -253 740 65 -1074 -47 -655 942 81 124 430 40 66 -674 1040 155
3660 155 -925 -217 -463 257 -751 -267 -27 354 -391 70 -320 392 468 1397 -824 167 145 406 481 -302
3680 -302 43 -894 -117 -84 191 69 155 764 -81 19 -1070 1096 -205 -997 1455 -194 63 545 -175
3699 -175 -200 -170 124 367 862 989 100 513 -1083 523 -168 375 -790 325 672 -1655 75 -1423
3717 -1423 1129 -1123 673 -218 -610 760 -174 1594 -713 -89 338 706 543 -572 -23 -751 -81
3734 -81 -288 -457 147 -426 426 -1103 -139 -1013 -712 -294 -279 -587 -434 428 -381 -546 -212 -198 -355 -283 -626
3755 -626 -337 730 764 172 353 -128 -714 201 155 118 1340 37 -766 811 479 290 -741 373 805
3774 805 156 -671 638 242 -685 406 -33 1078 -247 819 -417 1517 877 -1772 517 -494 777
3791 777 375 -333 45 -353 1184 -926 412 -1294 1052 -674 -512 -210 -1890 442 -133 -665 -288
3808 -288 -584 868 -2222 304 -960 -193 -147 -682 1228 -711 899 -32 -388 437 -658 227 -1090
3825 -1090 1135 -1723 80 -7 774 -110 -440 -173 -120 -24 473 -275 1064 -404 42 465 541 -845 497
3844 497 -77 149 620 -88 1497 408 411 479 302 40 529 125 -323 -321 -76 -363 -494 1238 -806 -455
3864 -455 -324 -469 527 437 288 -1104 1746 -180 -49 872 -678 848 -1293 -367 -1109 78 241 -1136
3882 -1136 990 -683 16 -678 -413 316 360 581 -808 1369 -515 762 -408 -79 329 -1518 -136
3899 -136 -1133 1641 59 38 -586 -1135 1056 -1071 488 -154 -1072 152 -361 917 -616 -37 -271 -79
3917 -79 -152 -475 892 -650 -439 53 -674 -258 -1187 -577 -920 -504 581 -156 -166 185 -278 -557 352 58
3937 58 683 -252 -287 423 -1225 433 -35 652 461 -1656 -281 -331 -271 -158 587 -362 743 -815 148
3956 148 1177 -692 -491 -637 40 32 1768 -338 98 861 653 -621 -686 967 -864 266 -774 -45
3974 -45 260 -521 526 -449 646 -530 -409 294 -566 878 -582 983 -1641 -166 361 621 1261 -977
3992 -977 858 -479 75 418 -811 456 -842 635 802 -247 1268 -123 -237 852 535 -1190
4008 -1190 435 -1235 -365 -185 -535 552 -1136 -946 325 736 848 -1179 1373 -264 408 -624 -634
4025 -634 457 -1418 520 -1269 -144 -173 512 -77 -315 -411 -713 -1242 356 -77 9 240 1654 -521
4043 -521 466 -284 399 448 308 337 -368 541 367 -830 577 879 155 -115 120 -305 -72 656 -252 587
4063 587 781 398 1742 -1096 7 708 135 576 -175 695 -411 -169 292 -26 571 -434 31 -833
4081 -833 -189 189 -1008 -738 -800 363 -138 -229 332 4 747 142 238 -1373 527 -286 1070 406 -720
4100 -720 878 767 619 -187 -14 380 -377 899 -104 2239 -621 143 77 -642 628 -1715 -288 -1254
4118 -1254 -546 -162 -519 775 104 -666 -689 414 533 -576 -146 -908 571 -723 350 -100 -564 1625
4136 1625 375 -34 -3 -645 30 1037 -589 -128 -85 -358 423 -164 286 -519 769 65 684 -743 288
4155 288 779 -1388 -577 243 -75 -476 552 685 767 434 -565 774 -1282 -224 -369 -240 1207 -1669
4173 -1669 703 -223 -185 279 51 316 -61 481 -747 701 476 193 19 244 1616 -1655 823 72
4191 72 -293 319 -1242 336 -484 -302 -903 217 265 -875 1090 -1112 -337 -259 491 -270 -598 -58 -702
4210 -702 433 -154 -717 -901 -211 696 -750 -117 829 -464 316 -431 -643 743 -492 -101 -729 753
4228 753 1040 871 792 761 1142 -1280 180 785 -515 -139 -965 -34 -607 -80 461 -789 610 -99 299
4247 299 423 -1087 127 249 -71 -601 1098 -373 -1041 -330 -667 -377 -1109 460 35 -495 122 323
4265 323 668 473 323 701 762 514 -111 478 -1466 819 -958 640 -477 -721 946 -1898 175 -493
4283 -493 682 148 -870 1116 -277 1191 -690 799 381 -422 599 -127 1138 308 362 -588 320
4300 320 370 -389 1237 -619 975 -326 599 712 -873 651 585 -74 -18 -157 381 15 -63 -152 961
4319 961 120 -122 563 -628 325 -669 498 -47 444 -377 910 1138 716 -479 576 172 811 1285
4337 1285 -508 180 -360 291 111 -850 537 333 -62 806 694 -490 317 492 311 792 -498 192
4355 192 -517 1160 384 -763 -682 127 362 -126 311 469 -642 51 425 985 -257 62 258 108 -164
4374 -164 215 1633 -967 789 298 -227 691 -1378 936 -1751 376 -1334 264 593 -895 1514
4390 1514 -361 1061 -85 769 -387 159 206 -1099 111 -664 -16 -359 -226 1058 -689 -377 -606
4407 -606 176 669 -1009 374 -861 -325 -533 -423 330 -864 304 -49 389 315 629 -558 -270 510
4425 510 321 1332 -352 235 724 -797 1064 273 -771 167 85 140 223 -1063 -707 112 -95 24 -205
4444 -205 595 436 -203 -383 1012 -206 -1030 -521 460 511 -256 268 332 144 -1330 -468 448 -728 922
4463 922 -1206 1153 -356 188 -152 -274 851 -126 -378 219 90 863 166 358 -780 -439 -1054 -75
4481 -75 77 -159 1493 -599 1845 234 618 1186 -797 468 -897 667 -575 -979 365 -266 -40
4498 -40 -1389 156 548 208 83 186 787 -63 351 -468 -785 -113 -71 755 -1012 -425 -384 340 608 -548
4518 -548 -21 176 416 908 374 681 1075 -777 -126 18 882 -1377 523 -380 -862 21 -427 1206 -153
4537 -153 -210 601 1130 -197 -588 225 28 81 -349 135 1394 -813 -129 -278 158 -51 -234 718 -397
4556 -397 -156 -1187 109 -464 1367 205 121 975 -167 86 -79 -414 -1370 -612 72 -643 -90 -250 -78
4575 -78 -313 -860 1139 -591 -228 -340 -175 328 -12 1116 -1141 1062 -197 391 262 -1776 108 -730
4593 -730 872 -415 -328 766 -1448 674 -1052 633 105 -301 865 -935 770 -390 177 -622 -150
4610 -150 -237 -71 -34 -884 531 163 54 407 122 524 -202 386 478 325 -1320 248 -404 -3 254 329
4630 329 -191 756 -685 -252 577 511 556 883 212 -232 -138 -92 -483 1600 -521 137 669 -386 -281 -603
4650 -603 464 -1098 472 552 380 -300 -880 864 237 1082 -75 279 1213 -799 2404 226 -408 -855
4668 -855 230 505 -2062 1259 -286 823 -627 346 820 -442 554 313 1356 235 724 -389 87
4685 87 -308 485 573 91 251 270 -39 1189 124 -82 -610 156 -290 5 -1 61 -102 377 -131 -164 -249 -1425
4707 -1425 -356 789 -401 784 -512 113 121 648 -613 685 -245 475 -372 -354 -818 -768 189 -134 388
4726 388 573 -49 -305 353 -631 71 8 -414 417 -196 -134 563 -998 588 -619 -89 229 -441 1585
4745 1585 -1105 185 770 457 56 -14 72 -642 271 -79 261 617 -449 276 -1114 1218 -312 -658
4763 -658 1279 -834 1009 -1037 -178 -683 504 134 -638 686 437 415 -624 198 -540 40 118 -454
4781 -454 950 -633 -360 1123 233 1074 -397 -31 -931 1392 571 -70 908 431 184 486 21 119 -75
4800 -75 107 1277 -692 -56 618 -339 277 448 -162 -158 -712 615 642 -921 201 211 -708 596 -669
4819 -669 -255 -385 337 -431 -41 637 710 -32 -238 1179 222 -1078 180 170 -12 -1 -267 312 14 321
4839 321 -760 601 -341 -931 -415 -532 455 -1274 309 -166 -11 140 -475 -536 -117 823 -52 -389 220
4858 220 -490 1172 -116 1197 716 17 480 -483 1001 -1157 217 -939 -300 165 -1470 1302 -1732
4875 -1732 570 840 -506 -154 -304 -166 182 826 -591 1424 -489 491 -673 -1092 1173 -282 264
4892 264 23 250 1041 -433 146 272 49 1291 -840 444 -240 -612 298 -1321 416 -531 -205 158
4910 158 -411 -102 74 325 -615 -368 -92 -368 1379 -398 -873 454 -620 -1004 194 695 -1063 -922
4928 -922 123 64 -570 -808 -379 -155 -266 57 -280 -452 -18 -347 -1297 259 -374 1071 567 -77 487
4947 487 -718 924 -552 799 -478 -680 185 -1794 1635 -1148 393 182 -877 526 -1327 278
4963 278 -1183 916 -630 150 169 -1088 251 -1476 -297 883 -238 1010 -236 676 -95 -536 -400
4980 -400 -955 361 -931 -364 -665 -278 944 86 113 1390 1326 21 -370 -4 -93 -369 -342 672 -550
4999 -550 -534 -245 -490 796 397 -587 299 -358 400 -93 -111 418 -1177 892 -708 -227 -422 -162 287
5018 287 602 -962 -475 468 -288 -388 886 -463 355 -725 -657 -767 719 1841 -809 552 -617
5035 -617 1475 -18 -507 -304 505 1073 -1012 154 -331 -550 -251 -1116 433 -824 -33 -1177 -62
5052 -62 -116 -243 969 -1270 405 185 -72 849 -163 34 -1731 -367 -1083 -270 1144 53 955 -881
5070 -881 37 -1167 482 -33 143 -1102 -1211 121 309 221 -259 906 710 -503 685 -122 814 -35
5088 -35 1200 835 64 423 -456 -742 -90 -380 337 -558 235 418 681 307 -523 165 -714 681 646 152
5108 152 -713 -288 -520 -212 125 355 -321 118 103 -649 -508 202 410 92 515 -353 178 512 -257 1152
5128 1152 -1759 -209 -597 115 709 184 -385 -21 658 -336 156 -32 124 1942 -767 190 -417 -212
5146 -212 649 89 1482 6 -459 -938 388 -148 -128 1040 117 -51 183 653 -471 -268 627 -1093
5164 -1093 701 -703 175 86 -457 -325 -902 343 -947 453 -307 1227 398 -485 265 -23 335 -515
5182 -515 -156 -16 541 381 662 -175 160 1057 935 -37 67 42 -491 -912 735 -512 -450 -127 -19 -166
5202 -166 154 -472 838 146 -253 1231 693 349 465 236 964 148 1671 -116 837 -137 449 323 465
5221 465 724 -536 1539 60 -63 919 -1811 569 264 267 -1695 185 689 -874 -481 -258 1166 -743
5239 -743 175 776 -694 736 -637 2436 -1802 -456 974 -824 118 -1416 275 -131 46 -180 -69
5256 -69 603 -153 351 -782 -176 -661 697 1245 -729 314 6 -836 -506 969 265 -985 202 -899
5274 -899 -763 1052 -786 -223 -685 710 -664 62 230 -510 752 -1253 -1538 -1590 -262 -524 -545 -678
5292 -678 -483 -277 -529 -103 -234 -566 -478 100 -384 207 -599 1173 -315 410 887 1124 157 -143 766 -244
5312 -244 88 514 -145 495 -1173 608 -606 547 991 -699 1348 -889 138 -1613 505 366 -981
5329 -981 1010 -642 1014 -182 614 -433 -118 708 -395 712 80 -386 -1132 -583 881 -1542 329
5346 329 -852 1188 -552 -1057 451 -1617 738 -83 563 292 881 -322 -1222 141 -779 663 -989
5363 -989 -681 -65 -242 23 -967 911 -497 -25 71 -1835 -74 538 269 -480 -393 678 209 135 -306
5382 -306 -200 745 -397 -100 -318 -479 -233 445 -31 76 -517 297 448 -475 -360 575 611 -175 83 -892
5402 -892 -145 294 1080 236 -143 -261 -74 521 -506 255 -1725 -654 -364 363 283 -420 51 -784 -198
5421 -198 50 73 893 -1091 1135 -681 91 -260 -389 1342 -1250 300 158 482 -786 -660 1244 -1139
5439 -1139 97 -404 -292 509 -47 384 -265 472 -129 929 171 620 594 -1600 637 -880 676 -200
5457 -200 -641 154 -1298 144 -238 904 262 -792 1130 19 -279 94 -487 229 464 58 -635 -349
5475 -349 83 -342 637 -643 1199 1034 -15 139 -341 33 -69 -89 -274 331 -436 67 -403 154 372
5494 372 216 -404 -64 648 -30 357 610 711 -884 -367 -586 -345 -88 506 -352 -424 884 -1276 732
5513 732 -333 -1165 283 -992 160 -1055 1460 -499 -188 177 -774 1434 -1502 342 -1877 135
5529 135 -85 879 1402 -50 1792 -319 -505 230 -1120 -843 -73 176 -1423 732 829 -54 1157 -521
5547 -521 635 -346 -115 -1028 716 -158 518 332 -1239 582 -569 -759 -47 -929 -199 136 711 443
5565 443 -624 -525 354 732 81 -163 91 -393 -998 -453 119 -294 1104 233 -179 -385 -155 -269 417 -599
5585 -599 677 1486 -113 1329 -552 -490 -1159 -310 -1395 163 -600 -1033 330 586 -64 -300 865 -700
5603 -700 -252 44 220 341 -327 212 -22 -167 584 -1107 1386 -954 549 -69 800 204 -1095 737
5621 737 -1331 -155 -652 -948 1066 -424 754 -777 506 581 205 931 -896 150 -449 1060 -202
5638 -202 -436 960 -504 -130 -541 121 -421 -607 1588 553 989 -2408 825 985 300 -720 -757 -40
5656 -40 -54 -47 530 311 -669 -760 654 -900 -737 -26 102 -300 755 628 258 -449 -602 -1236 -623 -615 92
5677 92 -254 -537 1260 -518 -50 -103 1478 756 -501 -578 -412 79 21 277 -427 -625 -356 -242 789 467
5697 467 -67 -30 227 867 193 596 1129 -599 576 -612 1013 -12 -216 -349 -156 1436 -1886 77
5715 77 -890 79 -520 -621 -666 -1187 557 -2424 245 -765 -317 728 -907 973 433 1589 -945 -1279
5733 -1279 795 -716 1225 -44 374 -563 -659 881 91 1052 -267 72 38 576 512 -370 1082 -800
5751 -800 1194 375 317 1172 -704 772 -90 260 -361 517 -132 -1 475 692 -56 -38 367 -1090 152
5770 152 -506 -1084 -500 485 265 -786 -107 -789 22 -6 -507 -291 473 -177 -541 412 -1985 -197 -235 400
5790 400 -150 -487 835 226 199 -1422 1288 282 640 -25 -901 873 30 -737 -116 525 1594 90
5808 90 1923 529 -855 549 -333 197 -255 517 -863 582 876 559 1268 -719 -438 -568 368 363 533
5827 533 238 -922 856 -6 -202 -518 -28 220 -1558 260 -735 -986 -16 -122 252 68 677 -505
5845 -505 192 -466 676 238 -481 362 -734 902 702 574 1422 -576 460 33 -111 -1395 -1191 -68
5863 -68 469 -325 341 151 -576 -72 257 -833 400 1167 -558 -220 -292 677 290 -605 530 881 123
5882 123 536 612 -71 -670 714 -1096 1076 401 527 682 547 -157 -512 -4 -618 79 830 -79 230
5901 230 -954 811 -651 1020 301 -11 995 -959 1366 -302 244 48 -337 589 -475 271 -999
5918 -999 381 -4 263 638 -13 374 -1373 -455 147 382 306 -1442 779 -853 913 94 101 1068 -637
5937 -637 828 -1040 658 244 -166 -606 -535 760 -431 -109 322 -318 978 411 1019 -470 1134 -205
5955 -205 -1202 -646 -191 501 441 -500 -900 -128 -195 -803 494 935 -308 -229 1376 -553 526 -321 321
5974 321 244 710 535 -111 1608 540 763 29 989 245 566 -104 -217 80 -652 1300 -404 -427 531
5993 531 -404 -295 -531 970 -572 892 -982 580 429 378 1076 190 -308 355 266 1116 232 1041 148
6012 148 -442 -1240 164 777 -872 180 -32 996 -714 -491 239 332 1226 -533 428 -720 42 841
6030 841 -567 1097 -1259 204 -673 -44 -673 231 735 385 -44 -38 -437 -35 -419 -454 -1136 1006 175
6049 175 -687 218 -750 -94 292 -40 -44 505 -358 395 788 422 -384 -115 292 -364 -547 409 242 507 631
6070 631 -914 -1173 -18 690 149 -294 307 -298 707 -916 183 954 -1142 985 -1194 1075 -75
6087 -75 298 353 -333 -368 -254 68 -352 -438 103 -129 616 -566 1345 -8 162 286 -86 171 -819 876
6107 876 -676 95 55 -284 1144 -776 -139 -415 202 366 -938 1381 -801 1350 248 -809 563
6124 563 604 816 -715 1023 443 -568 -743 -1202 -645 -1172 -81 234 464 50 -397 419 -280 -142 -792
6143 -792 758 -1389 605 -97 77 293 -602 501 56 -770 1114 -705 -385 931 601 228 -236 1426
6161 1426 -1114 55 719 -427 0 269 108 308 -725 702 206 -55 554 -106 1064 -926 -553
6178 -553 -241 -256 419 -380 796 -677 569 377 -192 -211 -1527 903 329 216 -2111 635 -536 -921
6196 -921 826 -681 1031 213 1104 -755 431 714 -1341 271 -705 244 -1897 746 661 45 1006
6213 1006 -649 1300 -479 -126 677 -318 1158 -1583 623 -752 -1378 0 -554 427 -986 736
6229 736 -527 454 654 -142 551 -835 -382 -712 -107 -1078 -72 -137 -791 316 272 11 -536 -1519 -341
6248 -341 -1312 -256 272 -322 -279 -287 -654 -1127 -952 -301 139 459 523 395 828 409 350 -996 -627 268 -733
6269 -733 -193 -753 607 -506 -49 -243 -80 -731 -1388 1098 -797 537 234 438 585 -869 821 -1164
6287 -1164 330 62 -40 662 -433 1793 262 -360 -188 0 104 -386 838 -976 503 330 -59
6304 -59 290 -1037 -292 -1913 256 141 1197 -543 -356 493 -520 -207 -306 341 75 -1902 1200 768
6322 768 589 343 -40 -327 -863 975 88 756 -1305 39 -678 -580 357 -558 787 -308 -1090 555
6340 555 -201 381 -756 -228 -515 222 -891 -346 337 614 305 408 -200 680 -284 720 73 -612 1573
6359 1573 238 374 -169 -1451 794 -930 579 -351 727 -723 -683 274 -1214 1177 28 404 674
6376 674 283 684 -282 185 -586 338 -1191 413 1345 -799 1728 -1537 120 405 397 -50 -619 1063
6394 1063 -681 731 -1229 267 518 -579 206 -1016 1162 574 -841 98 194 171 -1088 145 -954
6411 -954 -741 -501 507 86 -1341 1239 794 -294 -666 50 432 365 227 -724 1021 -491 -511 715
6429 715 -816 82 -330 -810 191 60 234 -67 -20 -333 -303 555 -62 -454 -216 500 570 -119 -10 -256
6449 -256 -70 -105 -520 1059 -542 -27 -236 640 274 -855 644 -146 -315 -315 609 351 -493 551 -627
6468 -627 710 -556 -13 326 -992 1146 -671 478 -631 177 -299 -350 528 -671 960 -646 119
6485 119 -421 30 -38 -633 1788 -1500 1216 234 -59 787 -447 -238 -469 -357 812 226 2330 -146
6503 -146 2120 -620 -172 43 -2328 381 -847 1018 -163 1304 -95 456 363 -1562 429 -495 888
6520 888 -204 492 126 -748 81 -1404 77 862 507 951 -588 -334 261 42 -669 -194 614 864 277
6539 277 232 523 20 -830 86 -771 352 863 -438 -276 -57 624 -353 -3 466 -1011 302 -54 323
6558 323 -477 -585 505 1041 200 129 -1365 -713 -881 1574 -727 458 324 -539 -161 826 -15 -820 459
6577 459 -1784 -358 -594 -501 666 153 347 -706 -254 413 -1034 -160 -843 308 -598 -454 -169 -373
6595 -373 273 129 61 -704 -359 1134 255 -574 -602 1274 -437 1197 729 108 873 -521 770 312 -55
6614 -55 -816 -683 -234 -204 194 -992 1037 -579 -625 205 -611 68 -824 575 -174 139 620 378 565 -154
6634 -154 -92 -497 -143 -875 198 -617 864 -49 -178 408 153 -77 -405 251 -1392 556 -514 -157 -287
6653 -287 -281 398 -672 32 -1132 368 -321 -1923 1298 -1132 1195 246 557 1205 -648 1471 -1473
6670 -1473 862 -518 499 538 -311 1339 -610 735 -96 -997 -95 109 -381 -693 1251 -278 137
6687 137 258 -347 1805 -659 388 -944 -260 -648 11 1303 -1377 452 -138 392 505 268 356 -542
6705 -542 -308 -1169 362 596 -689 -59 -380 177 -920 -48 -779 -1327 4 -897 -536 -443 -90 1429 -827
6724 -827 -265 711 127 -47 927 -432 170 255 83 15 780 173 586 -393 770 112 20 -520 -609 363 95
6745 95 361 102 -373 336 306 1406 -873 46 537 708 1243 -1198 1636 -558 -136 1760 114 1371
6763 1371 -1251 -114 -697 716 -111 -812 438 -145 611 -389 125 1044 -980 1098 -77 2030 325
6780 325 -241 1263 -502 318 -1243 1519 318 78 14 351 1452 -665 1294 -186 -623 -428 -1084
6797 -1084 851 -330 592 -122 677 13 1034 279 815 319 -1347 -56 53 -103 -74 489 -1195 -634
6815 -634 66 -1434 73 560 -460 527 -228 -773 -79 -685 -762 11 -281 535 -31 634 -833 420 -157
6834 -157 -9 1273 12 -156 -448 -582 105 -647 40 81 686 -1460 104 -206 -315 345 -929 249
6852 249 802 -375 -455 -168 833 -517 -562 -482 410 900 -506 629 -1190 1050 803 728 -483 -297 1005
6871 1005 -1691 813 -545 890 643 -601 -987 -1116 539 -798 207 594 158 664 -313 627 -712
6888 -712 166 -258 18 110 -787 752 -860 -479 -742 -96 932 -908 1070 -302 215 -88 649 948
6906 948 -1563 762 -603 515 -386 -736 654 -81 1044 -650 -144 -268 -283 94 177 -196 375 -185
6924 -185 -208 517 226 -323 466 457 -821 88 598 -628 729 53 -753 -95 582 427 -200 -43 242 16
6944 16 -817 6 -681 1491 1028 272 647 -681 -3 -895 -5 -616 -914 746 -876 982 829 614 535
6963 535 415 331 -1250 66 -638 1252 -40 -489 -671 -515 269 -545 676 443 -1228 411 -1316 167
6981 167 -685 505 -230 -1093 1347 -723 1508 -323 283 -215 10 -126 -624 -799 -1286 -282 385 -185
6999 -185 460 -476 -76 209 1876 -161 828 240 -983 315 291 106 521 823 475 64 -290 790 437
7018 437 462 612 -147 -257 -73 -299 -614 143 844 -483 -517 324 -82 -792 -1295 -411 -360 -53 -532 723
7038 723 -254 851 491 233 427 -883 128 513 1444 -242 -832 1352 -573 633 568 702 1218 -300
7056 -300 -1643 -934 1386 -844 765 -670 -473 -648 543 1134 -998 746 -767 -293 83 649 -114
7073 -114 -782 -89 -480 391 -319 310 330 166 1189 -547 1051 -706 -559 331 -295 391 -45 1505 744
7092 744 495 547 -407 466 381 1070 185 1265 650 -769 378 -270 688 -47 401 -28 -682 14 225 -85
7112 -85 -1030 -719 139 38 610 748 291 -965 -537 492 -38 -951 214 15 -642 -5 -1066 582 1325
7131 1325 1391 -1600 919 343 -716 233 1215 -413 -1157 -171 482 627 49 977 -102 -14 -483 48 97
7150 97 292 -762 1718 -725 242 -377 651 -20 -1275 204 87 -223 -780 42 717 -265 684 -787
7168 -787 1052 -785 677 493 -983 1151 -402 150 -1387 393 -869 -372 -5 -486 397 -350 100
7185 100 -392 -152 -59 -771 125 -831 -266 48 1452 1240 -245 555 957 169 341 -426 -356 -878 159 -844
7205 -844 280 -23 236 -1827 -606 58 -219 -828 -282 315 668 237 565 -335 -1048 486 -110 422 -721
7224 -721 54 812 716 792 -717 -1045 1392 -658 182 -87 786 -453 -60 58 -769 -306 -667 1142 -762
7243 -762 -752 875 -33 200 -950 1426 282 383 -44 126 245 196 1480 -182 -339 -312 -719 70 -69
7262 -69 301 -551 1057 507 -1314 259 -681 1012 -1576 -185 -1309 -1047 1013 -167 1517 -815 103
7279 103 -1161 -759 -300 -1047 460 -115 -707 -313 -451 475 -497 248 -614 -601 -394 376 618 -1532 -120
7298 -120 -746 1386 908 -660 762 -1112 246 45 517 -302 456 771 365 116 -587 214 792 48
7316 48 210 395 1302 -198 -1119 539 -104 -489 -33 -729 828 -82 517 -1272 126 -108 -932 491
7334 491 -1760 214 -1387 50 255 -389 -5 -810 -477 -1843 98 -247 -1024 202 -558 404 -401 -181
7352 -181 398 391 275 -1044 559 -644 331 -547 -205 -405 -459 1129 74 403 -688 -525 398 -942 -68
7371 -68 241 -706 -241 -1102 -269 -697 -683 -434 717 -739 117 376 -462 294 -571 -169 -71 -375 -695 469
7391 469 -255 -1564 193 489 652 -81 128 -717 118 602 -739 -713 -1108 10 262 40 -51 418 1257
7410 1257 -576 -381 132 166 -395 935 192 168 175 -427 922 -1294 491 -824 960 1067 516 377 -158
7429 -158 211 405 357 -24 -958 500 84 520 376 -405 137 -725 1285 -475 535 -469 1178 -470
7447 -470 -361 1158 -1074 -34 -220 -385 147 -577 700 -773 738 -1435 628 -1853 78 1061 259
7464 259 693 -897 911 -169 17 -465 -752 1468 -1028 865 -1034 -1227 -640 -1142 372 -95 -95 -993
7482 -993 80 -181 -624 -317 -637 166 -1020 795 -465 -966 66 -632 1682 1281 204 -218 786
7499 786 827 -1114 308 -180 -219 -171 400 -663 -563 147 -95 -604 -399 199 -423 123 -535 999 -676
7518 -676 732 -534 -311 -778 -678 1292 -293 78 591 -325 878 -853 426 -825 484 375 271
7535 271 1083 -761 245 -1357 732 -564 -556 236 -526 602 -543 110 -915 -852 1380 -1121 850
7552 850 -1234 962 648 569 -177 -1265 1699 -783 359 -882 -368 -161 489 642 -385 1060 -457
7569 -457 -216 27 -4 -39 200 -386 1075 265 1263 -1169 143 -829 413 -497 -85 821 -330 1749 1228
7588 1228 293 -165 247 1644 -874 379 -228 911 -495 703 436 -100 -173 432 -664 726 -657
7605 -657 -525 136 -547 75 -180 -23 357 147 694 723 545 -471 307 -995 -534 22 -1177 -665 -583 383
7625 383 -958 416 -197 -1153 -260 -1027 525 25 111 -284 -192 319 -1002 1231 -1171 155 140 -524 171
7644 171 101 95 -740 779 -7 213 1093 -352 288 -818 484 -110 268 -60 -1114 -459 -1012 389 258
7663 258 -243 -473 260 264 -1097 1162 406 -855 -150 103 1092 -509 1031 -508 243 973 -1370 -134
7681 -134 -421 776 486 750 -360 316 405 398 74 -445 -771 -189 809 -337 -120 -146 491 -583 4 -83
7701 -83 -153 1395 -496 426 -544 608 177 726 159 -508 536 492 1062 313 618 48 -268 -1027 -784 516
7721 516 -675 -634 624 -49 574 -1202 -645 157 266 301 -383 -210 -1731 403 -1049 -636 296 -1547
7739 -1547 -471 -1538 785 -750 253 14 -1336 1621 -894 660 -660 -316 727 -723 982
7754 982 -651 304 -991 327 -333 -450 -463 -319 206 -698 176 791 666 419 -1049 128 -412 173 930
7773 930 -681 73 649 685 135 -265 261 142 431 -100 293 -867 -525 -512 782 -234 998 -206 357
7792 357 553 985 153 -500 859 510 915 -610 862 -417 922 264 180 668 526 277 219 -1161 -222
7811 -222 -397 1570 194 927 475 -22 1009 -592 476 179 231 -928 -155 457 168 147 -803 528
7829 528 -555 492 358 -1109 687 -932 196 -698 -1044 537 -1406 293 -1093 612 325 602
7845 602 682 -255 -764 -905 941 343 -214 -472 -981 1294 -816 -747 -1295 308 187 9 1198 -1252 220
7864 220 73 -370 299 1059 -369 -469 1275 -344 -814 -320 -104 52 -407 1552 -98 749 -727 792
7882 792 788 847 511 -963 -644 511 707 -133 954 234 301 -662 -499 -841 -649 -559 -931 139 -721 137
7902 137 -919 -1494 54 -459 28 18 1382 -12 -346 588 -83 1608 -309 470 961 -162 -112 7
7920 7 145 -922 326 47 959 83 -1391 926 -315 786 -1306 435 900 -589 1137 -288 -232
7937 -232 -351 83 331 -122 1746 -31 414 -236 -131 1153 -9 699 -686 1050 59 1141 -189
7954 -189 115 -176 -322 -23 229 783 -764 -670 34 805 1077 -992 608 -609 809 546 -421 -22 -1688
7973 -1688 -130 -1622 1331 -67 594 -166 698 -282 374 101 0 579 -1024 -198 332 125 -1743 -580
7991 -580 -82 -726 -80 801 -806 -864 -195 151 -1298 847 -157 660 296 -885 -382 -303 -1 -189 767
8010 767 -251 91 -96 -986 806 -163 845 -469 -389 98 -674 550 -247 370 -566 141 -1065 -701
8028 -701 332 -2087 919 -221 -184 635 -52 153 -1281 579 -883 527 -451 187 166 -1059 1843
8045 1843 -974 420 693 -40 999 -1688 511 -1442 342 267 -501 -578 -737 55 -362 -488 730 -54
8063 -54 -63 103 -1184 -442 -252 -194 -341 113 -630 1256 -420 -1084 -272 218 140 166 -151 1422 457 -980
8083 -980 -579 -291 558 -388 229 92 1402 -57 -577 341 -611 -131 -742 873 70 442 1313 60 -399
8102 -399 -698 1262 -721 805 1176 -548 986 -1145 251 -959 -652 743 -545 901 328 1343
8118 1343 -227 633 -1158 -505 1428 -948 29 -368 -412 -334 -941 -760 -1132 54 68 117 -250 -474 711
8137 711 -350 1263 -455 687 79 -8 353 392 946 -533 33 -8 454 -384 -28 958 -548 613 -266
8156 -266 -427 -475 420 1034 -163 52 -389 718 392 -709 -449 503 254 -940 456 183 74 747 386
8175 386 -585 -405 246 407 417 -417 -153 -190 -1056 -143 487 -641 -899 -74 15 365 123 708 1013 138 247
8196 247 -864 155 191 -57 1626 -604 848 -800 229 -1354 340 651 -412 39 -1490 1609
8212 1609 -76 1318 485 -1180 429 -22 664 -1021 -949 -198 -1586 477 -1220 460 -32 28 -237
8229 -237 -446 1997 -1703 -312 -383 1155 -339 -1020 877 -615 1624 -1421 -171 -509 68 925 -1000
8246 -1000 213 -878 -225 725 -499 120 617 -296 -214 31 1066 -195 691 -669 275 60 203 122
8264 122 -455 403 78 -579 319 21 -72 552 -749 -87 277 431 -249 352 -694 119 204 45 -611 -286
8284 -286 807 803 278 133 489 1296 -222 518 823 315 887 -1252 749 7 296 -385 -166 77 -1052
8303 -1052 377 -92 -65 -520 -23 -130 -691 1185 -428 -54 -1699 381 -365 -1707 -266 -1194 1229
8320 1229 -836 214 -88 -377 -350 -30 963 75 1148 398 -733 613 -542 1038 -691 -100 -319
8337 -319 -476 1382 -813 1195 -748 456 16 -69 1302 -191 244 -1057 -796 -180 105 -626 199 929
8355 929 -732 -78 -165 -652 1077 -31 -92 -904 583 255 -372 761 114 -323 19 -78 -240 -362 -711
8374 -711 700 22 775 337 389 14 77 1042 -365 1028 -900 519 -24 389 -78 -1848 -143 137
8392 137 765 -1922 -503 101 -625 -29 -1174 938 -417 1071 -538 -757 338 -93 998 -1275 463
8409 463 -263 -314 -287 -908 512 -597 1807 -391 -878 163 -1338 -720 157 160 -164 197 -648 -788 1141
8428 1141 -1003 1012 571 256 -66 185 277 -306 928 -820 -978 474 -660 609 -232 114 -1294
8445 -1294 1313 -120 426 -248 -645 600 -708 319 -203 41 823 399 924 705 713 -1501 -540 27
8463 27 -715 -111 -134 -376 -602 -181 -463 876 654 40 267 1216 -507 -924 1123 -1063 544 -301 155
8482 155 52 -692 1174 -393 1579 -1286 109 713 -1043 828 -1297 896 292 -18 1120 62
8498 62 1036 -1096 -81 55 10 281 -101 1226 -1008 1063 -581 1339 341 -777 203 -2160 648
8515 648 -1226 773 -503 -3 811 -353 993 -606 426 285 -485 663 -584 1035 295 444 203
8532 203 -98 -341 -289 1078 -915 -540 -435 -625 -927 -207 849 -909 -668 -1010 -307 550 -771 -212 -637
8551 -637 679 120 -171 488 526 438 -708 191 -186 254 648 -33 -936 173 696 0 -222 -44 -252 -176
8571 -176 93 -326 169 -1360 -599 247 -395 433 161 676 146 -275 -525 474 1062 -912 1024 -810 263
8590 263 -28 -1050 810 -227 1306 -840 235 -337 -1157 1026 945 709 -1663 721 -432 -545 1053
8607 1053 -371 331 224 -608 -399 -273 215 -104 973 -481 801 -718 -396 996 -724 723 -1779
8624 -1779 1036 -150 -225 101 98 160 -327 792 -491 640 105 -957 226 161 404 -514 -97 396 -1357
8643 -1357 -197 -907 933 -640 -73 -271 -770 871 1238 500 701 68 245 -260 73 -870 366 392
8661 392 -1384 636 -195 -266 -794 66 418 195 1523 744 -102 117 -63 -260 -624 626 -408 -544 689
8680 689 -1584 730 -887 -367 84 -808 408 -1185 431 -1090 -313 -187 -39 1341 -260 946 -1792
8697 -1792 -313 -352 -471 1014 -302 -63 -966 599 -426 188 -204 -68 102 185 581 434 16 125 -252
8716 -252 1283 -824 -448 503 75 -81 -35 108 -1360 886 -148 -6 382 -69 354 -888 565 1116
8734 1116 208 -97 -12 572 433 576 -667 66 12 -55 -994 -13 -128 -233 362 -24 720 -191 317 415 495
8755 495 233 248 -861 -751 -112 -725 441 -1045 58 312 397 1597 899 1215 -1011 35 -442 -1023
8773 -1023 462 -939 676 -947 72 255 181 1500 -1582 731 -536 225 -480 -156 -296 -714 607
8790 607 -625 410 -615 -354 858 -746 1362 -1074 639 300 -373 1752 -264 1237 -166 925
8806 925 292 -1098 -147 -620 161 -940 887 -48 -895 1449 -75 -215 -131 103 -718 361 609 316
8824 316 674 -1311 923 450 341 216 -457 819 155 -407 365 -485 393 -101 1310 17 -41 -309 266
8843 266 -510 345 833 -565 997 -607 -716 -480 550 -91 200 -715 -1258 -258 758 -477 46 234
8861 234 -757 1629 -506 -1049 154 -678 583 -668 -697 -1002 -668 112 -602 137 -649 911 -177 1575
8879 1575 -820 -859 1252 -1138 1466 -1205 568 308 -55 -429 315 872 237 1391 -432 342 481
8896 481 -245 1087 -1491 -999 0 450 224 -1738 150 -1545 581 -59 448 161 -263 492 -884 900
8914 900 -254 54 -135 -811 441 165 671 444 48 -157 125 208 -1 -15 648 -223 43 -741 -180 -281
8934 -281 -73 -10 -206 1125 -137 -519 104 456 1038 -305 528 115 1088 136 -393 542 62 82 -2 416
8954 416 358 -125 433 -412 -730 -18 30 7 105 946 633 -27 -230 510 1216 -591 415 -220 -166 107 623
8975 623 393 -1104 1097 -52 742 -45 253 355 -80 980 -762 -118 391 86 -600 -1781 1116 -554
8993 -554 443 84 117 1289 -980 569 -578 778 447 417 333 -537 141 -375 484 778 133 -613 336
9012 336 900 137 686 128 330 -697 -384 846 -1589 402 265 1114 512 -899 -391 229 1668 469
9030 469 351 54 477 426 305 280 -249 442 -845 335 -487 -545 1094 -212 379 -782 18 280 572
9049 572 -237 301 -1101 27 540 -345 888 297 744 680 868 -242 -157 675 -25 1332 -541 -436 282
9068 282 722 132 -1033 482 148 338 419 1251 795 -527 61 -701 -309 -527 -745 372 -1311 1503
9086 1503 -36 366 -592 -1116 757 -543 -202 -2271 -235 -974 760 -122 -692 400 -1031 991 -638
9103 -638 -301 -347 -426 -79 382 147 -1052 -826 -877 -440 -198 494 -321 47 -241 377 -1271 433 -197 -435
9123 -435 -217 174 35 -786 1482 -213 -392 348 -186 -586 351 -244 53 201 1271 -554 -404 -728 -483
9142 -483 -797 152 756 -330 767 337 -243 966 -126 124 -961 -235 -367 -310 158 -966 1610 -984
9160 -984 -41 -615 -203 -193 -676 826 335 -95 911 -285 925 -821 770 -616 251 197 726 219
9178 219 -903 576 498 510 -241 744 -23 -602 327 -1060 585 -697 922 68 -653 1465 -23 208
9196 208 163 -280 -882 -875 1828 -894 308 -568 -521 316 -324 377 -306 467 72 348 -673 780 -637
9215 -637 -1055 345 -206 939 -132 -135 -399 -287 740 -595 -256 -288 1077 1159 -903 711 319 381 650
9234 650 -43 -334 -299 -80 -62 64 -27 -116 -1281 1603 1129 -49 -483 90 190 -1632 4 -595 -163 -169
9254 -169 926 1240 -357 -525 -290 1087 -847 103 146 1234 1085 -470 0 -852 436 -61 603 592
9272 592 -1150 266 -1378 -146 -568 -485 -137 -1144 795 -128 1757 -979 185 464 124 1591 -648
9289 -648 -411 -100 498 239 -1073 920 -278 466 16 548 -92 -597 1022 -153 1807 -684 875
9306 875 -760 -374 880 -963 -187 -65 270 577 -26 622 206 -291 -282 83 410 142 -406 418 324 78
9326 78 14 559 -418 -34 -1159 -311 108 -200 -588 989 -144 74 -1171 -22 -460 -142 -628 -910 879
9345 879 383 963 -590 -108 630 -632 825 -341 875 -996 -15 -145 521 568 -665 391 -1096
9362 -1096 444 -1231 406 -712 -1032 1683 413 -31 -424 238 976 -911 891 -945 1305 -1560
9378 -1560 527 907 -585 1527 -787 91 -438 -57 155 703 898 -573 1120 -450 -1067 730 74
9395 74 -112 -626 -552 -662 -589 -688 -641 280 -449 1125 713 326 326 -161 -191 -146 644 -1260 -458 -234 1138 535
9417 535 -712 -675 -449 162 630 -373 459 177 -509 -362 -31 -51 495 48 507 -405 -569 -336 158 74
9437 74 143 154 -159 286 423 790 605 16 -59 -891 448 7 -115 -439 27 910 -1144 769 -996 -285
9457 -285 -138 85 6 -564 -88 34 -46 -1512 -600 1067 120 836 -632 560 -967 -527 297 -957 617
9476 617 -1265 685 -186 233 -242 -527 1597 -1479 395 11 58 -621 -454 385 -738 446 -1563 186
9494 186 137 -738 792 -455 136 -1012 631 121 -1095 892 -701 701 -148 586 -228 -407 -442 593
9512 593 389 -465 210 -568 281 -603 -32 -459 55 682 -712 252 16 150 631 391 -792 732 14
9531 14 -692 491 -1011 1077 -598 -129 -382 -1139 -457 283 260 -1003 -10 217 905 432 -1446 1444
9549 1444 -297 -725 -1200 -2 361 158 -1068 -671 942 -451 1006 1146 -484 932 -1156 234
9565 234 -629 170 -500 -1819 981 -1754 582 -809 -233 633 -634 236 -176 -101 -641 659 -131 -176
9583 -176 -483 -485 1506 -207 1006 -203 -824 2041 -1491 227 -75 -594 -912 -11 797 478 -382 -276
9601 -276 10 -175 -674 -203 278 1220 76 -4 -279 468 -495 -907 669 -270 -787 -886 89 1132 -996
9620 -996 424 -92 -921 747 -456 432 -42 -829 -647 488 -612 -614 -306 -22 -929 496 33 663 -105
9639 -105 680 1093 39 638 -296 125 -676 -367 -200 474 507 -342 -49 -28 1157 371 -974 1452 -604
9658 -604 1135 70 -438 903 47 138 -596 352 -635 664 -1234 1243 -67 -322 524 207 177 -684
9676 -684 -713 661 -1299 1648 -936 531 -225 -851 963 -1291 847 183 -244 951 -874 -112 -685
9693 -685 269 142 462 1045 -226 699 -343 1151 -370 196 781 -41 365 81 -382 -601 765 931
9711 931 -514 413 -772 -405 -1365 93 1130 -35 817 -96 -1060 671 -923 321 764 -598 -638
9728 -638 -62 172 -729 451 -781 -909 -240 -1354 634 -858 334 -1148 -368 684 123 1316 -637
9745 -637 -709 1008 -964 -34 32 263 -2029 453 -1104 1382 -315 36 1579 33 415 366 73 345
9763 345 71 931 -656 85 -17 -118 -114 -81 439 -481 491 219 492 -7 -793 78 -214 1277 -588 434
9783 434 247 513 601 -807 954 430 -303 73 -287 1007 1 -892 -933 769 -888 447 268 -746
9801 -746 354 545 500 299 -1085 -298 168 -131 163 -1671 969 -1191 53 324 -1008 498 325 373
9819 373 -75 -136 -511 -221 1187 -546 -249 -91 -646 635 -851 176 -183 1016 401 717 -364 -803
9837 -803 1489 -175 735 -722 295 853 57 1411 -93 1495 -864 -514 -135 -336 1747 -428 345
9854 345 -239 701 559 152 1333 -515 1473 -766 1190 369 -210 -500 -727 -83 -549 -507 -269 -731 991
9873 991 -454 855 -754 491 -1028 94 41 -1329 1408 134 980 230 -408 840 40 891 -210
9890 -210 0 558 -286 33 -1469 759 -45 203 -204 -620 884 -464 144 678 166 699 -823 358
9908 358 195 -454 844 -1289 -209 -768 240 863 422 -9 -566 193 -184 811 829 309 317 291 437 -295
9928 -295 322 -140 -1365 992 -922 1167 65 -189 -73 -120 593 416 -1 -539 142 144 -496 692 -618
9947 -618 1258 -960 984 316 377 457 -62 1577 -1026 1077 93 -1671 1592 -139 392 -961 148
9964 148 -199 1005 -14 -592 1217 -854 477 -248 -525 859 -670 -585 57 33 432 -919 -607 -634
9982 -634 261 -344 -33 14 -197 487 -920 217 33 -849 -509 434 -12 926 203 -332 305 345 178 -241
10002 -241 1080 5 326 193 375 -811 1087 -772 1014 936 -280 122 -142 268 -39 -633 -144 -728
10020 -728 850 510 1192 -179 -1116 1185 -1217 -674 -900 147 1111 -345 956 -387 775 -763
10036 -763 -132 -57 -615 -14 -456 1046 -146 -838 -423 -920 576 -381 1046 -758 -386 -127 -629 938
10054 938 -839 860 -375 564 719 424 -260 -777 -220 -1535 1050 470 -227 287 -1446 193 -946
10071 -946 42 -176 -577 409 1102 624 66 687 578 224 -204 -1267 262 -134 -503 12 23 -13 861 301
10091 301 -537 -513 -394 215 31 -488 326 -706 -468 274 -73 -356 -185 -1212 -133 -127 246 -1083 87
10110 87 262 308 936 -1086 1137 -358 -194 -45 353 859 -206 462 174 -703 -122 140 1336 396 612
10129 612 173 377 646 -954 -369 -77 67 -1076 273 579 -1475 526 -1013 1256 -905 378 732
10146 732 -478 420 -514 1545 289 288 741 -316 1087 520 419 -1554 -505 218 -1099 -149 -646 160
10164 160 -4 186 206 340 1105 -337 312 -38 556 -146 -195 157 -222 -174 622 979 74 -457 175 -54
10184 -54 -91 -733 -424 219 471 594 -578 29 -629 152 65 476 -830 -35 -293 875 -248 1175 -788
10203 -788 -952 20 -1421 -1052 -673 812 594 775 559 -296 522 -208 131 158 592 385 -419 1020 -1270
10222 -1270 398 -1327 1622 91 -664 1092 -1006 36 -1410 -296 1453 -41 819 -1231 138
10237 138 -1492 380 -146 258 176 -1440 1618 -1005 1167 446 72 1230 98 43 -226 655 395 746
10255 746 1278 -1506 339 -787 175 393 -624 1124 -55 332 -130 263 390 -215 667 -694 880
10272 880 563 560 835 296 557 308 699 87 522 -188 -1339 -848 -470 -95 137 226 -361 -975 849 -559
10292 -559 456 -1311 674 2113 199 -241 -54 -110 275 879 256 -195 -391 -491 -1777 -124 -15 716
10310 716 -317 -537 -779 1113 -275 -1216 1119 -21 -137 -457 -1663 121 142 591 -371 1092 1184 160
10328 160 -63 -1060 772 -1653 -307 -1108 -431 -309 -466 922 -1363 948 -829 1031 145 -518 542
10345 542 -986 -507 -738 -381 -243 -1021 1724 -1094 180 570 294 -69 -278 1505 214 550 -315 825
10363 825 39 152 -165 -285 1164 4 -655 653 -395 246 757 -19 -23 42 316 -388 -688 604 410
10382 410 -369 -439 -210 -390 -615 776 -324 -514 418 -339 -520 -268 -980 -947 -318 -243 -301 303 333 36 -1250
10403 -1250 289 207 919 1214 128 1859 -559 7 603 851 -733 -380 878 -289 1009 -1446 1010
10420 1010 -938 -196 998 -883 1284 -1500 200 -330 -294 1302 -760 385 -466 1282 -404 -455
10436 -455 839 42 1045 47 584 -257 346 662 -668 779 -791 -320 265 522 210 -1101 -95
10453 -95 -226 339 -370 394 516 -278 -495 420 558 -1421 633 932 -467 568 388 425 51 -394 -234
10472 -234 1279 521 -227 -1209 -94 635 1364 43 280 392 422 298 14 133 760 -1083 623 -363
10490 -363 -686 -1185 -24 -711 -526 -224 -898 1147 -930 -423 -51 -283 -532 -448 175 -537 504 -251 -511
10509 -511 1195 -1466 1274 -532 977 -142 -1169 529 -1138 1037 -1080 18 451 -174 646 -696
10525 -696 49 -653 1538 -399 -914 -269 -1685 1088 -1293 1103 346 29 -55 -424 1156 -302 604
10542 604 -271 70 579 -1532 628 -828 1208 -776 3 191 203 -718 -619 327 -1069 1384 117 -184
10560 -184 172 -546 1348 -238 837 452 7 -230 133 -152 -190 848 -304 312 793 -971 977 -191
10578 -191 586 -19 702 -252 127 -1429 -786 -869 267 992 189 428 -526 19 -258 -312 590 154 380 -174
10598 -174 -510 -134 791 -132 -473 1018 -1228 -26 334 377 -27 145 388 -553 647 -221 512 231 -449
10617 -449 -497 -468 858 -1185 283 -1260 282 1753 -231 637 -592 239 -623 -588 1604 -297 309
10634 309 -360 338 -796 1442 138 -1646 1402 -425 494 59 -136 -374 -189 592 733 219 45 -482
10652 -482 -318 98 1132 -208 627 -178 792 1211 -161 259 -411 226 262 1393 854 -38 257 33 -610
10671 -610 422 -1142 -404 342 856 968 -894 -378 68 661 464 -966 -102 47 556 -939 378 365
10689 365 -787 361 -79 1143 509 705 -446 -983 -1623 -1018 967 -550 831 549 369 512 -1519
10706 -1519 659 -398 409 -857 1258 310 -1301 631 192 596 639 349 339 -349 1412 250 1216
10723 1216 -1147 -96 508 -98 1048 89 160 -1121 -18 -63 -680 -3 198 211 126 309 716 -891 277
10742 277 -1240 270 -308 -692 -23 -263 500 28 538 558 600 -622 -527 -266 -485 -146 886 -901 -845
10761 -845 -101 903 1087 -172 385 -154 -441 -309 187 -457 133 -499 74 311 -1210 -316 -1102 -498 -730
10780 -730 -431 667 516 -49 92 282 189 -681 -812 129 -1696 556 -631 553 376 349 -103 71 68
10799 68 -1316 -499 633 1538 865 -370 1102 -406 -528 -362 -400 -1473 -331 883 -1047 1548 -429
10816 -429 451 154 1334 795 -539 -506 -783 1107 -158 1196 344 -1179 1363 -817 665 -308 488
10833 488 207 66 -348 223 153 -543 605 222 -377 -109 208 1094 -999 -764 -117 -1297 -226 602 467
10852 467 -619 -1395 -338 -253 -581 -466 -421 202 -528 -415 598 15 128 -383 -789 -372 -242 -447 -978
10871 -978 302 -195 -167 -291 200 112 -746 514 -1216 627 -989 510 638 406 716 -1194 1384 -689
10889 -689 -309 -153 18 -586 -437 295 -928 -67 -931 -871 -1373 -1466 740 -694 673 -755 411 1041
10907 1041 -765 688 -833 1423 168 -36 246 -178 -418 -125 579 324 244 -786 -1217 636 277
10924 277 734 -1287 -27 -672 224 450 -752 1295 -895 -267 114 -321 434 -445 -57 -713 283 727
10942 727 849 163 99 -1080 -528 315 419 -1061 991 422 740 -129 782 -23 -1031 277 1227 -265
10960 -265 131 -145 -757 -562 104 774 -87 1093 -744 -418 -896 -1023 1162 -850 156 473 1146 268
10978 268 -255 -648 -520 -40 -53 1076 306 -1220 -223 -92 -213 -114 16 166 -44 320 -1523 1380 -217
10997 -217 937 -927 345 168 -932 1307 -917 673 498 860 -314 -231 1254 584 1203 -318 -144
11014 -144 394 308 666 -867 1494 -1036 174 -127 -1422 899 -1684 416 -727 -91 50 567 30
11031 30 -228 945 -704 -61 660 -521 182 320 -485 -822 566 498 479 10 251 2348 -1196 -873 163
11050 163 126 -458 -123 611 382 -152 385 704 92 542 59 207 498 -14 -34 -593 93 -72 1279 -589
11070 -589 119 389 -698 842 293 1027 -710 -805 -596 -49 374 -451 658 -1025 62 567 -28 1014
11088 1014 -6 155 -1736 828 -523 866 -368 -857 412 -414 763 -498 -195 -523 -584 709
11104 709 -469 690 -511 -258 -94 -312 488 -135 1501 68 -231 -615 5 553 455 1401 -496 360
11122 360 972 376 481 445 1154 -1083 811 -405 661 696 213 68 1057 514 76 811 -128 20 113
11141 113 -686 -485 -73 -450 226 -312 574 -970 -231 -921 -350 976 23 -372 962 797 741 -842 -93
11160 -93 615 -186 -110 -308 1117 -569 -703 420 -107 824 225 131 -875 -400 957 -620 721 -1117
11178 -1117 -61 196 611 135 -357 1464 151 38 -816 562 612 -1051 882 -713 430 -171 614
11195 614 815 -680 201 -627 537 -510 598 -1125 -373 32 -724 697 -1156 485 308 361 -41
11212 -41 -1033 1011 -841 -295 841 9 -166 -817 -313 -1129 514 235 41 143 -346 1102 76 -481
11230 -481 57 572 -674 665 601 -436 918 -11 183 297 236 27 314 -482 909 -151 -434 -191
11248 -191 -654 -157 -878 289 509 -238 822 -1059 649 -762 -831 -57 -1205 1088 -1900 990 571
11265 571 813 -114 649 817 -443 34 540 1076 -329 -379 654 52 46 -1320 -349 -416 55 1064 -1342
11284 -1342 537 -618 452 -707 -796 200 371 319 -329 305 -1352 693 -167 -59 392 -79 -264 -400
11302 -400 211 -89 -1323 578 -562 1185 -1264 1268 363 115 -421 -385 986 -1463 1698 630 218
11319 218 270 342 138 -793 -21 -1052 -664 -139 319 171 -386 501 120 -333 -54 -125 847 -673 -714 -136
11339 -136 473 58 -583 -198 -431 -471 -1500 1280 4 767 191 552 225 -348 573 557 -8 -248 -698
11358 -698 -996 115 -702 595 908 -858 1474 -452 1530 -883 83 58 -1720 1739 370 1203 -533
11375 -533 -317 -595 -440 1480 -1458 -858 -214 -491 290 -1125 638 -364 157 -985 -56 -1069 -302
11392 -302 131 79 525 -851 1530 839 34 556 -43 68 636 -688 921 -482 1421 -64 157 -733
11410 -733 325 -1260 549 -610 -1304 -127 -1355 120 -528 789 755 -310 -925 399 -114 -304 -442
11427 -442 399 -933 -1777 759 -35 325 -473 -905 0 334 -814 158 162 294 -996 329 1081 -135
11445 -135 -752 -111 -1525 659 578 -383 1280 246 1638 -421 -209 -348 550 -106 -1011 845 360 -11
11463 -11 541 -688 1350 -487 -425 595 -257 242 -150 9 -112 106 290 -241 12 -300 816 -1353
11481 -1353 516 62 360 -53 32 354 -1182 1389 688 1142 515 575 1094 -891 462 -187 370 461 -110
11500 -110 -1369 -1489 -365 270 2059 361 -943 641 -53 554 -1056 305 -600 -263 -164 -357 -69
11517 -69 -102 -965 -349 549 424 -632 817 346 142 1671 -147 821 45 -659 179 -229 947 -199
11535 -199 -191 -91 412 840 -214 294 368 1300 670 -319 1621 -696 991 114 -206 -784 99 1702 992
11554 992 -14 165 882 634 -490 595 1241 -246 -45 -344 -304 267 -567 -1010 894 -729 830 -532
11572 -532 -287 1067 -1229 755 -853 749 -618 -154 1174 -123 1666 -259 -315 1140 -136 564
11588 564 -1954 1353 13 84 1786 114 96 -1198 716 -112 463 -706 416 87 -441 187 -217
11605 -217 1123 -1059 858 708 865 28 -843 -64 186 -90 -1210 448 -593 -698 884 -586 500
11622 500 -109 222 743 419 -1079 -1072 -1197 -228 291 296 996 192 229 977 300 85 1095 44 -1351 990
11642 990 349 264 463 -602 746 -119 1755 -359 477 -14 408 714 -477 532 268 841 414 100
11660 100 1026 -403 405 -56 -692 544 -848 121 -709 1088 -298 -555 -122 -1563 615 -629 -253
11677 -253 1094 898 -163 -209 1938 -393 662 -692 419 -623 -1333 1943 -789 1193 -1608 -775
11693 -775 -490 -273 -656 -569 1126 126 781 592 226 -228 84 -705 -633 739 950 506 -201 -63 730
11712 730 335 536 439 -804 350 -608 -1576 -954 972 -203 45 269 34 181 836 -350 -369 -847 -20
11731 -20 381 -353 -154 -344 574 -816 638 30 -741 416 -606 1187 49 691 340 167 -68 -1216
11749 -1216 291 -715 402 169 732 549 -193 453 256 -56 -24 205 -525 -1137 845 172 478 -159
11767 -159 -66 536 250 687 -1717 796 -522 -10 511 -867 291 -1017 146 109 -773 1077 -530
11784 -530 550 363 480 63 185 108 -1182 -692 -1001 261 120 -413 292 789 1073 -1102 376 727
11802 727 573 -585 -464 -47 -522 714 -547 793 -434 -579 327 216 -299 -98 -334 181 909 -192
11820 -192 546 469 340 -444 -13 932 -1543 -603 577 -81 188 -657 405 339 69 -696 589 -102 -135
11839 -135 -35 -1360 35 -1859 1356 -1264 721 514 23 500 -720 1668 -254 1152 869 -1067
11855 -1067 1524 -1270 810 109 -366 -288 -721 192 -1889 1324 -331 -266 -400 1117 421 -1291 683
11872 683 -354 302 481 318 1116 806 -988 -845 802 670 -780 217 -1285 1956 280 -51 -241
11889 -241 310 105 243 1356 -1048 404 -1344 494 989 -768 -271 -427 -19 -182 -396 -392 -4 1068
11907 1068 -707 -468 -156 -240 60 635 -18 163 -385 652 8 104 1114 -328 1131 264 -243 -579
11925 -579 -53 1141 239 -92 -651 264 -1012 171 -26 -1353 -14 -465 754 -386 294 318 -931
11942 -931 75 -785 5 -362 402 -765 -472 811 -1497 806 135 107 2 150 1311 -454 579
11959 579 -299 578 774 61 809 -426 280 -843 498 158 12 1501 225 -391 -1109 -12 -336 -367
11977 -367 126 -865 358 -265 351 -1287 87 -268 -991 741 -117 693 225 171 593 36 527 681 -458
11996 -458 693 -691 -829 -45 296 -339 125 -164 -1020 778 267 209 -286 -316 -441 -462 -18 115 -165 221
12016 221 -233 -375 -624 -810 368 775 -498 -392 -779 -339 -827 260 -179 52 -1331 756 -994 -1098
12034 -1098 -174 -680 196 437 573 201 -197 -124 97 664 -83 5 -937 -834 241 357 506 -205 619 -1739
12054 -1739 14 -63 -1033 485 -1733 182 -1597 1275 389 -93 811 -876 1528 -1387 1955 -347
12070 -347 -337 984 -991 922 -769 603 21 -821 -558 -589 816 -1120 66 -492 -509 -97 -1050 -169
12088 -169 -206 -83 565 -328 69 123 3 197 375 -1 396 -1240 -574 -313 -1141 863 206 -655 -489 24
12108 24 170 -465 -322 29 429 761 -833 147 -141 -187 -104 -818 -135 213 -353 183 -48 765 -139 -59 -933
12129 -933 -199 -146 -610 345 -552 1490 -272 424 825 -1002 -162 9 545 72 -46 615 117 1264 -702
12148 -702 -15 -521 266 -658 -1066 573 -834 473 -269 201 -103 -1689 592 493 65 -458 40 -377
12166 -377 -338 -232 -474 83 -875 -685 956 -357 -71 -305 314 -634 1057 302 -1112 626 -1093 190
12184 190 900 170 560 -169 932 -1226 -241 520 -351 -991 821 950 -1151 985 399 85 -119 -852
12202 -852 -323 -261 -556 2 478 1096 -354 329 -955 -151 597 -464 940 163 -388 688 101 863
12220 863 -1197 208 121 319 1152 -537 -797 -502 -404 415 854 -308 -90 -193 -369 1162 178 477 1230
12239 1230 -1444 -526 681 214 -1018 267 847 -811 382 -730 1279 -150 -84 12 418 693 -285
12256 -285 1030 -802 -143 277 -629 91 -1423 848 -7 -502 -843 677 243 -97 -185 -548 -285 631
12274 631 -488 664 878 268 -1181 -665 93 -407 132 -652 352 -41 512 144 -390 1098 137 1112
12292 1112 -351 426 268 -308 548 333 -512 426 611 -482 -193 -677 -275 901 -371 -1130 -774 -721
12310 -721 159 -594 -302 506 185 909 1136 57 361 -1161 850 513 -323 -106 989 -212 -241 1743
12328 1743 901 -341 154 -251 405 -1424 2606 -438 100 504 -77 -299 -439 141 -506 514 -290 29
12346 29 868 -272 1045 -888 52 -801 507 389 -675 -422 -195 602 -540 -353 155 -1154 -522 -1043
12364 -1043 1657 160 10 -16 -140 359 -117 418 -1181 695 279 -263 574 -818 537 51 -537 -545
12382 -545 -251 -878 -285 -197 -1263 892 779 264 217 -527 -928 652 -422 574 504 296 -36 161 -281
12401 -281 -115 1195 -504 614 779 -130 -509 -133 243 277 -352 -464 -359 1042 144 -1041 595 -217
12419 -217 846 -378 1278 594 -785 522 -38 202 -849 51 -2389 208 713 87 -559 -415 339
12436 339 363 789 46 1318 366 -421 1011 109 186 -401 -780 526 -211 1009 -1082 -31 717 446
12454 446 266 240 1059 -1266 352 -1307 61 -26 -917 1190 -148 398 190 -586 868 -221 636 -1263
12472 -1263 -344 -494 301 66 -122 909 597 108 32 -1001 -187 -688 922 -216 171 -211 165 568
12490 568 -1017 289 1276 362 -405 -1175 -188 -628 -156 -175 626 917 -306 519 -857 307 -679 -405
12508 -405 -854 -787 385 -103 281 -778 -713 417 1045 22 365 457 -313 61 941 137 -10 -1239 242
12527 242 211 106 1074 -353 416 20 143 -155 48 2035 -1013 -282 -1007 88 955 -634 -115 -486
12545 -486 313 -743 352 140 109 510 -1176 -277 136 167 -563 -69 576 -76 -261 273 -70 664 594 1466
12565 1466 492 1268 -1718 -829 -555 -689 544 486 644 484 896 19 285 -1381 48 755 -888 459
12583 459 -487 410 459 564 594 204 -381 -351 -315 194 365 82 326 -196 390 -577 -635 242 -166 494 -468
12604 -468 1108 342 452 695 -207 -336 -651 -241 -118 756 1342 210 449 -668 2303 -181 -43 441
12622 441 -354 261 -825 479 -953 1123 839 -951 424 -506 1344 -526 -1168 347 -843 1444
12638 1444 -291 837 -309 -1262 -366 -1225 622 -287 659 174 539 -527 -736 686 -1061 819 -422
12655 -422 -514 327 -247 880 -1917 703 229 20 110 782 1185 54 1427 -1912 -56 -874 -214 -818
12673 -818 -790 1124 303 -231 496 -552 573 -1255 -604 -309 887 -521 560 173 555 -992 -864
12690 -864 328 -188 -93 1384 591 -661 -209 -754 271 -1011 -324 277 167 132 -505 -707 -240 -852 991
12709 991 -410 140 -676 814 -43 921 525 -801 146 267 -63 -1179 -864 238 -1025 384 -256
12726 -256 1103 -291 106 -47 -1115 695 -1068 18 -530 1322 858 -854 194 -1150 228 -836
12742 -836 -1203 -258 -1245 1443 -887 1076 750 476 -455 -115 522 448 621 -607 611 1085 -1283 469
12760 469 -991 189 -494 27 56 465 2020 -922 -89 -741 -137 979 -658 -276 -542 -1234 551 -356
12778 -356 -559 -552 331 -269 -344 -468 16 -87 -586 18 976 -339 378 -464 -535 -387 154 610 343 -45 -173
12799 -173 575 137 433 203 557 181 -680 5 1203 -1046 565 -1008 1650 -641 176 -472 -429 435
12817 435 -1645 482 -1003 814 -909 -156 16 -46 2032 -1256 1124 1366 36 616 -323 1152 -1826
12834 -1826 29 -1127 368 -755 -163 -132 -29 438 334 243 -263 -1109 84 -1144 337 324 -48 -785
12852 -785 -456 959 -568 79 79 -897 -598 166 425 -947 1106 404 1304 -460 409 212 292 -74 1376
12871 1376 601 263 100 18 -1362 -98 667 23 -62 -298 585 -136 267 6 -429 1151 161 4 -24
12890 -24 -323 63 -804 11 -748 -668 -451 -325 75 -861 -732 -714 210 629 -405 712 -420 -206 -905 2134
12910 2134 356 -331 458 -847 768 -372 661 -390 147 335 -984 227 -612 -209 504 228 745
12927 745 -632 678 -1017 -36 -543 -352 -344 586 588 -614 1144 116 -198 646 -758 468 -1519 429
12945 429 -896 141 -316 -340 116 -1114 983 211 391 719 -469 271 -1149 294 680 -366 -280 -425
12963 -425 -275 315 8 -61 -661 -336 -362 -374 271 556 1 257 -758 641 -1230 -1637 347 516 21
12982 21 -135 1276 -169 813 -308 455 -181 572 -715 106 733 -582 1200 -876 1442 -368 -1136
12999 -1136 545 -2277 730 -704 -417 15 -1070 874 -1494 1394 -636 665 -325 293 1481 -573
13015 -573 116 -71 830 184 -268 733 -120 575 -646 324 -1311 182 531 -1018 690 119 -192 -494
13033 -494 -329 208 -298 1305 -439 242 607 676 -121 -821 -210 -479 -836 -159 -159 367 -161 464 -751 1084
13053 1084 -833 -264 234 -375 148 -242 1288 -302 308 460 -804 1004 361 -74 282 -17 150 -1090
13071 -1090 82 861 -80 -401 -149 -158 -498 486 917 -375 -712 10 -391 279 263 998 -587 -268 151
13090 151 -1241 -229 -759 154 -537 675 -567 -317 511 -814 870 -916 1012 -8 32 -23 -977
13107 -977 1392 -277 1388 -347 -957 21 -1093 541 -947 445 -1442 529 306 -126 1458 74
13123 74 291 543 281 -645 880 627 -943 708 -1382 53 -666 441 533 -991 100 -609 1514
13140 1514 403 -1249 -141 634 46 -439 871 1555 489 -472 -1339 -15 -807 1023 -1520 46
13156 46 665 -670 415 230 -309 316 -581 125 -722 -730 -601 278 -617 122 972 -60 -116 -305 -799 609
13176 609 159 762 384 134 -520 -1626 590 -1693 887 129 325 -387 -338 1141 -1025 787 -164 700
13194 700 480 205 182 481 -100 631 85 667 -727 1103 -546 -171 343 -333 600 180 -277 -1170 -92
13213 -92 -677 286 961 25 750 -1006 406 -411 -932 859 -290 398 -560 406 -548 -524 830 -485
13231 -485 341 -388 805 -58 63 568 -1057 781 -224 -150 471 -34 120 283 522 -156 -818 -423 -565
13250 -565 695 -557 1626 -1561 37 -245 326 -526 175 -229 482 -496 -269 -131 -371 -15 331 -2
13268 -2 721 -221 -955 711 230 260 49 658 1014 -113 -217 -553 302 969 -229 355 308 308 419 -756
13288 -756 -265 -511 898 -337 -284 732 -1462 -296 -251 -380 -356 -896 244 -191 1175 -474 881 -1296
13306 -1296 -149 -1257 690 464 -1064 1521 -430 380 -171 0 -489 -773 1118 -734 11 -184 17
13323 17 356 -623 -284 161 2034 -614 -100 447 -307 -382 -717 -138 772 -1194 107 -707 524 -1087
13341 -1087 278 -86 -96 -225 -337 -403 -367 376 61 -738 1067 435 457 -547 398 461 332 -323 -896 -333
13361 -333 498 -152 -107 -559 222 884 785 819 -652 -367 -912 73 -255 -207 -42 826 707 -20 437 -329 -749
13382 -749 348 -601 1058 -835 1137 47 171 462 -1526 -738 4 723 465 -770 527 -1444 173
13399 173 -588 225 -656 -333 256 234 510 -1511 -11 148 -103 -27 239 107 -286 494 34 229 947 -903
13419 -903 -122 -205 14 -305 -522 -601 -916 2005 -553 796 75 91 -289 256 347 459 -144 -156 -521 -428 -1265
13440 -1265 93 232 -99 -106 -173 167 619 671 -388 536 -450 -222 -128 73 239 171 1119 41 -171 -423
13460 -423 -295 351 1840 -630 -18 -358 97 911 -377 835 -418 -126 -615 562 -19 -846 1107
13477 1107 -481 407 -1116 156 -651 -138 126 -1972 949 -747 466 534 -436 320 -455 779 -1275
13494 -1275 -326 270 -363 -87 -1550 1136 75 -69 185 872 723 -389 1151 35 1257 -861 -520
13511 -520 272 -268 986 9 281 -253 933 1307 790 834 332 1598 231 -48 -351 -839 682 -1668
13529 -1668 706 -1394 94 -208 -643 218 -931 635 69 259 654 1622 815 239 683 -25 -243 481
13547 481 -328 -50 -1014 -330 100 423 -718 -53 -238 340 86 198 -788 2071 1089 -109 358 170 95
13566 95 -1235 458 -43 -177 1140 -516 266 722 809 217 386 637 -1907 -258 320 754 297 155
13584 155 256 -728 605 -383 258 444 -751 1456 -177 843 -759 767 166 579 1066 -552 -157
13601 -157 -382 -13 381 -598 383 -992 430 -531 267 -257 155 178 -576 1160 197 773 486 230 -606
13620 -606 -206 -568 -242 171 228 -985 671 -256 -1004 -32 -379 788 11 209 868 -107 -391 -132 59
13639 59 -443 -162 -661 273 251 120 1230 267 255 932 741 -223 705 -4 870 467 1118 220 -33 -316
13659 -316 1720 -1267 -908 -349 -703 616 -644 279 -2002 795 -500 -164 104 -731 -458 -887 -383
13676 -383 558 404 695 -555 -301 126 642 -188 -544 217 -1252 1936 -1248 867 891 584 622 -592
13694 -592 1538 -565 117 -598 157 237 -1187 -235 -129 -1057 -50 -707 -154 -885 243 -81 -14 -896 719
13713 719 -912 -1535 -130 206 1151 -172 315 -654 -523 762 -909 566 -40 -572 293 -521 433 -225
13731 -225 817 21 87 1369 -1012 -903 677 -365 -681 795 437 252 -47 -407 333 1317 -1422 438
13749 438 451 324 862 2 1705 -199 941 473 -739 -49 -445 -14 -288 -1619 -377 -708 243 -319
13767 -319 63 -284 868 248 115 499 -1292 98 -1475 607 798 -937 -242 -272 576 -1034 186
13784 186 -70 65 747 -1299 771 -956 -139 269 -596 1154 460 643 -862 -208 -255 507 124 -1025
13802 -1025 1137 -882 617 -1518 85 -141 -1768 268 -230 185 -37 418 963 -415 453 61 -410
13819 -410 -13 596 -388 -24 1429 -550 372 335 692 1162 778 952 -1183 1139 995 -224 1462 857
13837 857 -860 400 -656 1218 267 -328 89 -688 -206 -405 236 -1014 -594 137 -190 49 -742 1774
13855 1774 -1664 22 -406 424 130 -121 1351 70 1299 -567 484 453 -127 1003 -144 1234
13871 1234 -547 -555 787 -655 952 -561 960 -244 265 414 -1347 368 187 976 -747 -501 301
13888 301 -1019 838 -907 -106 -144 -60 521 162 559 -230 889 -443 -987 -1026 -43 -2 -1405 -221 292
13907 292 -1120 -148 -430 1036 -787 753 917 -97 167 406 390 -1056 -1175 -398 28 123 -162 1646
13925 1646 -554 795 -416 350 284 -866 574 482 -343 -917 557 862 -346 539 1520 556 -602
13942 -602 -553 167 -577 584 -1020 -575 783 -253 771 17 136 385 646 883 -83 749 -804 -772
13960 -772 122 -425 -573 -702 -197 -24 -611 612 -572 -231 -808 -464 -30 972 301 -218 696 -933
13978 -933 196 -249 -323 -12 -542 1119 -822 -4 -159 -32 -268 568 806 -1206 999 -763 -431 813
13996 813 -964 -484 -1023 -635 39 394 -579 -581 606 -1180 111 -895 415 92 -102 533 -1393 -1013
14014 -1013 1 533 -932 1245 1133 461 -746 413 144 -518 -379 329 445 947 -56 -516 -147
14031 -147 -954 -561 160 1067 624 116 649 -743 -167 -448 -392 -43 -1135 1052 992 -774 308 -871
14049 -871 19 127 380 538 -32 -252 -288 -51 -1163 916 374 471 -183 -1231 500 -1343 1222 -141
14067 -141 94 474 291 1302 170 -50 -969 -609 263 -199 53 518 108 -1487 221 793 -142 1210
14085 1210 -753 509 -277 -141 306 -974 -310 -411 -2 127 -89 1262 431 1094 -1204 -39 -94 717
14103 717 -696 267 485 -289 1242 607 147 -42 503 906 591 -1113 41 678 -4 326 114 -407
14121 -407 475 -89 -137 151 106 706 -792 599 887 804 301 1111 -296 1044 6 -449 99 -132 303
14140 303 -721 328 -982 1243 -1184 229 10 -69 610 -1043 440 -268 850 269 -563 1313 -852
14157 -852 174 -869 266 595 -701 646 34 1030 -101 231 284 257 1140 -1489 1425 -993 328
14174 328 -882 943 400 -882 841 -892 47 377 184 -560 -1568 1033 -826 280 -295 205 397
14191 397 -1011 907 -352 662 -1135 -925 875 55 -589 -243 -280 294 -24 -1019 319 -265 277 1299
14209 1299 -544 -25 567 -332 270 -1280 -323 362 1172 -291 -139 1401 1011 930 -368 -597 589 -227
14227 -227 548 4 150 904 -17 368 215 -528 -28 -30 1109 -340 892 -4 218 1089 338 1418 -1006
14246 -1006 490 709 -434 216 -823 281 -145 615 -845 559 -382 -1330 953 -613 425 959
14262 959 568 118 -21 208 -1180 210 -228 112 706 121 63 -862 1110 -824 -272 -49 -172 -56 -41
14281 -41 1278 -427 83 -516 -1137 -188 -1400 1400 -744 561 -1236 -260 -404 -1388 1178 -724 110
14298 110 -135 -227 1269 -462 -840 1087 -184 -749 -340 372 372 -248 468 -382 185 185 -601 499 1071 1060
14318 1060 -688 199 -532 -10 113 55 -71 -1263 1441 -144 -794 494 -845 868 628 714 600 203
14336 203 -911 -370 912 555 1031 315 -1402 316 -296 50 -594 9 -873 -135 387 -179 877 -14
14354 -14 -600 -686 -682 534 -1072 1084 -160 732 -94 -293 -258 -140 23 -1626 594 -1312 325 848 -1224
14373 -1224 468 -594 1271 -585 -603 615 -454 444 -584 450 -131 395 -191 -179 673 -950 43
14390 43 910 -311 -823 -135 1134 271 -292 -513 -159 164 -114 246 -568 689 407 -669 -501 -185 419
14409 419 377 112 -1247 -479 977 -744 -1023 -490 -236 102 671 -345 -50 185 -313 1561 1077 -122
14427 -122 853 -692 -377 -377 -226 477 -130 251 -174 -135 397 -19 813 -1411 -504 -884 556 -332 -191 300
14447 300 -1057 898 782 947 -107 -317 819 -634 152 -147 -665 490 -986 -1196 -755 -150 -850
14464 -850 -999 -411 -442 1274 -1213 790 -639 -165 -318 813 1006 791 1038 -1006 1367 219 -211
14481 -211 681 -779 225 1108 1352 167 -1140 -196 -972 717 -1302 337 5 -226 -1257 624 477
14498 477 -746 470 1193 -40 1050 -980 340 -238 384 320 88 -395 -466 -859 -506 -602 1021 142
14516 142 -215 380 -1141 59 -564 505 -333 386 -155 -232 1194 -1036 399 -784 -675 -67 587 541
14534 541 -672 846 -524 43 72 677 912 -21 773 -912 51 -578 488 480 -631 -464 -259 2187
14552 2187 646 -231 1095 -819 776 16 -86 544 -598 283 -57 -63 -272 -45 -228 -527 1682 -938
14570 -938 553 -588 258 273 -616 968 -507 -299 -968 795 482 114 421 -343 -35 -753 -153 167
14588 167 119 -156 -593 -266 -243 -752 334 -397 -655 494 254 -287 -158 507 -508 299 -460 273 -585
14607 -585 -102 162 -451 -1470 378 -331 380 105 -223 279 743 1038 -707 147 -582 120 -23 146 230
14626 230 531 301 -730 1576 -756 -40 803 198 869 -630 955 -76 -104 723 651 1098 -1820 1423
14644 1423 -1106 1369 1254 -659 405 -859 -153 530 -120 761 -841 843 -615 1292 -1114 228
14660 228 -216 297 368 -607 1584 -1198 589 -22 -1225 1102 -205 815 -420 -755 389 678 1198
14677 1198 212 1051 -276 287 1378 32 -48 -799 -804 -683 -288 864 235 -314 -316 1235 -98 -53 -1200
14696 -1200 -417 147 -470 -170 -673 300 -762 -966 559 36 653 1024 -258 948 -1109 -41 -970
14713 -970 -234 -264 -475 294 484 -209 -1322 -264 416 -651 371 -561 816 422 -548 347 536 878
14731 878 -1161 -348 483 -1544 490 -682 625 -307 660 -238 -227 53 -657 1622 -1055 1232 351
14748 351 -1109 241 -1067 1041 67 89 313 -1161 1286 -141 1027 -428 494 -888 -82 -152 344
14765 344 764 -626 -303 345 -348 771 -498 431 -719 380 -1162 -582 -142 -789 -94 -289 319 -836
14783 -836 344 -703 251 -149 -982 -860 538 594 -726 18 -300 821 1638 -461 -248 99 -323 -27
14801 -27 -305 360 -151 590 231 330 -731 824 508 -832 121 225 -33 -10 169 -341 1739 -157 743
14820 743 -73 77 18 -127 194 -1709 -574 242 -265 390 -164 407 106 1361 -193 -132 540 -1737 430
14839 430 -460 75 -449 -988 1132 -1140 416 -1495 655 -873 -765 1143 -551 261 -566 71 -169
14856 -169 275 494 -1198 544 147 322 -740 -175 439 -558 558 -708 13 -407 -681 914 -137
14873 -137 1314 -391 170 333 -985 491 72 316 574 1356 438 866 -893 -514 -228 -282 -669 243
14891 243 -506 213 544 -636 -231 -234 -350 -264 710 369 -175 468 432 -128 -502 300 -822 -894 -209 1804
14911 1804 330 -896 -501 130 -926 858 -545 722 -48 -1102 -279 -532 286 -998 272 -705
14927 -705 36 623 -647 -137 -316 1465 -958 896 -601 473 1394 -518 881 -746 631 -187
14943 -187 40 2043 -403 607 -1239 654 371 322 -166 -1855 1115 -328 61 -913 468 198 747
14960 747 -40 -89 6 1079 -373 40 -387 33 -376 1482 345 471 513 -642 1223 631 1491 -78
14978 -78 -650 3 -590 696 -205 -589 238 -270 621 -199 608 -158 452 800 106 845 -1151 -374 -344 -146
14998 -146 -243 -375 673 456 -351 233 81 -15 -318 448 144 -417 -65 -464 1313 -1461 178 -827 536
15017 536 342 5 -83 -639 260 -158 -796 1133 -926 132 -1146 1232 -52 -645 683 -1418 961
15034 961 -1334 587 806 -16 1100 -924 88 143 -173 -371 377 -700 -321 671 -668 299 -103 438
15052 438 717 -444 921 -756 986 339 -120 -1320 -109 922 -640 1035 47 -176 1514 279
15068 279 227 -868 339 -491 -921 -732 -90 -68 -211 -13 -10 -249 1397 -131 -301 952 -75 46 294
15087 294 -79 377 -228 514 -159 314 -88 -1030 458 -439 -491 -736 1254 -1050 212 -512 62 -396 -793
15106 -793 334 -221 53 -784 -5 1005 -362 175 -489 714 510 -49 399 -982 1106 -63 24 -271
15124 -271 -116 639 -1009 1363 -937 825 -1316 -350 388 -1187 -685 -978 560 -17 -666 226 -556
15141 -556 186 -805 -591 -807 -228 -7 -964 534 -467 446 -382 -101 695 -342 478 -276 630 716 264
15160 264 1175 139 -421 -614 496 -96 -382 -350 -989 29 -439 649 784 1227 -216 -688 -113 -276
15178 -276 249 -595 40 537 348 -660 148 -22 74 -910 73 608 -1224 -372 -403 216 69 -464 7 622
15198 622 24 -480 88 -334 34 220 -246 -506 -803 -833 -302 -188 29 -1103 736 -29 1661 194 158
15217 158 -568 -574 451 -1106 121 -675 935 294 -830 -75 -1266 1663 -1077 335 -17 -225 1420
15234 1420 -1395 1065 -890 -18 -1212 -582 890 -42 528 -581 194 -774 -751 -521 -999 808 -1194
15251 -1194 220 -141 -93 -665 24 734 -348 1866 -609 -799 270 683 -402 419 699 360 96 1226
15269 1226 -1120 -335 -27 -744 510 597 572 -988 58 -235 -1008 165 -293 -933 -44 207 143 -650 415
15288 415 285 -267 420 -477 345 -500 -257 -459 684 688 -353 -32 329 1067 108 -237 43 -272 518 -741
15308 -741 517 -1040 -80 -223 300 -327 -945 1918 -1953 162 863 -1778 751 -1340 1172 30
15324 30 1075 127 -108 74 -526 830 -658 304 -68 -774 571 -962 418 -726 472 583 -19
15341 -19 241 -130 480 -1434 632 -245 -376 -830 -1260 864 287 444 50 1304 193 -569 1267 -882
15359 -882 668 -730 414 -30 -663 562 -1307 -479 762 727 -379 -465 -897 312 -165 -145 298 553
15377 553 127 53 -636 249 -184 -742 -968 72 -514 240 -88 -76 -919 142 374 413 131 631 195 526
15397 526 243 532 210 210 -1381 -286 -1194 -320 392 178 464 -533 679 -648 1214 -1226 -542 58
15415 58 -724 1174 -338 231 -1349 214 116 -1127 691 -953 1005 -1296 681 -96 -500 903 -1404
15432 -1404 144 -609 302 -54 -1052 0 -986 907 -617 -897 -599 -503 63 -666 506 -998 224
15449 224 -792 -321 712 -1080 168 -930 131 303 -298 66 -613 329 618 211 -438 89 582 -612
15467 -612 302 153 12 1008 -426 1002 851 -559 -697 587 426 206 -796 769 -261 377 -1132
15484 -1132 397 942 534 1351 308 -303 -961 -229 -795 403 686 -1881 1187 -1854 1637 233 -674
15501 -674 527 -562 422 -579 -121 -541 -27 300 -159 1036 -231 262 401 -304 591 -237 -119 -1843
15519 -1843 1228 -79 -230 -175 -29 836 -376 1344 -682 78 1267 253 1402 -150 556 -1352
15535 -1352 109 389 422 -7 -826 1121 1101 794 491 -492 937 -922 620 1090 352 -1019 465 713
15553 713 -371 -112 -107 1290 380 60 -391 -194 587 15 -233 -35 -305 -171 -835 -71 -373 -1361 -440 449
15573 449 47 101 -705 657 -464 789 424 915 286 -846 742 -239 68 -240 710 994 -1180 1052
15591 1052 -1113 -100 -529 277 946 -1602 -122 -545 464 -798 -846 -230 -1339 922 -516 833
15607 833 -846 189 1268 -971 1689 -2095 160 297 253 213 -1205 267 -845 90 -355 -382 933
15624 933 -583 422 -683 1018 60 -233 -377 -655 552 -771 -674 -450 -101 917 -615 1047 88
15641 88 250 -797 1246 354 -775 454 -1104 -548 -269 629 -613 -623 156 -769 635 -666 -611 186
15659 186 1121 1418 22 -64 -265 -378 480 -643 1152 -118 -143 145 430 86 -107 -371 414 -1052 -42
15678 -42 -792 1168 -377 178 -848 -1520 1292 -747 79 -340 170 -216 -597 1065 -683 1524 759
15695 759 23 846 285 -5 -865 257 98 292 -413 -2088 995 -2085 -515 929 -480 974 -540
15712 -540 565 27 1238 -1281 -624 787 -952 -868 -763 104 343 965 -935 -1034 406 292 756 -1357
15730 -1357 312 -345 -858 559 -1261 1644 -130 1754 0 -564 845 -1325 254 -516 69 1026
15746 1026 279 -705 -460 341 -335 391 244 -769 -1360 -135 221 -244 -223 -368 -1233 -299 -433 343 114
15765 114 -640 625 -327 -692 456 -366 444 1163 454 -173 457 1105 -701 703 -704 336 -1129
15782 -1129 -348 -286 -818 1897 -1148 542 265 420 1018 -1225 912 -96 -26 -316 -20 299 -1014 46
15800 46 -239 1408 14 -122 -28 -740 375 -427 320 -1204 251 927 -77 945 -1118 -571 7 121
15818 121 -23 -775 -6 -1721 1209 41 614 452 481 105 -407 -18 41 447 -1397 -839 250 -237 353
15837 353 202 -105 541 -262 -33 137 -410 -678 -4 34 -884 513 -1205 70 92 -1487 -215 -630 -409
15856 -409 -402 340 911 386 102 -90 114 -590 -1351 717 -1253 9 -147 -467 -1172 -756 570 -1299 531
15875 531 153 74 549 -936 916 -854 -123 -317 -372 537 -380 1926 -543 957 -277 -491 -493 -698 16
15894 16 -850 805 -2375 -674 1177 -263 1223 -548 235 -446 -340 -55 -503 737 -1001 515 285
15911 285 367 366 180 303 -938 625 -475 -765 -198 -512 -483 -833 -380 -109 277 536 -852 475 549 234
15931 234 -1050 1143 -627 -248 261 -1162 -109 -243 79 -75 573 63 355 1189 -749 -252 -353 -862
15949 -862 234 671 769 -416 -181 229 -15 -40 -921 229 331 386 121 409 -769 -320 -366 673 -806
15968 -806 765 -311 345 544 -462 452 17 787 -577 545 894 83 249 169 334 214 426 -499
15986 -499 -1421 676 -590 964 -452 335 752 -454 1523 -461 830 -675 1051 -26 -1470 1092
16002 1092 -1316 514 445 22 192 287 -95 -526 122 722 2070 205 -632 534 160 398 1091 641
16020 641 599 -148 226 368 328 -1526 -81 387 708 105 -756 -142 -1073 -338 22 308 -105 -97 -48 -192 -393
16041 -393 -138 -91 661 -222 -47 -163 -612 657 40 -367 346 72 -595 123 528 -705 -802 -242 -1449
16060 -1449 -267 -180 786 -1193 195 884 -150 -105 -1139 383 301 117 1098 -1795 1108 -1472 -256
16077 -256 -1325 256 551 209 2152 -319 951 -1701 -166 64 696 33 171 -142 -952 -282 529
16094 529 -44 180 -1613 356 -342 508 37 -1008 933 -358 -381 -217 798 -95 471 303 -537 341
16112 341 -667 -69 142 14 456 -451 792 121 616 160 -727 39 278 906 -307 870 -48 64
16130 64 271 -79 207 368 46 194 -187 -486 -212 1562 258 -483 -923 527 -981 -52 92 -159 -181
16149 -181 150 -1114 -726 -328 88 556 230 1482 587 504 -1228 196 991 -448 75 -720 749 133
16167 133 -536 801 -1689 1626 -861 245 1003 -749 887 -1452 1014 464 -604 286 -355 647
16183 647 -207 1122 120 -861 952 -1242 -830 776 1398 -350 -538 -674 582 402 -960 909 -1190
16200 -1190 543 189 -1144 677 -645 1022 -439 1981 669 -83 271 -469 1190 -419 162 681
16216 681 304 1133 160 -413 -936 -328 207 -885 685 -74 139 271 -416 -168 -213 1057 -239 784
16234 784 573 381 613 -736 240 -220 1558 -683 -855 70 -1421 -312 145 60 241 -846 -976 -156
16252 -156 399 594 -285 519 -143 -123 -201 439 -392 -730 209 -691 -544 -457 302 490 -213 1341 -573 -12
16272 -12 -252 -23 1090 393 360 -271 577 166 932 -9 -352 -178 98 655 178 109 850 -322 1365 -831
16292 -831 265 -471 526 -344 -1124 723 -29 260 -1076 1208 499 -1063 123 -705 1136 51 278
16309 278 162 -66 -592 -379 -532 -40 537 -184 -673 -583 332 347 417 1048 -286 -990 -543 -392 1267 -227
16329 -227 -140 -221 701 -787 257 -479 -560 806 312 162 382 319 961 872 -332 109 -151 -244 812 200
16349 200 -1392 -582 228 -786 19 253 -877 36 -643 1581 98 -165 -1123 -1153 841 -1307 644
16366 644 -759 354 -151 -903 895 -330 862 -11 271 -164 -1048 1566 27 137 -429 504 -151
16383a51
$$ Imaginary data points
##PAGE= N=2
##DATA TABLE= (X++(I..I)), XYDATA
0 0 0 0 0 0 0 0 0 0 0 0 0 0 0 0 0 0 0 0 0 0 0 0 0 0 0 0 0 0 0 1 0 0 2 -5 2 -3 6 -6 4 -3 3 -3 3 -3 4 -8 8 -9 11 -13 13 -11 13 -16
54 -16 19 -20 29 -29 32 -41 50 -67 90 -135 220 -439 305 372 1134 2390 590 994 -1617 -581 -797 798
76 798 1097 1329 1447 -522 -265 -1517 -208 211 2001 893 9 508 -794 -270 -1211 245 709 553
94 553 1530 -119 -800 -791 25 695 353 435 -194 20 92 -711 -738 -474 -474 -521 225 809 182 97 -1037 -28 1236
117 1236 -20 671 -150 -1063 -639 7 1091 718 1047 -380 217 108 -197 877 -869 1008 320 192
135 192 -708 -1410 179 -1067 800 -338 1049 1825 570 -1144 -443 787 -39 725 1133 -122 -606
152 -606 -1457 -558 -1317 -987 370 -472 1275 -1235 1117 -2037 -165 -426 1296 1397 -174 387 -643
169 -643 313 -518 631 34 190 1234 -409 279 -751 -71 -342 858 1630 28 120 -294 706 21
187 21 -308 446 359 365 146 -311 -1461 -1192 -49 -221 374 766 360 -248 131 -689 -436 519 321 67 -428
208 -428 -551 -1152 -567 210 -296 52 1302 -370 -1194 213 156 599 -249 182 330 -890 -483 -192 -848
227 -848 -210 -351 125 335 434 -19 528 -481 -94 -727 443 978 -1192 811 -938 -353 -370 398 1015
246 1015 -947 -531 -478 76 -1089 1415 104 -224 487 -1810 -404 -685 -589 325 -200 591 -999 1163
264 1163 -334 -698 -141 -584 733 -1079 496 -1 -237 224 -418 417 -617 1190 -47 559 1004 -931
282 -931 1025 -131 -634 379 970 170 -176 293 -71 758 -241 -973 966 -822 -65 -461 428 -49 1775
301 1775 -1 183 -444 237 19 194 -350 -36 440 -838 54 -63 -722 -1862 977 988 207 -39 31
320 31 6 -681 97 -64 -791 789 -1162 964 -58 685 -683 371 128 -1056 521 -1293 482 -517
338 -517 -208 146 -286 617 -645 1381 -816 -356 867 -972 351 -1358 1568 298 -242 247 -409
355 -409 950 -875 715 672 -89 800 -1458 326 -464 1111 -368 127 -843 -815 983 -1143 740 -1099
373 -1099 -212 -342 -601 1012 -923 85 -318 -301 320 -258 510 6 1656 -453 -639 -52 193 151 29
392 29 1001 -71 179 -436 -592 -299 453 207 -380 32 58 606 45 55 -294 873 538 -1114 -524 -1471
412 -1471 156 81 -678 -888 1535 -234 -209 204 -98 1784 -422 -446 223 217 639 -507 -140 -952 1130
431 1130 -873 -170 -683 -1316 740 -295 366 -1075 -58 1128 -985 983 -282 1096 -958 579
447 579 671 -507 406 159 390 -23 709 114 235 -239 79 619 -518 653 -332 -219 473 -539 259
466 259 148 -628 -631 -214 452 -1166 -579 -1214 -163 -384 -821 615 -779 438 -227 232 64 -318 -203
485 -203 -961 87 150 -687 -555 -932 -931 125 1125 268 557 -328 -660 74 122 -299 -53 216 -898 969
505 969 -1437 203 266 764 -144 736 -83 -368 -79 -1232 345 83 666 680 -304 866 -396 -585 -1683
524 -1683 92 -864 -717 790 -1595 1076 -1469 727 -502 -170 318 -891 551 -431 739 -485
540 -485 267 606 -761 468 -175 340 -971 155 -379 439 1074 38 863 -1398 135 -375 650 990
558 990 -44 1199 -308 -199 825 -537 662 -1006 -209 -1293 182 -264 -266 -17 -198 457 -882 1091
576 1091 -402 931 332 408 1377 931 -35 252 -471 673 -2 -446 552 284 602 107 -39 588 -383
595 -383 -776 -550 558 327 -459 -91 -206 -577 -29 463 -1203 935 419 -1548 34 -191 530 123 -229
614 -229 -382 -389 150 -715 481 -325 -118 24 650 874 -562 641 281 -837 25 -781 -677 -1613 516
633 516 -79 290 447 -614 -559 -2060 785 -1399 -353 32 -167 790 47 742 -566 102 -3 -1136
651 -1136 -18 -2144 552 -662 849 299 -1166 -362 -1553 992 -1173 1570 105 -1079 710 -822
667 -822 801 -775 1042 244 -1087 176 814 313 123 432 -653 278 -220 -50 689 -376 497 -796
685 -796 -205 -368 -177 339 -876 270 683 337 514 -6 476 1401 102 275 -507 -399 1267 -222 1031
704 1031 343 473 186 -385 38 -389 -404 -1232 336 590 349 246 -1066 1174 -651 470 -147 383 289
723 289 -961 757 -1276 1160 -377 174 -102 -84 1155 -1662 455 -854 -632 284 -641 742 -838
740 -838 457 33 569 -339 -1240 -286 -968 502 142 -450 388 1523 938 -795 534 -512 227 183 94
759 94 1101 142 -666 394 607 -172 311 232 39 624 -339 724 -465 -458 -461 -185 555 -314 595 1013 261
780 261 1257 -269 -571 -223 -412 498 -601 -209 -298 -765 -146 474 -587 654 1026 176 131 515 -1228
799 -1228 592 -798 -218 928 -115 784 -381 394 68 162 -11 -662 -394 -1057 -211 630 176 482 -812
818 -812 617 -1607 762 -149 -326 44 669 1768 -1235 593 -1271 -121 5 -565 953 -997 889
835 889 -188 797 146 1058 -36 -850 938 -212 633 -262 -403 503 -553 -148 44 -842 268 558
853 558 756 -52 20 277 180 -576 201 463 -128 -401 844 515 -118 -382 -403 218 -122 218 1484 -23
873 -23 -17 -694 -581 -550 -878 841 656 461 82 508 -431 159 -371 149 -223 -191 1811 -996 599 -879
893 -879 -281 -932 -1056 -342 -664 231 -1105 1186 -331 650 657 216 496 -573 -324 -465 -18 240 -822
912 -822 -230 -1142 1004 -706 -611 1430 -1018 248 -1638 428 -395 1418 97 179 -641 273 -106 -36
930 -36 175 182 204 792 -796 2221 -852 -68 161 -926 605 -1152 1301 -642 -500 283 -79 -921 -874
949 -874 913 -487 499 -84 172 898 -300 652 -527 104 88 780 580 156 936 -213 -751 -357 113
968 113 282 614 -601 529 587 -324 701 -835 -579 420 -381 -328 843 -461 454 -334 275 -185 -33
987 -33 107 319 869 -469 -551 -284 -222 -281 44 -100 889 -524 -117 171 577 -223 355 -906 98 461
1007 461 -951 -111 46 773 402 -488 30 -157 235 -658 347 267 223 -159 -456 1806 -896 398 562
1026 562 -914 40 -424 970 -1050 755 -604 5 572 -494 -305 -869 201 672 -50 103 -1120
1043 -1120 794 1003 202 384 -241 91 -500 -634 -971 -748 -1048 1504 453 -298 -121 -325 -159 -1421
1061 -1421 -986 37 -1031 -554 633 -43 -1029 376 472 840 -436 658 -37 185 865 409 -296 901
1079 901 513 -675 532 -176 -3 -256 -185 -111 -165 800 -320 -290 -668 -65 -66 -1158 188 -937 1634 -191
1099 -191 -1041 103 547 1699 -313 279 445 -1467 -716 -791 741 -30 -123 160 -198 871 -1927 1438
1117 1438 -414 1282 565 477 204 -1782 553 -382 -77 -819 140 -73 -1005 1940 -822 416 -591
1134 -591 -397 1251 -585 1182 -1518 356 -1341 -725 1870 -384 476 -279 265 -1252 258 -620 -151
1151 -151 416 -239 60 628 44 -46 -449 -312 29 951 -509 -207 -350 1141 -470 -263 -509 -218 -636
1170 -636 640 -491 -939 108 170 -90 -211 -678 662 -582 360 -78 324 493 -473 -824 -912 74 -377
1189 -377 995 -661 230 614 -704 218 -2107 61 300 1129 695 -547 370 -1044 502 -1243 -270
1206 -270 604 -755 907 -466 230 -511 245 1087 -372 901 -1470 1700 -1035 931 50 -842 -420
1223 -420 257 245 -625 128 1370 194 538 -279 1241 -519 991 224 -126 142 -775 497 -1091 -865
1241 -865 -1572 -43 891 -455 -82 -911 -53 -320 -534 338 34 -502 -205 985 -130 162 249 -421 -134
1260 -134 -126 294 617 202 -882 770 813 -673 -562 -97 -856 838 132 -262 -284 503 -910 685 628 565
1280 565 -723 1523 -965 544 302 -65 -576 -863 -110 20 1250 -570 759 814 24 -995 -916 1177
1298 1177 -972 353 614 -156 -93 -411 599 -843 1167 727 -236 139 -291 1332 -1828 1027 109
1315 109 351 505 -531 1477 -479 320 -597 313 293 -849 1095 -621 335 1064 723 605 -334 937
1333 937 -1491 -803 -640 165 333 -447 617 115 -1120 -507 352 362 265 2 -262 551 831 550 1455 -243
1353 -243 533 496 419 -364 -125 126 -448 -289 285 285 686 -202 802 1000 -659 624 -467 81 323 -287
1373 -287 -92 -569 -10 -1204 105 -556 -983 672 -854 66 133 -69 -1070 862 -290 -6 788 -639
1391 -639 299 -997 364 -323 -170 1465 -819 1092 187 905 332 -881 -265 -865 1115 -1257 994
1408 994 -776 -534 246 -512 1257 -892 -109 -27 691 691 -611 -590 -1076 1557 -70 127 20 -625 243
1427 243 -833 166 423 -965 851 282 311 1013 -158 -388 -384 8 122 206 -661 -789 -1361 1112 -856
1446 -856 459 -681 -278 -547 653 -897 50 651 387 72 -857 -16 -1335 388 -192 806 526 -672
1464 -672 308 136 56 435 272 -434 -851 77 -771 415 -532 305 -496 -277 -109 -354 99 -770 -547 1029
1484 1029 -990 493 -1598 572 388 -548 899 -565 158 -1109 -156 -686 70 947 -1370 283 -658
1501 -658 -836 -776 829 1389 -1419 434 -281 710 240 486 -740 -802 1097 -209 -703 -156 -208 -1213 -722
1520 -722 446 -676 396 -526 993 385 98 566 -1013 506 -41 -734 -122 -97 822 -755 97 -435
1538 -435 951 6 -330 -335 -426 -257 136 -266 238 -333 184 458 -1646 -115 -173 316 -327 5 655 -469
1558 -469 -533 -768 -1540 -445 -186 560 228 1058 -190 -48 340 -163 791 -1336 984 -85 79 427 -23
1577 -23 333 -1238 1226 721 121 224 448 1256 -833 220 -337 221 -104 145 1698 -143 1055 -1836
1595 -1836 868 -602 -600 224 -1456 1971 -1132 552 -461 -1171 659 -521 1022 -1443 1432 -277
1611 -277 -374 187 -833 1367 -1604 562 -803 851 344 -814 1162 -430 689 -1661 1 248
1627 248 -1284 1092 -688 1283 150 550 -334 -736 629 -284 -312 -75 -263 704 866 -375 -520 104
1645 104 523 -995 -293 570 -930 119 -667 -89 309 917 44 -573 420 479 415 1180 363 446 467 779
1665 779 818 1257 464 728 58 -671 12 -379 1087 -164 -649 486 -553 -524 -533 911 -419 -663 -841
1684 -841 -778 1257 -1116 748 -508 280 -521 -659 238 -347 321 -894 1210 -429 574 856 -1373
1701 -1373 141 233 1246 313 -383 766 -774 1366 -1732 -584 -804 224 1134 -233 -448 -1943 302
1718 302 -821 -1134 -987 176 333 -362 663 -756 446 -229 1564 980 -1071 709 718 123 67 -469
1736 -469 -319 221 307 -177 954 193 -609 897 222 -127 -363 652 -239 256 246 815 -47 483 258 708
1756 708 29 -430 -125 -230 538 -675 624 -651 -291 193 -600 -148 -39 200 440 -133 -502 -1599 -603
1775 -603 -494 919 -49 -459 716 48 427 -149 447 -191 -78 1240 -642 1796 333 620 -13 -334
1793 -334 674 -166 -202 -893 6 502 -481 160 41 616 -615 1152 -300 -491 627 -1106 292 -818
1811 -818 -878 -592 -538 380 -596 217 -280 1665 -1180 1196 -718 79 282 -533 545 -404 261 368 918
1830 918 816 72 -538 -380 628 -502 105 438 158 -173 944 -273 -353 217 1019 -28 -884 231
1848 231 82 343 488 -510 -125 491 19 -1201 -110 -21 -275 -125 -90 -70 -66 877 -634 482 1294 -457
1868 -457 -26 -739 684 -52 -38 67 -795 612 -1121 446 203 302 498 -159 171 -605 385 455 -63 -403
1888 -403 -821 1283 325 -129 359 -194 1106 -320 398 -1266 1166 -818 695 342 -900 1938 -1508
1905 -1508 697 215 -464 -575 -194 406 92 114 -12 873 -76 -614 906 387 336 -167 499 346 -982
1924 -982 -465 -365 887 178 495 -187 -550 -519 -1090 -291 -295 891 449 443 806 -199 -261 -352 -114 451 -237
1945 -237 269 1102 -1466 -81 -245 938 529 551 196 -71 193 -903 1022 -60 23 841 126 1367
1963 1367 -1661 -374 -172 441 449 -151 371 -738 240 -407 -33 210 358 665 -480 388 256 217 -103
1982 -103 -39 301 -459 -194 -1733 -476 -615 237 811 265 729 -358 -226 596 -772 192 -797 60 373
2001 373 -857 -685 589 465 -792 830 -176 240 -174 -619 -524 -1022 233 -350 1848 190 -395 854
2019 854 -348 -392 -735 -209 -59 336 1355 -326 -316 -181 -392 325 360 407 -353 -1406 -11 23 201 -177
2039 -177 459 228 264 1 -477 -463 269 -352 1716 85 417 3 -368 -85 -338 -1420 -1902 1140 -385
2058 -385 595 96 -489 289 -153 1877 880 928 462 -88 -96 108 1284 -957 -297 161 223 384 -1199 192
2078 192 -864 367 -39 1315 47 -71 132 -1574 -192 -571 342 370 456 132 -1566 668 356 -483
2096 -483 926 -42 -272 46 29 -264 819 289 -440 1001 -640 -31 -327 284 -1218 330 356 64 1520
2115 1520 -695 61 660 -105 716 439 562 -496 -637 -474 296 193 427 -243 -551 -1143 216 14 1013
2134 1013 -874 -324 -453 -648 -961 319 778 773 -375 1149 -51 -265 -229 -301 544 -879 -108 207 852
2153 852 -109 353 -1101 -504 374 -111 1301 -80 470 -626 -1082 67 -1319 1047 -857 1428 259
2170 259 -906 63 -535 694 -333 -610 -248 -464 720 -1569 1294 -606 258 1193 -746 1534 -886
2187 -886 583 -302 812 -234 -325 1006 -1082 863 -130 -570 -1586 -232 866 -344 428 -121 -1481
2204 -1481 308 107 846 68 839 -115 -10 -445 -791 75 162 -236 412 -48 201 -86 -605 757 -1134
2223 -1134 351 -795 1047 160 239 -415 -864 1109 -155 16 -511 -1231 -379 42 1047 684 -1224 429
$$ [...]
16383a29
##END NTUPLES=NMR FID
##END=
