##TITLE=31P_DE-80H_X3
 64 sc D2O
 26.2.2025
##JCAMPDX= 6.0         $$ Bruker NMR JCAMP-DX V2.0
##DATA TYPE= NMR FID
##DATA CLASS= NTUPLES
##ORIGIN= UXNMR, Bruker Analytische Messtechnik GmbH
##OWNER= root
$$ XWIN-NMR		Version 3.5
$$ Tue Jun  2 17:11:16 2026 Russian Standard Time (UT+4h)  Yarkov@DPX200
##.OBSERVE FREQUENCY= 81.013821
##.OBSERVE NUCLEUS= ^31P
##.DELAY= (6, 6)
##.ACQUISITION MODE= SIMULTANEOUS
##.ACQUISITION SCHEME= undefined
##.AVERAGES= 64
##.DIGITISER RES= 17
##SPECTROMETER/DATA SYSTEM= spect
##.PULSE SEQUENCE= zgpg30
##.SOLVENT NAME= D2O
##.SHIFT REFERENCE= (INTERNAL, D2O, 0, 243.863)
##AUDIT TRAIL= $$ (NUMBER, WHEN, WHO, WHERE, WHAT)
$$ ##TITLE= Audit trail, XWIN-NMR		Version 3.5
$$ ##JCAMPDX= 5.01
$$ ##ORIGIN= Bruker BioSpin GmbH
$$ ##OWNER= Yarkov
$$ C:/Bruker/XWIN-NMR/data/yarkov2/nmr/P31/2/audita.txt
$$ ##AUDIT TRAIL=  $$ (NUMBER, WHEN, WHO, WHERE, WHAT)
(   1,<2026-06-02 17:10:41.53 +0400>,<Yarkov>,<DPX200>,
      <created by zg, POWCHK disabled, PULCHK disabled
       configuration hash MD5:
       00 E9 B6 7A A2 85 ED C7 34 08 36 98 17 FE 4E 26
       data hash MD5: 32K
       A1 34 54 41 99 24 ED E4 4D F9 8C 60 11 2E 7D 62>)
$$ ##END=
$$ 
$$ hash MD5
$$ FE B0 B2 59 48 A5 D0 3A B2 73 A6 8D 9F 01 CA DA
##$RELAX= 
##$RELAX= 
##$RELAX= 
##$RELAX= 
##$RELAX= 
##$RELAX= 
##$RELAX= 
##$RELAX= 
$$ Bruker specific parameters
$$ --------------------------
##$DU= <C:/Bruker/XWIN-NMR>
##$EXPNO= 2
##$NAME= <P31>
##$PROCNO= 1
##$TYPE= <nmr>
##$USER= <yarkov2>
##$AMP= (0..31)
100 100 100 100 100 100 100 100 100 100 100 100 100 100 100 100 100 100 
100 100 100 100 100 100 100 100 100 100 100 100 100 100 
##$AQSEQ= 0
##$AQ_mod= 1
##$AUNM= <au_zg>
##$AUTOPOS= <>
##$BF1= 81.014009
##$BF2= 200.13
##$BF3= 200.13
##$BF4= 200.13
##$BF5= 200.13
##$BF6= 200.13
##$BF7= 200.13
##$BF8= 200.13
##$BYTORDA= 1
##$CFDGTYP= 0
##$CFRGTYP= 5
##$CHEMSTR= <none>
##$CNST= (0..31)
1 1 145 1 1 1 1 1 1 1 1 1 1 1 1 1 1 1 1 1 1 1 1 1 1 1 1 1 1 1 1 1 
##$CPDPRG= <waltz16>
##$CPDPRG1= <>
##$CPDPRG2= <waltz16>
##$CPDPRG3= <>
##$CPDPRG4= <mlev>
##$CPDPRG5= <mlev>
##$CPDPRG6= <mlev>
##$CPDPRG7= <mlev>
##$CPDPRG8= <mlev>
##$CPDPRGB= <>
##$CPDPRGT= <>
##$D= (0..31)
0 1 0 0 0 0 0 0 0 0.06 0 0.03 2e-05 3e-06 0 0 0.0002 0 0 0 0 0 0 0 0 0 
0 0 0 0 0 0 
##$DATE= 1780405840
##$DBL= (0..7)
120 120 120 11 120 120 24 19 
##$DBP= (0..7)
150 150 150 150 150 150 150 150 
##$DBP07= 0
##$DBPNAM0= <>
##$DBPNAM1= <>
##$DBPNAM2= <>
##$DBPNAM3= <>
##$DBPNAM4= <>
##$DBPNAM5= <>
##$DBPNAM6= <>
##$DBPNAM7= <>
##$DBPOAL= (0..7)
0.5 0.5 0.5 0.5 0.5 0.5 0.5 0.5 
##$DBPOFFS= (0..7)
0 0 0 0 0 0 0 0 
##$DE= 6
##$DECBNUC= <off>
##$DECIM= 4
##$DECNUC= <off>
##$DECSTAT= 4
##$DIGMOD= 1
##$DIGTYP= 9
##$DL= (0..7)
0 0 52 120 120 21 21 25 
##$DP= (0..7)
150 150 150 150 150 150 150 150 
##$DP07= 0
##$DPNAME0= <>
##$DPNAME1= <>
##$DPNAME2= <>
##$DPNAME3= <>
##$DPNAME4= <>
##$DPNAME5= <>
##$DPNAME6= <>
##$DPNAME7= <>
##$DPOAL= (0..7)
0.5 0.5 0.5 0.5 0.5 0.5 0.5 0.5 
##$DPOFFS= (0..7)
0 0 0 0 0 0 0 0 
$$ [...]
##$SUBNAM1= <"">
##$SUBNAM2= <"">
##$SUBNAM3= <"">
##$SUBNAM4= <"">
##$SUBNAM5= <"">
##$SUBNAM6= <"">
##$SUBNAM7= <"">
##$SUBNAM8= <"">
##$SUBNAM9= <"">
##$SW= 400.765351723535
##$SWIBOX= (0..15)
0 1 3 0 0 0 0 0 0 0 0 0 0 0 0 0 
##$SW_h= 32467.5324675325
##$TD= 32768
##$TD0= 1
##$TE= 0
##$TE2= 300
##$TE3= 300
##$TEG= 300
##$TL= (0..7)
0 120 53 12 22 120 120 120 
##$TP= (0..7)
150 150 150 150 150 150 150 150 
##$TP07= 0
##$TPNAME0= <>
##$TPNAME1= <>
##$TPNAME2= <>
##$TPNAME3= <>
##$TPNAME4= <>
##$TPNAME5= <>
##$TPNAME6= <>
##$TPNAME7= <>
##$TPOAL= (0..7)
0.5 0.5 0.5 0.5 0.5 0.5 0.5 0.5 
##$TPOFFS= (0..7)
0 0 0 0 0 0 0 0 
##$TUNHIN= 0
##$TUNHOUT= 0
##$TUNXOUT= 0
##$USERA1= <user>
##$USERA2= <user>
##$USERA3= <user>
##$USERA4= <user>
##$USERA5= <user>
##$V9= 5
##$VALIST= <valist>
##$VCLIST= <CCCCCCCCCCCCCCC>
##$VD= 0
##$VDLIST= <DDDDDDDDDDDDDDD>
##$VPLIST= <PPPPPPPPPPPPPPP>
##$VTLIST= <TTTTTTTTTTTTTTT>
##$WBST= 1024
##$WBSW= 4
##$XGAIN= (0..3)
0 0 0 0 
##$XL= 0
##$YL= 0
##$YMAX_a= 4183
##$YMIN_a= -6316
##$ZGOPTNS= <>
##$ZL1= 120
##$ZL2= 120
##$ZL3= 120
##$ZL4= 120
##$ABSF1= 60
##$ABSF2= -190
##$ABSG= 5
##$ABSL= 3
##$ALPHA= 0
##$AQORDER= 0
##$ASSFAC= 0
##$ASSFACI= 0
##$ASSFACX= 0
##$ASSWID= 0
##$AUNMP= <proc_1d>
##$AZFE= 0.1
##$AZFW= 0.5
##$BCFW= 1
##$BC_mod= 2
##$BYTORDP= 1
##$COROFFS= 0
##$CY= 9.86611175537109
##$DATMOD= 1
##$DC= 1
##$DFILT= <>
##$DTYPP= 0
##$F1P= 182.462994727601
##$F2P= 168.069089081705
##$FCOR= 0.5
##$FTSIZE= 0
##$FT_mod= 0
##$GAMMA= 1
##$GB= 0
##$INTBC= 1
##$INTSCL= 1
##$ISEN= 30
##$LB= 1.5
##$LEV0= 0
##$LPBIN= 0
##$MAXI= 11.51145
##$MC2= 0
##$MEAN= 0
##$ME_mod= 0
##$MI= 1.244541
##$NCOEF= 0
##$NC_proc= 0
##$NLEV= 6
##$NOISF1= 0
##$NOISF2= 0
##$NSP= 1
##$NTH_PI= 0
##$NZP= 1
##$OFFSET= 243.8632
##$PC= 1.4
##$PHC0= 1599.201
##$PHC1= 73.15952
##$PH_mod= 0
##$PKNL= yes
##$PPARMOD= 0
##$PSCAL= 0
##$PSIGN= 0
##$REVERSE= no
##$SF= 81.0140731611343
##$SI= 65536
##$SIGF1= 0
##$SIGF2= 0
##$SINO= 80
##$SIOLD= 65536
##$SREGLST= <31P.CDCl3>
##$SSB= 0
##$STSI= 0
##$STSR= 0
##$SW_p= 25641.0256410257
##$SYMM= 0
##$S_DEV= 0
##$TDeff= 0
##$TDoff= 0
##$TI= <>
##$TILT= no
##$TM1= 0
##$TM2= 0
##$TOPLEV= 0
##$USERP1= <user>
##$USERP2= <user>
##$USERP3= <user>
##$USERP4= <user>
##$USERP5= <user>
##$WDW= 1
##$XDIM= 64
##$YMAX_p= 0
##$YMIN_p= 0
$$ End of Bruker specific parameters
$$ ---------------------------------
##NTUPLES= NMR FID
##VAR_NAME=  TIME,          FID/REAL,        FID/IMAG
##SYMBOL=    X,             R,               I
##VAR_TYPE=  INDEPENDENT,   DEPENDENT,       DEPENDENT
##VAR_FORM=  AFFN,          ASDF,            ASDF
##VAR_DIM=   16384,         16384,           16384
##UNITS=     SECONDS,       ARBITRARY UNITS, ARBITRARY UNITS
##FACTOR=    3.08e-05,      1,               1
##FIRST=     0,             0,               0
##LAST=      0.5045964,     0,               0
##MIN=       0,             -6316,           0
##MAX=       0.5045964,     4183,            0
$$ Real data points
##PAGE= N=1
##DATA TABLE= (X++(R..R)), XYDATA
$$ [...]
7252 -16 639 -528 842 -554 -4 -1434 524 -151 -24 82 -1245 1120 174 -369 -204 -482 730 360
7270 360 639 -191 253 192 946 431 463 1286 885 296 765 88 794 -1741 201 4 -684 618 341 -60
7290 -60 1382 18 -371 -449 156 -337 33 -963 -511 -740 -223 76 -200 184 -917 270 668 -26 -93 -619
7310 -619 306 -428 -377 382 -193 914 -745 168 218 56 -807 -1507 778 1157 439 248 256 325 -621 -23 646
7331 646 459 176 -167 87 -430 56 -981 263 304 -452 1547 -284 588 -871 548 1399 -790 792
7349 792 1082 399 429 242 379 381 631 -509 2 -399 -48 181 -920 658 -461 857 428 55 365
7368 365 -710 1281 -279 -212 533 -25 311 -250 127 -748 840 -1450 -209 378 -323 915 -1282 515
7386 515 -583 -395 577 -313 -179 -958 494 -690 5 46 -50 366 -285 46 -412 441 286 529 1185 1333
7406 1333 -105 420 128 -137 -64 668 60 182 -1606 -951 951 -207 265 174 -281 1375 -151 -232 -687
7425 -687 -391 339 23 360 -1248 265 338 337 148 -1300 993 -865 748 400 -259 904 518 -188 -894
7444 -894 1035 -357 465 562 3 951 -917 -141 -284 1081 -905 -1250 245 -987 632 -220 293 -561
7462 -561 -881 236 162 1078 -323 318 1254 -649 646 -107 462 -882 -598 -646 -829 361 484 -529
7480 -529 -164 -219 -827 880 597 95 809 -1389 -562 -1242 12 936 -521 187 -511 108 993 98 -1184
7499 -1184 -341 454 224 879 106 -876 671 -567 -894 -155 191 56 -30 46 -554 341 1222 -118 817
7518 817 -713 -252 -35 -490 22 -1017 -15 -419 78 1469 499 921 -622 -83 -1136 810 716 1560
7536 1560 754 -542 245 -726 1487 -599 -226 827 -125 643 -143 1124 918 -50 1842 99 -634
7553 -634 -260 -34 336 -1567 1569 -1139 428 -208 -12 162 775 -244 -492 417 927 -585 -972 968
7571 968 -358 327 301 -460 687 479 -108 602 -813 -622 -328 -518 121 232 -418 -417 1828 -555 921
7590 921 180 92 65 -603 823 385 -744 -433 -341 -62 379 -875 -675 -154 74 -815 711 -273 -472 384
7610 384 -824 393 -501 95 -492 249 839 -598 922 -801 -243 -470 -753 -148 -61 393 -637 400
7628 400 246 -66 1251 -105 938 -196 -388 101 -91 1386 -336 -205 -66 1146 -24 -1425 -326
7645 -326 -512 1085 -203 -1006 400 -342 501 -909 253 -607 470 -526 -460 1073 -127 -267 -945 -256
7663 -256 627 385 -995 -1085 -458 -743 39 252 53 690 -433 622 -510 -396 664 -523 1137 71
7681 71 918 -1326 -370 350 -858 129 612 691 -629 -266 498 -529 -356 -771 541 476 -447 -177 1199
7700 1199 670 -484 -913 -520 158 29 -1098 416 258 -891 1660 147 -2 68 10 101 601 146 187
7719 187 -217 -517 214 254 97 243 -346 556 -22 -279 718 397 1005 53 195 -674 -253 458 -100 443
7739 443 560 158 -351 1085 -152 -205 679 -1467 964 -707 -114 -392 -7 -272 -95 315 -677 167 -119
7758 -119 938 1015 -711 765 227 152 1014 -563 -20 -2128 -888 663 1141 719 75 -439 6 35 -117
7777 -117 -339 352 486 494 589 -643 812 385 205 385 708 -345 -731 135 225 571 -133 746 -416 -455
7797 -455 180 -448 15 -362 -1365 -42 -493 -99 -595 -287 353 111 734 -318 779 198 607 155 1428
7816 1428 125 -848 -40 -706 -50 -1076 129 476 -220 161 780 1182 -895 683 -549 452 450 -182
7834 -182 967 71 109 -653 -280 210 -408 332 -938 431 -411 1317 -610 -987 1030 -387 1262 187
7852 187 161 -684 -295 882 -791 689 44 -316 -444 -503 771 196 -359 -928 -89 -602 337 366 -395 -546
7872 -546 -1292 171 625 -455 366 -131 -366 459 484 -314 -393 -233 -545 -701 -611 247 413 1313 -175 542
7892 542 -617 927 56 100 1181 -505 -672 -361 -106 -76 -156 -182 -54 345 -21 1015 -1076 688 -692
7911 -692 -515 -682 -751 280 -631 563 -340 -182 -66 -782 611 -1 1776 -515 -601 1017 -262 681
7929 681 -845 729 -171 -398 256 -1462 942 -612 65 -589 -547 1040 220 321 569 142 254 -83
7947 -83 -660 -1521 -243 803 309 -1219 -1053 -294 -620 513 -409 -117 440 556 -501 485 255 -1038
7965 -1038 511 229 -67 -455 -212 270 -589 -661 -1376 -233 -311 -210 13 1000 -253 413 -782 -128 -528
7984 -528 121 42 -1113 696 -110 957 248 -518 -57 -917 183 315 -38 -626 877 -272 716 499
8002 499 -152 -3 430 85 -785 -585 507 -1853 -47 -513 -469 1978 172 1064 -233 139 -842 66
8020 66 -46 -1157 -642 -484 -201 469 -530 298 -1048 536 -343 1023 -35 -1359 442 -1066 467
8037 467 -401 474 -298 412 859 272 -127 1236 133 -230 222 -546 -680 -430 40 368 -630 169 630
8056 630 267 220 -98 949 -48 260 -12 388 91 -366 81 864 -316 643 -866 195 -69 -72 -143 -232
8076 -232 912 -832 1078 -361 18 458 -348 371 -308 317 -299 466 949 -577 48 -245 2 -379
8094 -379 228 -212 -1850 373 483 118 76 85 692 83 235 -451 -396 -409 86 223 -369 -410 807 -478 -8
8115 -8 -134 1636 -226 -307 83 -337 1034 322 749 -174 820 -711 -923 11 -833 -371 -24 320 -471 459
8135 459 46 -513 1092 -165 98 270 -757 -1236 -471 -38 801 899 466 -272 -129 122 -426 -530 700
8154 700 74 753 -151 810 320 380 -94 40 -92 1099 -1096 477 -851 41 -45 -865 -146 -831 310
8173 310 1086 790 855 -729 861 -32 181 1063 -691 1680 -64 -65 -37 -1234 402 -904 175 266 -903
8192 -903 -701 453 -518 -744 378 -1663 117 -36 -530 714 465 931 282 80 609 234 1401 -302
8210 -302 190 -421 1296 -59 282 406 -717 77 -886 1674 799 -70 -218 -959 511 -553 -330 -312
8228 -312 382 -369 -1410 -71 -368 116 -555 -576 532 -1482 -406 -136 -115 767 -99 372 -995 576
8246 576 311 -145 499 815 688 -365 218 -540 124 996 -359 450 766 661 222 -698 -428 -140 885
8265 885 -17 645 -206 647 428 368 326 -628 472 -312 -137 -64 150 -847 838 50 726 -1337 282 268
8285 268 -552 744 48 900 -1170 1268 -420 -1150 -20 394 437 -1250 445 -299 -153 134 -332 1057
8303 1057 -1081 972 -1521 -60 17 -410 995 -603 -43 -643 -514 -639 315 735 22 1271 -1144
8320 -1144 754 475 -986 -279 88 197 -1247 486 -324 817 -786 -967 315 -1007 728 937 -370
8337 -370 -134 -362 -540 -643 192 529 316 303 -764 -444 -1046 1256 -102 396 274 -356 369 -1145 -94
8356 -94 130 627 928 948 -401 962 -79 662 1065 -372 -42 574 1215 429 -111 -567 -48 -55 -940 -226
8376 -226 -809 1346 368 -676 612 887 572 -1246 -566 -395 758 -733 -6 494 -390 497 -971 130
8394 130 1068 561 -323 -626 173 523 980 -372 -186 -552 -977 1184 60 209 401 -96 772 962 103
8413 103 112 -698 1989 -288 356 -1022 251 -376 -197 -708 -134 452 -841 487 70 338 -579 222 828
8432 828 -706 1102 -422 1169 -629 381 1085 55 751 -487 189 -172 -393 -576 -63 358 144
8449 144 288 -34 -478 781 772 953 -837 -700 205 -1026 -110 657 178 -692 594 402 -860 259 -280
8468 -280 -691 170 -1218 -7 468 1189 165 795 282 925 -870 -283 1487 -245 -67 74 857 -336
8486 -336 -427 317 -252 594 -700 -824 503 -835 394 789 -395 1562 -370 1051 -703 -472 -298
8503 -298 -1156 512 -1648 593 -24 -309 785 -553 -142 -627 83 273 320 -153 -72 556 -775 1932
8521 1932 -911 347 -557 -579 428 412 1180 -1214 69 -171 -800 282 208 -343 -706 1080 379 917
8539 917 311 271 -91 -1290 -253 433 409 -772 -743 203 33 19 322 420 1 -113 203 -657 -636 375 859
8560 859 -959 -106 1058 691 -1117 669 -728 -92 518 -557 275 -107 807 481 215 -224 -1087 601
8578 601 548 999 -1165 249 714 -297 604 -1020 216 -609 -117 -843 -194 373 -217 1491 -1416 212
8596 212 -510 -486 -817 -250 1007 -429 1104 -571 613 661 -1123 544 1 557 211 -340 918 -300
8614 -300 -1063 -764 71 -83 -279 1 -756 489 -965 509 134 -484 -207 -772 256 -766 264 -497
8632 -497 -96 242 -587 1500 296 -425 264 453 -378 -265 1498 -959 -314 -169 -631 501 -1093 -814
8650 -814 -29 -313 177 -1340 25 280 219 -454 -716 214 -614 30 -93 -835 881 -315 1419 447 334
8669 334 99 208 691 -635 557 -200 392 453 -322 516 -128 -388 134 503 -621 -335 -141 -684 1008
8688 1008 -880 974 -6 -341 -511 -48 660 -838 152 200 38 663 -1402 1112 -665 664 -596
8705 -596 56 -548 632 602 -602 356 -516 1000 121 0 171 -606 512 102 1000 51 -411 -140 -403
8724 -403 -317 64 -795 -721 -600 288 209 -218 -83 122 -103 -81 159 -361 -85 1032 -463 -318 600 390 1098
8745 1098 -303 872 -292 -1052 289 1124 -445 633 -601 -634 615 232 -52 1039 265 -187 -533
8762 -533 1047 -155 167 621 -253 455 562 281 -1169 -867 1019 -297 643 -223 -261 -843 343 803
8780 803 -374 179 -265 1022 -31 459 -519 -300 -445 -505 -185 607 656 241 -474 347 -298 -707 -1703 -764
8800 -764 1025 -56 623 182 334 -718 419 321 -100 967 936 727 -1016 439 865 -1290 -96 -650
8818 -650 401 -983 531 -781 -273 74 -1072 -661 -481 232 211 53 882 -684 -1494 893 1024 -524
8836 -524 129 -96 33 -217 -851 124 -1147 -267 -501 -501 -262 -436 -866 870 -1149 -224 -542 -1444 73
8855 73 -87 1306 -14 2 618 -567 253 -551 101 639 881 591 -404 443 145 107 -264 -736 9 -376
8875 -376 1242 -336 934 -482 846 231 -697 370 -1589 441 -1638 249 554 224 -660 -634 1124
8892 1124 0 -643 -267 -598 573 -902 276 -323 740 -239 886 -660 -686 672 -345 389 666
8909 666 -93 1335 -512 663 1150 -366 970 60 842 -1119 742 124 336 -418 146 -386 -46 -315
8927 -315 -546 14 51 -261 436 836 -51 -916 -14 -258 590 -384 -119 -372 -177 -717 1126 -293 25 292
8947 292 -301 192 -888 -266 -418 26 786 -681 1193 111 498 412 -932 541 218 773 -1127 312
8965 312 -763 -10 768 751 130 705 1357 -361 571 188 417 -94 -1522 1505 309 175 -1129 -1013
8983 -1013 420 -927 861 -376 587 518 -1173 -489 -979 364 -858 339 259 -23 726 -209 373 -294
9001 -294 108 270 197 912 232 583 325 852 -613 -1197 742 -898 617 -555 -920 219 -388 -1235
9019 -1235 -847 268 -686 270 24 -659 154 -99 555 255 334 1133 -482 705 -249 -307 589 -491 728
9038 728 -296 211 -409 1111 756 -601 953 542 -90 802 -182 -127 372 14 -651 -437 699 -358
9056 -358 335 358 -372 -746 687 -803 -179 -222 -369 165 -534 63 703 -1048 -297 -91 -147 34 -122 -192
9076 -192 -382 1133 943 786 -42 373 172 -1280 1024 -1087 -216 -210 468 40 -515 636 -808 -335 -110
9095 -110 984 -123 330 1046 -256 638 292 -514 -1353 356 216 4 191 336 -288 355 -694 -404
9113 -404 -360 -620 423 -278 -372 -1753 468 392 323 60 -711 -730 -454 706 976 1241 412 -784 698 -763
9133 -763 233 1040 411 549 -265 769 77 510 -1043 500 -243 -1159 -609 570 679 -699 1162 734
9151 734 463 367 -927 359 331 -895 20 1003 610 231 -391 713 66 659 -630 -166 -100 -277 157
9170 157 -57 206 105 877 -528 782 -700 -706 -141 -1827 1557 -787 -496 561 312 553 -601 943
9188 943 -955 313 43 -1022 -248 -1334 437 -69 -80 -336 445 217 -264 -265 -1067 536 -284 -488 -196
9207 -196 -1455 -403 560 -42 -167 -439 836 -512 541 -561 -164 188 -172 500 165 740 -704 896
9225 896 -42 723 682 -671 1424 325 -150 999 -60 482 -334 -1071 647 -1557 279 912 -10 269
9243 269 213 340 -961 1379 -1413 287 924 177 940 -357 -48 -577 686 102 543 1096 -497 223
9261 223 -144 921 -655 -541 -606 392 360 -15 661 -187 -848 1317 -1512 762 -695 48 -25 -504 53
9280 53 -153 205 -265 581 840 -192 797 58 -93 -375 623 569 -1121 705 -880 -257 -176 1552 -385
9299 -385 -474 226 620 292 -405 673 75 -272 545 -440 1423 -85 -82 -199 -749 272 402 336 -824 -523
9319 -523 -38 773 -224 -347 -808 940 -371 -872 -1137 -313 509 231 307 840 -68 -486 -569 567 -684
9338 -684 1527 48 1195 152 618 627 -1196 23 904 370 -1072 -19 -839 665 359 -1260 383
9355 383 -398 350 -327 -162 676 -157 714 -1282 1436 143 -1172 1016 -899 -199 -453 336 516 -940
9373 -940 800 185 1247 585 657 -159 83 30 352 1111 -731 -1388 -357 -913 161 -685 773 -485
9391 -485 1655 118 -570 400 -1589 742 582 407 -302 179 779 -1085 47 -100 -387 651 197 242
9409 242 -283 -1218 877 135 -475 286 -114 -329 -682 -37 520 682 -391 752 -92 -108 206 -606 35
9428 35 -621 291 571 -906 -746 -177 501 239 -814 456 -197 543 -116 -794 -639 97 8 50 1128 -601
9448 -601 355 -312 -22 216 186 346 -381 1127 -6 142 -794 -1072 202 -815 1113 -463 -29 -732
9466 -732 -688 1235 415 959 -1323 240 -594 -12 310 -3 1054 -207 224 -1110 -566 -35 -854 304
9484 304 -602 305 427 251 -1424 -1072 1521 -196 -650 666 -328 747 567 -10 -264 -520 467 -147
9502 -147 228 -651 -915 -68 -440 323 1202 -428 122 -501 727 -509 -157 -267 978 -499 -1394 105
9520 105 -490 -364 -494 1106 -28 -776 220 -991 1096 -598 92 -474 -43 734 -446 311 -207 422
9538 422 -431 -1270 495 95 885 -424 939 -524 -506 130 -529 -120 -160 104 -385 731 791 -131 -399
9557 -399 -85 -437 -339 -1027 575 431 38 -471 1195 -262 -558 649 -1186 1187 -106 1274 -526
9574 -526 -778 12 121 -67 -202 454 -1296 314 -66 1007 304 -185 536 815 -61 -383 -518 -572 -1378
9593 -1378 -1311 911 507 -625 -540 -4 -80 10 982 -25 514 -132 -201 397 -1443 -453 -21 -110 -528 -99
9613 -99 30 175 -1371 -1026 152 -819 83 666 -1589 1181 -570 647 141 180 2 426 188 -410 730
9632 730 -1009 151 841 -537 378 26 -171 787 158 785 -680 689 -1374 -446 -598 255 212 778
9650 778 453 -763 1074 -961 -554 1306 635 -595 -265 -41 31 -506 -237 -303 222 123 606 -1031 -446
9669 -446 309 -1125 567 -1480 1385 124 338 -903 226 714 573 625 -400 23 309 69 -744 -628
9687 -628 262 -717 -688 351 -400 1140 -523 -372 -53 1028 203 -268 2242 894 707 1000 -775 -210
9705 -210 -13 -305 280 1769 1351 -386 -311 -20 828 886 -411 -98 -364 -214 -135 -655 359 937 -800
9724 -800 -767 286 313 -170 1022 392 622 -1240 113 -385 620 1187 -132 759 -513 -89 813 -125
9742 -125 558 -87 -68 -771 1634 -444 -558 772 -840 -412 -891 290 523 966 823 -460 345 -172
9760 -172 -284 -688 75 -462 -614 594 -566 758 -44 183 -223 -467 435 -1149 827 1298 -121 71
9778 71 -718 -67 67 -241 389 65 2541 533 -81 572 -818 69 -21 -70 -95 -705 -1049 541 636 687 -341
9799 -341 107 693 -721 75 114 427 788 -832 156 652 289 917 89 -95 -700 -330 419 -1449 270
9818 270 -1411 636 -70 -615 -641 144 720 -645 -305 -1117 -719 455 -615 357 -491 4 139 730 -1025
9837 -1025 71 905 639 -114 283 895 1856 -453 197 -1240 1032 -850 -415 390 -1260 86 -1636
9854 -1636 514 341 582 -246 -790 62 201 -517 -532 674 1411 515 342 297 -83 -391 -423 -283 -161 507
9874 507 222 631 552 -152 751 -967 -732 -1414 -35 55 486 -101 -2 596 -369 -1305 -920 -1294 -509 263
9894 263 -620 -54 -90 -98 -404 -1041 -86 711 795 -153 817 -340 449 -67 1015 567 175 -206 -847 -701 15
9915 15 91 -129 -104 240 -773 55 3 -733 547 737 982 -1053 690 501 481 -261 -1118 767 775 973 -1269
9936 -1269 -404 402 -714 350 -1005 298 -1916 -588 -271 -1303 39 -733 522 304 -128 -5 -671
9953 -671 -241 -842 835 -1405 325 217 0 108 251 1165 -685 517 -302 197 352 -1362 382 -58
9971 -58 -481 655 -97 -311 -111 194 -261 -33 387 1358 591 -488 -1400 838 396 -788 -1047 -374 348
9990 348 107 1206 -1381 -1464 -98 -734 -38 502 -153 -166 -458 -115 833 1164 -1331 -295 -897 1005 763
10009 763 845 706 -247 135 -349 351 -938 590 -246 -318 769 -282 592 56 -169 978 7 396 -330
10028 -330 805 143 286 503 -1269 330 -590 218 -677 -210 265 -947 2216 -517 -11 -1048 733
10045 733 205 -1208 364 -457 -349 419 20 783 -667 -48 577 -524 -458 497 87 231 190 -729 66
10064 66 -534 136 1107 1032 354 -28 323 -665 -96 315 467 -72 -478 137 -982 166 -828 -334 -668 802
10084 802 865 296 -465 749 385 -551 584 -29 163 -168 108 -26 -277 1053 446 -91 -691 64 -422
10103 -422 -296 444 668 623 -628 622 791 206 -242 -306 607 -210 425 369 1120 -303 201 365 297 279
10123 279 -170 202 343 -1521 -652 637 151 -273 635 420 -487 426 -1093 660 -663 52 -293 312
10141 312 545 -645 1271 -234 -336 344 388 1075 -396 613 1017 -414 -236 223 -130 -458 258 669
10159 669 905 -758 -433 920 1205 199 768 157 -439 412 155 776 44 -790 110 11 -381 557 229
10178 229 -546 -63 -664 -957 562 -379 300 -107 306 272 18 -582 -918 816 -1174 -105 -822 -1203 -1365
10197 -1365 582 527 -266 749 -116 83 -636 -545 -1061 -730 643 -405 725 122 -384 564 -945 440
10215 440 -995 1189 -844 636 -853 -379 1039 -524 -53 325 94 342 -387 160 -943 393 -599
10232 -599 358 1106 335 683 -379 669 492 -150 -743 -1255 -181 -522 -290 496 -162 -393 -619 479
10250 479 -263 837 -703 101 -119 -806 817 -512 899 -217 411 -124 -64 426 234 1828 280
10267 280 -818 -32 209 199 -260 1078 -407 237 241 -2172 692 -111 -89 -702 -417 287 -375 -281 -490 -580
10287 -580 732 -443 183 -546 432 -446 -893 1516 -794 775 -425 -619 -237 -1048 -147 -279 784
10304 784 -474 592 21 -800 92 -120 658 -903 1090 564 -547 -370 -561 932 -313 235 -292
10321 -292 -1446 349 12 308 53 -874 -523 326 1117 -480 220 -181 -41 843 -100 232 246 451 -126
10340 -126 -611 -473 -541 257 -428 1637 898 532 215 -280 -110 -2 555 195 -401 -9 -493 266 325 221
10360 221 -304 447 144 -501 130 -238 -169 1219 -1295 -258 -231 282 928 272 1081 -228 1078 -754
10378 -754 1295 -1028 -955 145 -334 -149 -478 465 455 -1541 -821 -283 246 216 313 653 -67 592 1283 330
10398 330 87 630 787 1120 582 -452 624 -614 -474 255 -158 -399 -870 618 -497 1537 -29
10415 -29 -168 186 -1103 295 -1081 22 -378 90 557 -126 422 -572 78 1212 -800 -272 6 136
10433 136 -198 815 638 -1128 810 -462 982 51 -122 238 -1009 682 -595 807 605 884 74
10450 74 -399 -825 94 1820 -131 -376 42 -208 436 -773 -365 -7 -10 712 -745 710 553 -437 -137
10469 -137 173 -452 -776 842 481 -631 963 -1054 285 308 664 -73 566 -26 239 966 642 -40
10487 -40 174 -683 260 109 209 95 395 -731 320 534 -295 886 -425 392 -136 -729 -757 -544 -75
10506 -75 -695 479 -155 -529 689 -279 331 -805 302 1618 150 1467 186 965 -383 -233 179
10523 179 303 -153 -514 309 605 897 250 -1181 746 -77 252 267 33 63 -326 1691 189 -282 325
10542 325 -563 -94 -153 396 62 -1017 622 911 728 64 -139 -683 409 58 -444 -212 753 -51 -440
10561 -440 231 -392 74 352 -321 993 1182 373 -23 -753 797 255 81 733 -355 465 -1400 833
10579 833 -901 884 -164 -141 607 -420 -296 415 -222 281 52 860 -119 358 385 -68 285 -114 145
10598 145 -695 470 -251 695 780 -179 -105 240 639 -326 -162 -137 -1380 -696 -525 730 542 -529 -331
10617 -331 728 106 83 -37 -883 -67 -1156 -1187 93 -799 880 -346 -109 -479 -193 242 -1026 -51
10635 -51 -1397 643 -459 94 -238 166 105 -61 -689 93 -605 630 -124 -193 102 575 109 -476 82
10654 82 -691 249 187 13 -274 -830 -167 548 -821 947 -793 -330 281 642 -155 -56 1208 -1572 240
10673 240 -941 -409 394 -294 108 -268 -162 178 542 -111 -995 523 -618 -703 -236 -695 424 -36 358
10692 358 -1319 -260 547 431 128 528 364 -745 816 -654 401 147 -926 196 -404 -6 -660
10709 -660 728 -42 -634 588 -1110 339 179 671 707 573 508 122 233 -393 -141 533 399 -92 -128
10728 -128 503 63 0 -547 -213 715 -1130 1467 -761 582 1186 -640 462 -302 -306 369 71 653 -1069
10747 -1069 1317 -169 -5 -166 549 -143 -177 1432 -1675 187 325 -514 258 -343 474 168 -1639 149
10765 149 669 547 -321 1236 -1079 -261 450 -448 354 -405 264 768 578 296 -430 911 101 -48 887
10784 887 105 1564 -1131 945 -622 -718 1804 528 139 -236 926 -148 216 -514 -1189 521 93
10801 93 1661 -843 -488 99 -399 1077 -366 1941 -439 1256 -1100 366 54 -903 -138 38 -305
10818 -305 589 209 134 -229 374 -978 962 -546 -454 200 -395 815 -189 96 234 6 -126 815 637
10837 637 -274 607 459 128 198 822 -766 -440 -251 -902 -1093 -446 -210 1044 115 1178 81 -291 8
10856 8 -477 -388 298 -996 -393 0 -2 -114 88 454 -256 1122 767 133 -556 -946 1071 -577 152 -1122
10876 -1122 1149 127 -338 1711 -1756 -453 -1294 23 1557 395 1364 500 -5 -78 452 -707 -35
10893 -35 -503 -227 1061 -536 -166 -1192 -461 -416 -769 441 -1472 1112 6 -492 -665 -560 767 -59
10911 -59 679 23 -218 209 588 -40 1428 593 -228 -125 785 359 579 190 137 -578 242 680 -581 98
10931 98 -832 -138 824 -341 1102 186 -813 511 499 565 569 342 -463 71 -299 258 -131 34 466 225
10951 225 599 712 -1437 -921 -322 -216 211 -41 1433 -740 603 -224 36 538 -1054 622 -480
10968 -480 517 -729 -387 -186 495 -110 -285 407 25 -984 221 -471 -125 -377 -358 -891 880 1152 -347
10987 -347 -1097 -278 696 -439 -240 481 532 927 363 530 -1022 192 -198 149 237 -679 196 -425 -139
11006 -139 -1211 805 -160 -395 511 -1265 633 -362 -55 -568 -1237 392 -419 -1313 -1059 334 415 -327
11024 -327 977 -471 575 444 382 158 757 -240 840 408 447 -704 78 1253 -69 676 -183 444
11042 444 261 502 -705 276 230 412 -424 -897 327 -874 156 831 145 948 -986 593 447 143
11060 143 602 -135 802 -238 1599 -1752 -729 134 -2321 1084 -1017 -599 -483 -624 -357 90 -14
11077 -14 -964 -59 -214 -662 -38 -41 69 -867 1401 178 -349 -42 -462 147 -418 1179 818 942 -118
11096 -118 -949 847 -1359 423 89 154 117 -1826 536 -268 -124 317 -865 260 -429 990 -357
11113 -357 -172 -275 -224 1118 -221 1010 382 1071 212 478 -280 -341 -312 -452 680 455 -625 67 -560
11132 -560 -44 189 49 -59 161 539 -292 -639 397 -680 391 -804 -204 -238 -1109 758 96 452
11150 452 -1124 -274 -745 -626 101 -142 280 -507 -657 -882 -161 442 -1532 654 -1642 -1115 -848 -251
11168 -251 -57 149 1358 -327 152 -263 1220 1642 534 -454 601 1117 -735 -703 145 739 -378 -306
11186 -306 644 -14 -708 1379 -1117 409 -247 -489 -84 252 1100 -883 16 -762 784 -2442 249
11203 249 -116 -165 714 -805 346 -292 42 68 -138 631 -560 409 -1411 -1152 97 -517 661 -495
11221 -495 350 435 -415 69 621 513 274 -649 -1056 -882 -589 -701 -822 -728 784 244 -249 1053 -995
11240 -995 263 -186 278 -278 1130 257 -248 -343 191 -836 427 -124 112 -204 -842 394 -340 1416
11258 1416 -824 120 307 827 -825 -930 1498 -1095 21 -491 -682 336 -1227 92 -1355 874
11274 874 -434 -482 996 -73 891 810 -465 -481 1049 1500 -1812 248 239 -469 -625 570 -420 -346 337
11293 337 -194 664 -132 190 76 -269 -75 -333 417 136 890 177 -593 444 328 1396 196 85 -331
11312 -331 506 577 -562 -1357 1121 815 887 -680 -642 436 -33 -187 -573 1191 -804 -159 -426 -247 434
11331 434 310 210 413 227 108 -85 9 -126 -206 -619 -143 844 270 742 -27 627 -1101 -470 459 -631
11351 -631 23 -395 227 -963 180 -127 368 253 -799 840 332 2000 398 409 666 -396 972
11368 972 -695 -400 345 57 226 -1322 861 467 61 1016 -935 536 -688 417 -774 165 233
11385 233 -60 861 -106 -15 20 817 340 65 341 -962 148 -1307 -236 -112 -717 9 -60 39 -410 853
11405 853 276 305 25 -484 131 -878 -2 -549 -1249 571 174 -1354 -511 301 347 -684 732 27 -4
11424 -4 -451 -286 -134 -318 1143 531 -31 1020 -507 268 402 -555 -191 -747 1244 -656 370 966
11442 966 -47 465 -774 376 -476 72 333 -1320 -301 -229 759 1052 512 341 711 -636 -980 156
11460 156 -96 394 -141 434 -80 -761 562 -122 899 -418 580 1005 -281 332 136 945 120 -80
11478 -80 -358 36 878 -385 117 742 218 555 -857 570 -1234 942 -876 -1153 -904 -885 175 -55
11496 -55 1092 -1054 534 1880 575 -653 -814 234 977 131 -365 -435 706 -1268 -363 -842 -33
11513 -33 -362 -367 754 61 84 1602 333 469 -792 38 -30 44 -791 194 94 -171 585 332 390 275 -1261
11534 -1261 1291 128 262 1292 -520 1305 -62 631 383 344 503 -774 -17 466 62 -287 696
11551 696 609 -1612 1006 299 925 -573 594 456 -354 19 -347 898 -1763 -184 409 -1077 143
11568 143 20 -364 14 337 1071 195 -449 -186 619 -50 108 192 -630 -399 -752 1161 -29 156 -884
11587 -884 565 968 286 -94 431 723 -173 163 -516 -1113 770 151 -284 730 -569 65 -1286 310
11605 310 899 461 166 -70 118 -17 -237 -546 364 1367 -852 328 234 147 771 -1255 -37 -521 538
11624 538 -846 249 1096 -926 1098 1006 195 647 -1317 -231 -166 178 -117 -180 649 -353 -90 -869
11642 -869 571 -36 -29 710 298 587 -231 365 -606 -2022 -338 -749 1067 -1443 -344 -614 -27 1289
11660 1289 117 -45 -430 1019 -511 41 45 -555 667 -741 1110 -191 -281 -145 -824 371 234 237
11678 237 399 -268 -260 -353 626 731 1505 273 -218 -451 -977 893 138 544 -715 -339 -458 -767 98 136
11698 136 258 -155 -86 -174 56 -111 677 -156 424 -260 -47 -412 98 57 424 -400 -1537 231 -36 -16
11718 -16 145 857 -39 -317 912 75 845 5 -962 -606 -39 915 -490 1386 89 -128 1758 -2086
11736 -2086 769 -452 166 204 -255 2 -77 872 -166 -222 661 -168 8 -879 112 -70 676 628 -447
11755 -447 -217 -409 201 -125 720 -4 -253 1500 -596 346 -116 397 -347 -588 10 -153 -246 -244 -382 602
11775 602 -1169 558 -232 1843 1143 -606 990 -330 189 -1765 462 -591 379 -551 -665 248 -117
11792 -117 -405 -992 1425 -94 -261 1538 276 -609 -103 22 265 -776 490 766 -192 873 -365
11809 -365 66 1253 250 -153 603 412 -660 -101 232 893 1166 -1166 -398 -273 -98 670 -28 301
11827 301 -602 56 -961 -529 -645 394 754 -439 688 -1062 1270 -505 540 811 -1210 776
11843 776 55 599 -286 356 -346 312 840 -1286 61 7 141 -40 -748 -726 -722 1523 -556 -3 -50 -1682
11863 -1682 1213 -2203 699 273 89 425 -243 -1081 -1543 825 -733 479 -401 67 -420 -802 439
11880 439 251 249 -349 -187 485 -632 -124 -250 25 286 642 -10 236 1775 -140 -283 975 -56 201
11899 201 -1180 -220 -1387 -174 -677 -309 380 314 265 -108 99 1040 645 693 286 -533 -362 -815 578
11918 578 82 -297 -868 1053 503 101 479 -2176 466 55 -226 260 -94 448 -632 -13 -859 -1025
11936 -1025 -239 -359 1543 -939 -1143 454 -322 211 -778 943 -322 -359 908 -712 -144 -874 1003
11953 1003 -454 336 -314 -613 499 -125 1165 -431 167 -758 -1305 190 376 1408 -845 759 197
11970 197 -1472 208 -1665 2189 -245 -597 476 -434 -263 -781 683 -970 720 1474 10 373
11986 373 -258 105 339 103 435 358 -216 -180 704 -847 -112 -111 -181 -114 -810 1018 356 852 752 61 213
12007 213 471 -479 373 -550 1439 159 401 1097 70 457 -1021 1131 297 705 17 -691 136 422
12025 422 1209 509 5 -105 -1573 387 -1064 -939 -436 -241 -390 861 -829 -951 1379 -610 576
12042 576 579 466 -453 83 1077 -132 290 513 -428 -79 -387 219 694 274 -158 191 -24 -1231 230
12061 230 1264 665 90 -150 298 -1313 -843 -659 -1100 -30 113 -542 -1448 -966 14 1603 -231 486
12079 486 444 43 1013 1470 -120 -357 -459 477 -595 -810 -198 222 391 -664 -212 696 425 380 365 188
12099 188 -146 -1248 -359 281 -807 -480 762 -534 -238 458 -748 -273 -537 349 -365 826 -356
12116 -356 -448 69 -406 721 -1508 170 -529 -590 140 -1147 259 -152 47 224 -702 177 -923 1017
12134 1017 576 -93 238 1151 995 -317 -22 -692 -215 -419 -326 1604 -494 -407 -297 714 -327 120
12152 120 -880 -830 383 -1283 423 1396 -376 465 -174 533 248 -962 694 38 307 -1308 570
12169 570 -731 237 576 -1282 1596 -512 551 -1414 137 47 1381 229 -93 316 -156 -613 -155
12186 -155 223 550 127 -912 396 -628 1254 -1020 341 222 -799 -664 -270 -264 -1022 -802 -278 -249
12204 -249 938 1030 638 -1513 455 -21 -405 844 411 373 -160 176 95 -264 1131 -723 39 -762 402
12223 402 -5 26 378 -1145 658 130 640 -1279 -98 -456 -573 -407 -1020 -390 -1702 307 989 -355
12241 -355 436 -84 1249 108 61 982 -801 796 -1231 39 137 -57 76 -1153 432 -1121 -132
12258 -132 -906 11 -41 -764 374 -1315 269 -305 311 593 -842 -371 401 386 -644 159 117 -778 117
12277 117 575 -154 -48 -111 -595 383 -1071 -146 408 481 763 554 -376 605 118 -458 67 169 880 -527
12297 -527 -19 323 -410 1023 165 568 -2032 901 1251 -688 1150 -486 268 1038 63 507 -675
12314 -675 1108 -1105 66 -84 -274 417 54 392 -1314 863 -46 -23 672 -414 1110 190 -14 987
12332 987 50 854 -244 1028 93 250 -886 -556 503 -406 242 -890 750 -339 -877 40 -375
12349 -375 322 -266 1162 -663 266 1067 -684 190 -336 453 1189 -888 -915 -1113 -165 596 1066 -271
12367 -271 475 79 226 -247 -323 512 547 -499 -310 -405 344 322 -391 503 -314 466 -271 -520 396 233 -230
12388 -230 368 815 -37 -213 -262 -341 578 -348 -739 -380 -100 1236 463 7 -799 1040 118 -925 923
12407 923 -486 1181 -1048 -204 -317 -83 10 -230 -283 45 943 571 -330 136 -459 1341 -584 32 -556
12426 -556 -558 -287 -999 1138 -1095 849 471 745 269 -769 599 -882 1018 4 1047 1132 -224
12443 -224 -79 -422 342 483 865 -455 -510 415 103 -817 211 -776 804 -585 1047 -374 -979 888
12461 888 219 464 -95 614 647 748 55 745 11 -729 -244 -780 178 -701 -772 -587 -175 -297 -215 -322 359
12482 359 346 -28 -358 -32 970 -331 153 -1488 809 -351 -133 227 -1473 22 -697 1134 -1
12499 -1 165 635 21 -72 230 11 90 1443 383 534 1032 -154 278 -424 -353 158 -579 479 -853 421
12519 421 221 -361 485 -102 866 -122 -383 373 -349 480 -585 798 54 -840 -86 -1657 63 -406
12537 -406 187 -338 592 -349 -53 812 -467 -12 -1068 -274 -591 -1203 588 -638 662 -1132 -169 -720
12555 -720 127 1057 1073 -261 147 -466 -755 -27 505 525 98 249 -249 273 -409 -772 -402 45 -511 460
12575 460 -982 479 305 -328 637 164 -1097 294 -359 867 95 -197 960 831 168 -241 170 -137
12593 -137 240 199 728 974 -1207 297 103 -409 -106 224 364 184 298 -344 409 49 -818 566 -587
12612 -587 -410 941 649 818 -701 -157 -434 245 -39 974 152 -294 170 -746 -249 -631 -331 120 56
12631 56 -102 190 390 -41 -291 -265 -730 1378 -191 788 374 -691 1390 -1643 1223 -407 916 -297
12649 -297 -402 -1068 -1222 689 -1327 -901 -487 194 321 80 230 -1050 847 175 -1260 -233 76 8
12667 8 -1021 492 970 -42 -423 -91 151 155 -899 469 -315 994 -435 -503 875 -800 593 -477
12685 -477 686 -907 -113 -45 170 1869 -242 1155 482 918 -209 -711 -64 -1265 -350 -366 425 39
12703 39 -22 138 -1372 -1047 445 -1225 -315 -59 228 -518 276 -631 852 -3 227 785 -1314 -532 -653
12722 -653 -706 -364 -1173 803 -928 345 -827 -1180 363 -177 587 -1114 568 519 -173 225 -743 333
12740 333 358 568 756 74 -140 -141 51 363 -420 -415 52 253 579 -101 128 -329 557 -947 189 -432 666
12761 666 704 893 1403 1110 356 119 452 -180 -394 965 -836 428 -506 -786 -501 -76 -518 -178 92
12780 92 506 982 530 -766 261 -213 -648 622 -42 659 -1161 232 -350 1056 -17 -174 281 -1730
12798 -1730 723 -921 377 -469 610 727 501 1092 -174 1821 -868 -76 413 -642 426 -239
12814 -239 1292 -322 -400 -64 -10 328 -581 575 715 -883 836 126 112 296 862 -142 -562 347 115
12833 115 1139 -720 1544 -441 65 -1206 -1361 572 506 -1153 -488 738 902 -165 -247 496 -303
12850 -303 -114 -351 -360 -110 489 -607 -783 716 930 485 -370 -590 -628 5 662 338 729 19 6 -858
12870 -858 579 -335 178 306 -545 -745 -531 -434 634 213 267 -962 373 449 235 -84 -620 -60 218
12889 218 263 236 535 859 -204 282 1256 286 442 100 954 -690 1559 -215 -245 -79 -966 1115 -721
12908 -721 337 367 151 -514 36 476 -485 1574 1192 251 526 -560 958 -1228 406 147 -1054 -2
12926 -2 -772 -600 113 1234 -265 -455 -284 265 287 678 250 -461 -603 448 -1647 1115 -181 412 330
12945 330 364 -535 -449 -373 -214 -326 -50 365 1132 237 139 1018 -1808 446 286 369 103 267 302 -632 441
12966 441 182 -95 16 -635 883 -438 634 -66 459 -123 229 444 -858 938 654 -238 274 363
12984 363 342 -423 1212 -1019 633 1122 467 -470 -13 577 -456 924 -661 -652 288 -862 245 -181
13002 -181 667 -381 104 708 5 -960 -1276 357 -388 427 102 -565 521 -644 6 -152 502 518 -701
13021 -701 1068 1183 790 -1337 -226 400 -549 -335 -722 810 475 539 -859 -904 385 -623 -332 -121
13039 -121 -1068 161 1180 787 200 122 158 -319 248 807 684 440 -460 -1220 -159 -338 -48 1187 205
13058 205 124 370 -717 903 -455 422 269 -473 591 -246 604 -842 -489 -1126 -421 163 366 -318
13076 -318 -260 699 -242 243 493 -633 587 -157 559 273 -318 783 -1210 -379 -403 324 951 358 -279
13095 -279 -883 622 -113 499 48 -424 -51 -2195 -322 -688 363 43 -79 -291 -782 -83 296 216 -133
13114 -133 -901 157 -546 -296 -587 566 -113 -619 -552 -565 -83 -1627 -561 128 -766 117 85 345 -25
13133 -25 23 719 -1276 -115 1021 -619 564 -363 883 -1177 848 177 18 1113 406 1144 -9
13150 -9 -365 -326 -985 80 -244 52 -704 619 -59 -172 843 -103 559 -657 -50 434 12 -684 -243
13169 -243 -9 100 -217 362 42 815 -324 625 -770 -52 -224 67 818 -832 6 -623 507 -571
13187 -571 218 1240 -681 -31 -457 -278 833 215 461 -674 215 -461 176 -195 -870 341 -412 145
13205 145 -1178 972 406 -1636 723 -369 540 269 167 -1079 -235 238 57 1019 -496 594 -601
13222 -601 -876 543 -1611 -642 16 125 296 743 823 513 446 -115 -39 -328 -1117 -461 469 -745 -747 42
13242 42 321 -1581 286 286 690 851 334 501 283 370 -129 -1035 -856 -282 -90 -799 342 450 899 -69
13262 -69 -120 139 963 143 -476 -743 903 -1239 2377 -439 193 -119 -1345 766 -453 404 -76 -76 195
13281 195 -945 1305 -460 511 -1211 -48 -3 -465 767 301 1059 12 480 113 -649 110 -310 -505
13299 -505 -1517 275 -1027 -1005 -144 33 -7 -181 544 -66 -338 315 -731 1014 -199 116 -383 -154
13317 -154 -88 153 224 -1431 237 569 -407 -29 320 -381 -188 202 1102 273 883 -569 717 203 536
13336 536 -228 -607 -180 287 -332 241 -46 -723 -410 -72 230 -918 -399 462 458 -19 -474 -230 -427 54
13356 54 -245 182 -1266 -80 639 761 1038 -340 1442 -402 218 -846 1045 217 719 1835 309
13373 309 -112 1266 -611 271 -803 1056 148 977 -324 156 -56 -238 1312 -121 598 -344 -529
13390 -529 64 -253 1370 -628 -732 667 305 1005 1126 457 -729 139 253 -226 557 -780 768 -334
13408 -334 594 -1673 -455 232 -415 1039 -1276 -57 234 310 880 -52 -727 -552 92 802 -385 -339
13426 -339 -6 813 -509 -509 -175 610 640 -226 -1031 896 866 -180 590 272 -567 199 355 -799 949
13445 949 -96 88 -315 -412 526 -871 487 -448 740 779 -235 181 92 1496 -547 549 526 -705
13463 -705 496 -203 469 -396 -1037 -206 546 380 -846 -37 -621 -197 -754 -210 -30 -1049 1433 864
13481 864 194 215 -852 1114 -1395 -145 -933 542 474 -45 541 -788 1177 -186 367 -692 -284
13498 -284 -339 622 263 -397 1 -306 -389 16 327 625 -874 -1419 -443 -1275 -166 -510 -64 -653 -302 923
13518 923 174 252 526 -1632 100 1030 -318 -1164 299 383 -151 -333 -1107 381 -411 218 -257 351 -112
13537 -112 -1211 -120 -751 339 1081 -377 -383 -314 50 -184 287 350 485 -240 -593 1491 680 -509 -728
13556 -728 35 323 -205 -372 -209 887 -347 -570 593 -1625 740 -522 -190 480 128 383 286 -178
13574 -178 467 -408 422 -1490 639 -938 1601 -93 386 -827 -138 788 -1215 643 -1929 -69
13590 -69 153 255 755 233 184 -521 238 14 -1067 71 -1210 911 -17 397 91 -117 356 -426 -639
13609 -639 -1343 248 -785 -65 -952 219 425 -194 0 214 1040 1044 -49 436 -832 162 -331 -705 -88
13628 -88 -714 807 -901 416 986 -1466 -114 2 -336 533 1142 827 -188 309 450 -75 848 -292
13646 -292 1066 233 942 -215 7 999 -968 1718 -1052 226 -615 889 1521 -1358 783 32 -226
13663 -226 278 -275 711 -519 990 -432 406 -426 -156 1191 -66 506 -350 1167 -68 313 189
13680 189 -1097 1601 -468 -277 109 -1178 -314 -294 1446 -72 192 -1123 455 428 51 1315 -772
13697 -772 -34 431 -115 -1029 -1594 757 -1524 97 -360 21 -83 120 144 8 -187 573 224 1121 -442
13716 -442 122 -396 761 -508 -263 -25 -218 557 -177 299 404 537 670 69 -1430 254 -630 1222
13734 1222 -303 1040 -982 552 1039 -1120 -70 -715 -158 -807 -308 -595 -427 846 -1169 625
13750 625 121 -1060 -337 -387 548 -906 809 -580 165 561 -626 -738 -6 695 720 480 1860 -543
13768 -543 762 -930 17 7 174 108 -419 -279 -1923 -61 -8 -147 354 -681 -275 -1090 -1130 51 -623
13787 -623 114 400 794 -1351 682 -1307 686 348 -927 231 -970 -365 346 -937 -98 -126 6
13804 6 675 -763 95 644 708 110 -1021 513 213 164 -240 -520 224 -270 282 -366 -6 675 298 906
13824 906 214 329 -102 966 -1148 287 354 134 -808 18 -206 -871 -511 799 -133 -537 -378 397 -535
13843 -535 -189 654 -881 556 -1053 1050 -68 -373 -715 171 721 436 185 -395 -254 152 545 187
13861 187 192 72 -106 672 -211 -59 706 251 1395 -291 286 696 -42 1244 -241 762 -901 -160
13879 -160 397 -224 1189 -843 926 744 363 -495 -8 391 -492 720 -1327 424 93 -1420 681
13896 681 19 -226 167 365 643 -379 -76 -990 957 1 834 1363 200 -277 356 2 1151 -340
13914 -340 -410 -1171 -840 394 26 424 -779 -744 -504 -517 149 -664 16 110 -274 -898 198 -408 235 -274
13934 -274 -1900 -305 -1742 270 113 -942 339 -93 -21 -155 486 -130 -900 100 -665 -155 -1388
13951 -1388 -523 119 -321 188 -89 1201 -1395 1080 323 175 585 -461 1098 -1522 343 -827 -41
13968 -41 -299 -812 1112 -727 -642 -69 -487 170 -810 1389 -819 -145 541 -1478 -286 -190 852 -487
13986 -487 566 -1058 118 -753 -187 1255 -779 65 -395 890 -98 307 -262 839 799 -141 533 -235
14004 -235 597 391 561 -921 405 -626 -790 408 -460 583 609 1112 -413 -12 -294 -367 -547 -392
14022 -392 278 -146 1653 576 -446 -425 -419 -268 513 349 -268 386 527 -390 1671 711 343 -365 -422 964
14042 964 -846 3 -857 16 8 -1088 745 -840 767 54 143 -441 -465 237 101 640 -608 190 -123
14061 -123 -720 406 -1192 627 -460 251 -706 485 -793 140 843 452 49 -667 -345 346 263 310
14079 310 413 -1301 -1187 689 -377 -182 37 -59 259 302 1062 289 -272 369 -302 40 -215 -1002 -517
14098 -517 -1468 1048 -113 -20 811 445 1249 -617 -1 10 -391 348 -41 475 -851 827 533 -392 757
14117 757 -240 -269 -180 -429 479 -1181 401 -345 106 -86 -948 -542 8 1036 -863 -207 -1068 57 210
14136 210 167 1333 -936 455 -35 -105 194 -850 954 -1212 -590 -884 -116 325 -469 -72 -545 1058
14154 1058 397 -602 -265 514 -408 13 946 330 169 -214 -1030 256 117 234 184 428 635 402 1638
14173 1638 -704 1237 191 -35 920 -1185 603 666 1202 -334 -617 -697 -387 -62 -989 1 64 -651
14191 -651 -412 -928 518 125 -397 22 -740 545 -886 582 677 -533 -293 -996 808 594 -323 808
14209 808 -230 703 -563 552 -688 -1049 -478 -226 475 833 -106 -669 864 86 -1007 885 -1651
14226 -1651 -534 -330 15 476 -709 243 29 49 481 329 -160 -535 1978 -261 171 -396 192 -264
14244 -264 -42 624 -988 1254 -626 -259 1611 -513 634 -56 348 -581 82 162 -745 888 496 -304
14262 -304 -1089 367 587 163 247 -708 -916 187 244 19 49 504 -322 -417 251 658 -516 -371 215 -1496
14282 -1496 161 -161 398 481 534 978 -300 223 543 355 -697 115 813 168 -549 -220 -1284 -122
14300 -122 322 1045 -471 -43 600 -600 626 185 136 522 656 166 87 1268 -653 -1191 32 206
14318 206 16 1166 -220 -333 821 -214 -280 -711 -758 705 -864 -1136 628 76 1293 -629 65
14335 65 -665 -62 314 -539 -750 -160 1597 -499 -81 512 -165 379 -521 125 -213 26 -719 -817 -246 -45
14355 -45 860 -365 -398 166 -491 238 17 597 -351 -662 -68 271 -437 -1265 883 -241 157 220 58 -608
14375 -608 628 183 -70 582 247 488 -863 957 54 -371 381 1061 -1351 210 -51 -460 -64 1463
14393 1463 442 -369 683 167 164 -119 -443 105 -1700 -149 819 -336 -69 -1125 437 -592 -746
14410 -746 1177 -405 621 422 -130 -452 431 172 337 -114 -1082 -340 671 600 -191 29 710 -1086
14428 -1086 -210 89 -1359 817 -218 651 -379 760 -168 233 1169 -1422 292 -114 1973 483
14444 483 447 98 -55 454 -184 -87 -697 -590 7 21 434 -514 -869 -110 623 1317 198 172 -296 799
14464 799 -801 565 -12 -162 1268 376 10 267 -656 621 435 538 -371 557 529 -659 1354 1117
14482 1117 308 499 632 -349 910 722 -1343 -22 139 -240 778 -888 666 542 -283 -253 267 611
14500 611 -491 379 -4 -571 758 5 1211 240 309 -509 -94 -445 188 1416 597 805 -121 415 444
14519 444 -1497 1608 -1279 727 -694 393 -123 -1091 624 -1330 1794 -17 -1239 373 -330 -100
14535 -100 622 417 -706 415 -216 -559 115 -1847 60 -2 -248 -85 -426 -32 -394 993 -643 852
14553 852 3 -716 -792 -667 520 -295 -162 737 -171 -475 -467 223 526 620 -340 -174 523 -74 -653 -891 459
14574 459 -207 -97 575 56 -214 808 -410 621 -1353 237 -907 76 195 -1873 428 -1507 595
14591 595 891 688 504 -1054 337 -432 876 548 823 -325 -106 -199 -508 -62 -260 -374 1 626 -375
14610 -375 30 -203 179 241 1528 -579 642 -535 851 -1016 1 1419 -698 1223 -829 1566
14626 1566 -650 -64 143 -1865 89 -239 -437 251 -463 1038 -1993 -44 -417 -487 -260 71 71 -949
14644 -949 302 261 647 334 -438 -503 1052 -284 -526 -726 36 -828 697 -1117 -128 -769 719 -838
14662 -838 146 155 483 1060 -318 -126 102 -538 441 -334 968 1020 -809 347 -1167 -353 -578 -537 222
14681 222 -622 -344 305 409 -468 -923 383 -568 689 611 383 92 -172 307 -149 626 -450 575 431
14700 431 56 232 590 579 -589 814 -287 532 1237 -650 -397 -112 11 113 -183 710 -923 369
14718 369 159 347 74 -613 746 -500 88 -45 -672 -654 -174 1317 108 22 -811 -323 -390 -668 468
14737 468 -70 1029 -861 -457 595 -1542 -816 -577 -527 -163 -1566 137 615 -16 -1056 -319 634 435
14755 435 -499 -755 -726 928 -66 -1230 186 -224 -756 748 8 770 -9 -204 346 -198 -332 -688 -235
14774 -235 -341 -432 403 -471 1453 -555 -207 -32 328 1366 -914 88 -33 119 -613 -328 -64 -715
14792 -715 -31 15 -63 740 -26 37 -1077 659 76 -1038 541 -837 1156 -495 448 228 -1334 939
14810 939 -951 624 -115 -1606 364 -192 7 -825 575 -989 534 266 -1033 897 -987 852
14826 852 -920 1390 -49 -394 118 -524 83 -533 232 -686 -519 121 303 -950 -770 -794 139 -400 630
14845 630 -684 -362 434 -300 -1115 -769 748 -601 462 -682 105 -611 322 -160 -1228 1019 82
14862 82 16 -641 -448 33 -876 957 585 -231 -261 -497 43 -785 -457 326 -706 676 -31 -355 534 -1495
14882 -1495 708 -293 612 -1271 -652 -377 -1147 860 -892 1065 137 315 370 -1141 439 760 -315
14899 -315 -382 524 1243 62 1568 -381 -237 -783 -88 -599 -569 176 -840 1147 -664 -152 -45 -156
14917 -156 -427 -739 686 -527 464 -194 489 758 -277 82 -1552 -81 37 -418 -676 -116 -322 633
14935 633 133 629 -842 850 76 1050 166 514 783 -190 1041 -1199 22 -521 -510 937 -697 -364
14953 -364 -1179 940 372 475 1142 -213 -521 -423 1184 249 636 -496 -1308 -212 476 -337 295 -1373
14971 -1373 -218 -514 305 129 -290 414 -925 0 -1288 -463 171 85 519 -800 740 143 -362 -565
14989 -565 -257 1380 -1088 1019 578 950 -204 -319 -36 219 1498 62 554 732 -501 -394 -257
15006 -257 544 -266 -1047 187 98 404 519 621 -663 -812 -324 187 107 -243 1531 16 39 -407 -678
15025 -678 876 -251 142 367 -935 -467 677 653 620 445 -173 900 -181 -698 1088 -153 1248
15042 1248 257 358 418 367 -326 696 5 414 605 -592 -41 497 1102 -42 543 -297 -279 -30 15 -447
15062 -447 45 790 -93 651 319 652 -1011 389 715 -159 346 14 -516 -284 583 -25 11 273 91
15081 91 961 71 -193 786 114 1353 95 -414 -474 -761 1051 -324 -241 -401 205 1397 274 429 -666
15100 -666 703 -357 405 130 -295 682 -273 824 -1583 391 -27 -429 1376 -149 641 181 443
15117 443 -78 386 787 -897 994 -704 -516 -431 340 31 -563 543 -363 -624 -524 -407 540 240 487
15136 487 718 837 -649 -897 410 -1346 -425 -32 54 363 -408 261 279 1137 -512 513 600 -266 356
15155 356 326 -699 -927 626 42 -301 741 -547 47 236 405 -1071 164 1260 -430 -487 582
15172 582 -275 379 -25 -793 -972 -312 568 -53 805 238 1045 -1082 -216 564 -872 964 -1147 -420
15190 -420 190 348 664 208 473 -188 -140 -211 -241 753 -108 -976 -1656 213 141 -648 966 -195 1103 -501
15210 -501 322 1056 827 740 -568 809 -29 1261 40 -554 875 115 538 -856 849 -1962 -863
15227 -863 827 -457 172 -471 -863 -2 -529 47 -522 355 -327 553 -820 -891 -250 -44 -226 -763 314
15246 314 -717 299 291 901 430 291 984 -885 256 752 -778 592 1187 251 -266 -116 76 192
15264 192 168 85 -843 683 -1448 166 154 -31 -438 -384 17 707 333 1563 -27 -1412 -1037 405 -986
15283 -986 294 -538 828 -1115 -691 819 -597 -55 437 -704 -16 -576 -521 -702 447 -34 564 -1100
15301 -1100 -927 626 -734 813 475 -174 -92 -405 940 -605 -59 -550 124 521 -1382 1268 41
15318 41 -216 669 448 373 156 438 -192 -195 500 -126 230 487 330 -846 -111 -252 197 458 58 87 -445
15339 -445 323 376 -137 163 -1421 -60 771 9 418 -1171 1300 -71 489 -73 -537 957 -222 677
15357 677 298 -47 -12 100 208 -648 1150 -352 -138 -77 -382 -863 -839 682 638 -536 1203 -457 724
15376 724 -189 308 -127 -673 212 -49 682 -878 577 216 -552 232 -614 295 -699 859 -1011 -454
15394 -454 -283 -901 503 -151 0 -227 604 81 83 962 -787 -354 823 -27 -355 -1549 874 -398
15412 -398 -694 -534 522 205 323 677 -617 -236 -575 1248 710 54 474 109 965 -972 -675 1028
15430 1028 -651 210 255 -33 -157 -201 1601 -309 -378 -335 112 372 -215 -953 -57 1049 -611 95 982
15449 982 -214 276 358 -218 -1290 -360 528 -228 -283 -159 449 943 -225 1235 -720 24 242 -308 213
15468 213 471 970 456 -172 -322 168 -693 -33 1150 -179 -188 353 1181 -419 134 264 -498 -116 285
15487 285 -757 -484 82 -99 111 370 -828 144 840 -680 1184 175 1317 -531 -772 74 912
15504 912 657 -869 436 404 -310 54 -1237 1030 -673 108 814 403 142 -296 6 124 899 -445
15522 -445 605 47 -651 -569 -1132 -485 -430 274 -386 718 835 -1096 -262 172 579 10 126 -281 31
15541 31 -558 -1370 261 200 -543 -396 -452 -829 107 -242 985 474 -319 -214 289 179 -566 257 160 651
15561 651 251 -694 559 -373 1912 76 383 -154 -839 728 -225 592 -896 -1226 -1398 -797 432 -348
15579 -348 -586 -415 -321 267 -568 221 -583 157 100 -672 534 -401 193 51 59 -390 -127 -611 -575 914 -1362
15600 -1362 435 -1200 -67 152 61 22 -436 1002 -561 600 226 -477 -6 -48 467 -661 -408 1570
15618 1570 425 103 -1397 477 397 336 1606 90 -395 -1126 -134 73 -48 -174 863 -296 472 577
15636 577 452 -206 -535 343 -304 6 409 227 -864 -81 108 806 1006 492 696 339 89 -21 88
15655 88 -508 -1321 -45 -754 772 -250 1365 -72 -238 1367 -1077 337 -1131 -637 -146 -395 296
15672 296 -766 -302 -295 -159 114 -585 -58 -1701 824 -347 -376 1180 -300 1178 -316 1088 -45
15689 -45 1040 -706 -993 589 -135 907 422 -264 -81 -1422 -239 286 719 257 -506 607 -501
15706 -501 419 642 -74 439 605 926 994 818 -841 -465 -213 -50 -425 -697 -41 410 653 675 -295 -303 -389
15727 -389 462 437 -256 575 -48 -363 -547 -161 121 -372 -241 -467 -10 -238 -442 -870 461 861 -647
15746 -647 189 -126 280 289 -354 -469 -232 184 -448 -177 -526 -325 1549 -510 169 -912 447 240 -821
15765 -821 581 -1445 645 -844 -1016 -621 -1169 -134 -181 468 -624 717 267 -68 838 -246 943
15782 943 -513 603 12 -943 424 -948 1259 157 -256 450 -404 927 -576 364 863 -233 -497
15799 -497 214 755 189 -403 -813 470 222 -888 485 -587 302 -28 -246 617 -3 291 1216 208
15817 208 102 -817 334 -481 551 58 48 -80 882 103 345 163 -257 147 703 765 567 -991 424
15836 424 -172 923 -116 119 137 -120 578 137 -1020 36 -793 -306 -886 -187 -1034 -409 401 -631
15854 -631 872 828 800 398 -560 169 -1714 286 1284 461 -223 -1401 -137 -1 -268 484 -281 391 -1778
15873 -1778 360 132 712 -1768 230 1092 -804 17 -765 -978 282 -242 -280 604 36 -170 535 -371
15891 -371 -1080 937 113 2062 -1204 513 -61 -669 81 -633 494 -634 -804 443 953 -225 725
15908 725 44 -630 423 152 753 -304 -1047 462 44 -362 243 1055 -166 -815 -40 -1226 134 -96
15926 -96 939 99 -236 124 142 -201 229 -534 69 -1040 68 326 -475 969 -270 886 -383 447
15944 447 -230 -162 599 1 698 -20 8 -538 -2008 1147 66 -75 280 -32 -199 -559 215 -760 -67
15963 -67 757 -499 1372 -793 1163 -1353 769 -90 477 -833 -234 475 -720 1237 -1495 545
15979 545 751 372 -318 -1353 213 -133 -123 -406 -63 156 -784 110 -1467 607 -838 -1088 585 66
15997 66 481 383 -4 471 -622 1086 829 294 776 -131 313 -738 -845 124 -77 241 -136 520 441 -652
16017 -652 37 -1515 588 1072 662 235 783 -100 235 131 -576 -276 341 -482 -821 935 428 -849
16035 -849 -48 210 -761 -105 169 700 -871 740 -958 718 593 360 809 325 1460 -159 -525 -139
16053 -139 -559 383 -696 633 -546 115 -364 -1298 761 -715 1675 -302 -83 -345 -451 -1111 -1221
16070 -1221 536 -796 300 -725 -135 610 -474 192 -812 -401 526 -252 -380 -242 53 85 953 -548
16088 -548 218 579 -307 455 -733 638 229 -873 -379 -891 199 -515 29 721 -522 -89 23 518
16106 518 755 -913 759 90 1092 541 98 -177 544 -802 -85 815 -1176 7 -627 -281 1148
16123 1148 1028 -691 -133 -644 509 329 300 536 -1061 -904 644 1285 -351 -333 -1083 232 -65 -533
16141 -533 -424 -49 -322 -144 322 1031 -142 -107 -393 221 -827 407 927 23 1750 35 1105 -400
16159 -400 -114 140 -1349 1044 -1379 261 -7 -1246 161 -876 -75 11 1498 -374 -194 346 -420
16176 -420 100 -195 1377 -915 -387 612 -490 731 -439 -286 405 519 -180 -94 -24 -1094 846 -487
16194 -487 69 4 6 596 -318 -596 -981 -292 259 454 39 -46 308 144 -693 487 -88 338 -1005 -337
16214 -337 45 -50 -478 354 225 -119 -673 607 -272 256 1003 -434 -584 -661 546 -270 -212 -159 411 690
16234 690 -18 313 -127 -587 -765 636 -380 540 762 -1058 812 13 251 -22 550 736 1179 -403
16252 -403 -575 308 238 -1131 498 -289 39 -1090 -282 472 -652 147 -1037 547 -179 -83 1 -569 141
16271 141 -545 -339 -968 309 -10 -31 -123 374 772 -406 616 657 -487 -363 110 899 -601 32 -61
16290 -61 -855 -176 -774 -211 279 -275 535 -303 319 150 63 -692 -119 -349 -273 348 193 98 527 591 423
16311 423 -1112 -903 -7 167 979 842 616 1292 90 -195 157 -857 -1162 -104 -726 253 332 843 627
16330 627 -892 685 -903 -581 305 -923 343 -867 931 -892 -566 -219 216 282 -589 -169 -315
16347 -315 1182 469 -258 -585 -121 1841 359 628 -451 -248 129 -416 211 -1106 -594 -121 83 474
16365 474 -39 25 -485 705 -337 759 -715 -1080 786 -554 638 -426 -717 119 977 1255 -679
16382 -679 -404
16383d04
$$ Imaginary data points
##PAGE= N=2
##DATA TABLE= (X++(I..I)), XYDATA
0 0 0 0 0 0 0 0 0 0 0 0 0 0 0 0 0 0 0 0 0 0 0 0 0 0 0 0 0 0 0 0 1 -3 3 1 1 1 -3 0 0 0 2 -3 3 -2 6 -8 7 -5 6 -7 9 -3 4 -8 11
55 11 -9 13 -10 15 -15 19 -23 27 -34 52 -110 -6316 619 2890 3543 2785 -1167 -3063 -4172 -1036 1743 2871
77 2871 3629 -433 -1226 -3377 -1365 472 2959 2575 530 734 -1635 -104 -1011 1635 1411 883 -266
94 -266 -1769 -621 160 57 661 -973 185 -355 998 1076 400 -564 -215 -1261 -1152 1420 1000 1029 332
113 332 -977 -980 -1318 452 1454 2666 204 -1462 -1617 -1303 391 1170 2562 1275 -1041 -1845 -2498 3
131 3 2237 2386 1752 -93 -1398 -2587 -1997 -65 1653 2743 -334 311 -681 -1974 1165 1523 3342
148 3342 161 -962 -789 -1240 320 730 1004 419 1056 -1772 -1606 141 51 363 1272 -535 -625 -381 1153
167 1153 26 662 -4 -1034 648 -764 1197 825 1022 -552 147 485 -9 1365 543 783 247 -117
185 -117 -467 -960 1629 238 1720 228 -498 -1920 -878 271 -741 1405 -188 -247 149 -1880 -24
202 -24 249 2149 -62 -44 192 -1941 -661 -999 1384 435 643 -230 -1026 -464 -563 782 667 362 -395
221 -395 -67 -279 640 -45 374 77 116 730 -657 -702 239 -291 45 79 -294 284 927 -1012 442 -260
241 -260 -57 -1329 -793 318 911 223 -919 -127 -1205 491 -554 258 751 106 302 264 -256 821
259 821 -105 268 -387 429 157 -700 29 -44 1273 -571 1175 -402 -659 569 -1221 901 813 1103 -369
278 -369 -375 -86 159 947 -687 -545 505 -449 -71 -1504 909 -516 -105 -116 768 -436 -108 987 -321
297 -321 705 -654 -779 -87 -468 1116 -1080 337 640 536 -259 316 25 -152 174 186 -723 -336 -14
316 -14 1166 848 -181 141 105 1039 605 443 379 -533 238 -89 -1516 -865 110 616 516 -190 -558 353
336 353 244 -444 724 -928 1091 -744 -487 -7 332 375 -213 615 -636 431 -583 -616 1316 499
354 499 294 -831 -566 135 -364 1173 -539 1439 -603 -360 -796 -522 -39 -1240 1487 -612 515
371 515 -291 44 76 -1095 58 -1209 -240 842 -953 243 -1296 -689 286 -159 87 -270 708 670 567
390 567 -1483 1869 -657 -252 561 485 -35 140 258 -137 4 143 -602 770 603 217 305 617 465 -1172
410 -1172 360 -611 25 -720 860 -284 956 1007 -323 -437 -201 -366 1063 208 447 -313 -1150 674
428 674 -397 -1232 -758 811 330 -347 -97 -1144 -319 -739 493 69 -1414 816 -669 354 -667
445 -667 198 194 -1695 1389 -494 376 -215 -808 472 -583 313 -402 144 409 1034 408 -799 10 -388
464 -388 401 416 -175 538 -285 664 -1640 84 517 225 524 -490 400 -1616 258 -1147 1428 382
482 382 172 4 -1379 1165 176 1199 269 -33 1149 -886 -325 -1034 -329 258 515 606 -619 866
500 866 -366 -632 983 -63 273 532 -457 -436 -280 -374 -290 1106 -599 38 540 220 -202 -959 -1785 -706
520 -706 -207 371 227 -1020 320 147 -929 -155 -890 26 237 274 -45 -478 -825 590 -132 1507 -367
539 -367 -992 -739 -121 1334 -1659 739 -624 -480 -316 333 985 -1090 578 -236 576 786 123 134 -860
558 -860 1405 -886 395 1004 -1093 13 -980 347 -476 -705 1349 -191 731 -1121 42 444 -495
575 -495 207 -113 1556 -1247 11 -268 -955 1003 476 827 224 233 -211 -334 458 -3 441 -325 94 92
595 92 -307 783 -1444 170 -876 -845 -113 -288 -449 553 584 -853 -765 -223 39 -312 -280 -296 769 50
615 50 -36 352 -305 -280 -570 665 -776 125 -295 -10 61 37 -300 -635 549 39 1025 289 239 171 524 766
637 766 -496 -345 -229 278 303 -1248 -852 -646 947 44 583 1152 407 320 -1046 945 -503 -593 660
656 660 329 656 -292 -530 -870 -140 -21 -732 2374 -20 -46 50 682 -903 146 602 -638 924 551
675 551 11 -1071 463 201 -91 -583 -996 666 -764 -179 768 -1773 1354 192 -448 -1258 -192 74
693 74 -87 1103 135 -1032 -27 -1014 259 -244 -51 -690 -156 189 -297 502 -616 1077 385 200 276
712 276 -49 368 367 147 884 199 559 -94 -231 -1071 461 -436 -828 65 683 -434 1139 -135 -292 -421
732 -421 90 -1198 613 512 -306 -655 -7 1513 1145 -688 98 -309 273 -914 562 -539 418 -193
750 -193 231 1341 -1646 58 385 276 -26 -976 -19 47 595 -756 97 -93 -870 1028 186 -61 -532
769 -532 698 419 -374 1319 -1432 112 122 690 -3 -109 -494 -774 1650 -296 -209 -226 -725 1058 -310
788 -310 774 -416 388 1388 575 399 -1464 435 152 1065 -331 -199 289 -378 -581 612 59 816
806 816 289 289 -328 259 72 117 646 -213 -766 -573 -236 -54 -1293 443 -221 561 121 -966 149 -118
826 -118 595 -420 140 -497 204 669 -1054 1857 57 -100 -562 -862 902 -1177 1160 -1127 -258 393
844 393 -1284 -99 613 219 -895 432 -135 -936 426 -488 -254 -629 690 -201 30 369 499 873
862 873 -273 808 -742 -1227 130 -299 908 400 1009 -458 -1420 1154 -865 1345 -40 1049 -286
879 -286 -1113 1592 -719 697 -647 941 322 -647 524 -832 -45 565 176 507 -185 628 -186 505
897 505 -1210 -403 -397 -125 -720 358 -131 279 -956 616 352 306 -259 43 -122 -773 1112 -611 825
916 825 -77 -459 1084 -687 306 -590 44 -21 -1074 567 -348 1185 -361 -32 329 205 653 -998
934 -998 1008 194 58 -136 -152 1015 -597 768 -869 -305 94 -638 870 -947 206 -1782 454
951 454 -120 349 1839 -594 536 -363 690 107 -621 354 -1318 577 318 186 -926 -598 -392 -694
969 -694 884 -287 922 -146 845 245 -509 -179 -920 196 547 -514 -281 -1492 -681 -740 201 -45
987 -45 1259 -70 -593 -8 33 634 1263 166 241 -340 796 420 -676 230 -243 -493 -145 -305 187 -1377
1007 -1377 186 365 -1530 -583 858 10 -859 819 -579 682 -1044 -162 510 -351 712 -134 -324
1024 -324 -344 -724 155 13 -281 393 447 259 -448 850 -293 1577 -412 795 -34 -503 402 -867 868
1043 868 -405 1105 422 319 23 -23 975 -551 293 -34 1475 -1088 -1678 1174 -435 101 574 -427
1061 -427 182 35 1701 -433 -1155 -816 263 1188 -949 -115 -508 -904 -142 -371 156 -1338 -170 -771
1079 -771 -209 -564 -69 -505 -565 -1025 546 419 -109 -416 57 -348 -480 91 -510 473 234 -589 807 -178
1099 -178 823 -718 -36 -310 -370 70 -747 -253 -499 911 -33 1140 45 -205 -200 -1799 425 88 41
1118 41 972 465 1321 125 821 -351 22 -543 -60 697 -1154 258 -543 57 -197 340 1474 15
1136 15 819 -278 -303 -144 -412 -425 -530 652 -712 258 -6 -456 -382 -651 -623 -152 575 -1120 -780 -188
1156 -188 -1549 1348 705 -345 -374 -484 -113 -677 750 -277 834 581 -770 184 -665 473 -70 760
1174 760 -495 -413 569 -839 845 -419 1014 137 -496 -183 3 299 273 246 -1108 -764 -136 -311 -101
1193 -101 -922 -1027 -310 -134 23 -169 -33 441 -133 159 -717 252 -449 -1224 1379 381 192 314 -529 -364
1213 -364 -391 -822 -181 -103 1476 108 580 -1521 244 -931 2043 85 -90 -1189 -818 2010 -1083
1230 -1083 853 -399 -53 -1348 84 -556 -1451 689 -649 433 446 -359 241 -757 -18 -14 1081 -600
1248 -600 -321 483 -834 563 -588 644 -847 -67 290 -746 -667 -1074 -50 70 -87 587 213 529
1266 529 -573 13 502 649 -290 -237 564 303 -783 -1095 -336 -246 -46 -304 -100 212 -13 281 629 302
1286 302 -678 139 470 -661 716 -187 -375 1518 829 -420 -351 297 281 -10 -290 857 -219 675 -421
1305 -421 426 727 -89 75 -348 -572 -451 417 -950 -264 406 -222 1525 -152 -127 566 -1038 1528 -605
1324 -605 661 -39 -235 185 -490 -249 -914 558 345 667 24 408 453 -710 -598 -359 79 77 649 751
1344 751 -939 -640 -280 -1224 -533 -496 796 -453 508 -740 -358 -469 369 -536 -793 693 -153 307 92
1363 92 -375 556 -450 110 -728 -1037 1165 107 -202 -468 -662 -1116 106 622 -659 255 468 328 374
1382 374 388 243 844 638 251 208 -358 -577 245 -879 480 658 -792 527 4 973 -919 725 492
1401 492 -582 -264 182 532 3 143 -152 -105 1149 -417 476 131 -543 339 -1273 902 -931 -19
1419 -19 -36 413 226 -548 -24 -1316 671 -819 1692 -741 -984 1183 -1140 253 -917 328 -757
1436 -757 364 742 -350 667 -749 855 -552 87 -122 -181 -175 -1390 -1255 124 -217 654 442 762
1454 762 708 838 -513 -1211 209 221 1049 -53 219 -245 892 301 -489 605 -481 5 -220 -1109 -403
1473 -403 933 1799 -541 551 210 476 158 -695 1053 214 -22 -773 -1008 226 -274 -531 -58 -421
1491 -421 188 147 622 1061 -1083 816 -1583 307 -478 -1445 491 -461 125 -251 12 560 1249 32
1509 32 441 984 -1831 354 -996 311 198 81 495 -785 177 -816 528 -456 376 153 192 169 -788
1528 -788 -235 256 -813 -581 -291 1003 -1087 1158 -634 204 377 461 564 123 -222 142 -194 -198 -1903
1547 -1903 825 262 269 348 -231 111 737 497 -1296 976 245 304 -93 -711 14 656 29 586 -1079 755
1567 755 -349 238 522 477 1069 -266 -179 437 -63 -677 949 408 375 630 -467 -515 1220 -57 239
1586 239 -455 -210 854 489 -1200 401 1266 -287 -740 1052 623 -27 -1619 561 -670 876 260
1603 260 -421 79 -778 14 -156 -148 -283 -162 562 -1383 269 -465 42 -451 276 316 -266 -258 417 -378 228
1624 228 119 1054 15 683 258 -117 -109 961 1346 -43 41 -875 1072 -272 -636 226 294 626 489 -93
1644 -93 -577 -100 -33 -416 537 275 596 -352 275 -157 560 928 335 -104 375 725 259 47 -1145 -1028
1664 -1028 1014 296 517 191 -1342 50 -68 -1065 -215 83 -234 -132 118 378 -539 955 123 -389
1682 -389 -410 386 2 355 -67 -897 -610 -311 163 -37 617 172 -97 705 401 -289 536 217 -576 -105
1702 -105 865 -1064 285 -533 -1312 1280 -1317 662 -607 -407 1452 -1730 1300 7 -11 -176 -1075
1719 -1075 1256 116 867 -579 -664 292 -177 395 -510 597 -751 1284 359 258 426 -429 4 361
1737 361 500 -230 -1140 -77 -916 -25 -232 533 250 190 1028 -248 532 -276 309 660 -60 -528 -868 -59
1757 -59 -216 -1282 -872 -454 509 -82 -389 -1156 -64 1692 -823 -633 852 880 891 -82 167 -570 -396
1776 -396 582 -1051 800 137 818 187 702 -189 -126 178 228 -193 -1345 -114 607 -226 -323 -925 -292 -482
1796 -482 -37 -652 -1142 1133 37 -432 -614 504 -373 668 -436 -629 505 -130 122 77 -574 458
1814 458 -583 203 156 714 -106 -746 1029 -84 106 -1016 298 1162 -955 378 78 841 -137 -382
1832 -382 -357 131 842 -1771 907 -303 74 -379 168 -874 -314 69 -1119 318 -1111 -398 1043 -297
1850 -297 -841 -579 -113 -874 -296 53 277 547 -699 -54 -585 -541 -5 -581 -31 7 -284 1099 -619 1671
1870 1671 -115 -807 815 142 579 171 1114 -99 951 1040 50 -511 -553 -218 331 -890 695 -803
1888 -803 1272 -558 630 894 -275 -244 -232 252 -1422 334 -144 1381 1257 -1376 536 398 296 40
1906 40 -569 -33 231 223 -1219 749 -183 -182 1064 -756 252 107 254 -516 238 427 -722 7 76 1024
1926 1024 832 -649 -554 -1023 432 -760 807 -12 465 838 -565 812 -263 -238 -79 148 -265 328
1944 328 182 362 545 -985 -228 572 -361 -503 -907 51 413 -816 328 441 1013 -21 -1622 110
1962 110 378 -576 523 90 873 -631 701 -478 532 -810 -83 560 -440 187 -295 -520 -395 1165
1980 1165 728 98 123 -19 688 -383 316 -2 -275 623 -1228 1188 362 -513 -149 -533 252 -775 552
1999 552 -342 721 22 -484 -86 -583 1266 -626 44 350 -1073 809 174 369 -513 143 476 -917
2017 -917 -621 -697 448 -159 -148 -91 377 1536 -285 1133 -654 296 -139 -212 140 320 -1108 777 -351
2036 -351 -207 -428 102 -819 286 -414 174 837 700 330 515 652 2 -273 436 187 98 -337 191 11
2056 11 -595 328 -33 51 249 397 756 72 455 -364 390 -829 273 1326 -1140 1082 -459 -657 -458
2075 -458 -702 1149 -245 641 202 870 333 -123 401 -338 660 393 -554 292 -682 1376 -244 882
2093 882 -811 89 481 303 691 -1343 399 -213 -40 -80 -900 296 -1322 304 -668 774 1296 -149
2111 -149 1289 -593 646 223 899 -404 -844 379 -89 -1 756 562 121 314 -709 -431 -123 -1358
2129 -1358 -724 53 260 -394 -859 729 383 -128 256 33 835 -1197 889 -127 295 -827 -482 21
2147 21 655 -234 436 -261 275 1297 -24 -418 432 371 -274 604 -409 -202 681 -569 -56 -637 687
2166 687 77 590 594 -505 -138 -1350 229 -758 -410 453 -824 -137 30 -261 112 746 674 1033 900 -254
2186 -254 435 -109 -211 95 -363 73 -1051 -346 -675 515 452 -30 1087 -1109 527 679 -1437 1383
2204 1383 -185 -28 -241 796 -222 -170 125 -21 380 -1030 579 97 -124 -253 -309 690 -590 -11
2222 -11 -724 -280 676 -241 86 -559 1107 826 437 -279 -633 -428 -794 462 -431 613 -458 -141 336
2241 336 129 455 -661 378 -478 -445 541 241 -416 58 197 -924 -1230 270 924 -1008 -246 -648 712
2260 712 128 -1113 -267 371 1431 605 -134 236 -197 -334 -35 128 123 -695 -732 -702 -249 728 809 -1140 850
2281 850 -446 -381 389 -16 1314 -312 -506 -576 295 507 -156 1207 -928 942 -156 -665 283 -138
2299 -138 -425 -79 -752 -932 -535 714 -533 -76 -224 311 265 1438 -401 -438 158 -121 -13 -779 130
2318 130 -467 213 -178 -390 699 -464 -606 589 -1308 517 648 818 1077 -489 726 492 871 288
2336 288 600 1326 -963 -131 -173 -602 105 -648 309 459 1222 575 598 1121 -291 -205 -376 -432 -138 -218 -287
2357 -287 -571 259 -653 1104 1008 203 812 -728 783 -949 465 149 -673 1084 -870 902 -636
2374 -636 1589 -214 685 -65 -550 702 -474 1787 -1272 -524 621 -163 923 -1069 788 -1663
2390 -1663 -548 -126 -671 319 -440 1704 62 467 297 375 80 -106 395 -650 95 14 -585 674 25
2409 25 1657 -1206 288 -82 -89 835 48 1453 -264 961 164 121 1278 -439 -803 751 -22 187
2427 187 88 287 -193 145 360 797 76 9 940 -257 -441 232 928 413 155 -1082 -521 -218 579 -334
2447 -334 814 -1025 94 560 100 188 -532 -527 -170 234 627 -213 424 -547 -304 -906 27 -383 46 730
2467 730 -642 852 -429 829 1310 563 -27 -342 1284 253 1500 1859 -1494 983 -886 66 20
2484 20 -977 -400 -292 156 -542 659 -100 -74 -340 466 275 126 568 -183 -54 374 579 798 -434 325
2504 325 -786 865 -227 -1122 299 155 433 -628 -337 685 -37 55 -12 -345 -13 1207 1181 -870
2522 -870 -355 928 14 -297 90 139 -171 -595 -1225 -38 -266 -1596 710 -4 -306 165 843 920 -80
2541 -80 434 -891 -294 349 -818 756 -62 -704 -380 0 -199 -490 656 -636 99 -1116 253 123
2559 123 7 505 -427 1381 166 319 -324 243 942 -1285 1112 -169 -246 -1117 -399 1237 -296 1179
2577 1179 -1024 372 -986 827 -126 -982 -251 -908 -108 -293 -170 399 -1418 -132 -713 45 345 -486
2595 -486 579 -617 144 -795 -556 193 136 85 -1109 507 -211 -867 -235 183 37 -116 -56 -1075 -226
2614 -226 -79 812 -645 -1041 265 182 -418 127 622 -804 -1243 517 522 -134 179 -873 390 1231 -98
2633 -98 -315 -707 1312 17 455 -1009 -500 -166 -1320 1627 -298 167 373 84 -447 -384 835 -528
2651 -528 -276 -89 -81 -38 -667 -728 -6 485 1452 128 281 -1334 757 -1297 -70 159 -1456 180 -585
2670 -585 791 -671 -403 -494 -102 -431 -159 543 -618 -794 -122 -118 -76 292 333 -926 1670 -138 1002
2689 1002 -435 -756 818 -121 -697 -198 594 260 -164 302 -811 -30 -520 19 276 -885 -320 -1003
2707 -1003 -448 -405 796 383 -131 -596 -272 164 1181 -226 719 -1567 27 161 -471 173 -647 147
2725 147 -435 -107 597 -660 252 -346 -853 258 -292 497 -1046 -966 -597 -53 398 461 364 -911 1542
2744 1542 -497 -231 223 -270 -1 -155 -55 459 774 103 -25 920 476 211 -1312 144 -649 -692 1171
2763 1171 -975 -911 290 798 304 -41 493 -79 405 -392 393 -357 -815 865 -1195 731 -543 185
2781 185 -75 23 262 -628 856 -72 220 -480 -433 255 -547 162 47 731 -304 -857 -428 262 814 -826
2801 -826 -222 1020 -154 -442 204 262 -208 346 761 931 -178 192 -112 -986 -622 1039 573 -82 254
2820 254 419 377 441 445 -176 -60 464 -496 481 -1413 580 -500 278 -580 247 406 104 45 -559 613
2840 613 556 -675 398 565 644 -530 508 117 -507 575 109 430 -467 -446 -194 846 48 -1602 689
2859 689 -1322 517 332 227 -202 -1558 1943 -854 -318 -748 391 -24 -249 427 -675 110 -338 533
2877 533 614 -1084 231 767 -111 26 -1045 -166 -460 573 894 1187 -1008 -676 -233 -80 77 -143 -238
2896 -238 -46 299 282 318 164 962 -533 -468 1539 73 -280 -92 -246 -781 -14 -144 -300 -206 -464 599
2916 599 1486 -571 -439 418 98 139 -214 -779 387 -1844 1139 1110 -1442 1194 -149 783 -177 289
2934 289 -971 1288 -287 117 689 -614 1354 -162 -643 401 -908 -631 -934 -386 38 -584 144
2951 144 -567 -242 -649 524 13 -535 937 -1304 1319 -292 487 -626 546 -242 -977 1802 -528
2968 -528 306 7 238 302 189 1016 434 837 494 18 556 161 795 -706 899 175 378 732 476 708
2988 708 -810 1306 905 -8 -35 733 616 -695 -5 99 -158 -594 -964 221 85 -210 -447 -869 578
3007 578 -543 656 -226 -456 674 -42 -461 233 1058 835 -421 1033 -1201 126 187 -647 890 -660
3025 -660 654 -952 -792 362 132 -132 -470 -208 -272 24 -318 825 -426 -1031 68 -1482 243 298
3043 298 -529 811 -22 1783 -584 2140 -659 -473 -549 -1563 550 570 -194 -587 -346 61 -181 309
3061 309 -760 1670 -495 492 489 -711 1068 -520 979 424 -850 375 -379 -250 81 292 577 -230
3079 -230 174 -198 188 -1189 768 -29 -687 391 -435 850 -781 620 -771 171 599 824 414 -2156
3097 -2156 -724 -892 234 187 57 -1043 -177 -359 -1487 -846 795 -604 26 -702 -482 565 -575
3114 -575 291 575 -283 1157 864 349 -263 1289 422 1505 -270 -296 732 -819 70 668 544 790
3132 790 -800 2029 650 72 -57 151 -93 81 1354 -284 518 -426 484 690 -1041 696 241 205
3150 205 -590 491 94 -724 1100 -108 1422 -882 1035 180 -1245 629 -238 31 78 789 282 -1187
3168 -1187 739 -359 857 288 -388 233 846 1020 -1294 -879 -581 188 638 -268 749 -342 -396 670
3186 670 -491 959 -189 -935 924 845 1219 138 1051 383 583 -374 925 -676 183 -109 500 -721
3204 -721 619 682 -32 -944 -235 1083 -529 -444 -194 1461 -582 656 394 -913 123 -574 906 -628
3222 -628 352 200 1029 63 427 335 -559 790 291 -49 241 -185 1431 -110 -49 -250 -616 31 -430 240
3242 240 -994 1101 -280 925 -670 597 1192 -102 482 262 422 688 230 581 -955 242 -1602
3259 -1602 -282 65 585 488 16 635 -311 315 506 -637 219 -829 131 -353 44 423 -1262 1034
3277 1034 -750 -463 163 -801 1063 -678 -1310 -618 -47 -52 -609 -316 1043 -661 394 -761 304 -162
3295 -162 634 -555 251 357 300 369 -605 476 39 787 464 188 -229 -471 -218 213 -86 100 -780 462
3315 462 -1178 172 417 779 -330 -1427 688 -562 -40 -474 295 1087 -240 819 -1448 64 -329
3332 -329 -159 -99 -1306 558 -865 629 -636 550 -928 -439 -1 -1444 900 -133 587 -115 228
3349 228 178 -798 844 -685 823 100 -971 -316 -151 1603 -520 970 -55 32 1559 -233 559
3366 559 511 814 852 -249 -294 -346 -610 -910 322 -1209 596 801 -359 679 367 -99 120 299 438
3385 438 802 -917 55 -597 666 53 -680 -745 -1295 21 -880 841 -1127 -572 317 -613 31 -8 -366
3404 -366 -697 58 166 -265 377 -1165 538 635 141 -418 -397 -707 -381 884 610 -339 250 -805 1260
3423 1260 -239 1005 236 -359 -11 -777 452 18 148 -612 1459 135 -817 -252 -505 988 -95
3440 -95 -1055 263 -911 803 -1131 -102 660 -538 893 369 933 609 726 19 205 207 247 313 -769
3459 -769 -686 -555 -21 971 -735 248 341 310 -1019 -230 -591 187 1108 97 -115 421 -844 1088 1081 -332
3479 -332 -86 95 -942 -40 192 466 -749 -374 865 151 172 -163 -443 -550 11 -292 -126 -203 -33 44
3499 44 146 333 -1653 445 -661 -469 -329 -372 652 -668 1555 -1019 932 303 294 314 -680 -61 641
3518 641 317 -721 43 670 -1731 682 -29 1960 143 498 520 -2006 967 -504 513 612 560 418
3536 418 189 374 -898 209 -161 -190 -391 -379 -85 -399 -207 -473 -105 -506 -1387 1634 -208 516 -320
3555 -320 -558 1283 -1117 -48 63 -367 871 17 -532 -784 -526 75 1471 182 100 -406 70 396
3573 396 -925 -897 -881 -692 -625 -812 -730 210 -522 905 -53 -749 742 -409 539 -673 -217 -1021 1052
3592 1052 976 340 580 -191 679 73 1396 215 142 51 -648 86 -278 381 -330 449 -114 -1016 -224 -883
3612 -883 219 469 919 338 277 734 -1029 314 464 -299 499 600 898 -947 757 243 174 59 1421
3631 1421 976 -30 60 -301 24 -527 85 452 -975 681 3 220 873 -378 -704 -410 161 -1081
3649 -1081 1186 -810 -972 -305 244 1872 584 818 410 76 1424 67 1303 138 733 709 178
3666 178 937 79 408 -458 -663 939 -295 -26 93 212 62 -216 322 1682 208 44 80 654 222
3685 222 120 -721 -301 328 642 -437 -310 -172 -342 258 -187 -549 -295 -614 885 -802 16 544 -196
3704 -196 491 -1620 682 -75 38 38 -1077 -711 -1089 -170 -595 253 -915 -264 889 -1061 -260 373 449
3723 449 333 -1503 -121 -766 -211 -416 42 444 -1 795 -49 500 -209 367 422 -286 -133 -255 668 -656
3743 -656 871 -528 -1396 -1176 -628 212 705 112 -1520 695 -1118 -693 940 -429 5 -43 591 -258
3761 -258 37 1613 -832 -391 -413 -484 28 -209 -198 319 836 521 -159 619 761 -1118 -393 1003 589 -306
3781 -306 -16 -155 -539 874 -457 320 -175 -715 168 -1026 482 -147 780 -293 220 -233 -845 -499
3799 -499 -14 107 -314 -495 345 477 179 -670 755 -1085 -616 777 -902 -608 -601 511 -316 -906 564
3818 564 -508 1690 -364 -110 -967 79 380 139 944 -45 257 -98 506 262 -217 -271 363 675 -1194
3837 -1194 276 -134 208 380 -582 256 -702 401 -28 -848 1453 -639 -727 -65 651 471 330 816 -1550
3856 -1550 644 168 -791 386 132 358 306 1300 571 -1850 1199 -787 911 794 -428 93 -977
3873 -977 -673 -147 52 992 -406 1147 -972 -269 -71 112 -972 363 1304 271 654 -481 1044
3890 1044 223 -1094 -67 617 752 231 492 -291 301 612 -102 668 -831 169 74 -1230 -10 -724
3908 -724 872 -905 -86 -337 -568 293 -690 2030 -180 578 209 -422 779 219 754 252 769 514
3926 514 -454 1334 68 904 -1094 869 955 -169 806 -1615 982 -11 29 334 99 259 -2047 -777
3944 -777 -490 -439 -347 -1373 -232 -107 -404 576 -120 -123 1011 376 -256 239 99 -521 99 23 342 -300 -463
3965 -463 653 -350 41 367 -110 648 -501 247 370 258 49 160 -1073 193 -684 -262 -454 -414 447
3984 447 484 -301 1063 -27 412 -863 -638 1497 619 -181 -44 1159 -1815 299 -170 202 850 -1557
4002 -1557 -2 -1461 1090 355 -503 283 -524 1114 -595 -702 -1390 -523 680 -1273 4 11 -519 629
4020 629 -248 -126 -916 596 -740 1048 -431 -205 -614 -362 1011 -436 280 373 -619 241 -172 95
4038 95 -144 887 112 -157 -224 184 647 -321 342 -264 129 -664 -657 -165 -389 -29 1005 174 -528 -185 -876
4059 -876 153 -31 640 -324 416 -560 -890 372 -379 1370 -223 412 365 -466 794 -1475 700 -1091
4077 -1091 473 153 399 445 -1740 -783 -215 85 174 556 -759 -506 -853 -452 427 -122 -619 54 -211
4096 -211 1037 -822 107 99 -1145 -48 -498 780 -924 530 -773 -509 318 -402 1109 -581 1041
4113 1041 -517 -486 -210 352 426 -1326 646 142 679 354 -1015 1499 -948 -421 671 -241 491 302
4131 302 171 314 437 -697 1013 -420 243 -402 -182 -1072 1278 -359 77 -556 -261 312 750 -537
4149 -537 -546 -1122 472 539 539 -319 -232 228 712 454 189 813 -390 1027 512 -452 84 649 -160 -852 500
4170 500 -512 1000 712 -994 931 -174 109 -676 536 681 -444 217 -1606 346 -467 937 -447
4187 -447 -196 -688 -1571 -59 -526 -322 150 0 1088 -503 970 -1727 552 -425 -81 1514 -669
4204 -669 772 83 941 279 75 941 -431 344 -465 391 -751 209 275 -998 848 -703 662 -130
4222 -130 -434 -153 756 212 -506 117 -603 630 775 -635 601 -1626 559 931 604 270 -39 243
4240 243 -80 -522 675 -344 1269 187 -822 -1269 -209 -217 728 -35 52 -53 -35 -880 454 450 297 -184
4260 -184 -494 423 539 493 -695 921 70 972 265 -260 289 -462 -513 30 -779 730 -1777 649 -166
4279 -166 -133 -1535 -591 104 -526 1244 -205 -296 -442 617 -474 -103 -409 41 330 231 -422 31 17 914
4299 914 26 1333 -186 887 779 -1199 1166 -31 1397 919 -77 -271 -373 169 82 -664 -377 -387
4317 -387 805 -107 1035 82 700 317 -193 215 -941 -291 -1525 -282 641 627 374 500 1411 -160
4335 -160 498 -1195 -152 143 -331 -417 444 960 275 -558 150 363 -95 -734 245 887 -812 290 1051
4354 1051 0 -160 -2016 791 638 -1204 101 70 910 -3 134 -1016 556 623 -90 1601 -121
4371 -121 138 -684 -335 -273 -39 1612 -832 48 -1411 -327 -164 -120 603 -327 843 -533 -345 195 -106
4390 -106 50 -580 -1063 176 953 80 -1790 -421 -908 615 82 -910 -228 -3 1206 -1117 1094 -1009
4408 -1009 642 637 -612 261 -859 1038 -784 667 149 1217 4 -1088 205 341 435 35 82 -238
4426 -238 -981 65 -1500 300 -348 542 881 -611 -364 -671 -441 -167 -429 531 -994 363 -821 -355
4444 -355 329 -396 -634 -263 699 -271 918 637 440 -43 -708 -431 1206 -702 714 -1293 -320 -576
4462 -576 -764 -435 -119 -108 -866 -1115 819 232 39 -233 670 -30 908 1110 -237 756 -384 -271 -201 -25
4482 -25 -633 -641 162 -638 -395 313 414 -1465 -143 -260 116 1139 -316 -57 -1054 -234 1013 66 282
4501 282 -411 148 199 193 1150 221 444 -858 574 -316 -1369 -293 402 -78 -114 883 647 -154 -431 -1128
4521 -1128 644 -121 179 918 -650 342 -307 -722 -398 264 -36 842 -104 185 248 221 -1534 690 121
4540 121 -443 358 175 318 -227 23 493 -373 -192 117 -56 -1405 349 -99 -124 -980 481 107 -1035
4559 -1035 -706 -2077 -41 -372 -671 -653 -262 885 386 -762 -680 -97 -761 -51 1555 -1273 1182 371
4577 371 -110 1351 -664 715 -1059 886 -810 430 240 -123 90 -725 1144 -438 153 1164 -3
4594 -3 366 -819 -363 -561 464 177 -141 1151 -1516 -473 1071 -784 64 308 514 -623 153 -1312
4612 -1312 541 1244 798 -568 -1289 -94 206 163 740 -257 299 -643 55 -88 -518 875 -166 266
4630 266 643 -154 -574 -497 -612 944 380 406 -434 179 -561 218 512 963 726 -1374 623 -804 594
4649 594 204 -456 435 -570 911 224 321 132 520 615 584 677 -107 485 476 664 756 -849 196 -346 480
4670 480 -156 571 534 -622 1458 -835 1058 328 353 1173 -759 412 -654 683 -331 -1230 26
4687 26 59 1015 -1189 339 39 370 -998 353 -743 -1157 -670 -1080 -247 -494 -197 612 -776 -406 -391
4706 -391 297 -290 -950 834 -232 813 445 57 65 -339 295 -772 821 -516 -139 225 -1204 342
4724 342 397 178 474 -1071 -705 -660 15 226 174 902 126 -451 -606 494 441 102 928 -270 665 84
4744 84 -436 373 503 1275 -817 -119 -187 -99 599 -328 544 -1048 973 -196 894 764 -598 700 -720
4763 -720 955 288 93 -644 -93 681 -1112 627 -154 127 -26 11 1587 -699 329 354 -488 -118 -422
4782 -422 -473 43 238 -12 -819 -115 -870 393 -269 42 -352 -277 -831 479 -161 -973 355 -268 207 -297
4802 -297 -4 998 -116 786 540 -1216 599 -577 414 -414 525 -462 690 386 519 298 -1018 -615
4820 -615 -350 342 385 119 -197 -408 -140 409 -734 1066 660 -688 -699 -680 747 -134 138 406 -903
4839 -903 274 -671 -803 26 368 -1175 -551 -484 -1207 385 -115 418 -197 511 723 -217 875 -888 166
4858 166 -519 -1224 -162 -1300 865 -848 900 -785 361 80 287 135 -238 322 128 427 -232 -234
4876 -234 350 -616 -25 631 109 66 -662 135 -1584 187 -572 471 -1222 -1325 1226 -1214 -537 -21
4894 -21 -749 -239 574 418 -30 762 466 239 451 -344 667 593 -659 -126 753 45 -338 -294 -1020 -95
4914 -95 396 -1064 900 -139 -213 -297 -516 136 332 -50 -699 176 130 386 515 514 273 550 317 181 -257
4935 -257 328 -575 -394 -694 -386 -621 -33 1088 -151 -567 -175 13 -309 265 146 -839 1477 124 -890
4954 -890 911 -1021 762 -456 706 -1081 -16 92 147 2045 -883 866 -875 879 682 -1179
4970 -1179 738 -401 1051 -17 -416 854 -365 178 -613 -67 -1173 -158 888 353 571 -1136
4986 -1136 980 12 -645 -801 320 735 -1173 575 286 1725 -69 -968 75 -1225 723 458 111
5003 111 -144 -1152 192 130 -310 558 -1027 222 -663 -83 54 836 770 776 -459 536 -53 -205 -40 873
5023 873 -273 -435 948 856 -96 -30 36 -109 848 -484 -977 847 -553 754 183 3 839 72 813
5042 813 -1062 -378 -165 -42 -242 -40 449 -575 343 -1013 -514 -160 -22 351 -722 962 -919 -14
5060 -14 -303 152 -466 -494 707 -487 236 -1426 350 974 142 -694 -135 785 -52 532 567 6 654 375
5080 375 -339 -497 -129 461 -905 268 -435 -128 17 423 -39 -837 234 894 563 -471 -437 613 -111
5099 -111 1283 255 255 -7 -434 158 -1386 -302 -696 -1104 -548 70 -186 100 358 573 -679 -320 -417
5118 -417 837 482 -574 709 -617 641 147 95 517 659 555 -546 531 251 63 285 -1198 400
5136 400 164 1529 547 788 -587 -554 343 1172 142 402 515 -1048 261 218 351 -364 -330 733 -655
5155 -655 -199 608 138 1181 -1246 506 568 875 -626 -87 308 -574 227 -935 46 -343 270 1133 -337
5174 -337 -529 -1106 -1296 -645 556 919 -1196 1051 -1048 507 -237 -780 1232 -820 198 58 -671
5191 -671 1043 194 737 -74 64 -292 -214 -277 -919 -1119 1105 -366 -760 -317 25 902 345 -1134 -356
5210 -356 131 -1159 -203 240 489 1114 742 -369 626 1140 1719 -290 547 379 161 -1194 -147 -640
5228 -640 323 -407 38 724 -1473 451 -187 288 1227 573 1096 122 -267 -517 -655 -261 -1833 222 -945
5247 -945 687 -464 -1106 56 -860 -139 -248 1146 -1061 631 -252 -306 1233 -882 1489 -743 641
5264 641 -1660 68 196 -853 481 -81 -133 -97 -568 -85 -350 186 -543 187 -795 -722 -686 -320 -555 -171
5284 -171 463 -929 -353 -338 -49 796 -904 67 -1584 244 1083 -400 -424 418 -638 25 -848 540
5302 540 -88 -153 209 -139 709 29 763 34 740 653 351 513 -302 442 -646 1288 522 -592 -711 -307
5322 -307 297 -1072 -425 885 -415 870 923 304 1334 -889 886 -200 -151 207 -877 -394 -309 592
5340 592 -951 -11 -1063 204 141 -761 -715 -1088 922 -393 164 -102 -958 1241 -899 -21 -1397 322
5358 322 -426 441 247 -1020 -101 -211 -704 240 -567 101 -172 1072 11 195 513 -289 163 -1041 2501
5377 2501 -61 292 219 -1469 -701 181 281 -142 -722 129 -538 406 -955 -372 192 -343 198 -784 -551
5396 -551 -643 49 -782 -89 -1036 -57 1116 253 -452 -1029 -167 430 -379 -679 642 612 -290 -431 -965 -12
5416 -12 -317 119 49 1240 -541 1007 -358 -13 259 518 793 361 616 -1278 24 1317 65 115
5434 115 -726 1716 221 945 -576 -1 605 -747 1134 -1242 939 1192 187 275 964 1494 -181
5451 -181 -139 -501 -206 586 -1272 852 -1000 602 -504 -560 825 -446 514 660 -156 -184 -433 160 418
5470 418 347 -910 -278 94 -483 321 -1094 590 451 395 -586 801 777 -317 -363 488 724 192 -887
5489 -887 -31 273 740 -136 1168 -669 -1327 -625 -677 -110 937 438 1593 -829 794 145 -1133 140
5507 140 -1523 -587 -1209 -21 -11 753 143 -254 1019 297 272 542 3 709 -1236 217 -602 628 184
5526 184 -1113 235 -280 294 -394 1902 910 -94 -570 -636 844 774 195 -177 198 -232 -511 50 36
5545 36 -49 437 357 554 -1408 418 -1254 203 965 69 678 -256 883 28 -290 -723 552 726 -669
5564 -669 349 -467 -161 219 -992 458 -961 469 -879 -476 -685 -543 687 -328 1266 -28 -436
5581 -436 -535 -1534 628 -277 358 -296 657 178 -680 386 623 430 -14 -350 348 238 -107 1116 -1034
5600 -1034 -1338 -1365 1034 -313 -1145 -194 -1011 556 -448 -715 -212 1355 845 39 -104 -922 971 -957
5618 -957 -333 -70 1405 1212 -250 1511 575 1324 -237 -556 461 -126 1102 -327 790 -634 -389
5635 -389 117 -650 808 -1167 683 892 414 222 -961 949 113 -280 610 453 416 -76 890 -778
5653 -778 467 -240 144 35 -921 376 -1694 458 274 516 -84 -517 120 326 235 497 414 252 458
5672 458 -147 -10 13 -4 456 -348 -374 -60 189 -171 -1084 -1110 247 -829 -205 -61 -190 858 -136 1167
5692 1167 -454 -236 1134 294 1041 -26 1016 -332 567 627 -389 41 755 865 -442 4 460 -891
5710 -891 -60 -1588 152 -1492 -723 -14 -641 75 430 667 -1052 -1227 397 264 1985 -289 409 369
5728 369 497 -120 -116 756 187 -11 -302 33 661 -129 -171 -567 706 -361 -293 646 -542 -45 -982 -263
5748 -263 -549 -7 544 -579 1613 -676 296 -696 -170 727 -20 265 -93 91 387 -446 -334 -136 577
5767 577 165 1399 874 -98 250 1050 432 -19 -178 1072 506 359 573 -129 586 -1146 249 320 467
5786 467 259 215 512 -371 1427 -305 649 346 104 545 -942 816 132 -432 -329 417 874 -966 793
5805 793 -716 182 243 -460 1098 -330 379 -801 179 -892 1047 481 -292 471 -321 223 712 272
5823 272 -215 -1541 466 -376 562 180 -434 -204 -342 -17 -532 698 385 -286 362 -728 388 -147
5841 -147 148 -442 142 -193 -649 1258 -179 -566 567 282 8 500 910 -43 153 9 -164 201 -789
5860 -789 491 -337 505 -540 114 131 82 -249 801 -3 561 -260 -867 814 171 -538 -635 344 -736
5879 -736 871 368 416 685 126 127 -763 -1414 -292 -18 530 -411 280 -614 519 -843 -1619 1198 -1206
5898 -1206 310 -431 1 112 -303 1212 -116 689 -1066 205 -479 -995 400 -75 362 -856 449
5915 449 -886 -544 -690 -681 627 -454 161 -936 339 519 -304 1050 -905 113 -389 -291 320 405 972
5934 972 -141 321 -121 51 464 432 910 -740 -471 -85 -91 648 368 1037 -875 57 -303 31 -111 -101
5954 -101 -169 -244 -153 103 -44 448 -517 273 -76 482 707 64 545 219 -88 654 232 66 -371 424 -827
5975 -827 33 215 654 -712 676 416 -561 471 450 -478 1879 -540 362 468 -32 256 467 1493
5993 1493 -589 -1041 -25 -431 480 476 -14 -112 1057 470 464 358 -522 733 -1368 110 -588 351 -11
6012 -11 -422 1025 424 453 -266 -522 -353 -428 829 -706 -116 140 4 120 -1006 -755 -155 705 -1021
6031 -1021 -177 -1327 -919 -605 -636 402 -636 576 -70 -1019 1230 -325 219 652 405 -1282 -486 -71
6049 -71 530 1235 -358 762 -105 120 -221 -1241 122 42 -65 -557 504 769 -269 717 -195 -374 -180
6068 -180 1213 835 402 -432 277 -1047 -33 156 373 343 -324 627 -198 577 51 164 591 -206 933
6087 933 -672 283 260 -1047 -152 -1157 -21 -850 -701 -532 -322 46 -488 -360 -878 221 794 853 1388
6106 1388 -1540 723 -277 557 -375 520 -992 -138 269 -514 177 -549 -665 -292 326 740 -349 -397
6124 -397 -715 54 697 176 596 -653 -51 -1651 -555 991 -370 -348 -691 616 -1323 -185 -28 -542
6142 -542 138 -25 213 -306 -830 -238 93 47 -337 201 190 -298 822 83 248 342 54 -46 -643 -273 -189
6163 -189 -367 33 439 296 -836 767 -383 -158 753 -261 -256 -1012 751 152 334 -295 -798 203 366
6182 366 -57 115 -714 1235 -115 -268 -538 -53 191 443 688 18 654 -768 687 903 25 -288 -393
6201 -393 180 -1257 -84 -1207 343 -313 -1136 483 -340 255 -198 -135 -336 -1350 776 -271 493 -645
6219 -645 297 -254 100 163 -1497 294 -534 -1061 23 -1009 231 -100 -608 356 -584 -129 -682 299 202
6238 202 153 -183 406 -96 -833 139 -891 386 205 -103 588 50 116 474 1438 -126 -411 879 816 -187
6258 -187 419 -485 11 352 -14 -539 -679 174 -1080 429 -299 681 -636 -545 532 -1587 591 329
6276 329 1117 -989 248 -393 -470 -469 -922 1019 -359 915 -591 -1005 1637 -1539 342 -71 -413 671
6294 671 -343 872 -719 -5 862 873 519 -118 1010 -453 396 391 908 1674 -168 682 -1515 972
6312 972 -191 40 -820 -327 1073 82 -66 -1210 76 -442 -456 430 -526 425 -484 -1077 -385 -264 697
6331 697 -244 107 -330 587 -625 915 131 -1243 151 319 490 -41 -528 -75 841 -368 334 152
6349 152 266 21 265 -126 644 679 76 -855 -304 -207 -62 299 324 -145 235 9 -268 549 535 -113 74
6370 74 17 -1292 -635 43 -469 1372 167 -147 -189 104 756 -961 331 -2357 1333 -835 -637 489
6388 489 315 149 -209 639 677 820 1062 -248 -200 -843 435 -1244 749 1 169 627 -424 -363 455
6407 455 320 239 224 -172 -264 944 -688 921 550 -1214 773 76 632 -277 -457 162 256 542 -449 -703
6427 -703 -984 1369 -253 -807 -209 -314 575 446 336 166 -158 304 -840 360 560 166 662 -392
6445 -392 635 316 726 763 -440 -279 -135 -1441 1150 -317 347 432 -349 795 4 785 -542 996
6463 996 -749 97 169 421 32 -49 -122 -862 687 8 -255 271 -1297 457 -771 -77 -1554 473 583
6482 583 307 838 -657 862 -1113 -743 -327 -659 2073 -271 -177 -689 -294 -442 205 581 -661 -990
6500 -990 -981 1268 -335 5 574 -785 428 -1389 127 296 535 -474 -602 1551 -777 701 -108
6517 -108 -1219 -243 -305 397 -368 137 -110 52 -327 -941 354 -220 -219 -619 -728 -55 -660 -460 99 -77
6537 -77 496 411 380 196 473 160 174 14 -794 1575 536 -151 585 -29 517 1040 8 473 -292 -590
6557 -590 234 -673 -683 463 -468 -676 903 -529 -452 -480 607 360 -243 999 -506 1097 -969 -41
6575 -41 341 -259 992 -1356 -301 -1558 1021 38 -751 1129 -258 1760 926 306 380 -365 105 95
6593 95 639 -249 97 -261 -1183 580 -400 584 -70 1227 552 -720 737 -915 1609 -43 433 -523
6611 -523 -385 452 -110 715 -1287 277 -1562 -117 -227 -482 1154 -575 81 -94 -1023 696 -769
6628 -769 -391 1546 -533 -818 259 -277 82 317 -754 -300 1147 -500 276 -659 -148 442 144 269
6646 269 -811 757 22 441 721 -95 91 720 532 -122 329 556 -1329 716 -558 34 -271 -254 404
6665 404 -312 719 -129 -744 629 -206 528 -350 1463 -990 -312 -519 -393 -169 -1222 1299 -652 -122
6683 -122 388 541 -193 -1717 1771 380 -442 -580 -810 357 -1391 1825 54 -749 593 -942 977
6700 977 598 -333 -1364 419 -345 -323 -160 -1588 142 -633 -71 -488 -764 1568 -451 1112 21 -113
6718 -113 -80 1229 103 -98 262 -478 107 -948 -527 1088 -364 -69 96 545 831 877 1275 1068 -34
6737 -34 441 490 143 -702 351 243 668 0 -135 242 384 1037 -172 -1287 -93 409 586 -485 253
6756 253 -37 -362 -140 -10 549 -192 730 -708 307 -984 -1338 785 -663 616 356 -46 258 -1078
6774 -1078 1310 -38 -1028 771 -1714 251 -1383 144 -204 754 -806 -144 1537 -1233 1126 -905
6790 -905 -452 124 -48 -755 -1076 1385 -394 -690 -905 -166 122 -889 1115 142 194 407 270 -129 -436
6809 -436 471 -549 123 538 -735 -287 -495 -208 -63 -729 729 814 -540 407 -481 -605 -543 1297 611
6828 611 712 128 -115 -405 -31 1221 480 60 -367 310 849 853 -208 -827 2097 -365 -155 1313 -71
6847 -71 536 -1150 -483 -344 19 274 358 1689 -61 920 360 196 1493 -1098 1250 -491 183 -767
6865 -767 -334 540 -594 428 -446 -551 130 -979 955 268 1775 460 1522 -222 -705 -55 -220
6882 -220 699 -968 299 137 163 -99 -618 503 -570 600 1071 -999 -231 -1597 17 150 872 520
6900 520 -60 -351 -385 -121 -1476 -846 -630 -1654 368 -446 1166 481 365 980 -458 689 269 324 -236
6919 -236 951 -451 -663 760 275 151 181 -951 71 218 703 -68 367 -220 -574 -183 299 -79 950
6938 950 -120 -252 -476 488 356 -892 -164 757 1334 -356 -58 37 43 842 -986 82 -449 1289 -490
6957 -490 941 -1010 -395 745 -517 85 318 897 38 -534 669 -434 967 -817 1508 -539 -122
6974 -122 876 -995 487 -1282 1466 713 539 610 27 744 -537 1135 -839 -200 391 -465 -593 430
6992 430 -873 -8 75 425 -168 98 887 1352 -943 -1162 493 251 185 -749 482 311 859 833 -959
7011 -959 139 -548 -749 -549 -415 471 88 -1391 -4 387 353 -1216 569 46 185 801 -54 543 -1435
7030 -1435 -130 654 -407 471 -1015 -1023 337 -495 -748 -741 -89 -1904 43 -586 379 -1122 121 816
7048 816 -867 660 -1116 212 -127 -769 63 -206 615 627 534 -840 -737 165 487 947 77 159 701
7067 701 -605 364 -1706 221 -689 -314 -1095 -144 1036 -791 1009 -516 -571 -686 461 928 21 34
7085 34 -1567 -456 -660 275 968 -771 268 156 -176 -309 -316 578 -374 151 -525 664 138 451 580
7104 580 -273 457 83 11 -843 -605 1351 33 1137 299 338 -524 22 -245 509 259 -855 -4 74 369
7124 369 375 -31 -557 988 -301 806 -963 -142 102 -871 731 -569 658 -562 -230 981 -1286
7141 -1286 62 -435 -122 -963 953 -806 635 158 -72 -168 128 2412 -593 -1503 57 -777 1400
7158 1400 -776 1092 1280 -521 737 -907 -466 -851 -43 -137 272 520 -862 1935 137 1750 942
7175 942 -262 658 -515 -343 -877 254 -237 -503 417 141 435 -80 1133 404 -325 572 330 493 58
7194 58 671 -657 -857 129 -276 1251 618 639 402 -68 338 -622 -629 404 303 697 -110 150 -672 572
7214 572 438 -1136 733 -215 237 233 -829 657 -303 -757 -203 -885 -639 -475 328 -609 531 -229 -47
7233 -47 -386 817 -338 -1071 108 -848 533 -220 -20 554 -1439 882 -668 -763 -1040 -7 976 -300
7251 -300 274 -1126 -655 189 208 -205 -734 336 -299 819 64 249 1155 -805 463 -1282 -17 -674
7269 -674 476 21 -997 1131 -542 672 -992 -1118 -631 -564 491 -1383 -483 -1066 -687 -447 -563 1083
7287 1083 -99 -288 898 -220 494 -232 417 30 -86 -410 -631 663 -970 415 698 109 558 163
7305 163 553 429 323 -152 295 1133 -139 -862 -893 -702 311 316 -276 -136 -699 -18 439 21 -571 -491 -437
7326 -437 507 933 600 -440 -202 328 -489 1096 -510 -279 -82 -852 625 57 247 -342 -611 388 -456
7345 -456 279 -963 1229 -498 -2056 1167 -654 1128 -615 -502 160 472 1329 -196 1100 -998
7361 -998 -149 -54 -252 753 379 452 -239 446 26 438 772 145 819 -493 380 -1159 -134 -984 -1608
7380 -1608 817 -147 465 -266 375 -29 576 659 -957 -45 -845 -810 -35 -1053 577 750 72 540 -516
7399 -516 -528 -20 340 -871 -353 371 713 1026 -646 354 231 464 -634 -26 -1106 -303 -117 1006
7417 1006 -122 1032 -499 612 -579 532 -439 65 103 -101 -529 915 -318 747 -83 278 -908
7434 -908 554 345 53 1354 493 387 -1591 1324 -259 524 640 745 782 -766 -241 -379 -616 -615 -817
7453 -817 1567 -1073 166 -697 -226 1052 641 661 -419 1188 169 74 226 -870 702 422 105 239
7471 239 -574 815 97 217 -185 -170 -2070 944 866 -1516 -520 -36 -314 329 -951 -183 -929 184 -57
7490 -57 851 184 -595 -423 -581 201 -1018 -97 117 -126 341 -486 -769 -175 58 299 -1672 221 552
7509 552 -726 -849 -485 1260 -601 487 -211 626 343 1007 80 -1140 -473 -383 346 223 -203 1392
7527 1392 -1128 1164 -218 459 394 -357 990 -641 300 -814 682 -542 -567 131 -552 277 -842
7544 -842 -321 -154 -310 1167 -446 67 -251 473 879 -1379 527 -469 -555 -410 -145 -1165 -500 1239
7562 1239 232 -437 -914 -222 3 -487 248 424 839 -673 163 30 -775 408 -983 501 520 407
7580 407 794 567 -50 -782 0 137 407 363 636 211 -432 757 45 -629 22 41 942 -252 49 -32
7600 -32 9 -902 -1170 721 -40 97 420 -456 -1395 433 -227 314 -444 821 -751 1155 -230 1211
7618 1211 271 -81 44 -1128 766 -821 5 -214 131 736 -325 57 304 -510 1191 -917 1178
7635 1178 -773 665 -17 -143 -51 -1677 696 -499 987 -135 629 720 -432 1130 -1505 -506 922
7652 922 475 -116 -1233 956 -249 389 -717 -590 -119 -538 965 189 166 511 426 647 -958 776
7670 776 -843 649 -285 -484 250 90 -36 183 541 -474 -266 61 -725 -1258 -217 439 -555 189 -252
7689 -252 -633 -465 538 -318 431 -419 -567 683 574 -861 883 1399 -432 -1148 -123 -403 -126 -374
7707 -374 329 -257 866 -122 262 -782 178 171 -1296 655 -1274 377 912 -131 1745 -1610 908
7724 908 -445 -97 724 -499 464 -1578 -190 -799 265 778 -455 667 36 -158 -1222 -549 386
7741 386 159 295 -384 594 -248 -19 508 156 1015 -1309 199 -570 186 177 -1549 1125 260 402 -539
7760 -539 -317 312 -524 -240 -1413 658 -100 -50 801 -501 -333 -348 -92 -172 267 559 272 407 -136 314
7780 314 418 -207 141 -157 1260 214 810 -216 384 771 107 1033 99 -335 335 -477 -67 174 -642
7799 -642 872 679 1190 966 -339 142 -404 -103 -962 224 -51 244 -487 148 -109 -74 546 -940 1006
7818 1006 -676 166 145 -650 1855 -649 117 -383 -246 274 424 -306 -1307 -364 -255 189 172 34 1602
7837 1602 729 1084 -409 -622 19 -450 910 -776 980 76 88 -497 -1208 1038 -510 -478 112 1101
7855 1101 -107 -111 568 -1176 1198 -289 -164 425 -291 764 -421 311 -57 -500 470 -1480 74 -255
7873 -255 309 -199 971 -449 -169 76 -871 47 -325 -835 377 217 426 1419 -557 273 387 151 200
7892 200 -616 15 -200 1100 -970 -62 -985 543 -997 -411 278 -986 169 -1549 610 -310 63
7909 63 108 -1140 766 -665 -449 203 -1223 590 -819 999 -20 -409 -431 132 457 -1268 160 390
7927 390 550 -522 -780 496 -992 756 -254 -594 70 -1161 1071 -229 198 163 307 649 745 175
7945 175 373 1021 54 -32 -737 -1341 1194 -646 -414 -579 -392 231 331 189 167 1825 -22 394 218
7964 218 -221 263 -72 181 1306 153 389 789 519 -180 -1369 903 765 139 -169 399 1131 -39
7982 -39 90 -219 1478 -165 255 875 -140 767 -316 840 711 -356 -472 -307 -527 -375 595 -1230
8000 -1230 -286 -2 -851 644 -475 -255 257 404 -917 -943 536 -1089 223 -320 889 814 133 456
8018 456 -1213 1897 526 171 1136 614 867 -1137 -20 792 -127 -1372 176 443 -1103 1064 -258
8035 -258 288 -181 -946 663 -503 526 -789 879 -1118 -273 629 -638 915 270 1024 -691 263
8052 263 406 -141 717 -1152 752 266 1763 142 -2018 806 318 287 -223 -201 -102 229 8 -1386 1224
8071 1224 818 -945 553 -241 -1191 -686 -311 727 26 164 578 288 -173 -770 762 -83 -141 482 -404
8090 -404 274 -270 700 -343 -783 261 -274 721 -545 1058 -718 219 -465 14 706 -634 79 491
8108 491 386 612 418 -150 452 521 -757 1041 262 -591 -74 37 1543 142 922 -223 -1692 1107
8126 1107 -486 789 -987 -687 -736 537 -231 189 -219 -830 -109 -16 -293 742 -629 235 -798 -355
8144 -355 870 -595 609 -542 -206 -85 763 -947 -1039 88 -1358 895 632 231 816 669 340 -470
8162 -470 -594 536 871 276 -540 -1016 412 -372 494 305 -670 -1124 -39 1141 -706 0 109 344
8180 344 -50 -883 422 239 525 448 -293 35 -29 -135 -482 391 -194 575 -560 171 -348 -577 1222 -259
8200 -259 778 -192 -564 137 699 819 -1725 968 -528 351 10 706 132 457 -139 -1090 -411 244 300
8219 300 440 17 -40 -573 60 321 122 1011 -392 816 -815 547 662 -276 -33 -30 634 -223 -226 1262
8239 1262 -143 162 -933 287 414 -430 -228 572 -405 -126 774 -979 -167 328 385 -102 382 500 357
8258 357 -1141 -866 776 733 -902 -229 1 -238 368 221 1084 264 76 583 -865 631 190 -463 368
8277 368 238 -16 184 -427 -802 -311 627 -182 1446 682 -41 -84 637 -343 -1093 1188 -676 1210 -651
8296 -651 -169 1240 -163 1272 -163 -43 -446 -644 589 151 759 15 -690 -676 565 -438 -677 -279
8314 -279 -449 99 529 649 -484 -498 888 -1994 692 -29 1264 -513 52 1376 303 530 304 -509
8332 -509 -773 -354 146 124 756 -335 293 169 -119 2185 267 109 -284 -85 1502 -250 -76 444 701
8351 701 -564 -972 -320 172 484 343 155 -341 649 42 84 -373 -29 271 -317 519 353 1155 297 -533
8371 -533 -275 1108 266 190 -657 -216 -594 240 591 -391 53 316 -333 258 -942 1443 -171 197 -283
8390 -283 836 -890 -728 954 -564 1225 -345 893 205 -263 -695 -381 1642 -993 507 514 -265
8407 -265 1093 593 978 -213 -1230 -480 216 572 -1271 298 -905 1528 -158 326 804 -650 -153
8424 -153 -840 759 -372 -575 -40 -228 336 -352 -912 -687 -274 -227 -71 696 -231 35 1064 -333 1017
8443 1017 472 479 -308 790 244 -402 782 -86 -202 -426 179 -753 408 856 -396 836 948 957 -243
8462 -243 398 40 -376 -68 1195 -179 -181 -941 662 -4 320 186 -1149 50 -302 1223 149 -557
8480 -557 442 -389 522 -551 -287 -259 -55 712 -1234 1470 -856 498 1304 -1041 1303 -58 -220 6
8498 6 421 -259 -572 1409 213 24 -648 195 536 290 1038 -439 728 -488 1261 205 -400 697
8516 697 -15 825 270 222 -814 457 692 39 -195 108 10 -206 402 743 -339 651 9 -159 553 49
8536 49 504 -137 938 -94 279 317 652 19 -995 703 -384 150 528 80 -683 -261 -572 -284 -580
8555 -580 1084 -64 -527 934 362 323 -293 514 104 579 -646 708 -179 -126 -66 -251 189 1269 1174
8574 1174 -146 -1251 619 502 -12 143 875 369 -1244 773 -421 381 -304 693 -96 -897 186
8591 186 -190 743 125 94 -106 270 1082 -1108 994 370 -1448 -459 -1121 360 -705 446 -1135 -1067
8609 -1067 -31 -297 430 -256 -395 -779 188 -20 48 72 27 122 -558 -440 1267 760 -595 16 303 99
8629 99 407 -915 -594 1450 803 -583 -752 -773 252 -139 -211 840 127 522 -150 139 -18 51 -390 -201
8649 -201 -378 -158 -163 15 103 -1000 95 699 1092 981 473 752 437 -54 -87 91 -63 -19 -289 664 -59
8670 -59 426 -727 34 302 -290 890 -112 1156 -686 325 -828 324 766 -549 548 -985 628
8687 628 -205 -1027 435 106 391 -404 -770 -361 -381 270 -1696 742 910 -820 87 931 670 304 1129
8706 1129 -651 -18 -962 -1408 -795 -434 1061 795 63 -542 -79 751 -465 1112 192 346 -939 1000
8724 1000 100 -164 544 -491 1484 -765 -511 1292 -380 79 244 191 -1168 -1038 554 -418 -273 -464
8742 -464 -254 382 37 -399 -913 70 -849 45 1129 -228 -269 117 684 -182 -51 1135 -587 -158 -446
8761 -446 165 405 -739 32 -24 697 577 -578 746 -820 1065 222 282 -726 1134 920 -614 536
8779 536 -1170 90 689 -369 905 73 1039 -1179 -18 -184 -778 315 -874 444 -432 -318 -391
8796 -391 1512 433 638 528 149 -566 285 -591 489 -779 977 62 816 3 142 319 -386 611
8814 611 -745 1104 -319 -333 430 71 1072 -187 -1311 794 -294 1461 -725 -891 89 -670 454
8831 454 -72 1268 -78 11 -695 -313 -1028 -1587 355 875 532 -65 -430 -407 -505 80 565 -156 143 550
8851 550 210 163 1248 -135 -279 -646 808 -122 -666 200 -10 90 768 143 945 -679 -966 -38 -302
8870 -302 40 -281 761 -139 -386 -1414 -206 54 -668 154 -203 732 -575 183 503 -1533 1370 -613
8888 -613 1063 -1270 -413 177 -813 210 52 88 662 -497 748 651 -118 221 550 -443 -238 -117 56
8907 56 990 -334 188 493 987 610 -782 -306 166 277 -605 -363 244 -113 -524 -328 207 -11 512 933
8927 933 176 170 -195 -284 995 -235 87 -1219 456 -655 1169 -396 -58 175 -85 6 -311 249 170
8946 170 -793 -552 -736 -727 980 86 -837 -778 1322 -501 506 1585 -216 -787 -395 598 -295 -277 895
8965 895 -29 1003 340 -865 -1140 -228 -384 -428 1347 -473 544 213 76 -361 454 280 -935 2121
8983 2121 -905 -144 1407 254 153 -232 1625 -899 -910 387 -739 126 -1307 733 -332 906
8999 906 238 -58 207 996 328 491 -256 -590 521 -121 -176 -344 -199 -630 -52 -1091 250 -944 212
9018 212 -1059 374 -307 -954 635 -855 585 -73 941 556 -97 -749 -926 469 734 -580 -270
9035 -270 -638 665 823 286 499 -1475 -34 -678 221 65 219 766 -264 91 635 154 589 -524
9053 -524 -56 -707 162 -431 316 -373 203 501 -110 99 161 40 120 -778 -18 -1579 417 -1007 -252 1040
9073 1040 -618 557 -301 896 -71 -142 -503 -607 753 -14 -251 378 -421 68 19 1460 -656 -7
9091 -7 -887 320 705 -911 715 -76 85 -285 911 965 351 1082 -948 975 -747 -673 -144 -1784 1213
9110 1213 -535 622 -178 422 1139 -594 633 -485 -334 -188 -819 -286 -1187 -585 -190 -282 -25 711
9128 711 148 -765 405 405 -1379 262 -2 -114 513 527 -610 -653 726 -634 -118 403 46 98 251 1013
9148 1013 -562 37 -191 -725 -1201 -378 527 -217 -381 -3 -80 1288 -581 410 385 892 -724 -202 867
9167 867 -1086 574 -1470 78 -938 270 -830 -130 -324 -506 -780 148 282 725 -574 513 -584
9184 -584 584 1087 332 149 -440 1560 203 197 -874 276 1001 -1851 -63 425 278 214 -183 116 -526
9203 -526 124 -331 -1462 -12 354 859 -607 329 -242 380 -491 168 113 -133 677 67 -791 -237 366
9222 366 667 177 977 -445 -734 673 134 -238 827 379 416 253 106 -554 -244 1027 -184 -197 -1787
9241 -1787 287 227 103 -1203 1006 -349 -943 866 118 34 338 -241 993 -1253 1084 -54 980
9258 980 -1055 1793 -26 -1426 612 -1357 350 -1103 560 -60 433 981 -968 963 -655 -492
9274 -492 -317 -590 2107 99 -1122 1141 404 -304 -881 819 -577 129 -426 133 1188 738 257 -278
9292 -278 96 -757 28 -34 -450 369 -386 385 500 -664 1363 248 1505 194 1019 -833 414 -7
9310 -7 -89 -689 -315 145 380 -821 389 -605 -288 -269 -522 -834 -520 571 -955 137 -693 -243 797
9329 797 -831 336 -1012 993 1542 -284 216 -1076 566 -8 470 66 -393 854 -1700 17 -1148
9346 -1148 -368 222 -570 1555 245 967 919 -319 33 -705 1406 -121 6 -320 -1376 -1058 772 648
9364 648 -1619 -86 -365 199 910 97 777 -571 -905 -500 -550 492 -499 936 -1557 148 -435 1043
9382 1043 801 -922 36 -2073 -426 278 887 497 1512 905 -49 33 -762 -739 -1049 -922 -328 -67 178
9401 178 -486 343 253 652 302 -533 477 227 -322 430 245 902 -209 4 27 -1011 672 94 229
9420 229 -2 -454 329 -60 595 -399 -420 366 -416 -93 -110 1115 -720 71 -428 40 1639 -683 1458
9439 1458 -711 519 -442 -82 782 -686 871 -646 -114 690 -110 559 -1058 1006 -1073 593 305
9456 305 -1106 -694 -1174 124 -867 1705 741 -783 533 -338 194 602 239 1106 344 369 -1090 211
9474 211 445 194 -499 -658 749 632 -272 -1442 634 -720 27 -263 558 -615 855 288 -1073 -1554
9492 -1554 457 317 772 -900 181 224 66 616 567 756 -1024 -230 -93 370 481 413 141 118 -424 224
9512 224 -474 -169 -45 633 -3 60 -521 -924 -12 -113 -558 1503 -189 -347 -917 1046 -214 -702 -25
9531 -25 93 822 -540 -134 188 438 333 -90 466 -856 -667 891 -549 492 -168 1258 -897 1024
9549 1024 -52 -654 -366 -336 -1097 -1126 -758 745 -413 1361 -713 612 154 -95 -1450 -200 532 -1381
9567 -1381 -181 -638 342 1047 1016 777 -787 576 1388 701 368 -196 339 -877 166 245 -504 -69 -300
$$ [...]
16383b72
##END NTUPLES=NMR FID
##END=
