##TITLE=31P_DE-80H_X3
 64 sc D2O
 26.2.2025
##JCAMPDX= 6.0         $$ Bruker NMR JCAMP-DX V2.0
##DATA TYPE= NMR FID
##DATA CLASS= NTUPLES
##ORIGIN= UXNMR, Bruker Analytische Messtechnik GmbH
##OWNER= root
$$ XWIN-NMR		Version 3.5
$$ Fri Jul  3 11:22:32 2026 Russian Standard Time (UT+4h)  Yarkov@DPX200
##.OBSERVE FREQUENCY= 81.013821
##.OBSERVE NUCLEUS= ^31P
##.DELAY= (6, 6)
##.ACQUISITION MODE= SIMULTANEOUS
##.ACQUISITION SCHEME= undefined
##.AVERAGES= 64
##.DIGITISER RES= 17
##SPECTROMETER/DATA SYSTEM= spect
##.PULSE SEQUENCE= zgpg30
##.SOLVENT NAME= D2O
##.SHIFT REFERENCE= (INTERNAL, D2O, 0, 243.863)
##AUDIT TRAIL= $$ (NUMBER, WHEN, WHO, WHERE, WHAT)
$$ ##TITLE= Audit trail, XWIN-NMR		Version 3.5
$$ ##JCAMPDX= 5.01
$$ ##ORIGIN= Bruker BioSpin GmbH
$$ ##OWNER= Yarkov
$$ C:/Bruker/XWIN-NMR/data/yarkov2/nmr/P31/2/audita.txt
$$ ##AUDIT TRAIL=  $$ (NUMBER, WHEN, WHO, WHERE, WHAT)
(   1,<2026-07-03 11:21:28.76 +0400>,<Yarkov>,<DPX200>,
      <created by zg, POWCHK disabled, PULCHK disabled
       configuration hash MD5:
       00 E9 B6 7A A2 85 ED C7 34 08 36 98 17 FE 4E 26
       data hash MD5: 32K
       DE 66 39 04 E7 8B 77 91 0F EC FC 96 66 EA 73 B0>)
$$ ##END=
$$ 
$$ hash MD5
$$ 4D 67 AA 9F 2E B7 54 20 16 9E 27 ED F9 04 1E EC
##$RELAX= 
##$RELAX= 
##$RELAX= 
##$RELAX= 
##$RELAX= 
##$RELAX= 
##$RELAX= 
##$RELAX= 
$$ Bruker specific parameters
$$ --------------------------
##$DU= <C:/Bruker/XWIN-NMR>
##$EXPNO= 2
##$NAME= <P31>
##$PROCNO= 1
##$TYPE= <nmr>
##$USER= <yarkov2>
##$AMP= (0..31)
100 100 100 100 100 100 100 100 100 100 100 100 100 100 100 100 100 100 
100 100 100 100 100 100 100 100 100 100 100 100 100 100 
##$AQSEQ= 0
##$AQ_mod= 1
##$AUNM= <au_zg>
##$AUTOPOS= <>
##$BF1= 81.014009
##$BF2= 200.13
##$BF3= 200.13
##$BF4= 200.13
##$BF5= 200.13
##$BF6= 200.13
##$BF7= 200.13
##$BF8= 200.13
##$BYTORDA= 1
##$CFDGTYP= 0
##$CFRGTYP= 5
##$CHEMSTR= <none>
##$CNST= (0..31)
1 1 145 1 1 1 1 1 1 1 1 1 1 1 1 1 1 1 1 1 1 1 1 1 1 1 1 1 1 1 1 1 
##$CPDPRG= <waltz16>
##$CPDPRG1= <>
##$CPDPRG2= <waltz16>
##$CPDPRG3= <>
##$CPDPRG4= <mlev>
##$CPDPRG5= <mlev>
##$CPDPRG6= <mlev>
##$CPDPRG7= <mlev>
##$CPDPRG8= <mlev>
##$CPDPRGB= <>
##$CPDPRGT= <>
##$D= (0..31)
0 1 0 0 0 0 0 0 0 0.06 0 0.03 2e-05 3e-06 0 0 0.0002 0 0 0 0 0 0 0 0 0 
0 0 0 0 0 0 
##$DATE= 1783063288
##$DBL= (0..7)
120 120 120 11 120 120 24 19 
##$DBP= (0..7)
150 150 150 150 150 150 150 150 
##$DBP07= 0
##$DBPNAM0= <>
##$DBPNAM1= <>
##$DBPNAM2= <>
##$DBPNAM3= <>
##$DBPNAM4= <>
##$DBPNAM5= <>
##$DBPNAM6= <>
##$DBPNAM7= <>
##$DBPOAL= (0..7)
0.5 0.5 0.5 0.5 0.5 0.5 0.5 0.5 
##$DBPOFFS= (0..7)
0 0 0 0 0 0 0 0 
##$DE= 6
##$DECBNUC= <off>
##$DECIM= 4
##$DECNUC= <off>
##$DECSTAT= 4
##$DIGMOD= 1
##$DIGTYP= 9
##$DL= (0..7)
0 0 52 120 120 21 21 25 
##$DP= (0..7)
150 150 150 150 150 150 150 150 
##$DP07= 0
##$DPNAME0= <>
##$DPNAME1= <>
##$DPNAME2= <>
##$DPNAME3= <>
##$DPNAME4= <>
##$DPNAME5= <>
##$DPNAME6= <>
##$DPNAME7= <>
##$DPOAL= (0..7)
0.5 0.5 0.5 0.5 0.5 0.5 0.5 0.5 
##$DPOFFS= (0..7)
0 0 0 0 0 0 0 0 
$$ [...]
##$SUBNAM1= <"">
##$SUBNAM2= <"">
##$SUBNAM3= <"">
##$SUBNAM4= <"">
##$SUBNAM5= <"">
##$SUBNAM6= <"">
##$SUBNAM7= <"">
##$SUBNAM8= <"">
##$SUBNAM9= <"">
##$SW= 400.765351723535
##$SWIBOX= (0..15)
0 1 3 0 0 0 0 0 0 0 0 0 0 0 0 0 
##$SW_h= 32467.5324675325
##$TD= 32768
##$TD0= 1
##$TE= 0
##$TE2= 300
##$TE3= 300
##$TEG= 300
##$TL= (0..7)
0 120 53 12 22 120 120 120 
##$TP= (0..7)
150 150 150 150 150 150 150 150 
##$TP07= 0
##$TPNAME0= <>
##$TPNAME1= <>
##$TPNAME2= <>
##$TPNAME3= <>
##$TPNAME4= <>
##$TPNAME5= <>
##$TPNAME6= <>
##$TPNAME7= <>
##$TPOAL= (0..7)
0.5 0.5 0.5 0.5 0.5 0.5 0.5 0.5 
##$TPOFFS= (0..7)
0 0 0 0 0 0 0 0 
##$TUNHIN= 0
##$TUNHOUT= 0
##$TUNXOUT= 0
##$USERA1= <user>
##$USERA2= <user>
##$USERA3= <user>
##$USERA4= <user>
##$USERA5= <user>
##$V9= 5
##$VALIST= <valist>
##$VCLIST= <CCCCCCCCCCCCCCC>
##$VD= 0
##$VDLIST= <DDDDDDDDDDDDDDD>
##$VPLIST= <PPPPPPPPPPPPPPP>
##$VTLIST= <TTTTTTTTTTTTTTT>
##$WBST= 1024
##$WBSW= 4
##$XGAIN= (0..3)
0 0 0 0 
##$XL= 0
##$YL= 0
##$YMAX_a= 4404
##$YMIN_a= -13761
##$ZGOPTNS= <>
##$ZL1= 120
##$ZL2= 120
##$ZL3= 120
##$ZL4= 120
##$ABSF1= 60
##$ABSF2= -190
##$ABSG= 5
##$ABSL= 3
##$ALPHA= 0
##$AQORDER= 0
##$ASSFAC= 0
##$ASSFACI= 0
##$ASSFACX= 0
##$ASSWID= 0
##$AUNMP= <proc_1d>
##$AZFE= 0.1
##$AZFW= 0.5
##$BCFW= 1
##$BC_mod= 2
##$BYTORDP= 1
##$COROFFS= 0
##$CY= 9.86611175537109
##$DATMOD= 1
##$DC= 1
##$DFILT= <>
##$DTYPP= 0
##$F1P= 182.462994727601
##$F2P= 168.069089081705
##$FCOR= 0.5
##$FTSIZE= 0
##$FT_mod= 0
##$GAMMA= 1
##$GB= 0
##$INTBC= 1
##$INTSCL= 1
##$ISEN= 30
##$LB= 1.5
##$LEV0= 0
##$LPBIN= 0
##$MAXI= 11.51145
##$MC2= 0
##$MEAN= 0
##$ME_mod= 0
##$MI= 1.244541
##$NCOEF= 0
##$NC_proc= 0
##$NLEV= 6
##$NOISF1= 0
##$NOISF2= 0
##$NSP= 1
##$NTH_PI= 0
##$NZP= 1
##$OFFSET= 243.8632
##$PC= 1.4
##$PHC0= 1616.201
##$PHC1= 73.15952
##$PH_mod= 0
##$PKNL= yes
##$PPARMOD= 0
##$PSCAL= 0
##$PSIGN= 0
##$REVERSE= no
##$SF= 81.0140731611343
##$SI= 65536
##$SIGF1= 0
##$SIGF2= 0
##$SINO= 80
##$SIOLD= 65536
##$SREGLST= <31P.CDCl3>
##$SSB= 0
##$STSI= 0
##$STSR= 0
##$SW_p= 25641.0256410257
##$SYMM= 0
##$S_DEV= 0
##$TDeff= 0
##$TDoff= 0
##$TI= <>
##$TILT= no
##$TM1= 0
##$TM2= 0
##$TOPLEV= 0
##$USERP1= <user>
##$USERP2= <user>
##$USERP3= <user>
##$USERP4= <user>
##$USERP5= <user>
##$WDW= 1
##$XDIM= 64
##$YMAX_p= 0
##$YMIN_p= 0
$$ End of Bruker specific parameters
$$ ---------------------------------
##NTUPLES= NMR FID
##VAR_NAME=  TIME,          FID/REAL,        FID/IMAG
##SYMBOL=    X,             R,               I
##VAR_TYPE=  INDEPENDENT,   DEPENDENT,       DEPENDENT
##VAR_FORM=  AFFN,          ASDF,            ASDF
##VAR_DIM=   16384,         16384,           16384
##UNITS=     SECONDS,       ARBITRARY UNITS, ARBITRARY UNITS
##FACTOR=    3.08e-05,      1,               1
##FIRST=     0,             0,               0
##LAST=      0.5045964,     0,               0
##MIN=       0,             -13761,          0
##MAX=       0.5045964,     4404,            0
$$ Real data points
##PAGE= N=1
##DATA TABLE= (X++(R..R)), XYDATA
$$ [...]
11151e11Q59o2p60O85o06J110j555J851j209P7M11j23p66n22R87O19J63j58l74
11170A16o86l15M10K83R35l92R1l29K42R9m85P48p51o41j386K737K14J06j623
11189f27O65L32N38k45j569J428o43k89L4K48R55j636L094k839J468q28P49r94
11207a59K48K04j726K489k061J106j72n32K06J80N56q51L70M78p53J53j066J288
11225d2o48L16P20N35j1k603J574j38O74K04q96J833j095n91L95o88O44k84N11
11244D10j242J563r00M88Q15n57O99j281N85r73P91L39j682J150n77k92Q19M72
11262F27k48j689J386K10O57j752O76R22J43j013k42Q95L0j323K34k99J714q31
11280I7P3O31j275J040q18M30j96NK05N22k14J36o71o5r87P9J139L94M87j094
$$ plain form
11151 -511 348 286 -474 211 -395 715 -840 1011 -198 -121 290 167 -599 -1121 -134 485 648 490 116
11170 116 -570 -885 -475 -192 743 351 442 113 355 454 -31 717 -34 -675 -2061 676 890 996 -627
11189 -627 38 370 908 663 -906 522 -121 -410 -376 -128 827 -809 2285 -554 914 86 835 -159
11207 -159 89 293 -1433 1056 -1005 101 -71 -603 -397 -217 339 -512 -142 336 -417 -264 -1330 -42
11225 -42 -690 -374 346 881 870 -1733 -159 -297 377 581 -315 1518 423 -168 227 -461 183 -101 410
11244 410 -832 731 -169 319 1134 577 1276 -5 580 -393 398 737 -945 205 -372 -664 155 627
11262 627 379 -1310 76 286 943 -809 -133 789 932 -81 -323 572 602 -721 -487 -786 928 97
11280 97 170 801 -474 566 -252 178 -18 -13 192 714 500 636 -35 -100 -1087 -1008 131 525 1012 -82
11300h2K56j96J98n38r9L7K86q55K23O40L66J27k295J861N21j379M87M81L25j43
11320B21J31k85k98Q23p65O90o64j7P03r92K187j813R5R71j356J4l81J749k503
11339a490K596r19k74l08k79J292k120J155M13N34m82k65O24n19j61P57r66J398
11357I86j660J245j094R67j97j462J048j291K098n64k90k3K67J88k28l53l34P65
11375F8p63L82J114k27P3p07K22O07m38N41j067O0J11K71R32j851J972j705R32
11394E27l07L33K1j259J273M55K58j358J46P92j385J368j439K93J309q37l90n41
11412g41O24k25O62o89M7J012q09J78m31L29Ro35J521k001J570n36M27N14j666
11431h40J842j513L87j17J38K50j7K60j139O75N38l48N84j558J445p93L2l60Q45
$$ plain form
11300 -82 174 -22 176 -362 -461 -424 -138 -993 -770 -130 236 363 -1932 -71 450 -929 -442 39 364 221
11320 221 352 67 -231 592 -173 517 -147 -164 539 -453 1734 -79 16 987 -369 -355 -736 1013 -1490
11339 -1490 1106 187 -87 -395 -674 618 -1502 -347 66 600 118 -147 477 -42 -203 554 -412 986
11357 986 -674 571 -523 444 247 -1215 -167 -1458 640 76 -214 -237 30 218 -10 -363 -697 68
11375 68 -695 -313 801 574 647 -60 162 769 331 872 -195 -135 -24 247 1179 -672 1300 -405 527
11394 527 220 553 574 -685 588 1043 1301 -57 89 881 -504 864 -575 -282 1027 190 -200 -741
11412 -741 -117 -342 320 -369 -322 690 -119 59 -372 -43 -34 -669 852 -1149 421 -115 312 826 -840
11431 -840 1002 -511 -124 -241 -103 147 130 390 -749 -74 464 116 700 -858 587 -206 -174 -534 311
11450C11Q3j682K622j798K49N25p25M1P5J98M35J62o16K56M26l49L76m00J37J9
11470C45r4R49j722K39J052n35k3N48j321j19J101p4r97J012j340J446j230J789
11488A026j226n02J368j519J499j257P78l94PJ246P4j031j073J279p90O11J356
11505A452k049K157j056q45J480k425K360k078J589M0l17O44j736Q29k24n60K78
11522d61P04j21k66M29r41J383l29j050K56m10K32O72m24Q4R90o81M47L49j879
11541a016J419q71J212o08o29J001j311J748r49k26Q5Q8P14n29Q78j121N56J09
11559E50n36L53j311Q39J78o1K05n13R70n5r2j216P79r48L36K53J465j004l25
11578a33j045K391q95n70O90J24L57j068k09j552K104n46N3l18l8N45J25M22N87
$$ plain form
11450 311 394 -1288 1334 -464 -215 310 -415 -374 -299 -101 334 496 -120 136 562 213 589 189 326 345
11470 345 251 1200 -522 -283 769 234 211 759 -562 -681 420 346 -651 361 -979 467 -763 1026
11488 1026 -200 -702 666 -853 646 -611 167 -227 -220 1026 1100 69 -1004 275 -515 96 1452
11505 1452 -597 1560 504 -341 1139 -1286 1074 -1004 585 625 308 952 -784 45 -179 -739 -461
11522 -461 243 122 -144 285 -656 727 398 -652 -396 -806 -574 98 -326 -242 748 67 514 863 -1016
11541 -1016 403 -468 744 136 -493 508 -803 945 -4 -230 -145 -57 657 128 1006 -115 441 550
11559 550 14 367 -944 -105 73 12 217 -296 674 619 527 -689 90 -858 -522 -269 1196 192 -133
11578 -133 -1178 1213 318 -252 438 562 919 -149 -358 -1910 194 -352 -299 -617 -655 -110 15 437 1024
11597A024j990K090k362J460j093J675n49q0o81K39J060j782J277k71J95J11j32
11614A91j20K06m49L76j016j66R58N09j226N17k82LJ597j693J408j405r9K81J190
11633G80j237l69Q24J66o62J686j739R56p22L82n11l21O33K04o09M38N73r03M43
11652A2Q0J04J00j334P10K98N17k27o23l79Q41n41j242J293L46M55r37J435j037
11671a29J26P78q02J1J311j447n07N16M08m01l75J597J62j449R00k50n30m32o18
11690a131N56J28N61M34p75j69K8R61o30k41L51P56p48j94J34j091J835j532P5
11709f92P79l98L7o2M30k96O39j386J394P2R6Q27k266J516j062M89k05N41K44
11728F97m73q99P76j48M30p22K25j659J926m62J243J09r15L14j346J560j426M13
$$ plain form
11597 1024 -966 1124 -1238 222 -871 804 255 175 -506 -267 793 -989 288 17 212 323 191
11614 191 71 277 -172 204 -812 -978 -20 489 -737 -220 -502 -499 1098 -595 813 -592 -691 -410 780
11633 780 -457 -826 -2 164 -498 1188 -551 405 -317 65 -446 -767 -134 70 -539 -101 472 -431 12
11652 12 92 196 296 -1038 -328 -30 487 260 -363 -742 99 -442 -1684 -391 -45 410 -527 908 -129
11671 -129 -3 775 -27 -16 1295 -152 -659 -143 265 -136 -511 1086 1248 -201 699 449 -81 -513 -1131
11690 -1131 -575 -447 114 548 -227 -396 -368 593 -37 -278 73 829 81 -113 21 -1070 765 -767 -692
11709 -692 87 -311 -274 -336 94 -202 437 -949 445 517 613 1440 -826 690 -372 117 -88 453 697
11728 697 224 -675 101 -47 383 -339 -114 -1773 153 -309 934 1043 128 442 -904 656 -770 -357
11746c57J24Q50j266L18N24j024J636j492K67J388j248m82J057n17L44j10L57
11763C69k94K76m35l4J098r33k33l72l29J965j534J57m05P07l78J29m83O63M23
11782C57j105l95O73M81J145k139Q14m26J199r53o31J053r2J96j310K487j780
11799d26l86J675j824J201J68l82J92l5k34o05O42J02R80j959J233R9j395J232
11817B78M71j81q39R27k82M07L54j151o21J352j657K197j836J644j046L91j46
11834B62q17J611j232O41j706J254O3j542J747j939J956Q73j061K19l09N69m49
11851A40J011j366N74K53j880J500p15O55j89j444J688l16k46m00Q41l68n12Q62
11869H8j40m22P24j58Q94j416M85n3O16j234J465j262O44J760k021J367j269R3
$$ plain form
11746 -357 -233 617 -649 -331 193 -831 805 -687 -420 968 -280 -762 295 -222 122 12 369
11763 369 75 351 -84 -118 980 47 -186 -558 -887 1078 -456 -299 -704 3 -375 -246 -729 -66 357
11782 357 -748 -1143 -470 11 1156 -983 -169 -595 604 -349 -980 73 -19 177 -1133 1354 -426
11799 -426 -812 863 -961 240 408 26 218 183 -51 -656 -14 88 1068 -891 342 441 -954 278
11817 278 749 568 -271 656 374 781 1135 -16 -637 715 -942 1255 -581 1063 17 408 262
11834 262 -555 1056 -176 465 -1241 13 76 -1466 281 -1658 298 1171 110 329 20 589 140
11851 140 1151 -215 359 612 -1268 232 -483 172 -17 -1461 227 -89 -335 -735 106 -262 -774 88
11869 88 -52 -474 250 92 986 -430 55 2 618 -616 849 -413 231 1991 -30 1337 68 161
11887A61O69j177J040p21P36o07j010O60qJ018p18k66k68l9J207n60L8j864J124
11906e85K73J228N7j652R13K9L61j159N5J221j649J213q09J52K50o40M19j192
11924a515K208j558J017Q11k588J589r2Q22j041o13J739l43N1k614J746j22j58
11941f61k22j59J506l52K81O78r65l22N08M9j50J192k021M36R80j302J427j498
11959e95J319r09l64J325j482J793q35n46N56L18M93j718j1K64p9Q79j821J899
11977D86j57k84k60j82K512k642j04K35N20q01J388K57j549K043k059J49P12m74
11995b10N76j120J152p47l77J099m09M65j830Q11k98P01J78M95k28j778L153k415
12013g82O67K55r88N73j242K267n60K33J00n83J050k358J606r19Q41M58J96l27
$$ plain form
11887 161 830 -347 693 -28 708 101 -909 -249 -257 761 43 -223 -491 -530 677 117 155 -1709 -585
11906 -585 -312 916 973 -679 234 263 624 -535 -480 741 -908 305 -504 -352 -102 -742 -323 -1515
11924 -1515 693 -865 152 963 -1625 -36 -128 694 -347 -960 779 436 487 -2127 -381 -503 -661
11941 -661 -883 -1042 464 112 393 1071 106 -216 292 341 191 1383 -638 -202 778 -524 903 -595
11959 -595 724 -185 -549 776 -706 1087 252 -294 262 580 1073 -645 -656 -392 -471 408 -1413 486
11977 486 329 45 -215 -397 2115 -527 -631 -396 124 -677 711 968 -581 1462 -597 -448 264 -210
11995 -210 366 -754 398 -349 -726 373 -36 429 -1401 -590 -888 -187 -9 486 258 -1520 1633 -782
12013 -782 -115 140 -848 -275 -1517 750 190 423 523 -60 990 -1368 238 -681 160 618 814 487
12031D87k29l11p70N11l01N46l58M17M0K97j038J695m45L73q18k27mq60J181M
12051A90N97k40o55K96j399J338m99J205j477k3L14j56J826k467M80P29J02k18
12069e7n96R80o01J243n72j365J792n52r11m44J386L73j743J415o27Q67j291M94
12087b09K94q4R4k47J482j726J278j356P08P93r88M94j618K101j883O33M67k02
12105C1M39m27P65j033P94J94j495R36j238R42K31o94N39j122K071k93n07p43
12123f10Q02l51o15O72l79L3K1j23O12l23R42k35Q55k79j613N53j45L0j84M13
12143G6o14k35R01m16nM41n07j26m67J151P09j924J208k77J05j218J564l86j94
12162b14j40N55k16q61P79o96J174M12q80N50n62J74j218J109J375j989J102j338
$$ plain form
12031 487 258 -53 -823 -312 -613 -67 -425 -8 32 329 -709 986 541 914 96 -131 -135 -995 186 190
12051 190 787 547 -108 188 -1211 127 -372 833 -644 -667 -353 -509 1317 -1150 -670 59 161 -57
12069 -57 -653 327 -274 969 397 -968 824 272 -639 -1083 303 676 -1067 348 -279 588 -703 -209
12087 -209 85 1 95 -152 1330 -396 882 -474 234 1027 39 533 -1085 1016 -867 -234 233 31
12105 31 470 43 808 -225 569 763 -732 204 -1034 -92 139 -555 -16 -1138 933 640 133 -610
12123 -610 192 -159 -774 -102 -481 -448 -427 -550 62 -261 681 446 1301 1022 -591 -38 -183 -153 -337 76
12143 76 -538 -773 128 -288 -293 148 -359 -485 -952 199 908 -1016 192 -85 20 -1198 366 -20 -214
12162 -214 -354 201 -15 -876 -97 -793 381 793 -87 463 -99 75 -1143 -34 1341 -648 454 -884
12180h84N57R0j397K914j651J016j437J253p53q99J547j424K353j918J200j79
12196C88K16j809O84M99K15J720k091r4O68l46J395j812N65j289m17K848j389
12213d9J112k387M66m71J354M32j556J818j377J102j120J653n26L25r00q30P11
12230b43P47p82O77o46J267m07n03O44j5p94K09l32L84O79j615K36N14m4K63o0
12250A79J79j000L83J667j870Q56k76l21O33q32M11J84K81k89q68M05j209J516
12268B9J43j635K727j884J584j964J192j98N2j10l3P95r19j09q0k5J118j650J555
12287E88q97J166k290J400J477j394N30j158R36j120Q09L11j439J555j336K64
12303e98m31O61K6K20P62j054J7m03O33J677r47m45q89J417o75j2L60j034K45
$$ plain form
12180 -884 -327 -237 -1634 1280 -371 645 -792 461 -292 -1191 356 -1068 1285 -633 567 388
12196 388 604 -1205 -521 -22 193 1913 -178 -272 396 50 1445 -367 198 -1091 -1508 1340 -49
12213 -49 1063 -1324 -858 -1329 25 457 -1099 719 -658 444 -676 977 451 776 -124 -954 -243
12230 -243 504 -278 399 -247 1020 613 110 754 739 -55 154 -178 206 885 -730 -494 20 -24 239 179
12250 179 358 -642 -259 1408 -462 394 118 -203 430 -402 9 193 474 185 -683 -278 -1487 29
12268 29 172 -1463 1264 -620 964 -1000 192 -6 46 -64 -97 698 -221 -330 -410 -435 683 -967 588
12287 588 -309 857 -1433 -33 1444 50 580 -578 358 -762 47 358 -1081 474 -862 -598
12303 -598 -1029 -368 -342 -122 640 -414 -397 -800 -167 1510 563 118 -771 646 -29 -41 319 -715 -470
12322d70R61P35j766o07J627k68p06j090J534J58o22K25K68N56p80P78M18j107
12340a56q7l09N91k4J01N66m76L73J75j032j72J025O60j848R56n67J030L02j888
12359g80Q50j9L77k40k7R44j603P62M6k62L23l76M60p20k82R0Q96j264Q96M41
12379E12k33M0j439J220p37J0p6N22L66j36J458j892q79J649J6o41j58J88k17
12398d27j12P99p75O85m87Q46q73R19l62m71O99Q60o65q92P57K36q79J435j097
12417A96o72N49n39J555m39p99j05k33n41N21N63J39j01k56m91M01O1l76m41Q00
12437b08J055k33N63j733R09n67K37q03K20J245j562N94j57P74N47j288P93j51
12455B35L17n53j233K026k208J917q97m79j61P24k76k08J223j367J065J1j05j118
$$ plain form
12322 -470 491 1226 -540 -1147 480 212 -494 -1584 -50 108 -514 -289 -21 535 -245 533 951 -156
12340 -156 -243 -552 39 15 116 682 206 579 754 -278 -450 575 1235 -613 343 -224 806 1108 -780
12359 -780 70 51 428 188 161 1105 -498 264 310 48 371 -5 455 -265 -547 -457 439 -825 71 512
12379 512 279 319 -1120 100 -637 -627 -703 -181 185 49 1507 -385 -1264 385 401 -240 -398 -210 -427
12398 -427 -539 260 -515 170 -317 529 -344 575 213 -258 441 1301 636 -256 501 737 -142 1293 196
12417 196 -476 73 -466 1089 650 -149 -254 -487 -1028 -507 56 195 94 -162 -653 -252 -191 -567 -1008 -208
12437 -208 847 614 1177 -556 353 -214 23 -780 -560 685 -877 -283 -440 334 881 -407 386 235
12455 235 552 -1 -1234 792 -1416 501 -396 -875 -1036 -312 -588 -796 427 -940 125 136 31 -1087
12473a087L96J837k307J893j250l09J707j739R22j68l80J023l34J072j720J039
12489E95m04K42m85o43K115j384R78j507J124l67K52p43O34L13r26L20M15L20
12507H49j330N04J40n06O45n70k25J726j837J319r02P37j635K608n92j260J056
12524G27j178L56Qj174J790n91k50j84L83N05j633P71Q65r98J084r11K37K79N54
12543F40l30J009k028O27K70j047M39k15J283j177j17M68K63j21j05J39K70k118
12561a850L086j139j17j951K920p23j376J178j045J880k028R35N03J04L1m61Q08
12578G55m03N00l70q32Q20n84M24M5j47K23p21Q22p42J371j670N07L95k71J091
12597A213j426l51N38K10O72j269L23m57J288j280R42R11k611J833r63Q61l71
$$ plain form
12473 -1087 -691 1146 -1161 732 -518 -827 880 -859 63 -105 -485 538 204 1276 -444 595
12489 595 191 433 -52 -695 1420 36 1014 -493 631 264 516 -227 407 720 -206 114 529 849
12507 849 -481 23 163 -343 302 -268 -493 1233 -604 715 -187 550 -1085 1523 931 -329 727
12524 727 -451 -95 -87 -1261 529 -62 -312 -496 -113 392 -1241 -470 395 -603 481 -430 -193 86 640
12543 640 310 1319 -709 -82 188 -859 -420 -635 648 -529 -646 -178 85 -36 -141 -2 268 -1850
12561 -1850 1236 97 -20 -1971 949 226 -1150 28 -1017 863 -1165 -230 273 377 408 -53 755
12578 755 352 852 482 -350 470 -114 310 355 208 431 -290 532 -210 1161 -509 -2 393 122 1213
12597 1213 -213 -564 -26 184 856 -413 -90 -547 741 -539 403 1314 -1297 536 -427 434 63
12614F3Q9K77j126J163k65N46j091N86j35k6o63J202j180J381j190P51q31O42
12632A93K05q43R97p08P11j560J621j8p60J337j401Q23k247K342o39j138J113
12649B8j137J779j286p0k69N74J85j4Q42q35P96k6j009O89n92l32O3J19n73J121
12669E3J079j711J274r89J352l81o48N54j191J46O54M7o23P32n73j25O56k62M36
12688D80n30j287J897j079J630k041R57k60n17J037r39L13j79l89Q24n42Q43J89
12706D07Q94j005o23J312j233P61q18m25M25o99O21K18L15j94q8J21P9l55N24
12725B37o65m75J047o85Q53m98J74J526q86p16n5O30k24j828J843j19r07P18m00
12744d30Q69M70p34J36o8Q99r38J2l65L99L87j253J051j361N74k97J943j337o13
$$ plain form
12614 63 152 429 -697 466 201 747 -344 242 107 81 -582 620 -560 821 -369 382 -449 193
12632 193 398 -445 552 -156 555 -1005 616 598 -162 1175 -226 597 -1650 692 53 -1085 28
12649 28 -1109 670 -616 -686 -955 -381 -196 -210 632 -203 593 567 -442 247 -345 -677 -614 -495 -1068 53
12669 53 1132 -579 695 -294 1058 677 29 583 -608 -462 192 239 -384 348 -225 -350 306 44 480
12688 480 -50 -1337 560 -519 1111 -930 27 -233 -750 287 -652 -339 -518 -907 -83 -625 218 407
12706 407 1301 296 -327 985 -248 513 -305 -730 -305 -1004 -383 -165 150 -44 -132 -11 68 -287 237
12725 237 -428 -903 144 -541 312 -186 -12 1514 628 -88 -143 487 263 -1565 278 159 -748 -30 -430
12744 -430 439 909 175 311 243 1142 204 216 -149 250 637 -616 435 -926 -352 -649 1294 -43 -656
12763f56P66J18M71j542N33M32n40K19o65O37J89J57K46K07O72j491O99j054J436
12782H34j012J48K9o24O30p05p68J704o52k25K54J003o37J02j00R2L29q71P92
12801C23J59n75L55r99P28o4n03M3j73R29j62m69o84P90R58j300J543j097P09
12820E11k9j165M52k04Q09l99j03J77p0k84NN20j384O17R15j060R62j486J593
12839C77j261J079l72l86J159o01R18j481J014n71o96J52L55J794k150J362p50
12856e8l74J048j771K160j923J349q62l33J023j471J726K35p89L94o64J523j501
12873b88J178o48j480J606n69J416j140L78j651J006O7J80K30r91J757k311J317
12890E7N7l80Q74j215K43j66q2P60L36m57l78M47O87m80j385N42j62M77N47q33
$$ plain form
12763 -656 110 228 699 -843 -310 122 -418 -199 -864 -227 -38 119 365 572 1244 -247 452 -602 834
12782 834 -178 -30 -1 -625 5 -700 -1468 236 -416 -641 -387 616 -21 81 -19 73 402 -469 323
12801 323 482 -93 262 -737 -9 -73 -576 -533 -706 223 61 -408 -1092 -302 656 -644 899 -198 511
12820 511 482 -683 -231 -435 374 -25 -128 49 -21 -305 -300 220 -1164 -547 368 -692 270 -1216 377
12839 377 -884 195 -177 -563 596 -5 913 -568 446 -125 -821 -669 -314 1480 -670 692 -58
12856 -58 -432 616 -1155 1005 -918 431 -431 -764 259 -1212 514 749 -40 354 -310 1213 -288
12873 -288 890 242 -1238 368 -201 1215 75 453 -1198 -192 -125 55 285 -706 1051 -1260 57
12890 57 114 -266 608 -607 -364 -530 -612 148 484 27 -351 96 783 303 -1082 -540 -702 -225 322 -511
12910e11P41o3M83j014J075P8p09k26J48M41M47n34l90K32k60k26N76k88J7n4
12930c7J095j661J364j572J174m76K75j70j93K75l40o73Q63L67J6m87L53L6K35
12949D44n75p4N45j414K398j453P89l39r2R2p5J07J5l31J46q22Q61r94O48P21
12969E97q47q24M7J052j02N98m47k24J60L02K42n53J164o10j295O97n20J441j101
12988b23J84l59N70P25q46m58K33K11R35j278j00k47J053j20j39mN13l88K57o7
13008D52k92K19J1j63L38j603J370j246J977q06j304Q90J73J24q19P14j21q00
13026h86J327j688K118M63k135l31J23J106o69R52j113J84P87q24Q03j18o62R58
13044C95j229J394j001K441k481Q14j67J0Q45j145K54k35p44P77O20K77q50K25
$$ plain form
12910 -511 230 167 650 -364 711 789 80 -146 2 443 890 356 -34 198 -62 -288 288 0 17 -37
12930 -37 1058 -603 761 -811 363 -113 162 -8 -201 74 -266 -939 -76 291 307 -180 173 209 444
12949 444 -131 -205 340 -1074 1324 -129 660 321 229 321 246 353 368 37 183 -639 222 -772 -124 597
12969 597 -250 -1074 -1027 25 -77 521 74 -150 10 312 554 1 1165 555 -740 -43 -563 878 -223
12988 -223 -39 -398 172 897 51 -407 -174 37 972 -306 -406 -653 400 280 141 137 650 262 519 452
13008 452 160 379 390 227 565 -1038 332 -914 1063 257 -1047 -157 16 140 -679 35 -86 -886
13026 -886 441 -1247 871 1334 -801 -1132 -1009 97 -572 380 -733 -549 238 -586 217 99 -563 395
13044 395 -834 560 -441 2000 -481 333 166 176 1021 -124 130 -105 -849 -72 548 825 -25 200
13062B00lj172O90l79K086j113P61j222j04r22P57J386j935K233j954Q46o9q33
13080g47J050r57J318o38m6N57L6q72O31p67J28o21J267j909K135o15Q03q42P74
13099F85L44j562O32p78J149p23k35P5o78J243N76r40L92j208J452j784J409L50
13117C99r94J030j125J045j193O00N1K77P62j743J279j51K69n50l60J577k123
13134i50J370o32p4J273j194R51j077M86j186J466m34k55L68k51N78q91O19l82
13152b15P3N84j471K066k055J237n46j47K85j068J233n10k33M46K18N7K30N54
13170G38m33r0m40P06n87M32N13p20k42Q24j798J526q99K119j397o06P04o69K30
13189h9n3n08L8J219K81j186J141j286p7R62o62L35r17O73N76M04m09m84K21l14
$$ plain form
13062 200 197 -975 -285 -664 1422 309 1070 -152 -256 -1178 -421 965 -970 1263 -691 155 86 -747
13080 -747 303 -654 664 26 -20 537 573 -299 332 -435 -307 -928 339 -1570 565 -50 753 -89 685
13099 685 1029 -533 99 -679 470 -253 -488 -413 -1091 152 728 -212 180 -1028 424 -1360 49 399
13117 399 -595 435 -690 355 -838 -238 -187 90 852 -891 388 237 506 -44 -404 1173 -950
13134 -950 420 -212 -286 987 -207 744 -333 153 -1033 433 -1 -256 112 -139 439 -452 167 -215
13152 -215 -142 442 -1029 1037 -1018 219 -327 -474 -189 -1257 -24 -534 -767 -321 -103 -46 184 738
13170 738 305 215 -225 481 -106 326 839 119 -123 701 -1097 429 -470 1649 252 -354 350 -319 -89
13189 -89 -142 -650 -612 607 888 -298 843 -443 -520 442 -220 115 -802 -129 447 851 442 -42 179 -135
13209a35P63j732K2Q10j042K226r79J751j364j047R04l23R72r32J93j214Q65N60
13227B98j272K725j791L99l24p60J060m20P67p16p8m36j122J91N66J289l46Q44
13245H74q83j151J029Q3j161R25k96L57o68J891j291J79p6M80J46j099J88JQ63
13264C91o65J256r74J86l6j025J179p74R03K47j390O84p53J722j896O39L17m22
13282d11J185p90P41j549m22J071J130l45j893J926q71j154J898j355J147j653
13298a345R82l1k78J231j462J664O3j032J226k131j69N78J395n94j401K434j946
13315h16J329j333J261o27j247J587m82J543j352M91M2l72K59j419K251r27r2
13332I6j006l44J658l07n28o05R69O76n41J26j329J314K1j48R47j033M24k77N22
$$ plain form
13209 -135 628 -1104 -1082 -272 -1314 912 -67 1684 320 -727 177 -146 826 -106 87 -1127 -262 298
13227 298 -974 1751 -40 359 35 -725 335 -85 682 -34 -112 -548 -1670 -1479 -913 376 30 874
13245 874 -9 -1160 -131 -48 -1209 -284 -580 -223 -891 1000 -291 -112 -188 292 438 -661 -473 -472 391
13264 391 -274 982 8 194 158 -867 312 -462 441 688 -702 -18 -771 951 -945 -306 11 -411
13282 -411 774 -16 725 -824 -1246 -175 955 610 -1283 643 -228 -1382 516 -839 308 -1345
13298 -1345 -363 -394 -672 559 -903 761 824 -208 1018 -1113 -1282 -704 691 97 -1304 1130 -816
13315 -816 513 -820 441 -186 -1433 154 -328 1215 -137 354 396 24 283 -1136 1115 188 96
13332 96 -910 -1254 404 97 -431 -1036 -67 609 68 194 -1135 179 200 52 999 -34 390 113 635
13351F35o58J077j117j023J509j076Q07n58N47K72j437K202j670N70q73J696m09
13368D94r63P36p95J686j290j89Q62m5N4j047M92k67j23L93p14J977n68p24n19
13387e50N42l40o7K27n08O40n31J271m96K44J024j797N44O46q11m38m69Q49n22
13406e42L72N48q55O19j290J057o50k59J587j402J574k08p80M90o54R98q22N51
13424C34j843J643o96J076R40k885K116j209rJ021l52L57j401K272j794J315j198
13441c13j12N14L31Lp46J261r21J001m56j85p93l94K35R19l72J00m56N58P1P13
13461I58j207n87Q70m24O17m24l33K49O80N7r46M84O50k23l57K22k93k91L52r94
13481i40J074K49j56Nj27O78p38m48N49j463M73J684q57k87L41R74q30j06o11
$$ plain form
13351 635 -23 1054 -63 -1086 423 -653 154 -404 143 415 -1022 1180 -490 80 -793 903 494
13368 494 -469 267 -528 1158 -132 -321 541 496 550 -497 -5 -272 -395 -2 -716 1261 693 -31 -550
13387 -550 -8 -348 -415 -188 -696 -56 -587 684 188 432 1456 -341 203 849 38 -400 -869 -20 -542
13406 -542 -170 378 -477 142 -1148 -91 -741 -1000 587 -815 759 551 -229 261 -393 605 -217 334
13424 334 -1509 134 -562 514 1454 -1431 685 -524 -533 488 136 493 -908 1364 -430 885 -313
13441 -313 -425 89 420 423 -323 938 17 1018 562 377 -416 -810 -575 344 -28 72 -384 174 245 958
13461 958 -249 -836 34 -390 227 -197 -530 -281 399 456 -490 -6 644 421 64 286 -7 -298 54 -940
13481 -940 134 383 227 232 105 783 45 -403 146 -1317 -844 840 -17 -304 37 1011 181 75 -536
13500e36J9Q70n71P92J25o56j38J281n85p92J469j287M69r79J253o57q79J797
13518I95j574J283n32J84L36q73j01j99R51k34J9L19j254Q45P9n52k16J090n87
13537b1l94J139j246M43l20O48l06j5L69n57q2J154p66O14j151J844k340J798
13555H11o19L3M86o37L9j045Q66M04j383J289K00J16r33J86M92r70N84l22M52
13574D9L57k51k06j247J315M9o23P22l7J244j407M25l51k98Q26L67j68j976J180
13593c0j22Q63l60j118K089k89n11n87l96k75J96O29p59J169j112J211k88m66
13611a56R34j009K35M65j634J297k98o68M30O50l03l1j17r7J095m41M58k179J466
13630I7q63M37J726k294N70o55J022lm09Q22n69qM04n07J132j384M33q58N82Q38
$$ plain form
13500 -536 -517 353 -218 574 699 43 -95 1186 601 -191 1278 -9 460 -519 734 77 -802 995
13518 995 -579 704 172 356 692 -181 -282 -481 470 236 255 574 -680 165 244 -308 -524 566 -21
13537 -21 -415 724 -522 -79 -399 249 -57 -72 297 -260 -342 812 46 660 -491 1353 -987 811
13555 811 192 225 711 74 113 -932 -66 338 -1045 244 444 560 -373 -187 305 -665 -81 -403 49
13574 49 406 155 -51 -1298 17 66 -557 165 128 1372 -35 390 39 -259 567 934 766 -1210 -30
13593 -30 -152 711 351 -767 1322 1033 522 -65 -461 -736 -540 89 -670 499 -613 598 310 -156
13611 -156 778 -231 4 469 -1165 132 -166 -834 -404 246 -57 -88 -205 -302 793 352 810 -1369 97
13630 97 -766 -329 1397 -897 -327 -982 40 37 -372 450 -119 -127 277 -230 902 -482 -49 -907 -325 513
13650E13j337J405m80o26O53m76J088l89o65J22P26j292J212K46j54K57j777J976
13668A002q59J022j834L87J021j385J126l61p84J397j282NN53o33M65J688k096
13685e68N26J006j803R80m02j03J075r00J123j369Q07J018j576Q28j320K029j997
13702f46J059j185k46Q95r69K331j170j73P25r90p7q2J067j468R47o86R60L39
13720F31q69J658j340J024q90j631K286j175J398j655J019r06m00J354j400J778
13736H82j375P19M27j290N70q21R01j06M4j1j014J994o69M12J60j294N38q6l59
13755c78R32p87N75j110J126j641J154J03N75j180J120K03j327J390k141P39J663
13772A016j031O12o73R23r07l78J046q89J67l01L68J125j471K89n87M01j21J407
$$ plain form
13650 513 -824 581 101 -525 128 -348 740 351 -314 -192 534 -758 454 700 546 803 -974 1002
13668 1002 143 1165 -669 -282 739 -646 480 119 -665 732 -550 -545 8 -625 -160 1528 -568
13685 -568 -42 964 -839 141 -261 -364 711 -189 934 -435 372 1390 -186 642 -678 1351 -646
13702 -646 413 -772 -1018 -123 -1092 1239 69 -104 621 -369 -446 -528 539 -929 18 -668 292 631
13720 631 -238 1420 80 1104 214 -1417 869 -306 1092 -563 456 -450 -850 504 -896 882
13736 882 -493 226 653 -637 -67 -888 13 -93 -49 -60 -1074 920 251 663 823 -471 67 -19 -378
13755 -378 554 -233 342 -768 358 -1283 -129 -26 549 -631 489 692 -635 755 -1386 -647 1016
13772 1016 -15 597 -76 847 -60 -438 608 -281 -114 -415 -47 1078 -393 -104 -691 -290 -411 996
13790I96o77k80J060j283L10k3m16R03o17L7P77j438K69L04Q39j243J046j484
13808i20K264j371R28j60m24N5m44L82k32M13l62n87J224j679J640o71j055Q66
13826a33j103J537q60J420j716j5J649j996J861p66O69j622p5N52k05J523j114
13843c94J73L00J14L7p37Q12k14o43M94M02N1p28Q73l89j436R38R3M4J03M70P90
13864A153j503M20M2m60l77K60L68o43Q97p25J050j258M2K12K95J00n26J606j903
13883i50R07n92P47O51j758P30q93J135O23r02Q38j362M86O23o9K85j232L62L11
13902f0J282j156k59Q70P56o51k26m65J68j6p97O34m67j16J259n41o54O38j369
13921a170J872j561J182L17j571N57k69J675j686J046O94j284L12p93O75j199
$$ plain form
13790 996 319 39 1099 -184 126 103 -313 590 -27 10 787 -651 -382 -78 761 -482 564 -920
13808 -920 1344 -27 901 741 317 372 -72 310 78 491 129 -458 766 -913 727 56 -999 -133
13826 -133 -1236 301 -559 861 -855 -870 779 -1217 644 -122 547 -1075 -1150 -598 -803 720 -394
13843 -394 -221 79 193 230 -507 305 91 -552 -58 344 395 -333 540 151 -1285 -347 -254 -210 -107 363 1153
13864 1153 -350 70 112 -348 -725 -465 -97 -740 157 -568 482 -776 -734 -522 -227 -127 -653 953 -950
13883 -950 -43 -635 112 763 -995 -265 -1158 -23 600 -302 536 -826 -340 283 214 499 -733 -371 -60
13902 -60 1222 66 -193 677 1433 782 556 91 259 243 -554 80 -387 -503 756 215 -439 199 -1170
13921 -1170 702 -859 323 640 -931 -374 -643 1032 -654 392 1086 -198 114 -679 -4 -1203
13937a203J688p8p07M21p6L82j542K062M4j089N52j87L1p03J011n37M19J13r91
13956c90n1J182j057J592k432J469K86N81j689L04J200k127Q77Q80j130r6N24
13973g7K66n34L28RM4J38j148J027r36J417m90m56J446j532P40q56J036o05R67
13992G84o08q48K121j712Q90m02j10n52J06N54j161J804o66r69J430p68P71j561
14010h97J632m84N06q21K75r8n41J501j405n9J11m8N79j006J384j138k00J741
14028A032p94O14l3K52j124N07R5j675J264K71m68n56N40K93l89l54O2J192m3
14047F86N26r18J5J178j562p80N1P93L43O5j85M10k44j27N03k80n86j64j28o40
14067a044R48j25M03j803J193J119j437J273j391P40o1j5L54j930K318n11J273
$$ plain form
13937 -1203 485 407 -300 121 45 427 -1115 947 991 -98 454 267 298 -405 606 69 488 601 -390
13956 -390 -441 741 -316 1276 -1156 313 599 1180 -509 -205 995 -1132 -255 625 -505 -601 -77
13973 -77 189 -345 -17 -8 36 174 -974 53 -883 534 44 -412 1034 -498 242 -614 422 -183 784
13992 784 176 -672 1449 -263 627 225 115 -437 -331 223 -938 866 200 -769 661 -107 664 -897
14010 -897 735 251 757 -64 211 113 -428 1073 -332 -391 -280 -328 251 -755 629 -509 -709 1032
14028 1032 238 852 819 1071 -53 454 549 -1126 138 409 -59 -615 -75 218 -171 -525 -463 729 686
14047 686 1212 294 309 1487 -75 -855 -804 -11 332 397 212 622 378 251 754 474 -112 -276 -404 -1044
14067 -1044 -96 -221 182 -1621 -428 691 -746 527 -864 -124 -185 -200 154 -1776 542 31 1304
14084A304j066o85R1k44J316j043J408j532M68M29k18k3q52J058m06l92l38L67
14102c58J653j905J015n54j3o16K08R23l82j33p76J983j329j62J408j277J66j90
14120c39K81m4J54R38j493J286p18O54q04m4P53r55o2O31r72J248j69K39n74K26
14140B36j184Q63j58l54Q35j057N93J287l018K926j809J136m9l91J536j983N35
14157e6j94N77K31j493J243R7L7m12J071j167j67j92J46Q57j016l13M85K33k13
14176b46J04Q66j233M49J90j376K515j103M85k18j10q96j014J775q71L70k40O00
14194D7Qn58K74j8J065j174O93L39j200J280j187O71o98Q65J54p21J290j796M20
14213b46N7q5J39J82L0L97L33r48N60n95K02K59q1k56L90o11j57J22O43q54N34
$$ plain form
14084 1304 238 -447 -356 -600 716 -327 1081 -451 17 446 228 205 -647 411 5 -387 -725 -358
14102 -358 1295 -610 405 -149 -162 -778 -570 353 -29 -162 -938 1045 -284 -446 962 -315 -149 -339
14120 -339 -58 -102 52 990 -503 783 65 719 -85 -129 624 -331 -393 238 -734 514 345 584 10 236
14140 236 -948 -85 -243 -597 238 -819 -226 1061 -1957 969 -840 296 247 -144 1392 -591 -56
14157 -56 -250 327 558 -935 308 405 442 30 1101 -66 -233 -425 -279 578 -438 -751 -266 -33 -246
14176 -246 -142 724 -509 -60 130 -1246 1269 166 651 433 323 -573 -1587 188 -683 -313 -553 47
14194 47 55 -503 -229 -247 818 -356 337 676 -524 756 -431 240 -458 407 561 -160 1130 -666 -246
14213 -246 -189 -274 -135 47 77 474 807 -141 419 -176 26 285 204 -52 338 -273 -430 -308 335 -519 15
14234A5m41K47n91M02J70K22P72l58p19J012j358J50j46J117j293L71M6N77o21
14253d26j2R2J4k01M05J09L30J51n34M02j114J082j247M11R03j894J584q28J556
14272G83k70J26j209j37J126o07N03k37O12r34m27K407j384N82k329J147L32j163
14290a079J274r88J797p68N19j830J363K08j245K013p84o25L10p91N02L78Q80
14307A134k49k007Q81l30J658j150q2K62l02K70j87k72l64Q74r48k84K000j959
14325a055J008j41J8R94o42Q27j658J382n31o61J798j484J255j398K2P40q25J140
14343G89k83k77r06P69l8l66Q65j890J796p43P74p94L12Q20p84l0M54j507Q57
14362a82J122l58m13k91q59J678o19K1p71p86J443o39J403M06j674N21o19M73
$$ plain form
14234 15 -426 -179 -770 -368 -198 24 796 438 -281 731 -627 -477 -623 494 -799 -428 -382 195 -426
14253 -426 -438 -346 -332 -533 -128 -19 311 462 -72 330 -784 298 -949 -538 365 -1529 55 -773 783
14272 783 513 639 -570 -707 419 -188 315 78 690 -244 -671 1736 352 934 -1395 -248 84 -1079
14290 -1079 195 -793 1004 236 755 -1075 288 496 -749 1264 480 -145 165 -626 -124 254 1134
14307 1134 885 -1122 -241 -571 1087 -63 -145 117 -185 85 -102 -374 -738 136 -812 -1096 904 -1055
14325 -1055 -47 -188 -170 824 182 1009 -649 733 202 -459 1339 -145 1110 -288 -266 474 -351 789
14343 789 506 229 -677 92 54 -312 553 -1337 459 -284 490 -304 8 828 44 14 468 -1039 -182
14362 -182 940 582 169 -122 -981 697 78 99 -672 -1458 -15 -654 749 1155 -519 2 -617 -144
14380a44L39N77r39J46J326k273Q85O70J034j600n3j57Q41j39j432Q21J703j481
14398A24N08j422J379j190J206o83n78O54j012K35J232O16j974O38Q3q75M35N48
14416g6r44J149q17R9J98N02n76j119K955j837J080r78N83p24n21J035p3J003
14434I39j842J838j280J22J192j349M48n60K31N90j564J449j139N92M81q6J063
14451A125j774K06jJ14M73j233K081j452J121j968J889r93P6N30m24K04o08J187
14469E53l97o32Q15m76N36l2N5r7r56N01m26J068r78M65l12O09k34m43O4P9l18
14490e56P00p30J305q00L74j037J178l65r9R02k447L040k264O26j47k94J186k202
14508a630K127n23P34j843K20J904j159l38M20L21L31J67k29l91Q54l2m59p02
$$ plain form
14380 -144 195 772 -167 -21 1305 -968 -83 587 1621 21 -32 -189 652 513 -919 -98 1605 124
14398 124 632 -790 589 -601 605 -78 -656 -2 -1014 -779 453 1069 -905 -267 -184 -1059 -624 -76
14416 -76 -1020 129 -688 -589 -391 111 -465 -1584 1371 -466 614 -364 219 -505 -1026 9 -64 939
14434 939 -903 935 -345 -223 969 -380 68 -492 -261 329 -1235 214 -925 -333 148 62 1125
14451 1125 -649 -443 -444 -330 143 -1090 991 -461 660 -1308 581 -412 -336 194 -230 -26 -634 553
14469 553 156 -476 339 -137 399 367 422 325 -631 -130 -556 512 -466 -1 -313 296 62 -381 -317 -238 -556
14490 -556 144 -586 719 -81 293 -744 434 69 -30 872 -1575 1465 -799 -173 -320 -614 572 -1630
14508 -1630 497 -26 708 -1135 -915 989 -170 -508 -88 233 564 731 502 111 965 933 474 -228
14526b28M88m68q54R94p5p02R67M84l16k28J00L98j324K127j845J862r07j108
14544f35J469j372Q99j205Q85m73M04K4Q7j08j43J034j103j65Q48k42K02j979
14562a573K670j301J92L44o99J159l15j67J01p22J688j252O71j177k93J070p94
14579c98N94j636K671j683J189k31l11l00j297J255J36P17m22r96O06J34q23K91
14597e04J319P30k168J556j665J253k29m71O16m21L60j057J243k74M21n73k9J215
14615A322n11q35N17q9l9j267Q78j037R91r44J200r2j255J575q13Q59J027q37
14633F50r32m9J120j684J351m9j078J237q04p96J696j117J007j141J278j152K70
14650a93N14RM52r81k1k90Q13j106P48J231j942L90m06J695n28o42j44J77L53
$$ plain form
14526 -228 260 -208 -1062 -68 -143 -845 122 606 290 62 162 560 -764 1363 -482 1380 473 -635
14544 -635 834 -538 361 -844 41 -432 -28 -4 83 -25 -168 866 -237 -402 446 204 406 -1573
14562 -1573 1097 -204 -12 332 -367 792 477 310 411 -311 1377 125 796 -381 -674 396 -398
14579 -398 196 -1440 1231 -452 737 506 195 -105 -1402 -147 -11 706 284 -712 -106 28 -795 -504
14597 -504 815 1545 -623 933 -732 521 292 -179 437 16 376 -681 562 288 709 136 107 1322
14615 1322 811 -24 493 404 365 -902 -24 -1061 -70 -1014 186 94 -1161 414 -399 460 1487 650
14633 650 -282 -331 789 -895 456 407 -671 566 -238 -1034 662 -455 552 -589 689 -463 -193
14650 -193 321 330 782 -199 -220 -510 303 -803 -55 1176 -766 -376 -782 913 385 -257 -401 -224 129
14669A29n30L90O1J86L26o22k85K14L73M67j014Q34n82Q12j962K140k3j503J181
14688E92j276J659j125P35K28j924J465j070J117K2L61Q7j764J308o96qJ430q62
14706B79m41m14K80Q1L06n71J298n0m32n63r86J728j501P01O92p1J52m97R76j295
14726c28R03l39r88J32J052j161Q39J30P50k387J742o59j6R5j239J461L76k02
14744A61p42P06N12j217J70o12J509l53L9k3m95O05j014J427j3m54l1j22N18p95
14764b24J061j197j07R42o55l86J239L64j132K59R33k130J393m82m15Q99j260
14781h98P41j01J3L23N49O0n15M60q83N6j77J115j493R44q1j27l2m27O60Q78k135
14802a070K284j269M15q18K5O22j397K010j892R33R9m1l61J135L8o93P92p53n9
$$ plain form
14669 129 -401 -11 50 236 562 -60 -345 -131 242 709 -305 529 -53 759 -1203 937 914 -589 592
14688 592 -684 975 -150 585 813 -1111 354 -716 401 423 784 871 -893 415 -281 -289 1141 279
14706 279 -162 -576 -296 -215 91 -480 818 768 336 -227 -1213 515 -986 -285 407 336 488 -9 967 -328
14726 -328 575 236 -752 -620 432 -729 110 240 990 -1397 345 -314 -330 -235 -1474 -13 363 161
14744 161 -581 125 637 -580 -410 -1022 487 134 173 150 -345 260 -754 673 660 206 175 53 571 -224
14764 -224 837 -360 -467 475 -180 -566 673 1037 -95 164 1097 -1033 360 -122 -537 362 -898
14781 -898 -157 -258 -245 78 627 687 172 632 -251 -195 -372 743 -750 194 113 -14 -46 -473 187 1065 -1070
14802 -1070 1214 -55 360 -458 -433 189 -1208 802 -1090 -157 -58 -99 -460 675 713 20 812 59 0
14821@R13k715K506p60L48n10m5K96K58L28r58N26J28j213M00L46o56J282q60
14840c86J171q66J76j085J460j540J124J028m38m26N72j249J61K24P24p20J038
14857I68j040N20R8p53k01O8J477n52k23n7r70j64K31J039n70K8m52N01O83j205
14877e74P03J63l17R01j930R23m94O53m74R24n18l45J168q50R39j482L69L56m93
14896c78J415o31O39m04r61K7R01j8j163l56J468j266J064p54Q98j900J693k81
14914gK17j35r29J412k88J100r87k33M40k200K378r75O39n79j56j08N11N12j479
14933h67M71P97q30N59p81Q36j020N49Q01p36m28N39K74j07n23J89K19M85q53
14952d26M12n83M34P73j043J294r20P2r83J530J88j663K303j406J11l31l29J067
$$ plain form
14821 0 913 -1802 704 -56 292 -218 -263 33 291 619 -339 187 315 -898 -498 -152 -808 474 -386
14840 -386 785 -81 95 -990 470 -1070 54 1082 644 218 790 -459 -298 -74 650 -70 968
14857 968 -72 448 546 -207 -408 -340 1137 585 362 305 -665 -829 -598 441 -129 -101 -553 -52 631 -574
14877 -574 129 292 -25 876 -1054 -131 -625 28 -446 478 -40 -385 783 -67 872 -610 -241 115 -378
14896 -378 1037 406 1045 641 -320 -293 608 590 -573 -929 539 -727 337 -417 481 -1419 274 -7
14914 -7 210 75 -854 558 270 1370 383 150 590 -1610 768 -207 432 -147 -303 -411 100 612 -867
14933 -867 -396 401 -429 130 -651 185 -835 -286 515 -221 -649 -110 164 57 -466 -277 -58 427 -426
14952 -426 -14 -597 -163 610 -433 861 -59 13 -970 560 748 -915 1388 -18 93 -238 -567 500
14970E00N36j879l79K614j421O7P2j563K038j804K033p07n08j02R6P6Q79p05Q43
14989F86j377J505j292L87r83J550Q71j935J77o2L67M7J090q22l00p5kn55M50
15008b73P57m36j19O54n29P04n67j89K323k646m20R43j105J003j31j82n16J271
15026E42j351P29j039J143J23n53K30m30L31Q49o00J002j524R39o00O26o30r62
15044a175J428j276J273p39O23m10r32J706l55Q85j173O12o49L0K59J090k96j945
15062a044P2K84M97N54j310J648q87q11R73q32R46K13o50K14kJ412k067J202o19
15081b07N86l16J87nk00L15j7L47j839J086N35j487P43r80N76qN49r5M9J619j908
15102d70M7R4K53L94o52m7R58j094R47Q3O27j334J94l73o86J479j639J615r29
$$ plain form
14970 500 1036 -843 -1222 1392 -29 38 110 -1453 585 -1219 814 107 -401 -503 -407 -331 548 -157 686
14989 686 -691 814 -478 -91 -1074 476 1347 -588 -411 -473 -106 -59 1031 209 -91 -166 -168 -723 -273
15008 -273 484 48 -71 583 54 758 191 2 2325 -321 -741 202 -903 100 -31 -213 -729 542
15026 542 -809 -80 -1119 24 147 -406 -176 -606 -275 574 -26 976 -548 391 -209 417 -213 -1175
15044 -1175 253 -1023 250 -489 134 -276 -1208 498 143 1028 -145 467 -182 -152 107 1197 901 -1044
15062 -1044 -972 -688 -191 363 -947 701 -186 -997 -24 -856 90 303 -347 -133 -135 1277 -790 412 -207
15081 -207 379 63 250 245 45 360 343 690 -1149 -63 472 -1015 -272 -1252 -676 -684 -135 -230 -181 1438 -470
15102 -470 -423 -329 -76 318 -334 -381 577 -517 430 513 1140 -194 0 -373 -1059 420 -1219 396 -533
15121e33R81q86K67p79k95J897j018O34k67j27J288n78K83k145N86M89p03Q63
15139d3O08P8j097J381j389J084P36k637K163p33j033J437K03m19n52l76M68O09
15157D88l03o24M84j97Q53j163O18J93l48l94j049K402j828N5Q91j34l7O9Q39
15176H15m47n44m79k97J412j544J260K62j049R87j261J641j541n14J113O3K83
15193A60q25M32L00J7r79R97Q4k1q03L88L02L85j072J141l71O77o16o26O21q3
15213A08N93j263K108j498m36N96p45K281k705J331j24l69N71j203J156q16N99
15230A84j444J322J026j647J098m32K68J94j262J213j427J112p80J15O55r63J415
15247F47j436L4J472k39j68j064M15J31M71J37l09m61q1J226k312K019l61J16
$$ plain form
15121 -533 448 -438 -171 -950 -1245 652 -366 268 1 -126 1162 584 867 -1278 -692 -203 -906 -43
15139 -43 565 643 -454 927 -462 622 1358 -1279 884 151 -882 555 758 339 -213 -589 -121 488
15157 488 185 -439 45 -152 701 -462 156 349 1 -393 -1442 960 -868 -813 78 -56 -93 -24 815
15176 815 368 -176 -655 -952 460 -1084 176 438 -611 376 -885 756 -785 -1299 -186 -123 160
15193 160 -665 -233 67 84 -895 102 186 165 -638 -250 52 437 -635 506 135 812 196 -430 191 108
15213 108 701 -562 1546 48 -388 208 -537 1744 -961 370 246 -123 448 -755 401 -415 184
15230 184 -1260 62 1088 -559 539 107 375 569 -693 520 -907 205 -575 -460 195 -768 647
15247 647 -789 -755 717 478 310 -754 -339 -208 263 400 91 -370 -451 775 -1537 482 121 237
15265B37K22j278J597p41R7n65J367n07j954J906j10j089P31K62j166Q19J270
15282A098j039M03o09k92P88q81J310n91L58n12o57R40j11J3k04n71N83j56K73
15301A43K71o30J11O41q40O07l81J91K94m22k62J231k194J600l16k95j08L04L10
15320B55j066J792j335O62J547j558J172k424J005J20n66Q14j103J317p48O91
15336E75o50K09M6p33K025j885R83j105Q78K82m11O32j554J138j312J093R6q91
15354e84J156p25J486o55q90kJ201j93r47J205j123j23j65k98J695n85m33j027
15372a007J617M44j815J916r46p92Q59r50R83l59n29J228K68J45j376Q00o83l95
15390e92O27k89N29k97J80o21J806j168J92N5n62N74q38J182q30j54R05j876L315
$$ plain form
15265 237 459 -819 778 37 134 -431 936 429 -1525 381 271 -818 -87 175 -991 -172 1098
15282 1098 59 462 -147 -439 349 -532 778 187 545 33 -624 316 205 218 14 -557 26 -130 143
15301 143 414 -216 -105 536 -304 303 -78 113 407 -15 -277 954 -1240 360 44 -251 -359 -55 255
15320 255 -811 981 -354 308 1855 297 1469 -955 50 170 -396 418 -685 632 -116 575
15336 575 -75 134 180 -553 1472 -413 570 -535 343 625 214 846 -708 430 -882 211 307 -584
15354 -584 572 -153 1333 678 -212 -214 987 794 -153 1052 -71 -194 -359 -657 1038 453 20 -1007
15372 -1007 610 1054 -761 1155 209 -583 276 -674 309 -50 -579 649 917 1062 -314 486 -197 -592
15390 -592 35 -254 275 -22 158 -463 1343 175 367 422 -140 434 -404 778 -52 -206 699 -1177 2138
15409B138k250m05K39N16j12n95J127j241N98O73j127K87r14J105L63Ok36k8M83
15428F27j696K555k398J380k10j11P66j488J588q30K32M92j620Q09k30J262n58
15445E70l51n46j59O62o59Q27p93R1M68r81O69o09R47r5p6O39q61Q93n81j73K93
15466A75l11N02o93p50J225M24j051k16K171o14r11P48m38J65J14j041J119O22
15484A240j183j30P05J74p40j88O47o41L80P68k072J207l11k6O12j017J387p73
15502C9M54j328J216N8m82M00n72Q74l9n80m3j03R84k458K633j420Q15n21J174
15521A101r91O8J70j047J178q03k12O86p35N44n9k2p71J32J070j482J962j490
15539g01J298r57k34J271j909K283J22j197j52k84N21r35J154n07k59N64l11j69
$$ plain form
15409 2138 -112 -517 -278 238 126 -469 658 -583 15 688 -439 -152 -1066 39 402 408 172 144 627
15428 627 -1069 1486 -912 468 258 147 913 -575 1013 183 415 907 -713 96 -134 1128 570
15445 570 219 -327 -486 176 -483 344 -449 -358 110 -871 -202 -811 136 41 -35 604 -257 636 55 -118 175
15466 175 -136 366 -327 -1077 148 572 -479 -695 1476 862 -49 699 261 426 540 -501 618 1240
15484 1240 57 -73 632 806 66 -122 525 -116 264 1032 -1040 167 -144 -170 442 -575 812 39
15502 39 493 -835 381 439 -43 357 -215 659 620 40 -3 -106 878 -1580 1053 -367 448 -73 1101
15521 1101 110 178 348 -699 479 -324 -536 150 -585 -41 -100 -122 -893 -761 309 -1173 789 -701
15539 -701 597 -360 -594 677 -1232 1051 1173 -24 -176 -460 61 -874 280 -227 -486 78 -233 -402
15557d02P1J357k270J129Q24j360J361j144L12J495k266L64l6M31j006Q56N18
15574B34j050O10Q59l18K15n63m0O82p19O86J44r33J60N60o87L65n36N63K62n22
15594b8Q00j094Q75j93q92M54j56R68k272J890j622K388j285L84O6r76J873j822
15612f42R04K46n27m43j235K420j073o13R73k91J308j539J554o30o27o30R17j9
15630E3n40J002P5j82j015k9O44p91Q83q7o09M41p87K04O60R35j733J066k43o36
15650f89J122p0M97q62j83k38N63M15j175k61Q30k13M92j83J96k29O82p55L26
15669B65L42j909J748n20K2Q38j521P25n39P71j296Q07Q83j227R48r7N99j504
15687f65L18O38j34p0m62J187K44p59K0J1n78m10J03j16l69J253l92O29pK85o47
$$ plain form
15557 -402 -331 1026 -1244 -115 709 -651 710 -434 -122 1373 -893 -529 -565 -134 -1140 -284 234
15574 234 -816 -206 653 335 550 -13 -53 629 -90 596 740 -193 -33 527 -160 205 -331 232 494 -28
15594 -28 772 -322 553 360 -532 -78 -234 734 -1538 352 -1270 1118 -167 217 283 -693 1180 -642
15612 -642 262 508 -19 -462 -1697 723 -350 -963 10 -281 1027 -512 1042 412 -215 -845 72 53
15630 53 -487 515 590 408 -607 -636 8 -783 100 13 -596 -155 -942 -738 -78 857 -876 190 -53 -689
15650 -689 433 363 860 -2 -185 -423 140 555 -620 -881 -51 -264 228 45 241 12 694 -61 265
15669 265 607 -1302 446 -74 -52 786 -735 -10 -549 222 -1074 -267 616 -611 337 240 839 -665
15687 -665 -347 291 157 87 -375 812 1056 297 317 328 -250 -660 -557 -673 -1042 211 -181 448 441 726 79
15708G9k58R60l96O50j425P10j055K30K66o96O39J92M72p91K51J8p13J408k41
15727C00R4j68r21J918k322J479M06p10j252Q15R99j645J111N19L95k78j195O83
15745B28j478K332j195j69K84o18J328j43p85q30J003Q28k24R3j156P49m08N19
15763C58r98M77P38j410M25K84N21p67K97J219k972J819J331j574P38j553Q54
15780b13k68j56J132o10J055k453K749j196l93J147j192K331k162J000r98p97
15796a024O57o98J912j460J532r64K69K18j195L84J71J370k53r01j72k01J911
15813A556j655k32L28k85n3m41N94J02p0J40n83N06p86J312j223J272j321n7P98
15832i8Q2L19m99l36J018j189J752j185m31J00m83Q90l15K39P1P61j479J054O97
$$ plain form
15708 79 -179 781 385 1035 -390 320 -735 -505 -239 -935 -296 -104 368 -423 -172 -154 -867 541 300
15727 300 394 226 -695 1223 -1099 380 786 76 -1176 -361 638 -1007 104 623 1018 740 -455 228
15745 228 -1250 1082 -113 -282 2 -616 712 569 -216 -1046 -43 785 561 654 -502 247 -161 358
15763 358 -640 -163 575 -835 -410 -126 395 -372 -75 1144 -1828 -9 1322 -252 486 -1067 -213
15780 -213 -481 -637 495 -115 940 -1513 1236 40 -353 794 -398 1933 -229 771 -227 -1024
15796 -1024 -367 -1065 847 -613 919 -45 224 442 -753 -369 -198 1172 919 18 -154 -355 1556
15813 1556 -99 -331 -3 -288 -341 -782 -188 -86 -156 -16 -599 -93 -879 433 -790 482 -839 -896 -98
15832 -98 -16 303 -196 -532 486 -703 1049 -136 -567 -467 -950 -60 -375 -136 -65 696 -783 271 968
15851I68j356p61M37J442j076j35j63J52J394j981J156l60m1N77j043J025o40
15868d05J74j31K7J652j661m40N1P71J27l37K059j387n19N12p69J02O07k12k48
15887b7M08n00j35l96M39L08n93J403q50m63J327j065L07o98J593j022L26q82
15905e20M64Q76j164j39J19n00J691r91N02q21N99r2j451K183j116J024j595O55
15923b76k84Q35k13o90R86j315J513m18r69P23l75J123r65R87j503N57Q48k334
15941a770J466N39k67Q05j185J809k032J109q80M09L30q48K05k07J187r92R32
15958F10j490O18J05k41K01P38r32k6Q6j72n01J332L8q98J53l11P41p38J186O12
15978A111j840J754j238J018k299J207N84m79J232r69J088j603n14J231j026R66
$$ plain form
15851 968 -388 -1149 -712 730 -346 -481 -644 -492 902 -1079 77 -283 -324 253 -790 235 -405
15868 -405 -231 -362 -335 1317 -344 -784 -733 38 165 -172 1887 500 -19 493 -276 -174 433 221 -27
15887 -27 381 -119 -254 -650 -211 97 -496 907 57 -406 921 -144 163 -535 1058 36 362 -520
15905 -520 -56 820 -344 -483 -364 -864 827 -164 338 -483 116 24 -1427 756 -360 664 -931 -276
15923 -276 -560 275 62 -628 358 -957 556 138 -831 -108 -483 640 -325 662 -841 -284 564 -1770
15941 -1770 -304 235 -32 773 -412 1397 -635 474 -406 3 333 -515 -310 -517 670 -322 610
15958 610 -880 -262 -157 -398 -197 541 -391 -417 -331 -503 -1004 328 366 -532 -379 -690 51 -687 499 1111
15978 1111 -729 1025 -213 805 -1494 -287 297 -182 1050 81 1169 -434 -948 283 -743 223
15994B23p37J860n29r81J233k258K160k282J902K33j561J168m89L45p8Q75j130
16011d6Q6O26k260L160k188N03J6J45J24K40J91j296R79m16N99l10k92J098j325
16030c66J009j118Q1P96j626L14J432o4k24j240P94K09r16J789j572M09P97J76
16048F80m42o61P35L61k42n39K79J84j26O54q59J94o30J028k91o52j4Q25M93n80
16068C97j65j026k11J672l00p46j78K243j666l53l42M19O64j785J652p72j24R78
16086C57j027J383j812J479o51j39M14o32J628j630Q77k07K03R04j327Q20p93
16103a53j67J105j99j286n11N62N24J143r39r02J173j025J251j035M11j29q37
16120a014J260p03J642j713O90n42K99K94M69j169J61P40n56O82k57q37J6J024
$$ plain form
15994 223 -514 1346 817 -164 1069 -1189 971 -1311 591 824 -737 431 -58 287 209 1084 -46
16011 -46 40 666 -1594 1566 -622 -119 -103 42 166 406 597 -699 280 -136 463 153 -139 959 -366
16030 -366 643 -475 -394 402 -1224 -910 522 458 234 -1006 -212 -3 -919 870 -702 -293 504 680
16048 680 238 -423 312 673 431 -108 171 355 229 883 24 218 -412 616 325 -327 -341 484 977 397
16068 397 232 -794 -1005 667 367 -379 -557 1686 20 -333 -675 -256 408 -1377 275 -497 -621 357
16086 357 -670 713 -1099 380 -271 -410 4 -628 1000 -630 247 40 243 1147 -180 640 -153
16103 -153 -320 785 586 -700 -1211 -649 -125 1018 79 -823 350 -675 576 -459 -48 -177 -1014
16120 -1014 246 -457 1185 -528 162 -380 -81 213 682 -487 -326 414 -142 540 283 -554 -538 486
16138D86R4j341J038j94R82j019O17j24n65p0Q39j527K5J020j87K70o59O88m09
16157c6r10J260j88J589k363J009k73M3N86j156l60k2J026P2K54o98k13N1N27
16176A98L80n52k76N53p40O60r23R76j232P52m21L31Q36l73L95j172Q00n99n87
16195i94R9J113n78J127j065L30j393J465m19J508j963k66R52n9K43k13J184j947
16213h76J716K93j521J579j779R71L06j097J239M5p41j323Q38N76j773J792j334
16230a089J825j495J215l81j352K121k052R42j227Q32P75k31L82j260P26j7k44
16247e30N53L52k55P23j335Q41K31L10j368J021j224J93q31R82J458j586J027
16264E62j518L05P34k27R79j276J813j295n50N14q68J942q52L31j435P73L96j790
$$ plain form
16138 486 580 -761 277 83 1065 46 663 539 -26 -96 743 -784 -759 261 74 344 -315 373 -36
16157 -36 -946 314 126 1715 -648 361 88 131 717 -439 -799 -821 205 277 531 -167 -380 -329 198
16176 198 578 26 -250 303 -437 223 -700 276 -956 -204 -625 -294 542 169 564 -608 192 -407 -994
16195 -994 -895 218 -360 767 -298 32 -1361 104 -315 1193 -770 -1036 -84 -143 100 -113 1071 -876
16213 -876 840 1133 -388 1191 -588 383 689 -408 831 876 135 -1188 -350 226 -1547 245 -1089
16230 -1089 736 -759 456 75 -1277 844 -1208 -266 -1493 -661 114 -117 265 -995 -269 -286 -530
16247 -530 23 375 120 843 -492 349 580 890 -478 543 -681 -488 -1319 -337 1121 -465 562
16264 562 -956 -651 83 -144 835 -441 1372 77 -473 41 -827 1115 263 594 -841 -68 328 -1462
16282a462J740O03n24p97k59Q29j268J110q40R23n84L33J208m81j73j34J039j574
16300c11P48O23j942J523r79J371j408J650k53j46l28j106K099j105n62k50k42
16317f18k5P64j46M34n74J334k92l72n42K78j73j97Q17j187O84l59j36R35j047
16336d22Q68j801J370K14q28J108m61J91J7M41p31N56nj285J521j822J754r10
16354b25N06K17j504J727j158N37q13L41J46o53J084p64Q00l22J24R16k09K88
16372A038j488P46L87j081J517k082J622n11m45J661j064
$$ plain form
16282 -1462 278 881 357 -440 -699 130 -1138 -28 -868 55 -529 -196 1012 531 358 224 1263 -311
16300 -311 437 1060 -882 641 -338 1033 -375 1275 1022 876 548 -558 1541 436 -126 -376 -618
16317 -618 -643 121 -25 409 -165 1169 877 505 -37 241 68 -129 688 -499 185 -174 -310 625 -422
16336 -422 446 -1355 15 229 -599 509 48 239 256 697 -34 522 517 -768 753 -1069 685 -225
16354 -225 281 498 -1006 721 -437 100 -713 -372 -226 -879 205 -559 241 -81 43 959 750 1038
16372 1038 -450 296 683 -398 1119 -963 659 148 -297 1364 300
16383C00
$$ Imaginary data points
##PAGE= N=2
##DATA TABLE= (X++(I..I)), XYDATA
0@%%%%%%%%%%%%%%%%%%%%%%%%%%%%%JkNqRj5J7j7K0k0K2k5L2l7L9m4N1n5N7o2
49c2O7p2P9r1J01j10J23j42J62j78K03k41K96l74M83o91J182j2067J1643M053
69D394j866j463k920j109j303L646L913Ql01m128j718L86M94M443k35R51k221
86I71j680k803N54K523K135K376k394j769l777M8L464O63K611o79j094k843k35
103a929j067K949L331j295r54r29l084N07K816K580q80L41j168l559L14l25L458
120A106J096P75j904j466j420j4O69K866R63j000j772k22k028J360L45J943P96
137B093j376j04k381J90P84O52J996j077J69k413R45l40M27J616n52j67q80l77
155g95l62J209J41J07O04j228r91P7j00L065j331P38j360K20n8l03K56P63k07
$$ plain form
0 0 0 0 0 0 0 0 0 0 0 0 0 0 0 0 0 0 0 0 0 0 0 0 0 0 0 0 0 0 0 1 -1 4 -4 5 -10 7 -10 10 -10 12 -13 19 -18 21 -23 28 -27 30 -32
49 -32 35 -37 42 -49 52 -58 65 -77 85 -93 110 -131 165 -209 274 -417 765 -11302 341 4394
69 4394 2528 1065 -1855 -2964 -4267 -621 3292 3300 2999 -1129 -2847 -2461 -1967 2476 2241 3192 971
86 971 -709 -3512 -2958 -435 1700 4076 1682 -87 -3864 -3816 -352 311 2922 2243 1149 -1694 -1929
103 -1929 -2996 -47 3284 1989 1035 106 -2978 -2471 345 2925 2045 2386 1218 -2341 -2027 -2352 1106
120 1106 2202 2977 1073 -393 -1813 -1827 -1158 1708 2671 1671 -101 -323 -2351 -991 -646 1297 2093
137 2093 717 613 -1768 -1578 -794 -142 1854 777 946 -1467 -522 -862 -435 1181 629 462 -418 -795
155 -795 -1157 52 193 300 904 -324 -1315 -1238 -1338 1727 396 1134 -226 -6 -64 -367 -111 652 445
174D45j463J13J529p13J597j125K04j729Q62m73k76L346j665P86j220n53j55L63
192a27P49o13R43p43j987J54O02J985j50P60k47k824J021L22Q43Q25J0k42j788
211e07L30j312K063O79K04L89j709j599r56N22K284R68J366j887j113j967J090
228a155j68K500J309k42k154r83r41k72J824L243j150l06k057k064k52J955K238
245A325j60N52j472j942j372N25L544O55J336k516j353o68K18R49J346J908j376
262A499k101j338r57J548K378J589r89j227j602q73L76O30L057p4M40l899n89
279b132K73n4L718Q67j289j63k764k95l65K782Q50L47J60l267j387m78K673R88
297D64J226N20j992j269j551J739L38L485j53r58j712j624m89J141R35M304m401
$$ plain form
174 445 -1018 -905 624 -89 1508 383 587 -1142 -280 -753 -1029 2317 652 1438 218 -335 -490 -127
192 -127 622 9 952 209 -1778 -1624 -1022 963 813 1573 1326 -1498 -477 -155 688 1513 1523 1281 -507
211 -507 -177 -1489 574 1253 1457 1846 137 -1462 -2418 -1896 388 1356 2722 835 -278 -2245 -1155
228 -1155 -1323 1177 2486 2244 90 -893 -1834 -2106 -282 2961 1811 1505 -552 -2616 -2868 -913 1325
245 1325 1165 1717 245 -1697 -3069 -2544 1000 1655 2991 475 -878 -1546 -1328 -379 967 2875 1499
262 1499 -602 -1940 -2897 -1349 1029 2618 1629 402 -1200 -2073 -1697 -1067 1990 1916 2356 -1543 -2132
279 -2132 -1859 -1913 1805 2672 1383 1220 -1544 -1839 -2204 578 1428 1775 1935 -1332 -2719 -3197 -524 464
297 464 1690 2210 218 -1051 -2602 -863 -525 2960 2807 1849 137 -1487 -1976 -835 100 4404 3
314CR40j612j480Q70N93J871j73N21k476m15j153K166J463P49O62k623j631N50
332a175L30J628j5K064k552j468J483k017J631M80J224L89l342O67j822K967j39
349C33J433l64j414R0k421J354m63K898L92q47j136j480R51n12K116K71J06m41
367H66j978P2k14j59J911J447j398j088on42K032L64r50j61j556P62M53N06n14
386a53K43J092j038o29m60M67P46O06P64k845J281L27m82L27J48Q31j563P62q87
405d63o20K138m76L77j204n67k91K28J593k51J61m10k28L0j608J869k1K51K6l68
425A66R6j025J629n7L84r0j550l17p76J352n2J392P11j257j316j344O73O67J652
444I38P46j519R75l324Q63J259l40J930j09K83l519J255j464K237O23N93L23k819
$$ plain form
314 3 943 -669 -2149 -1279 -686 1185 1012 1533 -943 -1358 -2511 -345 1118 1867 2529 -94 -1725 -1175
332 -1175 -845 783 768 2832 280 -1188 295 -1722 -91 389 1613 2002 -1340 -673 -2495 472 333
349 333 1766 1402 -12 78 -2343 -989 -1452 1446 1838 991 -145 -1625 -674 -1186 930 1201 1307 866
367 866 -1112 -1040 -1254 -1413 498 1945 547 -541 -547 -1089 943 1307 357 196 -1360 -598 -145 361 -153
386 -153 90 1182 144 -485 -945 -478 268 874 1638 -1207 74 401 -81 246 394 1225 -338 424 -463
405 -463 -1083 1055 579 956 -248 -815 -1106 -878 715 464 625 215 -13 17 -1591 278 257 508 534 166
425 166 262 -763 866 809 1193 1103 -447 -764 -1540 -188 -240 1152 1863 606 -710 -2054 -1381 -714 938
444 938 1684 165 1140 -2184 -1321 -62 -402 1528 1419 1702 -1817 -562 -2026 211 834 1427 1750 -1069
462a069J99q23J006J551N10J001j127l107o53J414J717O95R55k049l12j914J084
479i22M96J512J847j39k553j446L1p3J33L013n08N29k645j036P79J228J678K66
497B190n38j353o63j574J62K668Q12P61j073l217m57K66K188J217k52J451k933
514c45n90j115O67J293J980K82j170j387j797J144l87J339K612r52k008l04j024
531a762L97N41K789p45M80k989K86q77R39K987j287J817k755q72j384K085J339
548I89J62N16j543j769p03Q30J627j5K247k215j226J360j794J063K045K82j876
565b0Q83j822j162K148l93J860j32o46r28p09k80mJ727P65n13q63j140K95l50
584a284J341j93j34O77j265k41Q41N22J74Q15j85j882j47R85r25P34K55J593j959
$$ plain form
462 -1069 -870 -1693 -687 864 1374 2375 1248 -1859 -2512 -1098 619 1314 2269 220 -92 -2006 -922
479 -922 -426 1086 2933 2794 241 -1205 -1174 -1247 -1114 1899 1391 1920 -725 -1761 -982 246 1924 2190
497 2190 1652 299 -364 -1938 -1776 892 1704 2465 1392 -1825 -2282 -2016 172 1389 1137 2588 -345
514 -345 -935 -2050 -1383 -90 1890 2172 1002 -385 -2182 -1038 -1425 -86 2526 1574 -434 -738 -1762
531 -1762 -1365 -824 1965 1220 1700 -1289 -1003 -1880 -941 2046 759 2576 -179 -1051 -2435 -350 989
548 989 1151 1667 124 -1645 -2348 -1518 109 94 2341 126 -1100 260 -1534 -471 1574 1856 -20
565 -20 863 -959 -2121 27 -366 1494 1362 716 -212 -921 -1201 -1205 522 1287 774 -89 -1229 -934 -1284
584 -1284 57 -136 -270 407 -858 -1099 -258 264 438 1253 1068 -814 -961 24 -901 -167 88 1681 -278
603b78l20K99M61L62j177J581j091J028k402J775K31p15J654j750O72j025r11
620a606J891J42J758k105l10o76N59j25P39J075q21l11o51m61J115M16K64p40
638A53l32r87m2J729j302J313K78j128k76j183J452j01K609j851q10L27p13J001
656A37j102K032r7n04j101m39J183p25Q08J41J662k005p31L87o01K569r61J032
674A685j192j629M13j087J888P74M29O02k430l32l81M05J073J050m75j15m25j958
692a705q4J735K92N84N3p96j387O9k16M10K903j238J362k755K78q05N24J860M72
711A556p23j597o04k09n61K130J112J241j650j927R6j50J162m65J795O77j939
728e6N3j572j73K284J340J8j422q1l039K123k08J066J598j808j51k573J411L13
$$ plain form
603 -278 -598 -299 162 524 -653 928 -163 865 -1537 238 469 -246 1408 -342 330 -695 -1606
620 -1606 285 427 2185 80 -230 -906 -347 -472 267 1342 521 210 -441 -902 213 629 893 153
638 153 -179 -1166 -1208 521 -781 532 810 -318 -594 -1777 -325 -426 2183 332 -478 -151 -864 137
656 137 -965 1067 970 466 -635 -1074 109 -616 192 333 1995 -10 -741 -354 -955 1614 653 1685
674 1685 493 -1136 -723 -1810 78 852 1281 1883 -547 -879 -1260 -855 218 1268 793 678 253 -1705
692 -1705 -1789 -54 238 822 875 79 -1308 -1239 -1455 -1045 1858 620 1982 -773 -495 -1300 -776 1084 1556
711 1556 833 -764 -1368 -1577 -2138 -8 1104 2345 695 -1232 -1136 -1286 -124 -589 1206 1883 -56
728 -56 -3 -1575 -1748 536 1876 1894 472 391 -2648 -525 -733 333 1931 123 -28 -2601 -1190 -877
746h77K406P5n43j038j120j7j324K276K79P26k02m03p34k392J583J509J570P05
764B479k610m91k215J279K698p43J072l24k74j725N45j063J994J19j9k24j631
781a133j34O58L82Q70j7m70p09k00j44N84J795q63L82m59k240J565n08J952j860
800e49J700P49j915j49j298J234N97N80p74r68Q56p81M42q03K181J37j441J155
818I53k864J522Q26n42J07q00J332M1p42L04R37p25j54L2j330J298n8m10Q74o87
838h6J920k522k62%N20K422j838n13m71q67J828j013J671l72k2r69m51J076N2
857A03J373j057P34j980J66k7J102J098j755N97q49l89k82N22J597l0o18j561
875a256J49J59N5K348j109N78m22j293j46O0O78Q69J63j158P74j256k07N53J337
$$ plain form
746 -877 1529 1604 1061 23 -1097 -1114 -2438 -162 117 843 641 238 -496 -2888 -1305 204 1774 2479
764 2479 -131 -622 -2837 -1558 1140 397 1469 1145 871 -854 -309 -1372 622 741 722 498 -1133
781 -1133 -1267 -609 -227 643 626 156 -553 -753 -897 -313 1482 619 1001 542 -1698 -133 -641 1311 -549
800 -549 1151 1900 -15 -164 -1462 -228 369 949 175 -793 63 -718 -276 -1079 1102 1239 -202 953
818 953 -1911 -389 437 -105 2 -798 534 575 -167 137 1074 349 195 227 -1103 195 137 -273 601 -86
838 -86 1834 -688 -950 -950 -430 1992 154 -359 -830 -1697 131 -882 789 417 395 -574 -1025 51 103
857 103 1476 419 1153 -827 -661 -688 414 1512 -243 354 -495 -884 -1166 -644 953 923 305 -1256
875 -1256 -1107 -948 -893 1455 346 924 502 -791 -937 -877 -199 670 833 -325 449 -807 -1014 -461 876
894H76K42j24j265J97j282N19K249q92J530j892R1j482L60P85J413J155j539j132
912a91j099o82J232J249N90l3o27j658l01K56J357J351K25K35j998K50j195n88
930a627J810J40J067k088J07K4l21J639K35K86Mr42j215p51J382n6J569o79P7
949F61j460j431J173j24K923n25k67j349j220J85J555J585n13L58j107j298m52
966a306M03R54J176O23j249k08k8k848J743q1K024L18k412J028j356J52J213K80
984D26J528j586m33j832J353j21L56J191p96J213j331K88j656J194P92J106j29
1001A563j377J36r53O60Q45K24j110O63j511O52j295L150m21Ol93k27j680M50
1019f18J572j096J544j104n70K09j484J249k81J370m77j307K83p10J465j432K079
$$ plain form
894 876 1118 994 -271 -74 -1356 -837 1412 520 2050 158 249 -1233 -873 -88 1325 2480 941 -191
912 -191 -1290 -1972 -740 509 1099 1066 439 -1219 -1520 -1264 93 1444 1669 1904 -94 156 -1039 -1627
930 -1627 183 323 1390 -698 -591 -567 -888 751 986 1272 1276 334 -881 -1632 -250 -306 1263 584 661
949 661 -799 -2230 -1057 -1181 1742 1217 950 -399 -1619 -1434 121 1706 1193 1551 444 -854 -1306
966 -1306 -903 51 1227 1850 601 393 365 -2483 -740 -821 1203 1521 -891 137 -1219 -1067 146 426
984 426 1954 368 -65 -1897 -544 -665 -309 882 86 1299 -32 256 -1400 -206 586 1692 1563
1001 1563 186 322 -631 29 874 1098 -12 651 -860 -208 -1503 1647 1226 1232 839 612 -1068 -618
1019 -618 954 -142 1402 298 -272 -63 -1547 -298 -579 791 314 -993 -710 -1420 45 -1387 692
1036F92l03P30r95j490K098j559N20L11J95J229k566J906j717K342j194q59N72
1053h8q55J439m68Q09k42j149P73p32m64J367Q8o9Ll93j001O45j13J984j458N46
1073F22k77l15n23k70J123R27n37l41m14p50L80j12J738k86J00j788L38k88R88
1092C15R14m28m23r54R72q21j130J301J462J23n89j998K89M13O50l21K61L93j050
1111f21N54j350J074M54K132o93k156m45m10J336j51J345l67Q4m13l57n63j681
1129b228K295O93P25m21k913M50k74K031M03J229m90l39j030k097J519M4K18J351
1147A166p44j354L16r50J054N87L01J01j42k315R93m52J601Q22N8J90k141L5k41
1166a115R74O95P03k11k014M93j588P60L152j34n22j856K62j231P2J767M34R74
$$ plain form
1036 692 389 1119 124 -1366 732 -827 -307 4 199 1428 -1138 768 -949 1393 199 -660 -88
1053 -88 -943 496 28 837 595 -554 219 -513 -977 390 478 409 412 19 -982 -337 -450 1534 76 622
1073 622 345 30 -493 -763 360 1287 750 409 -5 -755 -375 -487 1251 965 1065 -723 -385 -673 315
1092 315 1229 801 378 -576 396 -425 -1555 -254 1208 1331 742 -1256 -967 -554 96 -225 36 429 -621
1111 -621 -67 -1417 -343 111 2243 1550 -606 -1051 -1461 -125 -276 1069 702 786 373 16 -547 -2228
1129 -2228 67 760 1485 1064 -1849 -1399 -1673 358 761 1990 1500 1161 131 -1966 -447 -403 -185 1166
1147 1166 422 -932 -616 -1566 -512 75 376 477 335 -1980 -987 -1439 162 984 1042 1232 -909 -874 -1115
1166 -1115 -141 554 1257 1046 -968 -475 -2063 -1303 1849 1715 1193 -663 -401 -1632 -1560 207 641 1615
1184A615j711R6j201P5N20M39K662j524K22j269p93N45l21J212M44K33r09j108
1202g73O8L01O90O89N60p51k298N50N88m36J968n77pj435K43m55J467O01n00P63
1222A256j472m98m44L56J989j212J613k696K96K79K51L65JJ022j429J98j801N56
1240a370J349L65J55N07n00p78o60R84o57R27j802K675j213j906K618J34L08r46
1258A90M8K49j426R93L75j63k17L1L48j416J078m07M56j09l61j82n24L51J074
1277C88q7q41J475o28k87p17m69J279J128k009M18R96j37k350K534p8l70N3n77
1296b79J09p22J381m50L84K77j046M80q73J122J37n34R46j402J617j670O97Q94
1314A068j792K010p06l07k63j347J883r02J776j124j93j61j089K056j402J913
$$ plain form
1184 1615 -96 0 -1201 -1126 -606 -167 2495 971 1193 -76 -869 -324 -645 567 1011 1244 335 -773
1202 -773 -705 -404 286 975 1535 784 -1514 -964 -376 -812 1156 579 572 -863 -620 -1075 392 993 493 1256
1222 1256 -216 -714 -1158 -802 1187 -25 1588 -1108 -812 -533 -282 83 84 1106 -323 -125 -1926 -1370
1240 -1370 -21 344 499 1006 506 -272 -932 52 -605 322 -1480 1195 -18 -1924 694 828 1136 190
1258 190 238 487 -939 54 429 266 49 80 428 -988 90 -317 139 30 -331 -513 -1037 -686 388
1277 388 301 -540 935 307 20 -697 -1166 113 1241 -768 -350 646 509 -1841 693 615 245 298 -279
1296 -279 -170 -892 489 39 423 700 -346 134 -739 383 520 -14 932 -470 1147 -523 174 1068
1314 1068 -724 1286 580 273 10 -1337 546 -356 1420 296 103 -58 -1147 909 -493 1420
1330A420l15L30j187l92M07l58L35J97K39j031k02M70q55R86J69J164p9j875J21
1349d56q38J484L28K56m08q4j479r03J462K328j428O87j096N82j308M35m71K495
1367A586j481p17J85j184R01l90J118J454j144q15p97p2L07R27J472j27J27j536
1385a86r11J145J002q17j13J308j722r90k08Q26O69N09J445k415N92m92p10J99
1403h69J041K007l13k158Jj412R80N65J391j65j130J70j490J070k79J963j15j157
1421A00L28j678N77K12J651m89k99K90j390M41j369J733l56J014N52j199M91n3
1439E56j560O85J681n99q18n76K36n36M12K33J407o96L4j428L49O79Q6J43N4j08
1459B34o21j248J471l32N72m1J9n60K77m83L27J627k72l75k221K36K442j859N87
$$ plain form
1330 1420 1105 1435 248 -144 263 -95 240 437 676 -355 -557 -87 -942 44 213 1377 1298 -577 -456
1349 -456 -1294 190 518 774 366 282 -1197 -2100 -638 1690 262 949 -147 435 -873 -438 -909 1586
1367 1586 105 -612 -427 -1611 -710 -1100 18 1472 328 -487 -1284 -1356 -1049 -122 1350 1223 1350 -186
1385 -186 -1097 48 1050 233 120 1428 -294 -1284 -1492 -666 3 512 1957 -458 134 -358 -1068 -869
1403 -869 172 2179 1866 -292 -291 -1703 -723 -158 1233 1068 -62 108 -1382 -312 -591 1372 1257 100
1421 100 428 -1250 -673 -461 1190 701 402 692 -698 -257 -1626 107 -249 765 1317 118 609 556
1439 556 -1004 -319 1362 763 -55 -631 -395 -931 -519 -286 1121 425 459 -969 -620 59 145 288 342 234
1459 234 -387 -1635 -164 -496 76 35 54 -506 -229 -712 -385 1242 970 595 -1626 -1390 1052 -807 -220
1478b20k52J623j121l76n68K67K054n86J13m37j852J734n35Q35j296J354r79J38
1496a04R20j406O42j01P6O96p54K60j798K345r41j31J31q03J407j091J271j442
1514h23Q52L19lM47j719L30J714j14l74j301N57p72J78J39P83N71l51n26m33Q50
1534C24j210J046J610j631P1o06J27k43R62j061j61J430j367m6R9l02K091n47
1552E86L89m95j005K92Q21k93q46J581n82j112L37J05p8L53N71K85j006n60O8
1571e89J087p82J155j151M52q88K98%P72o09L14P05p74n42o97K78K88K958j240
1590A035j003j274J382j253J939p72N59J98j924N96j01R28l68J654n18p35n94
1607b51j560K404N13k47J210k483M25j005M13L19P88j60p21J000j109J94P13m92
$$ plain form
1478 -220 -472 1151 30 -346 -914 -647 1407 821 934 497 -1355 379 -156 679 -617 737 -242 -104
1496 -104 816 -590 52 -49 27 723 -31 229 -1569 776 -165 -296 -165 -968 439 -652 619 -823
1514 -823 29 348 345 792 -927 -597 1117 1003 629 -672 -115 -887 -709 -570 213 784 433 -93 -526 324
1534 324 -886 160 1770 139 210 -396 -269 -512 450 -611 -772 658 -709 -755 -656 -958 1133 586
1552 586 975 480 -525 -233 588 295 -551 1030 448 -664 -327 -222 -300 53 624 909 -97 -657 -589
1571 -589 498 -284 871 -280 172 -716 -418 -418 354 -255 59 764 -10 -552 -1249 -971 -683 2275 1035
1590 1035 32 -1242 140 -1113 826 54 613 811 -1113 -517 -618 310 -58 1596 1078 343 -251
1607 -251 -1811 593 1106 859 2069 -414 11 -994 -581 -262 526 366 -355 645 -464 -270 443 -49
1625d9J570n90k81j414k20k89K62K021m96N00j681o31J40Q2J644J84O72j38k164
1644h78R12l99Q98o68O79l5k11j241Q19k82K13O05l52R58j519l83N33l24J072
1663C97J025j287Q93k291J022N6Q5J367j057K68k053K522j642N48J934j466k95
1680B6M81j741o35J509J786j15j204r72P02l79P85m6q92J723j715N0M45o75J810
1699I43j103O29K28p29N49r62J19O37J113k035J008j75j048J874j975K283j436
1716h0M88n78n31M74j18J209j198O13M49k623J781Q04n85m87J83K48j044J555
1734E60j408J751n58L86o86o17n97R63O35j486J109j48Q7n88J97p7L49K40L9p34
1754e83Nn04J258Q60l76l12k2r29L40n26J346n40N36j82o96q75L34K125j361J392
$$ plain form
1625 -49 1521 931 650 -764 -984 -1273 -1011 1010 514 1014 -667 -1298 -1158 -1076 568 752 1424 1286 -878
1644 -878 34 -365 533 -135 544 509 298 -943 -124 -406 -193 412 60 1018 -501 -884 -351 -675 397
1663 397 1422 135 1028 -1263 -241 -185 -100 1267 210 478 -1575 947 -695 -147 1787 321 26
1680 26 507 -1234 -1869 -360 1426 1311 107 -865 -163 -542 243 197 -695 1028 -687 -637 -192 -867 943
1699 943 -160 469 697 -32 517 -445 -326 311 1424 -611 397 222 -826 1048 -927 1356 -80
1716 -80 408 -170 -701 -227 -345 864 -334 279 728 -1895 -114 690 105 -382 -199 49 -995 560
1734 560 -848 903 345 731 45 -572 -1169 -206 429 -1057 52 -96 -9 -597 -400 -477 -128 112 151 -583
1754 -583 -578 -1082 176 1036 660 348 326 -603 -263 -789 557 17 553 371 -325 -1200 -866 1259 -102 1290
1774A290j479k00J32N23J20j219K103j633L69r01l67J721o44J131j458J417r56
1791e1j273J550j230K740j311m15r3p52Rn14J167P67M87j570q33J295j352J363
1809a6R36O74j200o98p33M36N88J281n81l61j123N71k31O05m83R67N72j497M26
1828A33r04Q3J040L0N79k7j38j769R27r57J231J285p64k87l053K723p56J0J655
1847A041j088R84k11j908P35k50R69m9O75j732O98j062k89K438j320J392L29j206
1865A46R0j180P71l5L96No96J252j908R66J69ok09M79M46p59M7o31M84M73m77
1886a77J292k106M91J12P6J071r07N99%J03j420J289M76j055J036j633J754k609
1904a608J627n38j47J196j119J90j102J727r7n98J896k259O37J16m37J702p76
$$ plain form
1774 1290 -189 -389 -257 266 386 -833 1270 -363 6 -895 -1262 459 -185 946 -512 905 -51
1791 -51 -1324 226 -1004 1736 425 10 -83 -835 -826 -1340 -173 594 1081 -489 -1322 -27 -1379 -16
1809 -16 920 1594 394 -304 -1037 -601 -13 1268 687 326 -797 -226 -457 148 -335 632 1204 -293 133
1828 133 -771 -688 352 382 961 934 796 -973 -46 -1003 228 1513 749 462 -2591 132 -624 -614 1041
1847 1041 -47 937 726 -1182 -447 -697 272 223 898 -834 -136 -1198 -1487 951 -369 1023 1352 146
1865 146 236 -944 -173 -208 188 193 -503 749 -1159 -193 -24 -30 -239 240 686 -73 -26 -657 -173 300 -177
1886 -177 1115 -991 -500 -388 -312 759 -148 451 451 554 -866 423 899 -156 880 -753 1001 -1608
1904 -1608 19 -519 -666 530 -589 -399 -1501 226 129 -469 1427 -832 -195 -79 -516 1186 410
1921D10J82j151O93r42l43J455l41J418j383O1j16P39p73l00J679k121P08L33
1939B08k14K99K52n65k50j47k70q77K493m93j48l4J164j479K75O73j470N55P89
1958G61k64j582o0O95J096k13O28j772Q7L46N09n65J178n78K01P30k129N25j151
1977a558J276K23L9Nr79J046j250Q11N98P2O83j158K84n68J14n13J245M73j272
1996d29N99l74Q2L33k26J620j374k23q53R08O14j180J192J44j21j101o5n59J223
2015B10P95n76o32N42J27j583N12J818j677O51N5q82P14o30J120O51n6p19p22
2034b82N59j310K34J104L06M15j625k05J51K60j586K789J004j598N53k443J973
2051B99l4J014O61j304r6P2%j196J142O5j36M48j573N78N4l62J438q83k94O3J38
$$ plain form
1921 410 592 -559 134 -808 -1151 304 -37 1381 -2 59 -57 682 -91 -391 1288 -833 -125 208
1939 208 -6 293 545 -20 -270 -417 -687 -1564 929 436 288 254 1418 -61 214 887 -583 -28 761
1958 761 497 -1085 -1145 -450 646 433 1061 -711 -624 -278 231 -334 844 266 467 1197 -932 -407 -1558
1977 -1558 -282 -59 -20 -15 -994 52 -1198 -387 211 283 966 -192 92 -476 -362 -875 370 843 -429
1996 -429 170 -204 -122 211 -15 1605 231 8 -845 63 677 -503 689 833 712 -389 -454 -1013 210
2015 210 1005 429 -203 339 466 -1117 -605 1213 -464 187 242 -640 74 -556 564 1215 1159 440 -282
2034 -282 277 -1033 -799 305 611 1026 -599 -804 -653 -393 -1979 810 1814 216 769 -1674 299
2051 299 265 1279 1940 636 540 612 612 -584 558 623 487 935 -638 -60 -6 -368 1070 187 -107 -44 94
2072I4J008k319N80M73J593j437P42j626L45M14O05J523k731Q19k73j054J769
2089E25p98J834j222P83j674p59J087k04K73j009K715k628K67N34j60M97j9Q65
2107I07j582o9J010n51J133k00j19j26o95k41j75K86L61k04P49m50l79K07O16
2126D78q75J81K78RN31m21K09o88K67P19j990K138j361K92K26K1M16j379J384
2145D35k05j73l0q13J070p77k16J082p78q91J151R94j504Q20k11p74J212k51O74
2164H15j711K728j854j605J886J64K11j685O22k64J000P5k06P52j014P11p84j86
2182c45R29k115K791j182L60n68q27J763j504P24M4p08J569j78j588l16J824p40
2200f7L59R56q50R7L96o57r53N95M27m03j1p71Q52j364J337L37J18m76q67J407
$$ plain form
2072 94 1102 -1217 -637 -164 1429 -8 734 -892 -547 -133 472 1995 -736 83 -190 -1244 525
2089 525 -273 1561 339 1122 -552 -1311 -224 -428 -155 -1164 1551 -1077 -810 -276 -436 61 42 907
2107 907 -675 -744 266 -285 848 648 529 403 -292 -533 -708 -422 -61 -265 484 34 -345 -138 478
2126 478 -397 -216 62 71 602 181 390 -298 -31 688 -1302 836 -525 -233 -7 14 430 -949 435
2145 435 230 57 27 -786 284 -493 -709 373 -405 -1296 -145 849 -655 165 -46 -820 392 141 815
2164 815 -896 1832 -22 -1627 259 423 634 -1051 -429 -693 307 382 176 928 -86 625 -159 -345
2182 -345 584 -1531 1260 78 438 -130 -957 806 -698 26 70 -638 931 753 -835 -1151 673 -67
2200 -67 292 1248 398 495 891 234 -719 -124 303 -100 -111 -882 -30 -1394 -57 280 398 -78 -945 462
2220D62j000r14J818k06L9l37L90j660P34K485j091l76N92j542K4N17R0P38M13
2239A176k190N93j9m42J110n08K264j384j167j00l91J077k05Q14m75J79N71j408
2257e05J579k255K274k25J43r26q51J435j773K057n89L11r68j322J164p25J796
2274F20R2n48J103j870P23j885K285k20K31l76J30o29r73J120J104P2m68r51P57
2293C17j527Q97L09J710j194j018R49j565J109J10j362J687l75J369q84j194J531
2310H69j860J072n8N14o99m31J172j326R88j49M21n86n48j94P70N04o01K40O39
2329G37l73m84m50P36l84O13j6o74O04N94j217l01J833j277j36J788j889M35q20
2348f81J584o70j006J506j272Q95K31q71J77MJ058j680J861k220J451N60j299
$$ plain form
2220 462 -538 -1452 366 160 199 -138 252 -1408 -674 1811 720 344 936 -606 -582 -65 25 763 1176
2239 1176 -1014 -421 -440 -882 228 -280 1984 600 -567 -667 -1058 19 -186 628 153 332 903 -505
2257 -505 1074 -1181 1093 868 1011 85 -766 669 -1104 953 364 675 -293 -1615 -451 -1176 620
2274 620 712 164 1267 -603 120 -1765 520 300 531 155 285 -344 -1317 -197 907 979 511 -440 317
2293 317 -1210 -313 -4 1706 512 -506 443 -1122 -13 97 -1265 422 47 1416 532 -662 869
2310 869 -991 81 23 537 -162 -593 579 -747 241 92 513 -73 -621 -815 -45 459 -142 98 737
2329 737 364 -120 -570 166 -218 395 379 -295 309 903 -314 -615 1218 -59 -195 1593 -296 139 -681
2348 -681 903 233 -773 733 -539 356 587 -284 -107 -103 955 -725 1136 -1084 367 927 -372
2365c72K050j790J043p07n2l36J77O55k66Q51j197K27l68N2J190j722L00K65o91
2384f91j23k11J984j058j11pL86K84j629J223M53l15M92j035N76k25m71J84K18
2403g6K72r09K881l084J419l82l26K45j249J051o01J559j012J115j206R14p14
2420a03j13J894j982k81P94p59n96J365J91L59k06j275j227J655o60J797j128
2437b75j01R59j174R8J43K47J028q76J234k267L20L10j89N91M02P03j090j30o28
2456f95o01J922j357J336j57K46j025q2M49K42P91j383O48o27j56K1K90P82J90
2475H34L77j790k89R39n50J029K4n66k92k60J40K23O93o65K26J45K0o89m26P13
2495a64L7q2P48J73J73j656j48O49J122l71q9N07j499j16q31J103M77j51N1N31
$$ plain form
2365 -372 1678 -112 931 224 172 -164 13 668 402 1253 56 283 -85 -33 1157 -565 -265 0 -691
2384 -691 -814 -1025 959 -99 -210 -217 169 453 -1176 47 500 185 677 -358 218 -7 -478 -294 -76
2403 -76 196 -713 2168 -916 503 121 -205 40 -1209 -158 -759 800 -212 903 -303 611 -103
2420 -103 -216 1678 -304 -585 209 -550 -1146 219 410 769 563 -712 -1939 -284 -944 853 -275
2437 -275 -376 583 -591 -493 -350 -103 925 49 1283 -984 -664 -354 -543 48 450 1153 63 -67 -695
2456 -695 -1296 626 -731 605 448 694 -331 -413 36 278 1069 -314 334 -293 -449 -428 -138 644 834
2475 834 1211 -579 -868 71 -479 550 574 8 -284 -544 -404 -181 512 -153 73 218 238 -451 -877 -164
2495 -164 -127 -209 539 712 885 -771 -919 -270 852 481 392 899 -600 -716 -1547 -444 33 -118 -67 464
2515D64q22P88j33O69q87J056r97r5j000Q75J091m97k49o01k66m74J473J28j238
2534g15J299n84Q5o90O34O28j467R31m15j27o9j94J197l37J044q90O17j704K07
2553e50jR26o04p16K245Or57m4o74P91j364J311J56l43O1r54L40k52P95J17o73
2574c84N99L48r29J545j585P24j807J208p86K101j106q5k07k76P99j080J125O39
2592H43n89q70J031j07k39j65l05P66L75j576R8m51O40M16n29O41j367Q03k86
2611h71J217k0o09P68l30N40j345m31Q46J43r8k74J255j137N28o65O3P52m18o99
2631g85R23l88O50m39Q87j123J660j508j90R10j718K337j570R72m44r83K91l00
2649h18J237J7n9K71l03J59j560J200n22O82O23j472k32R99k66Q57j43L63j508
$$ plain form
2515 464 -358 430 297 966 79 1135 138 43 -957 -82 1009 512 263 -338 -604 -1078 395 523 -715
2534 -715 584 0 85 -605 29 657 -810 121 -294 -421 -490 -684 513 176 1220 330 947 -757 -550
2553 -550 -551 375 -229 -945 1300 1306 349 305 -369 422 -942 369 525 182 243 -711 -371 -623 172 289 -384
2574 -384 215 563 -366 1179 -406 318 -1489 -281 -1067 1034 -72 -157 -364 -640 159 -921 204 843
2592 843 254 -616 415 308 69 -96 -401 365 740 -836 -738 -1189 -549 -133 -662 -21 -1388 -585 -871
2611 -871 346 326 -283 485 155 695 -650 -1081 -235 -92 -190 -464 791 -346 182 -483 -420 332 -86 -785
2631 -785 138 -250 400 -39 848 -275 1385 -123 -313 597 -1121 1216 -354 618 174 -809 -518 -818
2649 -818 419 436 377 648 345 504 -1056 144 -378 304 927 -545 -777 222 -44 813 670 1033 -475
2668d75J996j663m14L87Q6J020j090l01K33K51q46P60K55l86M47n79p74N56J2
2687e25J664J33q07n46J634k634J174O73m15R24k437M92M95p54K348j402K40L21
2705E78k43m21m89N72l06J515n58q39J040j909J845p45P21l95j084J626j631J032
2723C09j266J975m42K98K02j831K79k54J755j303L85Q63j429N14q14J111o4j147
2741h59R91m22O70j374R1M47L47Q07k147K238n00j182L99J449k84r74R68j241
2759e76k05O04R93M10j858M40l32Q50Q55k57p28n07J85J67M50l90j39M85m03L30
2779C74j208K58Q25j490J506n02J565j363j024N27n23Q30m73O33j70J165n74n09
2797a53n63R07M52j77q92Q82j484J623o37K30n94K12L45l37O53r07J087q46P96
$$ plain form
2668 -475 1521 -142 -556 -169 -83 937 -153 -454 -221 30 -816 -56 199 -187 260 -319 -1093 -537 -525
2687 -525 1139 1272 465 -81 1553 -1081 93 766 351 1275 -1162 -670 -175 -929 1419 17 257 578
2705 578 335 -86 -575 -3 -309 1206 648 -191 849 -1060 785 40 761 366 -718 908 -723 309
2723 309 -957 1018 576 874 1076 -755 -476 -730 1025 -278 107 970 -459 55 -759 352 288 -859
2741 -859 132 -290 380 -994 -903 -456 -109 698 -1449 789 289 -893 -494 955 671 -303 665 -576
2759 -576 -781 -177 816 1226 -632 -192 -524 326 1181 924 196 -311 -126 41 491 101 -38 447 44 374
2779 374 -834 -576 249 -1241 265 -237 1328 -35 -1059 -532 -1055 -225 -698 -65 -235 930 356 -153
2797 -153 -716 191 643 466 -426 456 -1028 595 -42 188 -406 -194 151 -186 467 -440 647 -199 597
2816E97l86j060L65L29K26P99q99R8j771J273M47N78O88j605j44L79J24R92j482
2835d52J316j441J386j621K25O17j777K605p09K18j194M53j59m69N59J20P95j185
2853g13n54R02n72J579k11L37j21r56P29j217R41L98K03j055j86R91j743J923
2871F75j445J582O7o43n44p81J730q26O45P63p22j76j647J397K40N25J34q44R1
2890B21o24J088r40L72J75l65K63j426J296L98o94J306j238J164j561j74K92M54
2908GL3m84J464j552r23J382J129M3j699J460j255R22j090o4R58j418K422j153
2926A82p81R66n13M14r74J102l36J0J85K41k84j279J589p80J272p75j225J134
2944A48m70j34n05K136j180qM60j292J484n05J355j067j263J589j722J323j835
$$ plain form
2816 597 211 -849 -484 -155 71 870 -29 69 -1702 -429 18 596 1284 -321 -465 -86 38 1030 -452
2835 -452 864 -577 809 -812 -587 30 -1747 858 149 367 -827 -374 -533 -1002 -443 -323 472 -713
2853 -713 -1267 -365 -937 642 431 768 647 -309 420 -797 144 542 745 -310 -496 495 -1248 675
2871 675 -770 812 879 236 -308 -1089 641 -185 460 1223 501 325 -1322 75 315 840 974 130 221
2890 221 -403 685 -255 117 292 -73 190 -1236 60 458 -236 1070 -168 996 -565 -739 -447 7
2908 7 40 -444 1020 -532 -1455 -73 1056 1099 -600 860 -395 527 -563 -627 331 -1087 1335 182
2926 182 -599 367 -146 268 -706 396 60 70 255 496 212 -1067 522 -258 1014 239 -986 148
2944 148 -322 -456 -961 1175 -5 -13 447 -845 639 134 1489 422 -841 748 -974 349 -1486
2961a486J961O17j300J102j418J471k082J755K77n25o34p81R23j97L37L22k06
2978A36j5j044J200q99N75P65k153J983q61O90p32N74j31O63n18k5P46j136m25
2997f07J364j545K81j89J487q25n6J283j465P71p68n12K4M06Q11K46j786Q53o58
3016h85P10j032J187N13m13j092J528l91o27J305j291J626l91j671K568j802P91
3033F33P2o95K42o63P53j025R70n94Q01j129Q64Q70j900J300j099J641l4j615
3051f08K421k105M23k05M07o51P61R81k119J420j237L23J085p13P89r42m31O12
3069B11j268J442j720J530m42J3L68l70J062j741J222n26Q73j447L11P82l21J196
3087A175j244j151Q40l81Q16m64J675n23n25o5k47O13r87J061Q51p69n11j671
$$ plain form
2961 -1486 475 1092 -208 894 -524 947 -1135 620 897 372 -262 -1043 -120 -317 20 342 136
2978 136 121 -923 277 -622 -47 718 -1435 548 -313 377 -355 219 88 751 233 208 954 -182 -607
2997 -607 757 -788 -507 -696 791 -34 -90 1193 -272 499 -269 -781 -757 -351 460 706 -1080 -227 -885
3016 -885 -175 -1207 -20 493 80 -1012 516 125 -502 803 -488 1138 747 -924 1644 -158 633
3033 633 705 10 252 -411 342 -683 287 -307 494 -635 229 1099 -801 499 -600 1041 1007 -608
3051 -608 1813 -292 131 -74 333 -318 443 1424 -695 725 -512 -189 896 183 972 30 -401 211
3069 211 -1057 385 -1335 195 -247 -234 134 -236 826 -915 307 -219 654 -793 -482 300 -21 1175
3087 1175 -69 -1220 -380 -761 55 -409 1266 743 218 153 -94 519 -468 593 1444 675 164 -1507
3105a507J474p25R07o88Q31P13j740L23r96J837m35j394J139k93Q3p13J317q58
3123g25o12J673j301Q16n25J393r23q8Q80j700K169j544P00l80k42J342r26l26
3141c19n3K16J8K23M68j22j61n26P98l60n41J483j808J973j475p25mM63J119j078
3161d11J091j98j024l33K84j9O84q0n81N31J78L0J47o34R65k58J51K90q53J107
3181A067J23p4m82l83q00n85J864j726J296O30j719R68m00M3k97R65p30m91L28
3200d03j62J134q00k48k7n76J782r31O32l59j208K625j130m32q11J487n85p42
3218g54P61P1Q15o88M9L90k117K485j846P42K93m44L68K5J165k461J316k56m26
3237e12N5K15J347k216J031j03Q59k54k01N4p42J590m85R47j492m13P7j219K713
$$ plain form
3105 -1507 -33 -758 149 -539 292 1005 -735 -412 -1408 429 -6 -1400 -261 -554 -471 -1184 133 -725
3123 -725 -1337 336 -965 -149 -674 719 -204 -292 588 -1112 1057 -487 213 -167 -409 933 7 -319
3141 -319 -372 -156 -138 85 553 431 270 -256 542 182 -359 1124 -684 1289 -186 -911 -915 -452 667 -411
3161 -411 680 482 -542 -875 -591 -610 74 -6 -587 -56 122 152 299 -335 630 372 523 813 -40 1067
3181 1067 1190 1116 634 251 -549 -1134 730 -996 300 930 -789 179 -221 -178 -475 490 -240 -731 -403
3200 -403 -565 569 -231 -479 -506 -1082 700 -231 401 42 -1166 1459 329 -103 -914 573 -12 -754
3218 -754 7 78 893 205 254 644 -1473 1012 -834 -92 201 -243 125 150 1315 -1146 170 -86 -512
3237 -512 -457 -242 1105 -1111 -80 -183 676 422 221 275 -467 1123 638 1585 93 -320 -243 -1462 1251
3256A251j132J43n81N7J577j359P08k40q65j56K82m3K75N29Nn2n19m81l30Q69
3276f2J49p2m10Q16p57J142k259J630R75j65j096k81Q32j060M46L02J22J60k13
3295A99m84j53j42J777j005Q7p16J380j407J16N50K81L05q70l10L86N21j128O0
3314e53J100q55J309j129N80m2j997K144p72P37K63k001Q03M94M49r60Q11M99
3332H80j193N30p79J399j344J034l13q16J342m02p66o18J508q1m75O16j304R86
3350B04O3q6j34L09M69j467R55l06MN03r25P19q71O85p37N11J620j368M97j001
3370c56J248j434O14O33j798Q58j07k82J453j191P05k53J331q42j08o29l15J575
3388A102j569M71k11o0j35R38n60j151K462o57m3o82L48q36L51K47J62n29O28
$$ plain form
3256 1251 119 262 -319 -262 1315 -44 664 424 -441 -597 -315 -358 -83 446 451 399 -120 -601 -931 -62
3276 -62 87 15 -395 421 -336 806 -1453 177 1152 987 -109 -390 442 -618 -172 130 252 412 199
3295 199 -285 -438 -580 1197 192 279 -437 943 -464 -348 202 483 788 -82 -392 -6 515 -613 -553
3314 -553 547 -308 1001 -128 452 410 -1587 557 -215 522 785 -1216 -413 81 530 -430 381 880
3332 880 -313 217 -562 837 -507 527 214 -602 740 338 -428 -1046 462 381 -94 522 -782 204
3350 204 267 181 47 356 825 -642 313 7 11 514 -411 308 -563 122 -615 -104 1516 148 645 -356
3370 -356 892 -542 72 705 -1093 -235 -342 -624 829 -362 343 90 1421 579 471 -158 -473 1102
3388 1102 -467 4 -207 -267 -402 536 -24 -1175 1287 630 587 -95 253 -583 -232 15 177 -352 276
3407B76n41P39j250R81n51n94J637m47Q5j233J018j78N64l86j66O4j442J204N48
3426C28J55L39j153J67l48J074j495P85R1M81Q28j829m59K059p98n93m58J302
3444D76q8r56Q31j216L99o7N85L55j587J009N36O86r20N6j096R18m71j08R45j035
3464g48J084o5m25O1o53J312k72R10j330nN96k96J12j84m79J317r71l56N5O18
3484B81j43o52Q42l85K81r65Q25n78M22r85O36N96o30R70j381J038K5j55K97J42
3504D81l77p83L48J205j951J322O19o53M60j592J841j184J923k166Q51R4j439
3521a001Q62O53j18k97P9l68j42m2k83J214j076K8J314j303M83j24Q65j232M39
3540d9j001J47J905j736K084j302m36l39k42Q36o48Q02J102j843J562j010J71
$$ plain form
3407 276 -265 474 -776 205 -346 -940 697 250 335 -898 120 -58 506 120 -46 18 -1424 -220 328
3426 328 483 822 -331 -164 -512 562 -933 -148 -57 424 1252 -577 -1036 1023 225 -368 -826 476
3444 476 388 -568 263 -953 -554 -621 -36 319 -1268 -259 277 963 43 99 -997 -79 -550 -658 287 -748
3464 -748 336 271 -154 -93 -746 566 294 1204 -126 -131 465 169 281 97 -382 935 -36 -392 -337 281
3484 281 138 -514 328 -57 224 -741 84 -494 -72 -1057 -421 175 -455 515 -866 172 197 42 339 481
3504 481 104 -679 -331 874 -1077 245 864 211 671 -921 920 -264 1659 -507 344 438 -1001
3521 -1001 -139 514 396 99 178 -190 -332 -374 -657 557 -519 -491 823 -480 3 -121 744 -488 -49
3540 -49 -1050 -903 1002 -734 1350 48 -388 -727 -969 -133 -781 21 1123 -720 842 -168 3
3557CL93j035J503j236P18j073M01L33J252o79o6N38j317L96r94O55K50p04P56
3576I4q8J122j041l66L01l66K73n49R66r50J03J096k24Q93k412J016m02r8J5L23
3596b94J298j620k94O4R80L54j175K176j977Q73m62n51J327q16J525j904J808
3613A312o27j522J391j569J204k16N52J85k20J045k026J406o09n60Q4J67J706
3630A703k945J602k03J7J047j528m93m93K504k063O07N25K13l14j124J576n48
3647H3k13N42n15j65q07R33k17l64J404r91k27p94M32P65l57O25l55J29mn34m36
3668a066L46Q39N41q98O25kJ43m93J24n39L71k00P13k78L24p84L52M69j874Q22
3688d65J488j852k38L88N11K73l77N95n61K55n08J563j328r1J014j848J789n50
$$ plain form
3557 3 396 -639 864 -372 346 -727 -326 7 1259 580 514 1052 -265 131 -863 -208 42 -662 94
3576 94 6 1128 87 -279 22 -344 -71 -620 346 -604 -501 595 371 1264 -1148 -132 -534 -632 -617 -294
3596 -294 1004 -616 -910 -846 134 488 -687 1489 -488 385 -77 -628 699 -117 1408 -496 1312
3613 1312 685 -837 554 -1015 189 -27 525 710 490 1535 -491 915 306 -254 -170 -3 1703
3630 1703 -1242 360 157 174 1221 -307 -800 -1293 1211 -852 -245 280 493 179 -945 631 83
3647 83 -130 412 -103 -268 -1075 -142 -359 -723 681 -310 -537 -1331 -899 -134 -491 134 -221 -92 -96 -630 -1066
3668 -1066 -720 119 660 -238 387 385 528 35 159 -380 -9 -209 504 226 550 -234 118 587 -1287 -465
3688 -465 1023 -829 -1067 -679 -168 105 -272 323 -238 17 -491 1072 -256 -347 667 -1181 608 58
3706E8J186o58l21m4r01R61k47P89l33L15o49o59J698o05k7j600J243j697L45
3725a146J775o96k9q43K80J479n67n95n43J511J25p07L50M5Q14k234J66P22q39
3744i32J198m03L62k5k21j42p78O42J90J23j81L37K76J87M15k115L50R40l48q27
3764i52M1R43k60M12q5q25N69P33l34m2p93N21j217J571q56O61J057j012j82q38
3784h88J096j313J928j138p0M41l56O96r87O4J01J28J444j533J1j60J298m50R4
3803D06o02r98P86j17J2P7J026q47j02Q33j153L17m11M80R03j159J354j234Q02
3822C73j392N72n26R07J458j293j01o86P40k09Q78O77j425N10k19j152J477r05
3840c16N12n37M54k94q16J519q06K75L89l46L6r2Q18q61K21j65j87O68n02J51
$$ plain form
3706 58 1244 586 265 221 -680 281 34 823 490 805 156 -503 1195 590 563 -1037 206 -1491 -1146
3725 -1146 629 -67 -96 -939 -659 820 253 -342 -885 626 751 44 394 439 1253 -981 -815 -93 -932
3744 -932 266 -137 225 200 -21 -163 -941 -299 -109 14 -167 170 446 633 1048 -1067 -717 223 -125 -952
3764 -952 -911 32 -228 184 99 -726 -157 576 242 200 -593 -72 -1289 282 -574 87 1144 132 -50 -888
3784 -888 208 -1105 823 -315 -385 56 -300 396 -591 -527 -426 -298 1146 -387 -376 -536 762 312 406
3803 406 -196 -1194 -408 -525 -513 -436 590 -257 -359 474 -679 -362 -773 -293 610 -549 805 -429 373
3822 373 -1019 -447 -973 -66 1392 99 -2 -688 52 -157 721 1398 -27 483 264 -888 589 -316
3840 -316 196 -341 113 -181 -997 522 -284 -9 380 34 70 -22 796 -65 156 -9 -196 472 -30 121
3860A21N48M73n28r4j94j112L34m14J950J17J21j580P54M78j943J180o9p3P5n92
3880d48J454l51l06K92j438J340j954J706j027J572l50j336J576j993J972q19
3896a10J79N21m37M70o75L09K01p64J093r45P38K2j017N9R20m6j527R27q77J662
3916G03j50p36j90M88L27p90o81J045p86R13M95k33n75K36p50m63J490n58J117
3935I02j604J214l76l13m24P59J78r82J054q07L19j23k34j21K93K36M08j231K363
3954A511j884oL20j049J742j843J365o84P33L64q83M62J17P46j646Q02m28J28
3972a33M23r10R21j432J360N52j863K064q16J79n32lO17j119Q06j486R26j75K52
3991c69J041r15P10r85J742j441L7Q83j368J000o95J190o54L22j91k015K009m26
$$ plain form
3860 121 669 1142 614 520 326 -786 -452 -866 1084 1201 1322 -258 496 974 -969 211 142 69 144 -448
3880 -448 1006 655 349 641 -797 543 -1411 295 -732 840 490 -846 730 -1263 709 -110
3896 -110 69 590 153 623 -52 257 458 -306 787 -158 580 602 -415 -356 564 518 -1009 -82 -959 703
3916 703 553 -183 -373 115 442 -348 -1029 16 -770 143 638 405 -170 66 -684 -1147 343 -215 902
3935 902 -702 512 136 -177 -601 158 336 -646 408 -399 -80 -203 -437 -558 -265 -29 379 -852 1511
3954 1511 -373 -379 -59 -1108 634 -1209 156 -528 205 569 -314 148 265 1011 -635 167 -261 -133
3972 -133 290 -620 301 -1131 229 781 -1082 982 166 345 -187 -190 427 -692 114 -1372 -446 -621 -369
3991 -369 672 -243 467 -518 1224 -217 -180 703 -665 335 -360 830 176 498 307 -1708 301 -125
4009a25J169n89n26J600k120K30O87m5n20K74O11j582J116R21q01k16M62n39Q6
4028I3o74L85Q91q37J064N82j667N18q81J006j81m61K19j059Q68l0j78R45p48
4047a45M43k27k28N90k84L25j231kM55n97J124K82k56j74M63n03l27L00K47k8
4067B27j083J099P70j314P00j479J145j142J740j085K88M58m35L14j344K011j794
4084i24J497L53j547K69l58J109q69M95O95j332P98J71L57k94o57M24k02q20J078
4103B43n29j29j0M94k87m02m69J414p6N20j83p03k74L38K41m04J122N24j948J23
4123c95J131j243J46p16J597o13J733j962M0M33l46K74l13P33l46p33K1j26J314
4142F29j74l29K65m95Q06j054O36o36J80L91j288J455m25j50M56n87O95rj040
$$ plain form
4009 -125 1044 455 -71 1529 -591 -361 326 281 -239 35 646 -936 180 1101 300 84 546 7 93
4028 93 -581 -196 695 -142 922 1504 -163 355 -526 480 299 -162 57 -1002 -134 -164 -342 603 -145
4047 -145 298 71 -157 433 149 474 -757 -759 -304 -901 223 505 249 75 538 35 -292 8 255 227
4067 227 -856 243 1013 -301 399 -1080 65 -1077 663 -422 -134 324 -111 203 -1141 870 -924
4084 -924 573 926 -621 -352 -710 399 -470 25 720 -612 186 357 714 420 -237 187 -15 -835 243
4103 243 -286 -415 -425 69 -218 -620 -1089 325 249 769 586 -117 -391 -53 188 -216 906 1430 -518 -395
4123 -395 736 -507 -361 -1077 520 -93 1640 -322 -282 151 -195 79 -234 499 153 -580 -559 -685 629
4142 629 455 126 391 -104 702 -352 284 -352 -172 219 -1069 386 -39 -189 267 -320 375 366 -674
4161f74P36L13o72N45j14k71p8j73O93J9j74l80K30L67p03L07m86l60J052m68
4181b91M90P26p52j703J490K57p57J202p95m58o32J694Q4j321N41o05J098J5k9
4200B54r55K35J683p82n25l87N56K76j392J184m45J91n5J96J53j27l16L7J706
4219A487j824K86k2m64J841q78l6j397J75J701o06o10Q56m78m46m23R96j082Q08
4238a16M8M91j118P26n67J066j255jP63J330k108l51J311K17l97r02J927j704
4256f40J123n28k84R04m48J10K6n65K23o15J762j534M08J064j381k29Q72j270
4274a002k43J690q33L46n41L14Jk36J912k148K196o20j281J139j468J526o43j50
4292d1l66K69M97L48r81p00K455j789K35j59l40m72K82J048r06L9L33l62O61N65
$$ plain form
4161 -674 62 375 -297 248 134 -137 -215 -388 305 324 150 -230 0 367 -336 -29 -515 -875 177 -291
4181 -291 199 925 173 -1530 -40 217 -540 662 -133 -591 -1223 471 555 -766 -225 -830 268 283 254
4200 254 -701 -466 1217 435 -90 -477 79 355 -1037 147 -298 -107 -162 34 187 60 -256 -219 1487
4219 1487 -337 -51 -73 -537 1304 426 390 -1007 -832 869 263 -347 509 31 -415 -838 158 -924 -116
4238 -116 -68 423 -695 31 -536 530 -725 -726 37 1367 -741 -1092 219 436 39 -863 1064 -640
4256 -640 483 -45 -329 575 127 237 263 -302 -79 -694 1068 -466 -58 1006 -375 -604 268 -1002
4274 -1002 -1245 445 -388 -42 -583 -269 -268 -504 1408 -740 1456 836 -445 694 -774 752 109 -41
4292 -41 -407 -138 359 707 -274 -974 1481 -308 -73 -232 -572 -1044 -762 286 -620 -581 -248 -610 51 616
4312F16M66l91m38K01q40Q70o55J46R7M04q86m48J307p71J41P94j416J462L99
4331A058r19m57K07n40J9Q88n76L91o72P90O2k96L29k22N74l54j026J748j651
4350f47J993k399J192j086N34O4j037K035p81K70k71k47R83j284k12P69N13Q23
4368A212j804J326k259K511j510P64O35r96O35o48O7n30M03O54o83n66p2J390
4386E29j83k43m38l03J057q02R23j010R25j157Q56M11j361J476n35n01O13N0J72
4405D79j348J644K44j632J118j043k15J99Q52q02J44K97m69J480n95j110J308
4422E51l60j19r96J469J66p64j32Q5q50R8J134j122k18J390j453J240L7l9l20
4441b03L58m6m07J091r24j46M56j848K283o11J062j060o21J161j338J473K63L8
$$ plain form
4312 616 1082 691 253 454 -386 484 -171 -25 72 476 -410 -858 449 -322 -181 613 -803 659 1058
4331 1058 139 -318 -111 -651 -632 256 -320 71 -601 189 251 -45 284 62 636 282 -744 1004 -647
4350 -647 1346 -1053 139 -947 -413 -349 -1386 649 -132 138 -133 -380 603 -681 -893 -124 389 1212
4368 1212 -592 734 -1525 986 -524 240 875 -121 514 -134 -67 -597 -194 460 -223 -789 -861 529
4386 529 346 103 -335 -638 419 -383 540 -470 455 -702 154 565 -796 680 145 -356 257 307 479
4405 479 -869 775 1019 -613 505 -538 -753 -554 298 -504 -360 -63 -532 948 353 -757 551
4422 551 191 72 -924 545 711 -53 -185 -100 -950 -852 282 -840 -1058 332 -1121 119 156 117 -203
4441 -203 155 109 -298 793 -131 -277 179 -1669 614 3 1065 5 -616 545 -793 680 943 981
4459I81j02n67P75q80J82p27J637j616j8O26n77K415l508J565n4J10j76O63q44
4478a15L8R09j556J894j525l82J699j584R64m74N34n67m96P24p24K26O72j317
4496a080J503l76k13O68k30l37M61k60n97K64K49N23o60Q28m10p13J52k79J309
4515H02r41o90P96k47l8m69J693n52o89N8j06P10q23N9J98Q6N9P33q6k92K2k00
4537H3n45P22l40J025j489o87J983q58j3l78O89j55o04R31o16j78n08J278K55
4556E95o45l58j294J786m69p65r4R73N00j34N2j344J592k46r05J104j009J747
4574A086p07l00J29r91K96M54L21o21J373j071j33O53l66k82j63k88R56o21n14
4593g89p34J588n37l88J071k85J103o54O33j466O98K51m86j05l16J211n91j324
$$ plain form
4459 981 879 312 1087 207 389 -338 1299 -317 -335 291 -286 2129 -1379 186 132 242 66 729 -115
4478 -115 -77 832 -724 1170 -355 -737 962 -622 342 -132 402 -165 -661 63 -661 -435 237 -1080
4496 -1080 423 47 -166 502 272 -65 396 136 -461 -197 52 575 -85 743 333 -380 -228 -507 802
4515 802 -139 -829 -33 -280 -318 -787 906 354 -335 -277 -383 327 -496 -437 -239 -153 -94 639 553 261 283 83
4537 83 -462 260 -80 945 -544 -1231 752 -106 -119 -497 192 37 -567 364 -252 -430 -938 340 595
4556 595 -50 -408 -1702 84 -385 -1150 -1244 -271 229 95 147 -1197 395 149 -756 348 -661 1086
4574 1086 379 79 208 -783 -487 -33 288 -333 1040 -31 -164 489 123 -159 -322 -610 346 -275 -789
4593 -789 -1523 65 -472 -860 211 -74 1029 375 1008 -458 240 491 5 -100 -416 795 204 -1120
4611a120J964p2j39o86O75l27L57q19M15L05L15m59L78o46L84p76O69p98p79J931
4631G72j555P80o56K54N04M65P4j070J10M0L23l4M4N21n43J485j720O62j123O41
4651b6j04J41J017l200L373o95j13J468k672J601q56M81j081p5J743j227P38j121
4669f08J295j000l35J163K53k92j196J626j390R09K9l16J274o41m20n64O97j85
4687B99J41M47q56l30N39j948J996j567J448n17P2p47j30J499j057J665o10j011
4705f67L09M02N67j613J184L01m02J296q44j84j375J863r77O3J66q51J263j260
4723g59J070m30N04K81j425M16J117l45mJ04r8n45o00k75M57L81R96j691J79J471
4743H04j340Q94Q86j304K09j113J286k76J55L45n21J135j290J32j242N32P07n35
$$ plain form
4611 -1120 844 772 633 -53 622 295 652 -167 248 553 868 409 787 141 525 -251 418 -380 -1159 772
4631 772 -783 -3 -659 -405 99 564 638 -432 -322 -282 41 7 51 572 29 1514 -206 456 -667 -26
4651 -26 -130 11 1028 -2172 1201 506 393 1861 -811 790 -66 415 -666 -741 1002 -225 513 -608
4669 -608 687 -313 -648 515 768 476 -720 906 -484 425 454 138 1412 771 351 -213 484 299
4687 299 440 887 31 -299 240 -1708 288 -1279 169 -348 -276 -1023 -1153 346 -711 954 344 -667
4705 -667 -358 44 611 -1002 182 483 81 1377 533 349 -1026 837 -140 -77 89 -762 501 -759
4723 -759 311 -119 385 666 -759 -343 774 429 425 529 431 -114 -714 -989 -532 -151 845 -846 -667 804
4743 804 -536 358 1244 -60 149 -964 322 46 201 546 25 1160 -130 2 -1240 -708 -1 -536
4761e36O80N12j188R80K09Kk47n98k16K95p12J472K06j533j73J54J66K39O04M44
4781G60j145J016p34J95Q23q44K62j124O92j66P97n91r49N96k32K93L35l68J03
4800b81L35j84p84Q08j34P23j225M46M27k87n08J062l85L45n45K37m31JK08M1
4820a31Q09j886J361k12O02J40j626J366j146J096j163J102K67j319K017j694
4836d17P01N9o20K05j150Q89o82J269L36J51q47j6J605j803J147r96n0L21k64
4855a62N60j751J909j340j14M01k19J441j357L91P44o60J50p42J796j571J134
4872F10j60j532J462j271K069J9j024K51q71O83r98O03j94L25P19p71M55p00P21
4891C96l44o14J301l06N83j715N59J40r3K6j269K407j102k58N96L93o70L2L04
$$ plain form
4761 -536 144 656 -532 448 657 659 412 -186 -402 -107 -819 653 859 -674 -847 -693 -527 -288 316 760
4781 760 -385 631 -103 92 915 71 333 -791 -99 -265 532 -59 -1008 -412 -644 -351 -16 -384 -281
4800 -281 54 -130 -914 -106 -240 483 -742 -296 131 -156 -664 398 13 358 -187 50 -381 -380 -172 -131
4820 -131 678 -1208 153 -59 543 683 -943 423 -723 373 -790 312 579 -740 1277 -417
4836 -417 284 343 -277 -72 -1222 -333 -1015 254 590 741 -106 -122 1483 -320 827 -169 -219 102 -162
4855 -162 398 -1353 556 -784 -898 -497 -716 725 -632 -241 503 -157 -7 -749 1047 -524 610
4872 610 450 -1082 380 -891 1178 1197 173 424 -447 236 -762 -159 -353 -28 691 -80 375 -325 396
4891 396 52 -562 739 433 1016 -699 -140 0 -93 -67 -1336 1071 -31 -289 307 700 30 62 366
4910C66m66J96j120O75O71p17J148n01K75m35k39J113j554R82m15j28J289k181
4928a041J425p53Q67K17q92L57j458J453p37K02l33J94Q95j102N11p25K349j132
4946B97n81L79J29K07j314P72l6j5J218j877J025m98p7o31O99J339j597J015j133
4965f79L08L44n62Q08K06L47o37p08M69M27N49j454J050n84m42R06q52Q84j214
4984h34J222j43j188K15k28J325K5M78j169J217o75j106P07N37o11P34n1O54j327
5003b18p0j026J275p2k18P72Q9l49o5m95m89P02J242j882J175Q06n71m30q54P67
5023H9k99q7J5l75N19n5k19L59P19j038M07J10q44J746j392P71j161K20M82o52
5043f85R98j072K76K10j30L32L25Q42j746J709j093J3o16l44Q92k23N86n60J088
$$ plain form
4910 366 -100 96 -1024 -349 322 -395 753 252 527 92 -147 966 -588 394 -21 -149 1140 -1041
4928 -1041 384 -369 498 715 -177 180 -1278 175 -562 -360 -693 -499 396 -706 -195 -920 1429 297
4946 297 -284 95 224 431 -883 -111 -147 -162 1056 -821 204 -294 -371 -1002 -303 1036 -561 454 -679
4965 -679 -371 -27 -589 219 425 772 135 -573 -104 323 872 -582 468 -116 -558 348 -504 380 -834
4984 -834 388 245 -943 -728 -956 369 394 872 -297 920 245 -861 -154 383 -228 506 455 1109 -218
5003 -218 -288 -1314 -39 -111 -329 443 532 183 118 -377 -866 -164 1078 -804 371 1177 606 176 -678 89
5023 89 -210 -297 -282 -657 -138 -193 -412 -53 666 -372 35 145 -699 1047 -345 426 -735 -515 -33 -685
5043 -685 313 -759 -483 -273 -403 -71 254 1096 -650 1059 -34 -21 -637 -981 -89 -312 274 -286 802
5062H02L12j480J73J375j316j1K04J087j897J776k148J494n38p72J516j324J124
5079C77n7M88j766K57J146o83K75j016J516o59N12J12q31P03l09N85q15n36J370
5098F69m60j633J489n06K31q25M37Q25n43K15o71J561q04Q60k466J536m66L85
5116a66N92j669J223k91L25n8L21M81j258N68J36p29J353j021J091k81N78r27
5134B68o40n02Q41K91r13R82l91m91J040j303J552j207L70K17j70N24r48R87o89
5153a82M75o56Q44j89q32J497j649J80J042n84j22K72r3l57O41Q03j350J36Q11
5172F87N67j963L84M78k92J793j721m49J073n51j71M50q31k75P73l01l28J115
5190D38j004J443j334J676m00j580Q88m22R5l28J038p87M40K5l65M12j468J343
$$ plain form
5062 802 1114 -366 -193 1182 -134 -145 59 1146 -751 1025 -1123 371 -167 -939 577 -747 377
5079 377 320 808 -958 -701 445 -238 37 -979 537 -122 390 502 -329 374 65 650 -165 -701 669
5098 669 209 -1424 65 -441 -210 -1035 -598 227 -316 -101 -772 789 -15 845 -1621 -85 -551 -166
5116 -166 426 -1243 -20 -311 14 -44 277 758 -500 68 204 -525 828 -193 898 617 1195 268
5134 268 -372 -874 -33 258 -655 327 -64 -555 485 -818 734 -473 -103 114 -56 468 -480 507 -182
5153 -182 293 -363 481 292 -540 957 -692 -512 530 -54 -176 96 3 -354 287 1090 -260 -124 687
5172 687 1254 -709 -325 153 -139 1654 -67 -516 557 6 -165 285 -546 -821 -48 -349 -677 438
5190 438 -566 877 -457 1219 819 -761 127 -295 -200 -528 510 -277 163 188 -177 235 -1233 110
5208A10n95K55P89l34J444j722L49o07jJ280j814J078j318P61J701j602O13l93
5226fP41o73j41q1j70J367j805J781j629N04p8j474J538P08M79k9j194N02k30
5245A10J088j704J576j347N01K57j158M35O2R30j30L57j086m81P17p44J97o7N14
5264B7N53p62L28J81K4j010o51J693J5n78L22q66R92l08J62N3N0m1n97N27j72
5285e8N04r20J341l29j228J54R86r49o19J119m26J244q62K15R29j129j14J78q97
5304h61J699k627J430J931o06j561K29K11j13J293j726J72R46j106Q38l78N74
5321C45p16L42Q50o43N78j226J240j735J66O77n94R13r4k22J48k6j607R98J282
5340F76l20j102K69J360p19m5l32K4J62p03P59L34m14J066j409Q90r18k05M47
$$ plain form
5208 110 -485 -230 559 225 1669 -53 296 -311 -312 968 -846 232 -1086 -325 1376 -226 387 -6
5226 -6 735 62 -79 -160 -330 1037 -768 1013 -616 -112 -190 -1664 -126 582 1061 1032 -162 340 110
5245 110 1198 -506 1070 -277 224 481 -677 -242 -180 750 620 977 -109 -590 127 -617 -420 -487 27
5264 27 580 -182 146 327 351 -659 -1310 383 398 -180 142 -724 268 -40 122 175 225 184 -413 114 -58
5285 -58 446 -474 867 538 -690 -536 450 -499 -1118 1 -425 819 -43 172 1101 -28 -142 36 -861
5304 -861 838 -1789 -359 1572 966 -595 -366 -155 -268 1025 -701 -529 417 -689 149 -229 345
5321 345 -371 -29 821 178 756 -470 770 -965 -799 -122 -716 197 103 -119 29 3 -1604 -606 676
5340 676 356 -746 -477 883 164 119 -213 -189 -27 -730 29 363 -51 1015 -394 496 -422 -627 -180
5359a80k64Q40q26J226r09j11K69r98J774j496R10K61r66P60n60j99O81m99R74
5378F87j538O06M97M00o23O42L3j217O62m95j38O27N30o11P3J107j280K59k65
5397d4K56p1j682K436k132R31J079j202K98l46J201j413K65L07o41K03P01m18
5415b72j89J183o51J44K9j87O44j418R43n99M32K36j115J426l86j11R80j425J049
5434G13M2j72r50J190j90j734J412j308Q79R44L98r83Q06j302o84R55j43k81J234
5453H26j499J184r59J164j720J388n52o60J417j66q80Q20k41q62P17j76K6Q59
5471F86m84q49M87n87J082o76O15J25j052J123p64J298j113k16R6j37Q32o23K27
$$ plain form
5359 -180 -444 396 -430 796 -113 -224 45 -953 821 -675 235 496 -470 290 -270 -469 212 -287 687
5378 687 -851 -245 252 652 29 671 704 -513 149 -346 -484 143 673 62 135 1242 -38 221 -44
5397 -44 212 141 -1541 895 -1237 -306 773 -429 -131 -477 724 -689 -424 -117 -758 -555 146 -272
5415 -272 -461 722 71 215 244 57 701 -717 226 -373 59 295 -820 606 220 109 1089 -336 713
5434 713 755 583 -367 823 633 -1101 311 -997 -118 826 1224 241 1047 -255 -939 16 -127 -408 826
5453 826 -673 511 -448 716 -1004 384 -168 -828 589 423 -457 363 122 -740 -23 -199 -173 686
5471 686 202 -647 -160 -747 335 -341 274 399 -653 470 -294 1004 -109 -325 -229 -366 466 -157 70
$$ [...]
16383C31
##END NTUPLES=NMR FID
##END=
