##TITLE=31P_DE-80H_X3
 64 sc D2O
 26.2.2025
##JCAMPDX= 6.0         $$ Bruker NMR JCAMP-DX V2.0
##DATA TYPE= NMR FID
##DATA CLASS= NTUPLES
##ORIGIN= UXNMR, Bruker Analytische Messtechnik GmbH
##OWNER= root
$$ XWIN-NMR		Version 3.5
$$ Mon May 18 16:50:42 2026 Russian Standard Time (UT+4h)  Yarkov@DPX200
##.OBSERVE FREQUENCY= 81.013821
##.OBSERVE NUCLEUS= ^31P
##.DELAY= (6, 6)
##.ACQUISITION MODE= SIMULTANEOUS
##.ACQUISITION SCHEME= undefined
##.AVERAGES= 64
##.DIGITISER RES= 17
##SPECTROMETER/DATA SYSTEM= spect
##.PULSE SEQUENCE= zgpg30
##.SOLVENT NAME= CDCl3
##.SHIFT REFERENCE= (INTERNAL, CDCl3, 0, 243.863)
##AUDIT TRAIL= $$ (NUMBER, WHEN, WHO, WHERE, WHAT)
$$ ##TITLE= Audit trail, XWIN-NMR		Version 3.5
$$ ##JCAMPDX= 5.01
$$ ##ORIGIN= Bruker BioSpin GmbH
$$ ##OWNER= Yarkov
$$ C:/Bruker/XWIN-NMR/data/yarkov2/nmr/P31/2/audita.txt
$$ ##AUDIT TRAIL=  $$ (NUMBER, WHEN, WHO, WHERE, WHAT)
(   1,<2026-05-18 16:49:53.84 +0400>,<Yarkov>,<DPX200>,
      <created by zg, POWCHK disabled, PULCHK disabled
       configuration hash MD5:
       00 E9 B6 7A A2 85 ED C7 34 08 36 98 17 FE 4E 26
       data hash MD5: 32K
       1E 8A 59 B1 B5 88 A6 D7 56 B3 28 FA 76 05 14 4B>)
$$ ##END=
$$ 
$$ hash MD5
$$ BB A6 18 D9 4A 11 E7 41 7D 9F 54 8B F6 69 88 DE
##$RELAX= 
##$RELAX= 
##$RELAX= 
##$RELAX= 
##$RELAX= 
##$RELAX= 
##$RELAX= 
##$RELAX= 
$$ Bruker specific parameters
$$ --------------------------
##$DU= <C:/Bruker/XWIN-NMR>
##$EXPNO= 2
##$NAME= <P31>
##$PROCNO= 1
##$TYPE= <nmr>
##$USER= <yarkov2>
##$AMP= (0..31)
100 100 100 100 100 100 100 100 100 100 100 100 100 100 100 100 100 100 
100 100 100 100 100 100 100 100 100 100 100 100 100 100 
##$AQSEQ= 0
##$AQ_mod= 1
##$AUNM= <au_zg>
##$AUTOPOS= <>
##$BF1= 81.014009
##$BF2= 200.13
##$BF3= 200.13
##$BF4= 200.13
##$BF5= 200.13
##$BF6= 200.13
##$BF7= 200.13
##$BF8= 200.13
##$BYTORDA= 1
##$CFDGTYP= 0
##$CFRGTYP= 5
##$CHEMSTR= <none>
##$CNST= (0..31)
1 1 145 1 1 1 1 1 1 1 1 1 1 1 1 1 1 1 1 1 1 1 1 1 1 1 1 1 1 1 1 1 
##$CPDPRG= <waltz16>
##$CPDPRG1= <>
##$CPDPRG2= <waltz16>
##$CPDPRG3= <>
##$CPDPRG4= <mlev>
##$CPDPRG5= <mlev>
##$CPDPRG6= <mlev>
##$CPDPRG7= <mlev>
##$CPDPRG8= <mlev>
##$CPDPRGB= <>
##$CPDPRGT= <>
##$D= (0..31)
0 1 0 0 0 0 0 0 0 0.06 0 0.03 2e-05 3e-06 0 0 0.0002 0 0 0 0 0 0 0 0 0 
0 0 0 0 0 0 
##$DATE= 1779108593
##$DBL= (0..7)
120 120 120 11 120 120 24 19 
##$DBP= (0..7)
150 150 150 150 150 150 150 150 
##$DBP07= 0
##$DBPNAM0= <>
##$DBPNAM1= <>
##$DBPNAM2= <>
##$DBPNAM3= <>
##$DBPNAM4= <>
##$DBPNAM5= <>
##$DBPNAM6= <>
##$DBPNAM7= <>
##$DBPOAL= (0..7)
0.5 0.5 0.5 0.5 0.5 0.5 0.5 0.5 
##$DBPOFFS= (0..7)
0 0 0 0 0 0 0 0 
##$DE= 6
##$DECBNUC= <off>
##$DECIM= 4
##$DECNUC= <off>
##$DECSTAT= 4
##$DIGMOD= 1
##$DIGTYP= 9
##$DL= (0..7)
0 0 52 120 120 21 21 25 
##$DP= (0..7)
150 150 150 150 150 150 150 150 
##$DP07= 0
##$DPNAME0= <>
##$DPNAME1= <>
##$DPNAME2= <>
##$DPNAME3= <>
##$DPNAME4= <>
##$DPNAME5= <>
##$DPNAME6= <>
##$DPNAME7= <>
##$DPOAL= (0..7)
0.5 0.5 0.5 0.5 0.5 0.5 0.5 0.5 
##$DPOFFS= (0..7)
0 0 0 0 0 0 0 0 
$$ [...]
##$SUBNAM1= <"">
##$SUBNAM2= <"">
##$SUBNAM3= <"">
##$SUBNAM4= <"">
##$SUBNAM5= <"">
##$SUBNAM6= <"">
##$SUBNAM7= <"">
##$SUBNAM8= <"">
##$SUBNAM9= <"">
##$SW= 400.765351723535
##$SWIBOX= (0..15)
0 1 3 0 0 0 0 0 0 0 0 0 0 0 0 0 
##$SW_h= 32467.5324675325
##$TD= 32768
##$TD0= 1
##$TE= 0
##$TE2= 300
##$TE3= 300
##$TEG= 300
##$TL= (0..7)
0 120 53 12 22 120 120 120 
##$TP= (0..7)
150 150 150 150 150 150 150 150 
##$TP07= 0
##$TPNAME0= <>
##$TPNAME1= <>
##$TPNAME2= <>
##$TPNAME3= <>
##$TPNAME4= <>
##$TPNAME5= <>
##$TPNAME6= <>
##$TPNAME7= <>
##$TPOAL= (0..7)
0.5 0.5 0.5 0.5 0.5 0.5 0.5 0.5 
##$TPOFFS= (0..7)
0 0 0 0 0 0 0 0 
##$TUNHIN= 0
##$TUNHOUT= 0
##$TUNXOUT= 0
##$USERA1= <user>
##$USERA2= <user>
##$USERA3= <user>
##$USERA4= <user>
##$USERA5= <user>
##$V9= 5
##$VALIST= <valist>
##$VCLIST= <CCCCCCCCCCCCCCC>
##$VD= 0
##$VDLIST= <DDDDDDDDDDDDDDD>
##$VPLIST= <PPPPPPPPPPPPPPP>
##$VTLIST= <TTTTTTTTTTTTTTT>
##$WBST= 1024
##$WBSW= 4
##$XGAIN= (0..3)
0 0 0 0 
##$XL= 0
##$YL= 0
##$YMAX_a= 4725
##$YMIN_a= -5430
##$ZGOPTNS= <>
##$ZL1= 120
##$ZL2= 120
##$ZL3= 120
##$ZL4= 120
##$ABSF1= 60
##$ABSF2= -190
##$ABSG= 5
##$ABSL= 3
##$ALPHA= 0
##$AQORDER= 0
##$ASSFAC= 0
##$ASSFACI= 0
##$ASSFACX= 0
##$ASSWID= 0
##$AUNMP= <proc_1d>
##$AZFE= 0.1
##$AZFW= 0.5
##$BCFW= 1
##$BC_mod= 2
##$BYTORDP= 1
##$COROFFS= 0
##$CY= 9.86611175537109
##$DATMOD= 1
##$DC= 1
##$DFILT= <>
##$DTYPP= 0
##$F1P= 182.462994727601
##$F2P= 168.069089081705
##$FCOR= 0.5
##$FTSIZE= 0
##$FT_mod= 0
##$GAMMA= 1
##$GB= 0
##$INTBC= 1
##$INTSCL= 1
##$ISEN= 30
##$LB= 1.5
##$LEV0= 0
##$LPBIN= 0
##$MAXI= 11.51145
##$MC2= 0
##$MEAN= 0
##$ME_mod= 0
##$MI= 1.244541
##$NCOEF= 0
##$NC_proc= 0
##$NLEV= 6
##$NOISF1= 0
##$NOISF2= 0
##$NSP= 1
##$NTH_PI= 0
##$NZP= 1
##$OFFSET= 243.8632
##$PC= 1.4
##$PHC0= 1604.601
##$PHC1= 73.15952
##$PH_mod= 0
##$PKNL= yes
##$PPARMOD= 0
##$PSCAL= 0
##$PSIGN= 0
##$REVERSE= no
##$SF= 81.0140731611343
##$SI= 65536
##$SIGF1= 0
##$SIGF2= 0
##$SINO= 80
##$SIOLD= 65536
##$SREGLST= <31P.CDCl3>
##$SSB= 0
##$STSI= 0
##$STSR= 0
##$SW_p= 25641.0256410257
##$SYMM= 0
##$S_DEV= 0
##$TDeff= 0
##$TDoff= 0
##$TI= <>
##$TILT= no
##$TM1= 0
##$TM2= 0
##$TOPLEV= 0
##$USERP1= <user>
##$USERP2= <user>
##$USERP3= <user>
##$USERP4= <user>
##$USERP5= <user>
##$WDW= 1
##$XDIM= 64
##$YMAX_p= 0
##$YMIN_p= 0
$$ End of Bruker specific parameters
$$ ---------------------------------
##NTUPLES= NMR FID
##VAR_NAME=  TIME,          FID/REAL,        FID/IMAG
##SYMBOL=    X,             R,               I
##VAR_TYPE=  INDEPENDENT,   DEPENDENT,       DEPENDENT
##VAR_FORM=  AFFN,          ASDF,            ASDF
##VAR_DIM=   16384,         16384,           16384
##UNITS=     SECONDS,       ARBITRARY UNITS, ARBITRARY UNITS
##FACTOR=    3.08e-05,      1,               1
##FIRST=     0,             0,               0
##LAST=      0.5045964,     0,               0
##MIN=       0,             -5430,           0
##MAX=       0.5045964,     4725,            0
$$ Real data points
##PAGE= N=1
##DATA TABLE= (X++(R..R)), XYDATA
$$ [...]
$$ plain form
11364 843 -700 1049 -435 -10 808 -60 368 -604 1262 361 -667 527 -625 118 143 583 -260 456
11382 456 -207 -127 -462 569 -1149 -649 -177 758 -704 -1431 298 229 420 403 -608 541 421 -144 -586
11401 -586 -710 92 -850 6 -1061 -62 -813 506 -670 914 -379 250 16 -162 155 825 1071 -469
11419 -469 631 1098 916 232 -1343 264 -51 -593 1215 725 962 -530 707 158 -1132 130 225
11436 225 997 -474 545 -45 180 196 -351 -232 -76 1173 -10 267 195 276 154 -520 741 -1446 427
11455 427 687 -373 50 698 1430 -136 -446 -304 287 1285 753 1001 370 -800 921 339 -717 -243
11473 -243 -371 399 -362 354 -1422 -317 361 16 -1043 1025 480 -558 -581 -159 306 36 712 195
11491 195 -593 908 424 143 406 291 135 238 394 76 -457 759 -708 635 -51 348 -629 -567 616
$$ packed form
11364H43j543J749j484M25Q18q68M28r72J866r01j028J194j152P43K5M40q43P16
11382D56o63Q0l35J031j718N00M72R35j462p27J729o9J91j7j011J149j20n65m42
11401e86j24Q02r42Q56j067R99p51J319j176J584j293O29k34j78L17O70K46j540
11419d69J100M67j82o84j575J607l15n42J808m90K37j492J237n49j290J262R5
11436B25P72j471J019n90K25J6n47J19J56J249j183K77p2Q1j22o74J261k187J873
11455D27K60j060M23O48P32j566l10J42N91R98n32K48o31j170J721n82j056M74
11473b43j28P70p61P16j776J105O78l45j059K068n45j038k3M22M65k70O76n17
11491A95p88J501m84k81K63j15j56J03J56l18n33J216j467J343o86L99r77O2J183
$$ plain form
11510 616 412 736 -754 -89 -3 -266 964 133 630 -533 781 523 -711 613 290 1155 -269 284
11528 284 -200 -152 1414 -215 3 128 607 -264 109 849 -110 611 -83 -514 71 36 114 -121 1264 -595
11548 -595 761 915 -672 1084 -849 1106 -144 -540 -482 227 394 -245 1221 14 -453 -668 -825
11565 -825 99 -442 898 -336 1260 -679 -613 159 121 -109 -475 208 751 -336 629 -123 -325 -149 -92
11584 -92 541 -135 1116 -796 -427 686 -755 -513 143 193 6 150 1012 541 571 259 1329 394 -722
11603 -722 1006 -496 678 455 -447 246 871 -239 710 837 -77 -539 170 -748 1039 -566 99 -493
11621 -493 -311 596 -576 597 -1590 -341 -42 772 -714 -844 395 -917 1607 -465 181 -2 -344
11638 -344 641 -1318 -251 -1063 -453 -335 -469 1253 -455 -282 -48 -2 784 -1959 716 205 -34 1095
$$ packed form
11510F16k04L24j490O65Q6k63J230q31M97j163J314k58j234J324l23Q65j424N53
11528B84m84M8J566j629K18J25M79q71L73P40r59P21o94m31N85l5P8k35J385j859
11548e95J356J54j587J756j933J955j250l96N8P09J67o39J466j207m67k15j57
11565h25R24n41J340j234J596j939O6P72l8k30l66O83N43j087R65p52k02J76N7
11584i2O33o76J251j912L69J113j441K42O56N0j87J44Q62m71L0l12J070r35j116
11603g22J728j502J174k23r02O93O25j110R49J27r14m62P09r18J787j605O65n92
11621d93J82R07j172J173k187J249K99Q14j486j30J239j312K524k072O46j83l42
11638c44R85j959J067q12O10J18j34J722j708J73K34M6P86k743K675n11k39J129
$$ plain form
11656 1095 -254 1114 1350 416 -732 21 -91 -304 2 124 1044 -1549 -873 -346 337 595 360 -160
11674 -160 -70 -1610 -126 487 1037 -472 100 -1354 200 519 -671 186 683 1010 398 326 -288 184
11692 184 284 -1161 136 787 -644 -428 -277 -296 142 135 574 -755 -860 1185 86 -442 -192 365 -642
11711 -642 517 -1414 438 125 -1068 -763 -1065 591 -607 204 -413 119 877 -297 1189 60 230
11728 230 -27 182 825 443 -233 -1181 881 -496 -714 198 -1173 1577 -755 1136 -778 558 1521
11745 1521 -441 691 -6 -857 -1112 1007 434 -306 1255 -799 53 -698 279 95 379 201 52 596
11763 596 -420 -597 -486 985 -174 -501 345 474 -299 -116 398 117 -574 -350 990 -101 589 736
11781 736 458 -405 524 445 -1190 1021 -1533 541 -368 -183 921 1006 -77 197 1090 512 184 330
$$ packed form
11656A095j349J368K36r34j148P53j12k13L06J22R20k593O76N27O83K58k35n20
11674a60R0j540J484O13N50j509N72j454J554L19j190Q57M97L27o12p2o14M72
11692A84J00j445J297O51j431K16J51j9M38pM39j329j05K045j099n28K50N57j007
11711f42J159j931J852l13j193L05l02J656j198Q11o17N32P58j174J486j129J70
11728B30k57K09O43l82o76r48K062j377k18R12j371K750k332J891j914J336R63
11745A521j962J132o97q51k55K119n73p40J561k054Q52p51R77j84K84j78j49N44
11763E96j016j77J11J471j159l27Q46J29p73J83N14k81o91K24J340j091O90J47
11781G36k78q63R29p9j635K211k554K074r09J85J104Q5j083K74Q93n78l28J46
$$ plain form
11799 330 509 -162 -987 657 -94 -422 862 -548 -950 52 -661 -1742 58 647 -970 -511 -222
11816 -222 625 -263 -409 603 -653 931 -53 -137 47 -1132 499 418 -270 -264 -970 928 -879 985
11834 985 985 -462 -881 38 -167 -688 -153 -732 622 -1115 114 699 142 -198 -528 841 -678 344
11852 344 356 -169 788 -71 832 -275 158 -618 -22 327 421 931 368 755 282 -253 364 -669 708
11871 708 516 351 1439 520 -248 -246 28 -218 86 605 -851 -14 -64 385 -185 428 476 423 426 -1059 -698
11892 -698 -337 54 349 -723 459 -232 552 84 -195 1253 543 176 100 -309 -164 -558 1325 -119
11910 -119 941 -608 -381 1301 -246 -433 -684 557 356 -635 59 -1086 735 28 932 246 -708
11927 -708 -76 -956 1083 -160 149 -175 -307 -169 -999 742 295 515 1008 720 547 -617 537 -483
$$ packed form
11799C30J79o71q25J644p51l28J284j410m02J002p13j081J800N89j617M59K89
11816b22Q47q88j46J012j256J584r84q4J84j179J631q1o88Op06J898j807J864
11834I85%j447m19R19k05n21N35n79J354j737J229N85n57l40l30J369j519J022
11852C44J2n25R57q59R03j107M33p76N96L49R4N10n63L87m73n35O17j033J377
11871G08j92j65J088r19p68KK74k46L04N19j456Q37n0M49n70O13M8n3Lj485L61
11892f98L61L91K95j072J182o91P84m68k79J448p10l67p6m09J45l94J883j444
11910a19J060j549K27J682j547j87k51J241k01r91O94j145J821p07R04o86r54
11927g08O32q80K039j243L09l24j32J38q30J741m47K20M93k88j73j164J154j020
$$ plain form
11945 -483 403 -348 -230 400 621 -327 -805 -395 675 -656 1190 -671 1074 -183 -311 35 693 -242
11963 -242 -332 858 -449 -1091 450 -219 144 -587 41 299 -348 -337 -354 1182 632 429 1093 168 1095
11982 1095 404 -74 459 141 180 -511 1258 -424 592 -464 -27 63 469 -108 -1061 -73 136 659 1142
12001 1142 -1135 316 19 -27 21 -575 127 -349 -210 -867 1188 -169 -602 -317 -434 263 -351 140 -67
12020 -67 275 666 -509 221 823 138 -1226 -12 914 155 -1296 307 60 568 -629 769 -764
12037 -764 22 -1374 -175 87 -793 -469 -1171 143 -224 460 -701 -892 574 -10 1078 -788 -666
12054 -666 -311 981 -176 -598 817 -125 -325 237 -161 583 1165 -121 -62 779 537 -104 714 -499
12072 -499 -375 445 -349 -130 -866 -480 201 -118 655 -1126 -382 -22 -312 -297 416 -765 -796 -614 429
$$ packed form
11945d83Q86p51J18O30K21r48m78M10J070j331J846j861J745j257j28L46O58r35
11963b42r0J190j307o42J541o69L63p31O28K58o47J1j7J536n50k03O64r25R27
11982A095o91m78N33l18L9o91J769j682J016j056M37R0M06n77r53R88K09N23M83
12001A142k277J451k97m6M8n96P02m76J39o57K055j357m33K85j17O97o14M91k07
12020f7L42L91j175P30O02o85j364J214R26p59j451J603k47N08j197J398j533
12037g64P86j396J199K62q80L24p02J314l67O84j161j91J466n84J088j866J22
12054f66L55J292j157m22J415r42k00N62l98P44N82j286N9Q41k42o41Q18j213
12072d99J24Q20p94K19p36L86O81l19P73j781P44L60k90J5P13j181l1J82J043
$$ plain form
12091 429 152 602 -387 193 -1602 668 -139 444 612 -649 394 -602 -310 -904 -884 -403 -254 1096
12109 1096 -1397 43 -538 250 1563 -512 -250 -55 -575 488 713 137 220 235 -637 233 -120 631
12127 631 686 11 -382 1166 788 -1001 -188 0 839 668 -704 810 116 490 -526 23 736 -857
12145 -857 677 -666 -282 -338 -365 945 269 275 73 312 -76 142 903 -1484 358 -819 194 -32 -444
12164 -444 1057 540 -90 -283 -592 868 -34 572 867 -839 629 -531 193 116 506 -947 441 733
12182 733 234 554 -1081 490 -143 444 -422 -1275 513 187 1197 -183 -727 711 -915 496 -18
12199 -18 790 -414 291 -57 -501 -162 363 1838 -904 -170 -297 -1117 924 -247 806 368 -654 1534
12217 1534 -878 -649 -940 -452 -41 151 1305 -776 923 -1315 -108 -172 156 -124 -126 146 511 115
$$ packed form
12091D29k77M50r89N80j795K270q07N83J68j261J043r96K92n94K0M81J49J350
12109A096k493J440n81P88J313k075K62J95n20J063K25n76Q3J5q72Q70l53P51
12127F31N5o75l93J548l78j789Q13J88Q39j71j372J514o94L74j016N49P13j593
12145h57J534j343L84n6k7J310o76Ok02K39l88K18P61k387J842j177J013k26m12
12164d44J501n17o30j93l09J460r02O06K95j706J468j160P24p7L90j453J388K92
12182G33m99L20j635J571o33N87q66q53J788l26J010j380n44J438j626J411n14
12199a8Q08j204P05l48m44L39N25J475k742P34j27q20K041j171J053m38j022K188
12217A534k412K29k91M88M11J92J154k081J699k238J207o4L28k80kK72L65l96
$$ plain form
12235 115 336 -572 -622 -1141 822 -303 32 -78 -530 437 -850 328 662 498 -318 407 900 -307
12253 -307 -728 -357 -89 228 951 -139 -1234 948 -1091 708 632 -360 405 604 506 511 -991 1159 -336
12272 -336 -306 -757 282 -98 -35 1238 -590 464 -121 -698 1362 7 -222 -318 928 -710 -159 798
12290 798 -706 1299 459 700 718 686 553 -803 523 126 580 -610 341 249 -381 1529 9 -631
12308 -631 -68 516 -421 -634 40 -594 446 -466 812 520 -1199 778 -472 428 1339 -81 1637
12325 1637 -356 156 -158 -177 -103 -564 269 293 1153 383 155 -32 536 613 797 298 -160 826 -688 -269
12345 -269 230 -714 -251 -136 -352 -61 -428 -372 -498 770 789 295 134 -351 1628 218 -2 440 -403
12364 -403 298 -208 -495 -154 -585 815 -304 113 -294 1039 697 570 564 -833 -125 -309 652 399 -788
$$ packed form
12235A15K21r08n0n19J963j125L35j10m52R67j287J178L34j64q16P25M93j207
12253c07m21L71K68L17P23j090j095K182k039J799p6r92P65J99r8Nj502K150j495
12272c36L0m51J039l80O3J273j828J054n85n77K060j355k29r6J246j638N51R57
12290G98j504K005q40K41J8l2j33j356J326l97M54j190R51r2o30J910j520o40
12308f31N63N84r37k13O74o34J040r12J278k92j719J977j250R00R11j420J718
12325A637j993N12l14j9P4m61Q33K4Q60p70k28j87N68P7J84m99m58R86j514M19
12345b69M99r44M63J15k16K91l67N6j26J268J9m94j61m85J979j410k20M42q43
12364d03P01n06k87L41m31J400j119M17m07J333l42j27oj397P08j84R61k53j187
$$ plain form
12383 -788 23 552 -12 180 110 152 784 -115 -507 361 755 -366 -12 893 21 -670 1466 -661 -1002
12402 -1002 19 -452 -871 209 558 -387 -464 -333 -352 -166 -796 424 -342 671 -611 29 89 35 1163
12421 1163 -235 -61 92 -197 603 -1398 -341 -504 -10 -1230 205 400 -53 552 -1043 518 -1255
12438 -1255 334 692 364 429 24 962 -103 -499 681 -901 -295 -1041 48 -489 -169 431 -476 -519
12456 -519 -14 -119 -658 -460 -351 -929 239 -461 -205 -655 -9 -168 -361 -324 -898 -344 -695 188 -183 232
12476 232 -465 302 -782 -683 -248 -66 -1096 -549 -119 -1397 -335 -638 -65 787 -388 15 -1040 178
12494 178 507 1225 608 -672 695 -850 -1060 124 -312 -9 -356 793 -680 669 418 -81 -1429
12511 -1429 -382 382 -1532 399 -359 -381 -546 -806 479 -1085 273 -1006 -924 500 -546 336 -296
$$ packed form
12383g88Q11N29n64J92p0M2O32q99l92Q68L94j121L54R05q72o91K136k127l41
12402a002J021m71m19J080L49r45p7J31j9J86o30J220p66J013j282O40O0n4J128
12421A163j398J74J53k89Q00k001J057j63M94j220J435J95m53O05j595J561j773
12438a255J589L58l28O5m05R38j065l96J180j582O06p46J089n37L20O00r07m3
12456e19N05j05n39J98J09n78J168p00K56m50O46j59j93L7n74N54l51Q83l71M15
12476B32o97P67j084R9M35J82j030N47M30j278J062l03N73Q52j175M03j055J218
12494A78L29P18o17j280J367j545k10J184m36L03l47J149j473J349k51m99j348
12511a429J047P64j914J931p58k2j65k60J285j564J358j279Q2J424j046Q82o32
$$ plain form
12528 -296 1468 -614 -237 255 -250 131 -607 -208 726 3 -890 -274 1010 -280 -400 -1249 -353 1326
12546 1326 -83 276 573 623 -432 10 -174 301 170 1662 650 -370 -241 -205 240 2094 589 -335
12564 -335 -10 -272 501 -315 -385 -1498 -530 1110 -1137 937 -778 522 650 -392 517 -115 748 -1318
12582 -1318 1042 -58 820 109 153 1028 -519 442 -94 -1195 274 -474 -179 -657 799 54 -500 -103
12600 -103 -441 1084 868 -295 696 786 339 -698 620 210 -166 539 394 -143 -598 755 -171 92
12618 92 60 -237 509 1483 486 -417 820 158 332 440 -668 -566 -1080 -397 -768 364 -216 -596 -159
12637 -159 100 249 527 38 -703 -20 609 -461 491 -598 475 -151 -134 626 -747 382 227 447
12655 447 237 192 553 -438 -34 399 2 83 -1403 287 530 -403 -287 -816 446 567 -19 168 -146
$$ packed form
12528b96J764k082L77M92n05L81p38L99R34p23q93O16J284j290j20q49Q96J679
12546A326j409L59K97N0j055M42j84M75j31J492j012j020J29L6M45J854j505r24
12564c35L25k62P73q16p0j113R68J640k247K074j715J300J28j042R09o32Q63k066
12582a318K360j100Q78p11M4Q75j547R61n36j101J469p48K95m78J456p45n54L97
12600a03l38J525k16j163R91R0m47j037J318m10l76P05j45n37m55J353r26K63
12618I2l2k97P46R74r97r03J237o62J74J08j108J02n14O83l71J132n80l80M37
12637a59K59J49K78m89p41O83O29j070R52j089J073o26J7P60j373J129j55K20
12655D47k10m5L61r91M04M33l97Q1j486J690K43r33J16n29J262J21n86J87l14
$$ plain form
12674 -146 1114 163 675 -159 -816 -1234 -847 622 48 1321 8 -450 778 -426 1352 -948 -1252
12691 -1252 -204 23 537 709 509 -478 426 -41 92 792 -230 683 -550 -402 -38 441 -71 732
12709 732 379 562 149 932 473 -638 115 615 670 -556 190 -292 -344 -1168 150 -297 -209 -43 -204 576
12729 576 -607 437 -91 -389 -152 43 1 -199 -249 -823 246 1130 -913 -97 -418 37 -1006 1083
12747 1083 549 -166 671 -353 652 735 330 -1330 625 -577 -507 -12 -66 -248 877 -83 893 471
12765 471 -62 1164 532 318 -158 811 -731 -257 832 -277 1212 -15 1229 -436 -569 -159 -884
12782 -884 98 -537 511 -430 -324 403 -416 833 -882 -357 -853 -76 498 -166 -218 -2049 -55 207
12800 207 1780 272 -261 1021 -769 -339 388 -171 1079 -397 1220 -1010 396 257 -1291 -162
$$ packed form
12674a46J260r51N12q34o57m18L87J469n74J273j313m58J228j204J778k300l04
12691a252J048K27N14J72k00r87R04m67J33P00j022R13j233J48L64M79n12Q03
12709G32l53J83m13P83m59j111P53N00N5j226P46m82n2q24J318m47Q8J66j61P80
12729E76j183J044n28k98K37J95m2k00n0n74J069Q84k043Q16l21M55j043K089
12747A083n34p15Q37j024J005Q3m05j660J955j202P0M95n4j82J125r60R76m22
12765D71n33J226o32k14m76R69j542M74J089j109J489j227J244j665j33M10p25
12782h84R82o35J048r41J06P27q19J249j715N25m96P77N74o64n2j831J994K62
12800B07J573j508n33J282j790M30P27n59J250j476J617k230J406j39j548J129
$$ plain form
12816 -162 358 337 -564 926 -491 -530 1106 -417 320 -354 1368 506 115 675 -858 596 124 728
12834 728 -261 -325 -320 -278 -235 -798 -455 635 -619 237 -473 -313 320 -573 164 -165 -546 -173 -376 220 -215
12855 -215 734 -291 407 475 -1139 -605 -532 490 -838 -769 29 91 1093 17 288 128 -911 -74 -1076
12874 -1076 -659 262 1343 -952 -126 -858 -129 -503 -815 1474 -949 483 292 531 592 -675 -3 -301
12892 -301 395 455 -437 -32 -1021 897 -358 638 -850 -643 1153 -2049 661 -1230 167 -285 -159
12909 -159 -107 -607 1199 -760 258 2 181 318 52 1294 -1164 142 -528 -630 -302 -158 270 -38
12927 -38 -114 905 -1266 0 1208 93 -68 -387 1512 41 681 -484 -462 173 -645 -531 56 802
12945 802 690 -443 558 -716 -676 -758 -529 394 -637 394 -688 -8 522 191 662 -470 -613 -690
$$ packed form
12816a62N20k1r01J490j417l9J636j523P37o74J722q62l91N60j533J454m72O04
12834G28r89o4NM2M3n63L43J090j254Q56p10J60O33q93P37l29l81L73k03N96m35
12855b15R49j025O98O8j614N34P3J022j328O9P98O2J002j076K71j60j039Q37j002
12874a076M17R21J081k295Q26p32P29l74l12K289k423J432j91K39O1j267O72k98
12892c01O96O0q92M05r89J918j255R96j488K07J796l202K710j891J397m52J26
12909a59N2n00J806j959J018k56J79J37k66J242k458J306o70j02L28J44M28l08
12927c8p6J019k171J266J208j115j61l19J899j471O40j165K2O35q18J14N87P46
12945H02j12j133J001j274M0q2K29R23j031J031j082O80N30l31M71j132j43p7
$$ plain form
12963 -690 -697 -756 -14 -945 -116 516 -689 1162 1068 980 218 -1136 -195 -9 1157 -684 87 -752 342
12982 342 543 704 1235 -419 563 -24 -69 -727 -384 353 -1057 681 -594 354 351 110 191 -594 671
13001 671 -1986 381 435 -802 -357 -884 -195 54 -688 -1046 -419 734 -1168 1020 -1022 -303 76 160
13019 160 227 -177 737 -38 463 649 591 -181 -1507 -192 228 -449 -556 -766 1130 253 -124 -117 -1155 -360
13039 -360 -1330 -146 -656 -340 966 -814 478 290 -403 -174 -143 -80 -1187 -12 -494 110 402 -779
13057 -779 -253 238 729 614 158 102 -1664 -11 -1211 1092 675 147 -503 123 299 228 230 720 448 1453
13077 1453 -1134 1462 -500 620 -365 -137 987 -1545 1155 5 602 739 -10 209 -742 579
13093 579 -1273 751 506 1032 1279 767 1171 -794 329 -749 653 815 -435 447 152 694 -950
$$ packed form
12963f90pn9P42r31Q29O32j205J851r4q8p62j354R41J86J166j841P71q39J094
12982C42K01J61N31j654R82n87m5o58L43P37j410J738j275R48lk41Q1p85J265
13001F71k657K367N4j237M45n27O89K49p42l58O27J153j902K188k042P19L79Q4
13019A60O7m04R14p75N01J86n8p72j326J315M20o77j07k10J896q77l77Pj038P95
13039c60r70J184n10L16J306j780J292j88o93K29L1O3j107J175m82O04K92j181
13057g79N26M91M91j15m56n6j766J653j200K303m17n28o50O26J76p1KM90k72J005
13077A453k587K596j962J120r85K28J124k532K700j150N97J37p49K19r51J321
13093E79j852K024k45N26K47n12M04j965J123j078J402J62j250Q82k95N42j644
$$ plain form
13110 -950 151 -525 -774 -201 -535 655 -278 479 579 190 -91 -569 510 9 -715 -230 116 -183 -544
13129 -544 317 732 10 614 650 -375 792 529 696 -545 448 -33 181 -681 87 2388 -123 963
13147 963 -1160 -718 859 -151 -786 201 1307 -467 178 372 -491 -187 -1199 988 -774 924 363
13164 363 -757 980 397 -229 -506 565 299 -273 -141 -570 483 -1043 21 1064 -327 221 -463
13181 -463 -289 -164 188 -516 38 1058 -802 220 -710 -317 408 -188 782 -259 551 432 380 225 -960
13200 -960 1542 668 1230 68 -418 338 259 412 -524 378 449 -383 -664 952 -703 494 -1251 -216
13218 -216 197 -825 -335 401 -365 -185 -543 -498 629 -231 587 147 670 -621 240 751 -1390 134
13236 134 -76 -383 157 -473 785 -495 -140 -654 -557 997 -1342 622 924 594 -1144 -374 402 -220
$$ packed form
13110i50J101o76k49N73l34J190r33P57J00l89k81m78J079n01p24M85L46k99l61
13129e44Q61M15p22O04L6j025J167k63J67j241R93m81K14q62P68K301k511J086
13147I63k123M42J577j010o35R87J106j774O45J94q63L04j012K187j762J698n61
13164C63j120J737n83o26k77J071k66n72J32m29J053j526J064J043j391N48o84
13181d63J74J25L52p04N54J020j860J022r30L93P25n96R70j041Q10j19n2j55j185
13200i60K502q74N62j162m86P56p9J53r36R02P1q32k81J616j655J197j745J035
13218b16M13j022M90P36p66J80l58M5J127q60Q18m40N23j291Q61N11k141J524
13236A34k10l07N40o30J258j280L55n14R7J554k339J964L02l30j738P70P76o22
$$ plain form
13254 -220 1017 -637 32 314 -189 341 467 832 -946 570 -114 -6 265 -218 79 191 -328 -180
13272 -180 -30 1407 -181 867 11 -559 1286 -1190 403 -806 833 -1607 -1193 289 -153 814
13288 814 -1582 -255 -669 948 837 -304 113 -717 991 758 954 317 -837 723 -290 708 979
13305 979 163 179 -35 202 -209 53 -425 -74 41 -1181 455 -287 1235 -253 -861 989 -215 -204
13323 -204 -415 293 -1462 599 -111 346 -145 -1178 834 898 -487 107 269 563 -1 801 515 -1239
13341 -1239 -248 -365 114 338 -836 -629 -98 481 1404 -468 669 -1047 403 -740 36 581 519 658
13359 658 -463 864 -569 662 -386 839 114 -848 229 -744 1098 -1023 1459 -73 -130 654
13375 654 5 -68 664 53 38 -364 -5 -253 -491 -1148 -38 1033 -485 -936 342 -18 369 22 710
$$ packed form
13254b20J237j654O69K82n03N30J26L65j778J516o84J08K71m83K97J12n19J48
13272a80J50J437j588J048q56n70J845k476J593j209J639k440M14J482m42R67
13288H14k396J327m14J617j11j141M17q30J708k33J96o37j154J560j013R98K71
13305I79q16J6k14K37m11K62m78L51J15j222J636p42J522j488o08J850j204J1
13323b04k11P08j755K061p10M57m91j033K012O4j385N94J62K94n64Q02k86j754
13341a239R91j17M79K24j174K07N31N79R23j872J137j716J450j143P76N45o2J39
13359F58j121J327j433J231j048J225p25r62J077r73J842k121K482j532n7P84
13375F54o49p3P32o11j5m02L59k48k38o57J110J071j518m51J278l60L87l47O88
$$ plain form
13394 710 292 281 -614 289 413 679 433 538 618 -811 623 -164 238 96 -89 -265 -972 126 44 1039
13414 1039 -289 -267 207 -348 162 -579 -1059 76 -393 -60 207 113 802 17 1636 -1199 -255 -990 -130
13433 -130 1000 -681 751 131 1603 -358 333 66 301 844 -525 160 -1272 127 863 263 -210
13450 -210 -357 277 22 213 880 208 594 662 92 -774 -1577 887 -244 210 483 260 459 21 382
13469 382 445 333 -1251 650 188 158 522 -186 557 -581 729 -413 431 394 -552 -56 215 395 -179
13488 -179 -647 794 -21 213 -243 810 -502 -833 1021 -131 330 -91 -203 -91 -352 876 650 -498
13506 -498 -988 319 -30 -180 -397 -449 1764 -368 -402 -1628 -769 1889 150 537 314 -377 508 172
13524 172 44 -235 -484 -152 -20 104 -1400 298 981 -62 -194 -269 249 -187 641 -52 -153 375 -492
$$ packed form
13394G10m18j1q95R03J24K66k46J05Q0j429J434p87M02j42j85j76p07J098q2R95
13414A039j328K2M74n55N10p41m80J135m69L33K67r4O89p85J619k835R44p35Q60
13433a30J130j681J432o20J472j961O91k67K35N43j369O85j432J399P36o00m73
13450b10j47O34k55J91O67o72L86O8n70q66q03K464j131M54K73k23J99m38L61
13469C82O3j12j584J901m62l0L64p08P43j138J310j142Q44l7r46M96K71J80n74
13488a79m68J441q15K34m56J053j312l31J854j152M61m21j12J12k61J228k26j148
13506d98m90J307l49j50k17n2K213k132l4j226Q59K658j739L87k23o91Q85l36
13524A72j28k79k49L32J32J24j504J698O83j043j32p5N18m36Q28o93j01N28q67
$$ plain form
13543 -492 376 -300 1237 -100 -416 -620 25 1096 -1454 -131 228 0 -449 46 805 -336 372 -889
13561 -889 -512 1009 63 717 -1241 -1 -428 -1142 685 -1517 459 -457 -54 79 24 759 -106 800
13579 800 487 614 480 -8 780 -26 434 -253 645 909 -255 1080 -644 -94 -716 184 -717 -780 9
13598 9 230 -225 348 -68 -37 591 151 620 -214 933 -1060 -21 -1089 -199 356 873 -366 412 -2
13617 -2 657 -380 125 -791 198 -189 448 -910 -596 -134 -670 442 -794 412 -1204 -465 436 -573
13635 -573 778 -319 647 -1718 -58 652 -584 546 -58 1060 44 577 -455 -1150 718 -39
13651 -39 337 -1777 -106 784 205 930 -801 952 -1525 1079 -653 -302 -65 -540 1074 -744 1850
13668 1850 -48 -724 365 -536 -453 -905 241 745 -336 322 -677 -317 -561 722 -175 262 538 -583
$$ packed form
13543d92Q68o76J537j337l16k04O45J071k550J323L59k28m49M95P59j141P08j261
13561h89L77J521r46O54j958J240m27p14J827k202J976r16M03J33n5P35q65R06
13579H00l13J27j34m88P88q06M60o87Q98K64j164J335j724N50o22R00r01o3P89
13598IK21m55N73m16L1O28m40M69q34J147j993J039j068Q90N55N17j239P78m14
13617bO59j037N05r16R89l87O37j358L14M62n36J112j236J206j616P39R01j009
13635e73J351j097R66k365J660P10j236J130o04J118j016N33j032o95J868p57
13651c9L76k114J671Q90n79P25j731J753k477K604j732L51K37m75J614j818K594
13668A850j898o76J089r01Q3m52J146N04j081O58r99L60k44J283q97M37K76j121
$$ plain form
13686 -583 -306 -1051 -764 -296 -656 654 -239 -4 -742 595 1274 306 100 -409 -831 -43 -73 25 296 469
13706 469 -709 -120 -388 -556 712 273 -885 -16 960 -285 197 -88 360 -134 831 219 -306 -705
13724 -705 -14 729 -1069 45 83 115 103 -194 -1425 3 556 -522 -1091 -777 782 -72 -760 -118 1115
13743 1115 -313 -154 -891 216 267 56 -662 -938 296 -475 -476 1038 -46 736 120 -1099 179 -725
13761 -725 253 -165 -730 1970 80 86 -670 58 1302 -742 966 -853 1116 229 583 -129 1086 789
13779 789 -1578 -226 -978 251 943 -377 282 505 364 130 -12 411 510 945 -789 -551 1026 -657
13797 -657 1023 266 1122 -264 841 870 29 105 -611 644 934 422 455 -706 -9 313 520 -919 804
13816 804 454 -367 -521 231 962 -378 -1180 -877 -257 369 -841 -1153 729 468 1023 -116 1311 -79
$$ packed form
13686e83K77p45K87M68l60J310q93K35p38J337O79r68k06n09m22P88l0R8K71J73
13706D69j178N89k68j68J268m39j158Q69R76j245M82k85M48m94R65o12n25l99
13724g05O91P43j798J114L8L2j2k97j231J428N53j078n69L14J559q54o88O42J233
13743A115j428J59p37J107N1k11p18k76J234p71jJ514j084P82o16j219J278r04
13761g25R78m18n65K700j890Op56P28J244k044J708j819J969q87L54p12J215k97
13779G89k367J352p52J229O92j320O59K23j41k34j42M23R9M35j734K38J577j683
13797f57J680p57Q56j386J105K9q41P6p16J255K90n12L3j161O97L22K07j439J723
13816H04l50q21j54P52P31j340q02L03O20O26j210l12J882k61N55j139J427j390
$$ plain form
13834 -79 -144 -1176 -521 1237 66 1332 -45 709 775 220 390 -1221 49 -1397 187 132 -30 518
13852 518 274 454 285 -87 1 -984 -120 -1141 204 -194 -195 11 113 354 -621 -948 -1106 -397 718 -239
13872 -239 767 -384 748 -492 -525 979 169 47 266 1104 28 106 -723 -98 -511 -265 -138 -184 447
13891 447 -166 251 -1223 -227 745 422 -535 64 407 -15 -10 741 58 -1027 1442 -257 -901 -804 318
13910 318 666 111 -625 297 -659 -1080 -216 68 -472 538 617 -966 559 39 904 -1462 752 27
13928 27 717 -445 -791 571 -842 284 31 476 446 932 726 -886 586 208 327 -308 -1323 615
13946 615 -588 1166 -1479 417 -330 -62 1258 -215 329 -33 -329 -156 -353 783 158 -549 18
13963 18 -1417 -515 196 523 -246 1102 -721 -817 683 -92 43 -1223 1386 -330 -261 -776 -45 220
$$ packed form
13834g9o5j032O55J758j171J266j377P54O6n55J70j611J270j446J584n5j62N48
13852E18k44J80j69l72Q8r85Q64j021J345l98jK06J02K41r75l27j58P09J115r57
13872b39J006j151J132j240l3J504q10j22K19Q38j076P8q29O25m13K46J27m6O31
13891D47o13M17j474R96R72l23r57N99L43m22NP51o83j085K469j699o44R7J122
13910C18L48n55p36R22r56m21Q64K84n40J010P9j583J525n20Q65k366K214p25
13928B7O90j162l46J362j413J126k53M45l0M86k06j612J472l78J19o35j015J938
13946F15j203J754k645J896p47K68J320j473N44l62k96J73j97J136o25p07N67
13963A8j435R02P11L27p69J348j823r6J500p75J35j266K609j716O9n15P31K65
$$ plain form
13981 220 276 346 -1413 -261 -221 -633 -92 -626 -781 -154 -222 -712 670 57 352 415 125 -1030 -260 -474
14001 -474 906 -261 20 1058 897 26 -821 204 259 283 477 52 212 -770 -917 162 -512 44 -873
14020 -873 1297 -168 464 290 680 512 -1198 1329 -357 655 -981 -502 745 -806 462 -434
14036 -434 218 -281 -21 579 -1542 -5 309 -879 -682 664 1015 -1117 1001 -253 -1179 -258 -309 -67
14054 -67 324 778 -1658 310 -128 -1554 -88 -48 574 -72 -447 -431 -210 54 -1015 1633 -11 -665
14072 -665 256 -30 191 -252 265 -896 303 192 -738 9 -375 -247 213 -61 63 -961 108 205 408
14091 408 -495 -711 -543 -604 -271 1098 -264 254 245 -531 454 -747 -3 208 270 -238 225 263 403 -1102
14111 -1102 -191 527 -1111 -127 4 -495 428 524 258 -214 635 379 280 418 -543 14 211 536 -480
$$ packed form
13981B20N6P0j759J152M0m12N41n34j55O27o8m90J382o13K95O3k90j155P70k14
14001d74J380j167K81J038j61q71q47J025N5K4J94m25J60r82j47J079o74N56r17
14020h73K170j465O32j74L90j68j710K527j686J012j636M79J247j551J268q96
14036d34O52m99K60O00k121J537L14j188J97J346L51k132K118j254r26R21n1K42
14054f7L91M54k436J968m38j426J466M0O22o46l75J6K21K64j069K648j644o54
14072f65R21k86K21m43N17j161J199j11r30P47l84J28M60k74J24j024J069R7K03
14091D08r03k16J68o1L33J369j362N18rp76R85j201P44K11O2n08M63L8J40j505
14111a102R11P18j638R84J31m99R23R6k66m72Q49k56r9J38r61N57J97L25j016
$$ plain form
14130 -480 214 731 64 1436 -457 -377 -775 283 35 500 82 285 1937 -346 152 -992 -535 233
14148 233 -454 794 -168 284 47 16 1058 -709 760 -723 578 -552 -668 651 -199 -969 -758
14165 -758 -52 35 365 557 174 -1066 -1000 215 1130 166 712 -234 1254 678 -1048 254 -939 364
14183 364 -1190 640 702 595 -114 -465 507 -754 -593 1026 -493 810 536 587 325 12 -750 -253
14201 -253 815 -1743 106 83 -461 265 -672 509 -811 -117 -97 103 -1175 -713 422 -960 -435 169
14219 169 -358 -336 -69 570 -190 225 82 -745 971 -477 -314 -20 2095 38 -461 152 -1388 378
14237 378 -392 545 656 -587 468 -112 958 650 -207 -37 -412 92 81 649 544 256 415 -830 12
14256 12 -289 927 572 330 179 -582 404 -520 32 592 298 -304 -29 1065 -379 920 -425 1433
$$ packed form
14130d80O94N17o67J372j893Q0l98J058k48M65m18K03J652k283M98j144M57P68
14148B33o87J248r62M52k37l1J042j767J469j483J301j130j16J319q50p70K11
14165g58P06Q7L30J92l83j240O6J215R15r64N46r46J488n76j726J302j193J303
14183C64j554J830O2j07p09l51R72j261J61J619j519J303k74N1k62l13p62M97
14201b53J068k558J849k3n44P26r37J181j320O94K0K00j278M62J135j382N25O04
14219A69n27K2K67O39p60M15j43q27J716j448J63K94K115k057m99O13j540J766
14237C78p70R37J11j243J055n80J070l08q57J70l75N04j1N68j05k88J59j245Q42
14256A2l01J216l55k42j51p61R86r24N52N60k94o02K75J094j444J299j345J858
$$ plain form
14274 1433 1266 72 -16 -245 375 -1760 -664 -102 236 -219 -50 492 -360 -735 882 313 208 -312
14292 -312 460 209 -190 668 -525 -885 -348 131 -271 -870 1128 -492 402 1084 -840 -135 -284 814
14310 814 -749 -184 1071 -820 493 -15 639 -679 393 387 -313 189 -576 652 -1388 320 293 1093
14328 1093 -155 -348 -26 358 1350 -233 -1001 82 -903 939 -1388 -171 47 -1121 801 -752
14344 -752 911 797 367 975 -91 -835 -116 -522 77 610 -269 453 -374 -782 1051 -744 596 134
14362 134 275 -70 -68 621 -202 239 1510 -22 195 -678 940 576 -1191 696 -983 632 8 -107
14380 -107 -697 758 757 102 565 -621 -1646 576 -78 -653 934 -831 -1095 735 -362 314 -725
14397 -725 -114 184 334 -1309 393 -478 145 -794 1245 -326 -505 563 -605 482 -76 214 -18
$$ packed form
14274A433j67j194q8k29O20k135J096N62L38m55J69N42q52l75J617n69j05n20
14292c12P72k51l99Q58j193l60N37M79m02n99J998j620Q94O82j924P05j49J098
14310H14j563N65J255j891J313n08O54j318J072op00N02p65J228k040J708k7Q00
14328A093j248j93L22L84R92j583p68J083r85J842k327J217K18j168J922j553
14344g52J663j14m30O08j066p44P19m06N99N33q79P22q27m08J833j795J340m62
14362A34J41l45KO89q23M41J271j532K17q73J618l64j767J887j679J615o24j15
14380a07n90J455jo55M63j186j025K222o54n75J587j765k64J830j097O76j039
14397g25O11K98J50j643J702q71O23r39K039j571j79J068j168J087n58K90k32
$$ plain form
14414 -18 -2 643 -316 -105 -828 300 -406 -808 103 393 525 -582 1044 164 -637 801 59 568 -480
14433 -480 452 -278 -685 447 -2198 813 -681 -261 -322 -187 12 -1259 871 -1235 211 -421 -965
14450 -965 819 -1046 135 -412 -874 -827 749 609 320 1231 -1141 -366 933 275 554 -377 1131 -876
14468 -876 -355 -735 -958 -437 -718 661 146 -458 1621 -529 469 459 -408 -420 -355 -607 -336 187 -337 599
14488 599 -55 -643 876 1676 337 -532 -312 -188 -866 85 -235 507 -896 1196 -249 -600 53 233
14506 233 1846 34 550 -557 -398 431 -163 -839 -186 254 -48 -386 605 120 569 734 -551 416
14524 416 -962 827 -163 274 -1045 121 696 427 1000 38 1703 247 231 18 -1276 982 -39
14541 -39 751 -297 -959 473 -318 714 7 433 185 904 733 -647 558 -113 -5 -105 -917 368
$$ packed form
14414a8J6O45r59K11p23J128p06m02R11K90J32j107J626q80q01J438p42N09j048
14433d80R32p30m07J132k645L011j494M20o1J35J99j271K130k106J446o32n44
14450i65J784j865J181n47m62M7J576j40k89R11k372P75J299o58K79r31J508k007
14468h76N21l80k23N21k81J379n15o04K079k150R98j0q67j2O5k52K71N23n24R36
14488E99o54n88J519Q00j339q69K20J24o78R51l20P42j403K092j445l51O53J80
14506B33J613j812N16j107J59Q29n94o76O53M40l02l38R91m85M49J65j285R67
14524D16j378J789r90M37j319J166N75k69N73r62J665j456j6k13j294K258j021
14541c9P90j048o62J432p91J032p07M26k48P19j71j380J205o71J08j00q12J285
$$ plain form
14559 368 -592 620 -942 474 -203 -1325 282 -1123 704 -435 72 -209 164 353 -755 -910 412
14576 412 -261 292 448 -135 -275 650 -407 -206 1210 -6 -452 -287 321 -77 -446 701 -414 719
14594 719 533 579 814 -219 390 -414 260 158 -267 -144 -155 681 -314 -119 -886 846 1056 -663 460
14613 460 -920 -576 -875 323 901 -20 807 113 -96 80 -1075 280 -566 168 -133 -668 -326 125
14631 125 55 -525 375 256 293 -160 -635 536 420 1374 201 -481 -33 -585 268 -911 95 213 11
14650 11 -358 -681 -611 -671 953 -357 203 675 892 419 -68 18 -732 -258 -633 641 483 1237 -785 316
14670 316 690 -792 783 104 -9 183 -188 165 -749 304 951 325 635 238 -339 1197 -174 981
14688 981 -88 -507 334 -473 30 -1044 -266 -209 447 -327 -306 808 695 393 -402 1824 457 -1062
$$ packed form
14559C68r60J212j562J416o77j122J607j405J827j139N07k81L73J89j108j55J322
14576D12o73N53J56n83j40R25j057K01J416j216m46J65O08l98l69J147j115J133
14594G19j86M6K35j033O09q04O74j02m25J23j1Q36r95J95p67J732K10j719J123
14613D60j380L44k99J198N78r21Q27o94k09J76j155J355q46P34l01n35L42M51
14631A25p0n80R00j19L7m53m75J171j16R54j173o82M48n52Q53j179J006J18k02
14650A1l69l23P0o0J624j310N60M72K17m73m87Q6p50M74l75J274j58P54k022J101
14670C16L74j482J575o79j13J92l71L53r14J053O47o26L10l97n77J536j371J155
14688I81j069m19Q41q07N03j074P78N7O56p74K1J114j13l02p95K226j367j519
$$ plain form
14706 -1062 969 -785 508 -21 -869 -320 -714 246 -784 989 -795 967 141 -1108 804 -167
14722 -167 -79 869 -515 -921 -70 -71 -474 773 -1343 236 447 -798 305 -479 -124 -907 -398 -115 -706
14741 -706 876 343 -134 227 -731 424 -1065 471 573 377 -123 -434 304 880 383 -108 -523 586
14759 586 225 697 275 1075 -254 1050 -182 -576 211 -326 -346 55 105 47 1025 322 -1699 750 -1090
14778 -1090 -986 889 -199 789 1011 -594 -1366 18 370 449 423 -592 913 121 -1597 -134 -502
14795 -502 189 -142 -319 372 -582 724 -102 -154 -162 -954 658 168 637 -641 865 -110 677 482 -669
14814 -669 508 -167 1187 -873 -561 197 -165 -265 91 658 -1527 -484 -161 -670 832 -939 -723
14831 -723 -818 -185 837 -1449 470 -919 114 1820 -1613 -1039 -507 1195 -844 1234 97 -138
$$ packed form
14706a062K031j754J293n29q48N49l94R60j030J773j784J762q26j249J912r71
14722a67Q8R48j384m06Q51jm03J247k116J579K11j245J103p84L55p83N09K83n91
14741g06J582n33m77L61r58J155j489J536J02j96n00l11P38N76m97m91m15J109
14759E86l61M72m22Q00j329J304j232l94P87n37k0M01N0n8R78p03k021K449j840
14778a090J04J875j088R88K22j605p72J384L52P9k6j015J505p92j718J463l68
14795e02O91l31j77O91r54J306q26n2qp92J612m90M69j278J506r75P87j95j151
14814f69J177o75J354k060L12P58l62j00L56N67k185J043L23n09J502j771K16
14831g23r5O33J022k286J919j389J033J706l433N74N32J702k039K078j137k35
$$ plain form
14847 -138 415 142 1055 -1090 -871 -340 -274 758 426 -231 -189 1243 683 402 1666 -352 711 -938
14865 -938 295 -203 43 1100 140 899 28 499 330 175 823 417 257 512 1245 760 -563 222 -260
14884 -260 126 -128 -1582 283 -572 32 25 -135 696 -309 663 -1060 238 -105 627 -498 -775 -372
14902 -372 -2045 376 -68 -129 -670 -1200 1243 -352 -85 51 55 1480 -1391 1009 401 924 1128 -1028
14920 -1028 157 -1166 39 -566 183 -906 -669 244 449 1152 -618 -620 -1007 -896 -137 -292 -20 -1119
14938 -1119 1203 -144 -46 555 -294 403 -666 -71 461 -670 -349 -422 749 -303 121 -382 -174 303
14956 303 -408 356 332 -43 -188 184 1062 -213 -159 -85 497 524 -179 -494 -583 706 -503 494 512 -263 1341
14977 1341 796 -214 739 297 213 -727 291 -235 352 927 -677 291 950 1449 275 -268 -889 -669
$$ packed form
14847a38N53k73R13k145K19N31O6J032l32o57M2J432n60k81J264k018J063j649
14865i38J233m98K46J057r60P59q71M71j69j55O48m06j60K55P33m85j323P85m82
14884b60L86k54j454J865q55O04pj60Q31j005R72j723J298l43P32j125k77M03
14902c72j673K421m44o1n41n30K443j595K67J36MJ425k871K400o08N23K04k156
14920a028J185j323J205o05P49j089K37R13K05P03j770kl87J11P59j55K72j099
14938a119K322j347R8O01q49O97j069N95N32j131L21p3J171j052M24n03K08M77
14956C03p11P64k4l75j45L72Q78j275N4P4N82K7p03l15q9J289j209R97J8p75J604
14977A341n45j010R53m42q4r40J018n26N87N75j604R68O59M99j174n43o21K20
$$ plain form
14995 -669 35 -90 215 522 -497 520 278 214 633 -14 -699 265 384 606 -16 -1367 -165 -7 280
15014 280 -633 -603 -260 -821 -513 648 580 695 -744 826 183 469 121 -154 118 -1280 -25 381 945
15033 945 3 -350 -7 405 -710 -133 253 -78 -306 -179 -1391 -245 -484 -419 -327 -3 -88 -174 311 801
15053 801 367 -766 -147 -74 -1560 -344 -41 -25 168 3 -283 20 980 -325 -1429 -56 -461 112
15071 112 -72 836 -530 -196 365 76 -275 72 -242 -795 -374 1058 402 -163 -316 228 153 -892 159
15090 159 214 -132 -694 138 450 -522 177 -919 436 -1244 -157 612 -946 902 98 84 -527 -64
15108 -64 -719 -768 1239 -449 104 -1521 -1201 19 -840 -374 -842 250 779 231 -1183 -1954 1049 -435
15126 -435 741 320 -537 159 -163 177 -224 2196 585 472 548 -115 588 -468 968 899 757 -448
$$ packed form
14995f69P04j25L05L07j019J017k42o4M19o47o85R64J19K22o22j351J202J58K87
15014B80r13L0L43n61L08J161o8J15j439J570o43K86l48k75K72j398J255M06N64
15033I45r42l53L43M12j115N77L86l31k28J27j212J146k39O5R2L24q5q6M85M90
15053H01m34j133O19P3j486J216L03J6J93j65k86L03R60j305j104J373m05N73
15071A12j84R08j366L34N61k89l51L47l14n53M21J432o56n65j53N44p5j045J051
15090A59N5l46n62Q32L12r72O99j096J355j680J087P69j558J848q04j4o11M63
15108f4o55m9K007j688N53j625L20J220q59M66m68J092N29n48j414p71L003j484
15126d35J176m21q57O96l22L40m01K420j611j13P6o63P03j056J436o9j42j205
$$ plain form
15144 -448 -1163 -796 160 -497 119 -227 -187 -26 -350 -1504 5 131 -43 -202 398 817 -1057 -1177 -659
15163 -659 -300 152 199 -1063 20 842 -102 -1235 -735 -310 843 451 374 930 634 63 -428 630 136
15182 136 351 111 -482 570 -1527 -390 819 -635 1940 478 -16 -927 249 652 -602 395 -875
15199 -875 211 -331 -646 102 -158 1539 -415 -470 -94 -74 1310 339 123 -938 905 -762 -55 549
15217 549 -442 787 -1391 587 -757 -17 -8 -919 1521 -1484 194 -297 47 954 -1026 -653 -59 -240
15235 -240 -350 -441 416 -761 1410 -407 139 -970 1001 307 -63 162 -127 1041 174 -151 562 -184
15253 -184 507 -425 203 44 -146 462 -612 503 574 669 -1045 -457 706 288 270 386 -80 -87 -584 841
15273 841 -54 -366 141 -610 289 -942 -760 524 736 -8 -1241 1097 -468 -144 -531 551 177 -612
$$ packed form
15144d48p15L67R56o57O16l46M0J61l24j154J509J26j74j59O00M19j874j20N18
15163f59L59M52M7j262J083Q22r44j133N00M25J153l92p7N56k96n71m91J058m94
15182A36K15k40n93J052k097J137J209j454K575j462m94r11J176M03j254R97j270
15199h75J086n42l15P48k60J697j954n5L76K0J384r71k16j061J843j667P07O04
15217E49r91J229k178J978j344P40Rr11K440l005J678m91L44R07j980L73N94j81
15235b40j10r1Q57j177K171j817N46j109J971o94l70K25k89J168q67l25P13p46
15253a84O91r32O28j59j90O08j074J115P1R5j714N88J163m18j8J16m66pm97J425
15273H41q95l12N07p51Q99j231J82J284K12p44j233K338j565L24l87J082l74p89
$$ plain form
15291 -612 1011 -782 -28 65 513 9 -1777 776 -901 193 -836 645 -242 -619 561 -307 1318
15308 1318 272 45 -112 -179 401 -1009 571 -914 -323 1805 -562 8 -670 430 289 22 -253
15325 -253 -191 1398 444 790 -181 -1606 280 328 205 -154 -992 37 556 1314 -1345 623 79 -292
15343 -292 -911 233 1364 -168 15 -17 857 -720 -617 61 -1077 1292 880 -467 656 -401 92
15360 92 -503 196 -884 -126 644 902 218 268 503 854 9 441 -456 759 -124 -948 -885 -249 607 -214
15380 -214 10 -694 -1635 -245 -500 272 -727 7 -662 -626 1400 -65 1444 -210 693 -740 80 -267
15398 -267 234 832 -74 434 911 -211 464 -79 -259 -466 339 -229 870 -83 -807 810 -325 505
15416 505 292 -273 -939 -774 585 -619 -47 529 880 244 -802 11 37 924 -940 -533 -29 -310 -225
$$ packed form
15291f12J623j793P54R3M48n04j786K553j677J094j029J481q87l77J180q68J625
15308A318j046k27j57o7N80j410J580j485N91K128k367N70o78J100j41k67k75
15325b53O2J589r54L46r71j425J886M8j23l59q38J029N19P58k659J968n44l71
15343b92o19J144J131j532J83l2Q74j577J03O78j138K369m12j347J123j057M93
15360I2n95O99j080P58P70K58o84N0K35L51q45M32q97J215q83q24O3O36Q56q21
15380b14K24p04r41J390k55P72r99P34o69L6K026j465J509j654R03j433Q20l47
15398b67N01N98r06N08M77j122O75n43j80k07Q05n68J099r53p24J617j135Q30
15416E05k13n65o66J65J359j204N72N76L51o36j046Q13K6Q87j864M07N04k81Q5
$$ plain form
15435 -225 -740 -372 -673 966 1337 -45 1000 -60 -874 935 -146 -65 -468 -17 -514 -573 -102 -131 -17
15454 -17 1459 335 536 782 205 -259 649 -866 620 -328 -739 565 334 231 -232 43 61 487 -283
15473 -283 -401 -140 -716 901 65 -127 963 -129 -998 654 -1448 172 238 649 158 147 123 110 29
15492 29 -155 885 -219 -450 -1133 500 619 -937 1261 -293 453 -549 539 675 -316 -195 -252 202
15510 202 13 112 476 49 586 -280 1848 71 276 605 791 366 -1739 -86 192 434 1299 -540
15528 -540 1338 -791 534 -355 -259 -292 404 1328 -342 -113 -444 72 818 329 91 -1157 378 314 -10
15547 -10 325 -352 502 813 -419 -373 -1200 -503 -779 -263 25 -419 543 -440 755 -511 566 1077 39
15566 39 504 -641 451 313 -879 -372 -1042 439 -672 284 276 -375 -400 -538 46 190 1212 -197 179
$$ packed form
15435b25n15L68l01J639L71j382J045j060q14J809j081Q1m03M51m97n9M71k9J14
15454a7J476j124K01K46n77m64R08j515J486r48m11J304k31j03m63K75J8M26p70
15473b83j18K61n76J617q36j92J090j092q69J652k102J620O6M11m91j1k4j3q1
15492B9j84J040j104k31o83J633J19j556K198j554P46j002J088J36r91J21n7M54
15510B02j89R9L64m27N37q66K128j777K05L29J86m25k105J653K78K42Q65j839
15528e40J878k129J325q89R6l3O96R24j670K29l31N16P46m89k38j248J535o4l24
15547a0L35o77Q54L11j232M6q27O97k76N16K88m44R62r83J195j266J077N11j038
15566C9M65j145J092j38j192N07o70J481j111R56qo51k5j38N84J44J022j409L76
$$ plain form
15585 179 620 -654 -196 -664 98 -877 185 -494 -345 606 -515 -382 1155 561 298 -454 -82 -132 277
15604 277 -7 -269 759 -489 611 -474 563 -990 221 -378 -160 731 117 -225 -519 -713 -7
15621 -7 637 38 882 -28 29 419 -646 -634 1453 -143 -232 371 95 609 -246 839 29 -46 -984 916
15641 916 606 -377 985 -120 845 559 823 -151 62 1039 -214 662 498 569 135 288 -137 196 -75
15660 -75 -453 -441 511 149 -419 795 69 1187 439 376 -205 947 433 -561 775 -766 -118 -556 875
15679 875 505 156 -520 -776 463 264 547 -42 296 342 -919 220 -492 357 134 -353 270 -524 187
15698 187 -1090 556 -311 -616 1141 -183 111 61 -1386 655 262 299 492 -304 -1038 -44 445 -418
15716 -418 -249 -300 822 -78 -870 423 108 -144 592 385 -42 -276 768 -507 374 -788 1161 519
$$ packed form
15585A79M41j274M58m68P62r75J062o79J49R51j121J33J537n94k63p52L72n0M09
15604B77k84k62J028j248J100j085J037j553J211n99K18Q91o14l42k94j94P06
15621gO44n99Q44r10N7L90j065J2K087j596q9O03k76N14q55J085q10p5r38J900
15641I16l10r83J362j105R65k86K64r74K13R77j253Q76j64P1m34J53m25L33k71
15660g5l78J2R52l62n68J214p26J118p48o3n81J152n14r94J336j541O48m38J431
15679H75l70l49o76k56J239j99K83n89L38M6j261J139p12Q49k23m87O23p94P11
15698A87j277J646q67l05J757j324K94n0j447K041l93L7J93p96p34R94M89q63
15716d18J69n1J122r00p92J293l15k52P36k07m27k34J044j275Q81j162J949o42
$$ plain form
15734 519 -551 825 -754 -1031 -36 299 380 153 -90 -620 160 -94 74 -834 -214 390 731 230 -121
15753 -121 1218 272 -638 509 -960 208 121 351 612 -1144 -582 262 47 434 -605 560 -128 -153
15771 -153 -227 -85 87 279 154 -74 1170 871 265 1148 -67 70 -160 429 -166 181 515 1192 58
15790 58 -615 582 -42 -225 143 -493 869 -928 770 -337 -472 133 248 483 -265 -2 -1053 93
15808 93 -427 -657 -146 -169 378 449 -502 -578 -391 473 289 733 -777 264 508 -1361 585 -1193 768
15827 768 19 -1002 571 -110 -146 -51 173 -785 -999 -361 -74 868 -247 -891 375 7 196 -293 10
15846 10 -776 397 -547 -383 1233 -510 613 418 466 -449 14 -1335 147 1015 -218 -1025 -162 -1171
15864 -1171 -124 894 -406 418 -663 351 -333 1119 -493 -662 -636 83 -959 -1459 -368 182 -868
$$ packed form
15734E19j070J376j579k77R95L35Q1k27k43n30P80k54J68r08O20O04L41n01l51
15753a21J339r46r10J147j469J168q7K30K61j756N62Q44k15L87j039J165o88k5
15771a53p4J42J72J92j25k28J244k99o06Q83j215J37k30N89n95L47L34O77j134
15790E8o73J197o24j83L68o36J362j797J698j107j35O05J15K35p48K63j051J146
15808I3n20k30N11k3N47P1r51p6J87Q64j84M44j510J041K44j869J946j778J961
15827G68p49j021J573o81l6R5K24r58k14O38K87R42j115o44J266l68J89m89L03
15846A0p86J173r44J64J616j743J123j95M8r15M63j349J482Q68j233q07Q63j009
15864a171J047J018j300Q24j081J014o84J452j612j69K6P19j042n00J091N50j050
$$ plain form
15881 -868 -220 -508 -651 145 403 -1140 1431 68 -230 292 155 262 -378 563 1275 -335 934 -357
15899 -357 27 -631 -406 383 -376 431 -903 801 -670 430 810 631 -933 49 371 412 351 250 -72
15918 -72 469 414 812 704 9 1160 -440 583 274 -417 -532 529 458 350 -615 -951 265 -1332 -81
15937 -81 375 -511 870 -511 263 831 -30 -132 207 -229 241 274 -323 -723 37 355 -118 -373 697
15956 697 237 -74 423 -424 -410 111 376 315 -1240 125 -116 218 -317 -545 -1107 -817 854 -665 400
15975 400 -165 243 829 -744 16 -197 271 -162 586 370 -861 -104 -1325 1117 -685 -1007 885 -465
15993 -465 1046 -1106 611 170 -466 -267 -679 -910 -1206 298 205 -207 381 556 -277 608 -9 180 75
16012 75 264 -327 69 -1265 -63 -616 -667 442 80 908 -539 797 829 -581 31 711 947 -257
$$ packed form
15881h68O48k88j43P96K58j543K571j363k98N22j37J07o40R41P12j610J269j291
15899c57L84o58K25P89p59Q07j334J704j471J100L80j79j564R82L22M1o1j01l22
15918g2N41n5L98j08o95J151j600J023l09o91j15J061p1j08r65l36J216j597J251
15937h1M56q86J381j381P74N68q61j02L39m36M70L3n97m00P60L18m73k55J070
15956F97m60l11M97q47J4N21K65o1j555J365k41L34n35k28n62K90J671j519J065
15975D00n65M08N86j573P60k13M68m33P48k16j231P57j221K442j802l22J892j350
15993d65J511k152J717m41o36J99m12k31k96J504r3m12N88J75q33Q85o17J89j05
16012G5J89n91L96j334J202n53n1J109l62Q28j447J336L2j410O12O80K36j204
$$ plain form
16030 -257 281 516 -270 -120 556 100 1051 75 28 -58 -346 -73 246 -608 -750 -91 545 748 385 -776
16050 -776 -70 663 295 -288 -355 539 267 572 -283 343 -627 445 180 -917 674 -423 1224 -713
16068 -713 23 12 624 138 -667 1443 -58 -479 1478 -502 920 -674 933 -1390 1629 543 -296
16085 -296 390 -5 1312 -587 139 -596 376 260 -906 613 -990 -94 337 770 159 -435 -33 829
16103 829 -852 460 412 -884 -936 1218 -304 -87 -716 270 -83 -1259 614 107 871 196 624 -15
16121 -15 -325 -1183 -471 481 -311 -501 543 896 158 -228 300 -308 195 1085 -1082 478 317 -906 -5
16140 -5 -445 16 514 913 -637 128 1572 286 400 245 212 688 -1451 1122 113 -977 81 -312
16158 -312 59 -378 359 -1296 559 711 587 193 141 1033 213 381 -1298 235 855 -638 1 -119
$$ packed form
16030b57N38K35p86J50O76m56R51r76m7q6k88K73L19q54j42O59O36K03l63j161
16050g76P06P33l68n83o7Q94k72L05q55O26r70J072k65j097J591j097J647j937
16068g13P36j1O12m86q05K110j501m21J957j980J422j594J607k323L019j086q39
16085b96O86l95J317j899P26p35R72j16j166J519j603Q96M31M33o11n94M02Q62
16103H29j681J312m8j296n2K154j522K17o29R86l53j176J873n07P64o75M28o39
16121a5l10q58P12R52p92j90J044L53p38l86N28o08N03Q90k167J560j61j223R01
16140em40M61M98L99j550P65J444j286J14j55l3M76k139K573j009j090J058l93
16158c12L71m37P37j655J855J52j24l94n2Q92q20J68j679J533O20j493O39j20
$$ plain form
16176 -119 -222 -1044 459 410 -1016 969 -825 1029 129 -305 778 -679 1331 -315 289 -181 -1230
16193 -1230 1331 515 928 -485 470 150 -749 -282 -351 462 410 -539 295 -634 475 -213 417 193 233
16212 233 -864 -172 901 226 692 759 416 337 103 105 73 724 -1047 -86 -131 -1136 -74 328 169 507
16232 507 92 796 -458 596 -441 -410 853 -786 1017 -274 121 576 670 -273 -1161 594 -693
16249 -693 -447 -1342 -486 290 -822 138 -28 739 22 109 234 703 675 361 249 -788 178 113 -978 1007
16269 1007 -1039 1461 1257 150 367 77 782 -1513 491 1171 487 1086 -129 1599 -1198 288
16285 288 -31 -971 385 -919 291 522 259 143 -368 562 181 -198 -535 192 -289 -1299 -631 -377
16303 -377 811 562 -35 232 -760 782 275 447 -707 -530 -90 -776 -11 -732 -891 531 331 582
$$ packed form
16176a19j03q22J503m9j426J985j794J854r00m34J083j457K010j646O04m70j049
16193a230K561q16M13j413R55l20q99M67o9Q13n2r49Q34r29J109o88O30k24M0
16212B33j097O92J073o75M66O7l43p9k34Kl2O51j771R61m5j005J062M02j59L38
16232E07m15P04j254J054j037L1J263j639J803j291L95M55R4r43q88J755j287
16249f93K46q95Q56P76j112R60j66P67p17Q7J25M69k8l14j12j037R66o5j091J985
16269A007k046K500k04j107K17k90P05k295K004O80o84N99j215J728k797J486
16285B88l19r40J356j304J210K31k63j16n11R30l81l79l37P27m81j010O68K54
16303c77J188k49n97K67r92J542n07J72j154J77M40o86P65p21j59J422k00K51
$$ plain form
16321 582 -714 1146 346 -320 164 -249 -287 754 526 -99 934 -90 -1777 1176 -941 106 634
16338 634 187 136 -307 180 -1012 959 -174 -1393 -259 -327 -98 -1004 327 1132 389 1062 -34 394
16356 394 -512 -132 -196 66 -287 -600 1561 -418 730 481 -1 618 -1377 513 -451 655 598 980
16374 980 -399 298 -1334 339 548 -299 -963 841 -183
$$ packed form
16321E82j296J860q00o66M84m13l8J041k28o25J033j024j687K953k117J047N28
16338F34m47n1m43M87j192J971j133j219J134o8K29r06J331Q05p43O73j096M28
16356C94r06L80o4K62l53l13K161j979J148k49m82O19j995J890r64J106n7L82
16374I80j379O97j632J673K09q47o64J804j024
16383a83
$$ Imaginary data points
##PAGE= N=2
##DATA TABLE= (X++(I..I)), XYDATA
$$ plain form
0 0 0 0 0 0 0 0 0 0 0 0 0 0 0 0 0 0 0 0 0 0 0 0 0 0 0 0 0 0 0 0 1 -2 1 1 -2 4 -5 2 -5 3 -1 0 -1 3 -4 5 -6 7 -8 9 -8 8 -8 8 -10
55 -10 8 -18 18 -26 26 -30 35 -47 65 -95 181 -685 -1134 3157 4298 3802 1234 -1312 -4296 -3331 -2560 63
77 63 3618 3782 3671 440 -368 -2332 -4824 -3021 88 2870 3695 3208 1666 153 -3015 -3606 -3250 -41
95 -41 2261 2950 4487 2004 -65 -2996 -4152 -2667 -1139 1495 3680 4367 1419 -970 -2540 -3077 -2666
112 -2666 -1187 2228 3336 3780 476 -883 -2890 -4913 -3516 150 2403 2021 3439 1682 -756 -2674
128 -2674 -4789 -2549 -263 2681 2558 2731 1125 -1118 -2183 -4409 -2119 -1215 1658 4411 3481 2323
144 2323 -302 -2687 -3660 -2619 -1164 2010 4179 3084 3091 -1192 -1372 -4164 -3088 -228 1065 3455
160 3455 1887 1604 -254 -2947 -3472 -3300 -1048 1695 3166 3690 1628 -246 -2515 -3348 -2689 -334 1169
$$ packed form
0@%%%%%%%%%%%%%%%%%%%%%%%%%%%%%%JlL%lOrPpQmJjMpRj1J3j5J7j7J6j6J6j8
55a0J8k6L6m4N2n6O5q2J12j60K76q66m49M291J141m96k568k546k984R65P71K623
77F3L555J64j11l231q08j964k492J803L109K782Q25m87j542j513l168n91L56L209
95d1K302O89J537k483k069k931j156J485J528K634K185O87k948k389j570n37M11
112b666J479L415J108M44l304j359k007k023J397L666K253l82J418j757k438j918
128b674k115K240K286K944j23J73j606k243j065k226K290R04K873K753r30j158
144B323k625k385r73J041J455L174K169j095Pm283j80k792J076K860J293K390
160C455j568k83j858k693n25J72K252K743J471N24k062j874k269q33O59K355J503
$$ plain form
177 1169 3112 3283 2114 199 -2258 -3792 -2625 -708 709 2229 2902 799 -688 -1734 -3834 -2941
193 -2941 -832 1761 2742 2469 1654 -1869 -3056 -2804 -2742 -1315 1917 2915 2357 2147 273 -2720 -2506 -2490
211 -2490 -367 1747 1769 2545 1027 291 -2465 -2153 -2510 -807 2113 1539 2739 1463 -16 -1932 -3141
228 -3141 -2451 -1058 1193 1101 2260 2894 -753 -1505 -2284 -1613 -537 968 2426 2355 1751 -305 -882 -3598
246 -3598 -624 -1603 1014 1346 645 1380 -2098 -1331 -1746 -1601 -7 513 2453 1693 1453 359 -2035 -981
264 -981 -2998 -265 214 2674 2235 1752 -373 -1440 -2435 -2173 -343 1509 2092 2438 655 -213 -3115
281 -3115 -2818 -1751 -899 812 1846 1978 1342 -288 -1293 -1190 -1938 47 1341 2402 1268 2406 -647
298 -647 -923 -2530 -1250 293 -267 2084 682 874 -104 -1593 -903 -2658 -755 1410 2634 2220 1666
$$ packed form
177A169J943J71j169j915k457j534J167J917J417J520O73k103j487j046k100Q93
193b941K109K593R81k73q15l523j187K52O2J427L232R98n58k10j874k993K14J6
211b490K123K114K2P76j518p36k756L12l57J703K920n74J200j276j479j916j209
228c141O90J393K251r2J159O34l647p52p79O71J076J505J458p1o04k056n77k716
246c598K974r79K617L32p01P35l478P67m15J45J594N20J940p60k40j094k394J054
264i81k017K733M79K460m39m83k125j067r95K62J830J852N83L46j783q68k902
281c115K97J067Q52J711J034J32o36j630j005J03p48J985J294J061j134J138l053
298f47k76j607J280J543n60K351j402J92r78j489O90j755J903K165J224m14n54
$$ plain form
315 1666 -662 -2798 -1584 -2568 -37 -163 1157 2461 -29 724 -1742 -1744 -1382 -1312 3005 2404 3386 869
333 869 225 -1559 -1976 -1305 -375 1865 745 2232 364 -429 -1664 -2258 -897 -246 1619 2033 2075 885
351 885 -1005 -904 -2159 -702 -402 725 1564 1521 1057 -2588 -1077 -1503 -1011 741 516 2436 1919 1001
369 1001 -977 -2015 -2100 -1892 484 2250 2055 1433 -39 -554 -1775 -1745 -1318 -386 1383 2606 1971 868
387 868 -59 -1413 -649 -1025 -926 519 1601 2613 -167 46 -1318 -1998 -674 -749 56 2175 1115 1718
405 1718 -404 -1077 -2704 -1869 159 1066 2187 1209 1129 -1371 -2369 -835 -1472 681 943 1673 1261 198
423 198 -340 -2168 -1116 -2411 679 814 2183 1841 435 -186 -2322 -2123 -1807 -392 910 2549 2936
440 2936 -152 871 -2630 -2150 -1126 -1010 1790 1291 2355 276 -993 -1757 -1843 -855 -34 1238 1428
$$ packed form
315A666k328k136J214r84K531j26J320J304k490P53k466kL62P0M317o01R82k517
333H69o44j784m17O71R30K240j120J487j868p93j235n94J361O51J865M14M2j190
351H85j890J01j255J457L00J127Q39m3m64l645J511m26M92J752k25J920n17r18
369A001j978j038q5K08K376J766j95o22j472n15j221L0M27R32J769J223o35j103
387H68r27j354P64l76R9J445J082J012k780K13j364o80J324p5Q05K119j060O03
405A718k122o73j627Q35K028R07J121r78q0k500r98J534o37K153K62P30m12j063
423A98n38j828J052j295L090J35J369l42j406o21k136J99L16J415J302J639L87
440B936l088J023l501M80J024J16K800m99J064k079j269p64q6R88Q21J272J90
$$ plain form
457 1428 2073 2638 -1609 -1810 -2327 -795 -81 999 2644 -77 1189 -1498 -1861 -1326 -1294 546 1373 1844
475 1844 1873 1028 -720 -707 -2485 -1284 -480 641 1409 1232 1203 -852 -1114 -820 -2440 -92 2460 2177
493 2177 1754 463 -596 -1985 -2760 -705 -566 1494 796 1505 236 -1268 -1167 -3021 -1342 -527 1988
510 1988 1301 484 1292 -592 -908 -2978 -1894 351 199 3116 988 586 -1289 -395 -1489 -1278 -528
527 -528 886 2530 1572 652 25 -1375 -1767 -1549 69 1114 2051 2578 829 -88 -1483 -1261 -1263 -149
545 -149 -152 1438 2192 114 -690 -2070 -854 -1777 -885 1526 1951 1394 -329 -170 -1218 -1930 -1726 -972 1306
564 1306 1419 2260 1001 -90 -1000 -1889 -1716 -230 1367 2393 3028 580 845 -2127 -1442 -1555 178
581 178 932 1908 1801 904 -311 -1456 -929 -971 -892 1173 2132 2377 1893 225 -1714 -2416 -1840 -896 1741
$$ packed form
457A428O45N65m247k01n17J532P14J080J645k721J266k687l63N35L2J840Q27M71
475A844K9q45j748J3j778J201Q04J121P68j77k9k055k62K94j620K348K552k83
493B177m23j291j059j389p75K055J39K060o98P09j269j504J01j854J679Q15K515
510A988o87q17Q08j884l16k070J084K245j52K917k128m02j875Q94j094K11P50
527e28J414J644r58r20o27j400l92K18J618J045R37N27j749r17j395K22kJ114
545a49lJ590P54k078q04j380J216r23Q92K411M25n57j723J59j048p12K04P54K278
564A306J13Q41j259j091r10q89J73J486J597J026O35k448K65k972O85j13J733
581A78P54R76j07q97j215j145N27m2P9K065R59K45m84j668j939p02N76R44K637
$$ plain form
600 1741 909 1920 667 -1079 -1158 -3769 -639 -231 1205 1622 1520 1604 -458 -619 -3102 -1707 -1850 996
618 996 2229 1597 1062 -1520 -15 -2391 -2285 -314 60 2333 2324 2132 743 -465 -1782 -2087 -495 226
636 226 2067 1286 989 16 -1124 -1075 -2694 -416 443 1693 2335 1666 -123 -1379 -1074 -3350 29 1709
654 1709 2025 2379 646 232 -1070 -2171 -616 0 903 1325 1613 1823 319 -728 -2727 -1979 190
671 190 -51 806 1954 1705 -183 -569 -1287 -1175 -1166 538 853 1840 1434 393 -1041 -1563 -1351 -510 940
690 940 1005 1192 1189 792 -1789 -735 -1049 -779 703 1449 2967 -197 255 -1322 -1413 -1318 -675 149 982 2050
710 2050 1272 -447 -265 -1431 -1451 -1682 1070 82 2565 344 -676 671 -1451 -1646 -700 818 1976
727 1976 1575 1440 -96 -607 -2201 -1841 -66 -465 274 935 2060 -33 -365 -744 -2037 -71 92 981
$$ packed form
600A741q32J011j253j746p9k611L130M08J436M17j02Q4k062j61k483J395j43K846
618I96J233o32n35k582J505k376J06J971L74K273rj92j389j208j317l05J592P21
636B26J841p81k97r73j140M9j619K278Q59J250O42o69j789j256L05k276L379J680
654A709L16L54j733m14j302j101J555O16R03M22K88K10j504j047j999P48K169
671A90k41Q57J148k49j888l86p18J12RJ704L15R87m06j041j434n22K12Q41J450
690I40O5J87ll97k581J054l14K70J482P46J518l164M52j577r1R5O43Q24Q33J068
710B050p78j719J82j166k0k31K752r88K483k221j020J347k122j95R46J518J158
727A976m01j35j536n11j594L60J775l99P39O61J125k093l32l79j293J966J63Q89
$$ plain form
745 981 1246 1055 1102 -232 -319 -1401 137 -97 232 1376 928 729 -1089 -1567 -1063 -638 -291 1162 2834
764 2834 691 432 -1309 -1244 -1622 -1736 341 283 1935 1340 -331 -1404 -1338 -1058 160 126 1116 843 536
783 536 -109 -183 -384 -1027 -1131 -1377 1156 258 -129 174 -1406 -1588 -1187 1182 665 918 1124 210 130 -561
803 -561 -1790 -2077 -256 1038 391 1313 400 154 -2266 -398 -895 -391 1212 119 2229 -153 -51
820 -51 -703 -1676 -458 -662 1965 914 456 933 -300 1285 -1806 -128 45 423 1964 -67 1296
837 1296 -776 -735 -1276 -240 183 891 658 993 380 -224 -669 -1567 -610 174 -285 1608 1460 -396 384
856 384 -60 -1385 -1472 -286 164 48 766 412 613 235 -1151 -1284 -46 871 1236 698 40 1131 -896
875 -896 -782 -1356 -257 -135 173 733 434 -369 35 -1836 -231 -697 460 686 299 1521 -266 -970
$$ packed form
745I81K65j91M7j334q7j082J538k34L29J144m48j99j818m78N04M25L47J453J672
764B834k143k59j741O5l78j14K077n8J652n95j671j073O6K80J218l4R90k73l07
783E36o45p4k01o43j04k46K533q98l87L03j580j82M01K369n17K53K06r14q0o91
803e61j229k87J821J294o47R22r13k46k420J868m97N04J603j093K110k382J02
820e1o52r73J218k04K627j051m58M77j233J585l091J678J73L78J541k031J363
837A296k072M1n41J036M23P08k33L35o13o04m45q98R57P84m59J893j48j856P80
856C84m44j325q7J186M50j16P18l54K01l78j386j33J238R17L65n38o58J091k027
875h96J14n74J099J22L08N60k99q03M04j871J605m66J157K26l87J222j787p04
$$ plain form
893 -970 -142 -1873 217 887 805 795 1967 -684 -1159 -1015 -1197 760 -477 1202 1339 270 32 -700
911 -700 -323 -870 -135 189 670 34 -96 1305 -357 -375 -671 -1127 3178 1027 1571 -563 -470 -20 -1667
930 -1667 -1546 -574 983 120 778 1019 -1100 1063 -1008 -71 -308 -82 1108 -112 1243 -23 -180
947 -180 -1611 -857 160 -483 888 946 46 261 77 -1443 -1505 -583 374 955 -171 973 1152 -479 -178
966 -178 -58 -337 1096 1275 263 -643 -68 24 -1581 595 -554 -311 153 910 -118 200 -1146 -2638
984 -2638 -1207 -543 430 -230 779 2068 -241 421 -1026 -1786 684 -658 240 288 1800 -102 -788
1001 -788 31 -1059 -475 884 810 1233 -58 -408 -155 -1429 -1606 371 -858 1040 1364 -531 303 -1017
1019 -1017 -1267 67 740 -209 136 873 -202 308 -1556 -613 -931 -338 919 949 893 1263 -1552 270
$$ packed form
893i70Q28j731K090O70q2j0J172k651m75J44j82J957j237J679J37j069k38p32
911g00L77n47P35L24M81o36j30J401j662j8k96m56M305k151N44k134R3M50j647
930a667J21R72J557q63O58K41k119K163k071R37k37K26J190j220J355j266j57
947a80j431P54J017o43J371N8r00K15j84j520o2R22R57N81j126J144J79j631L01
966a78J20k79J433J79j012r06N75R2j605K176j149K43M64P57j028L18j346j492
984b638J431O64R73o60J009J289k309O62j447p60K470j342Q98M8J512j902o86
1001g88Q19j090N84J359p4M23j291l50K53j274j77J977j229J898L24j895Q34j320
1019a017k50J334O73r49L45P37j075N10j864R43l18N93J257L0n6L70k815J822
$$ plain form
1037 270 -670 -1197 -937 236 -439 915 953 -946 -57 -1178 -1176 -1246 498 1138 -109 649 31 -1026 -1152
1056 -1152 -1535 234 585 909 -64 -303 9 -1328 -398 -870 -443 51 888 1184 394 1021 -1537 -783 -861
1075 -861 -549 -453 687 1762 971 762 -1003 -978 -583 -804 1050 1275 1165 479 487 405 -924 -38 -1752 1065
1095 1065 986 122 1110 -2000 -70 -1877 -230 -683 -93 1345 678 2172 -752 -656 -1147 -1211 -533 -350
1113 -350 2033 622 1115 257 -111 -897 -1505 190 -53 1138 27 341 -24 -1278 150 -317 248 -4
1131 -4 9 1489 995 -518 -795 -918 -808 -1198 266 -331 416 159 661 -928 -1190 -393 625 80 1051
1150 1051 301 161 80 -78 -1006 -999 -979 -528 1003 1264 848 253 -402 -847 -578 -908 -475 934 792 411
1170 411 1027 -269 -1124 -1506 -147 85 1119 480 -317 692 -1136 -123 -1059 -462 172 601 1042 581
$$ packed form
1037B70r40n27K60J173o75J354L8j899Q89j121Kp0J744O40j247P58o18j057j26
1056a152l83J769L51L24r73k39L12j337R30m72M27M94Q37K96p90O27k558P54p8
1075h61L12R6J140J075p91k09j765K5L95k21J854K25j10o86Qq2j329Q86j714K817
1095A065p9q64R88l110J930j807J647m53N90J438o67J494k924R6m91o4O78J83
1113c50K383j411M93q58l68p86o08J695k43J191j111L14l65j254J428m67N65k52
1131dJ3J480m94j513k77j23J10l90J464n97P47k57N02j589k62P97J018n45R71
1150A051p50j40q1j58r28PK0M51J531K61m16n95o55m45K69l30M33J409j42l81
1170D11O16j296q55l82J359K32J034o39p97J009j828J013r36N97O34M29M41m61
$$ plain form
1188 581 1624 -999 -1329 -568 -1392 1253 78 1076 1290 -1543 -187 -1583 -334 -1117 983 269 92
1205 92 490 -1530 445 -802 -906 -531 -184 355 240 762 -305 -770 -971 -1468 -469 -1252 1202 -195
1223 -195 791 968 -316 -337 -1848 305 757 689 1112 625 652 256 -412 -1061 -1213 -750 35 577 482 1190
1243 1190 -394 -298 -1186 -365 613 1048 857 568 374 162 -1541 -917 -745 -279 784 352 205 545 160
1262 160 -910 737 -824 -875 -335 766 784 -47 -195 95 -1864 143 -27 2166 642 651 -198 475 852
1281 852 -896 -844 637 -714 1159 1200 197 -81 -499 -745 -1463 413 -1228 1187 -37 36 -667 -717
1299 -717 -846 405 192 352 849 275 -376 -110 -1725 -531 -728 -542 642 409 428 -526 12 -976 276
1318 276 -782 -619 869 483 1327 -413 -330 -614 949 -188 511 1756 347 246 -326 95 -640 -1630
$$ packed form
1188E81J043k623l30P61q24K645j175R98K14k833J356j396J249p83K100p14j77
1205I2L98k020J975j247j04L75L47N39j15N22j067m65k01m97R99p83K454j397
1223a95R86J77j284k1j511K153M52o8M23m87K7l96o68o49j52M63P85N42r5P08
1243A190j584R6q88Q21R78M35j91k89j94k12j703O24J72M66J063m32j47L40l85
1262A60j070J647j561n1N40J101J8q31j48K90j959K007j70K193j524Rq49O73L77
1281H52j748N2J481j351J873M1j003k78m18k46p18J876j641K415j224P3p03n0
1299g17j29J251k13J60M97n74o51K66j615J194j97J86J184k33J9r54N38r88J252
1318B76j058J63J488l86Q44j740Q3k84J563j137O99J245j409j01n72M21p35r90
$$ plain form
1336 -1630 -382 766 783 1062 -177 537 160 -743 -713 207 833 -421 1642 956 -8 371 -402 -1053 -127
1355 -127 596 -2258 847 720 294 -4 -212 1060 89 -756 1429 -1031 971 -514 -285 -281 -251 645 -1050
1374 -1050 383 -719 1196 -673 -630 -375 -630 122 -6 290 529 1351 324 -482 -584 -1524 -103 -12
1392 -12 -536 1240 -851 819 -933 -55 -787 -918 -458 -104 937 -827 999 772 -1316 85 -833
1409 -833 91 -174 595 56 795 830 377 50 -312 626 -656 37 1268 -367 -188 307 -1139 63 -107
1428 -107 -361 13 322 -225 -599 242 -250 388 -182 607 265 143 966 -1309 266 110 -560 756 -54
1447 -54 675 426 569 -352 -945 -1220 -259 -309 913 434 552 672 -756 -448 902 -1291 -132 1137 547
1466 547 -280 -301 1434 -981 408 -1043 -164 898 826 1455 370 249 -414 -913 -436 -1019 1569 552
$$ packed form
1336a630J248J148J7K79j239P14l77r03L0R20O26j254K063o86r64L79p73o51R26
1355a27P23k854L105j27m26k98k08J272r71q45K185k460K002j485K29ML0Q96j695
1374a050J433j102J915j869M3K55k55P52j28K96K39Q22j027q06j02r40J421R1
1392a2n24J776k091J670j752Q78p32j31M60L54J041j764J826k27k088J401r18
1409h33R24k65P69n39P39L5m53l27l62R38j282O93J231j635J79M95j446J202j70
1428a07k54L74L09n47l74Q41m92O38n70P89l42j22Q23k275J575j56o70J316q10
1447e4P29k49J43r21n93k75R61n0J222m79J18J20j428L08J350k193J159J269n90
1466E47q27k1J735k415J389j451Q79J062p2O29j085j21o63m99M77n83K588j017
$$ plain form
1484 552 858 710 -1640 -537 -591 591 -45 1332 265 224 1191 -1230 109 -1860 139 -86 543 481
1502 481 -242 278 -509 -189 -1253 -1454 709 24 1217 581 1181 -950 -573 -421 -656 -157 962 764
1520 764 603 195 -145 -595 340 -302 700 1427 42 -13 -739 -108 -1805 -376 -184 -65 393 219 741
1539 741 120 -61 735 -44 450 473 783 534 199 -437 443 -1073 -565 -1053 542 445 288 155 557 -365
1559 -365 -37 -548 -129 479 674 1668 -441 1160 240 -531 -414 -523 452 261 665 1232 -830 -248 -1660
1578 -1660 -1123 255 140 997 165 1226 41 -1486 -598 -191 1159 -828 1203 1365 920 -509 -652
1595 -652 229 46 152 -38 515 29 -233 446 -1400 -239 -1165 -19 1795 -524 542 974 -189 -1053
1613 -1053 -521 -295 -100 -407 376 871 282 172 -1161 -1111 -1709 -551 341 815 460 467 -113 -591 -4 -405
$$ packed form
1484E52L06j48k350J103n4J182o36J377j067m1R67k421J339j969J999k25O29o2
1502D81p23N20p87L20j064k01K163o85J193o36O00k131L77J52k35M99J119j98
1520G64j61m08l40m50R35o42J002P27j385n5p26O31j697J429J92J19M58j74N22
1539G41o21j81P96p79M94K3L10k49l35o36Q80j516N08m88J595r7j57j33M02r22
1559c65L28n11M19O08J95R94k109J601r20p71J17j09R75j91M04N67k062N82j412
1578a660N37J378j15Q57q32J061j185j527Q88M07J350j987K031J62m45j429j43
1595f52Q81j83J06j90N53m86k62O79j846J161r26J146J814k319J066M32j163q64
1613a053N32K26J95l07P83M95n89j10j333N0n98J158Q92M74l55Pn80m78N87m01
$$ plain form
1633 -405 273 -38 537 150 427 -350 -434 -392 -216 -215 -955 930 -315 473 896 239 373 -68 318 47 919
1654 919 493 131 -119 398 293 -657 215 -1283 -179 776 728 1093 -807 -420 -696 -1033 131 278 760
1673 760 394 -159 22 -1673 798 -123 -101 483 1751 254 -1263 -14 -528 91 -48 706 628 270 1081
1692 1081 343 125 -647 35 -652 -370 -63 -748 1485 285 -79 -820 -507 -428 -747 410 411 -293 876
1711 876 -277 -182 -1049 -174 771 -335 452 -628 512 820 -12 53 -1247 207 258 1188 1096 600 -742
1730 -742 -1357 172 -48 -532 -752 1077 591 466 355 -481 -359 458 -578 -225 -322 1202 32 168 -48
1749 -48 -127 -781 -422 491 921 487 -224 -633 181 36 239 -363 397 1189 497 1273 -1024 -175 -654 -711 792
1770 792 54 1026 805 114 41 -608 -520 -1313 430 -108 764 -506 111 -360 -1280 -911 -248 746 33 482
$$ packed form
1633d05O78l11N75l87K77p77q4M2J76Jp40J885j245P88M23o57J34m41L86k71Q72
1654I19m26l62k50N17j05r50Q72j498J104R55m8L65j900L87k76l37J164J47M82
1673G60l66n53J81j695K471r21K2N84J268j497j517J249n14O19j39P54p8l58Q11
1692A081p38k18p72O82o87K82L07o85K233j200l64p41L13P9l19J157Jp04J169
1711H76j153R5q67Q75R45j106P87j080J140L08q32O5j300J454N1R30r2m96j342
1730g42o15J529k20m84k20J829m86j25j11q36J22Q17j036L53r7J524j170J36k16
1749d8p9o54L59R13M30m34p11m09Q14j45K03o02P60P92o92P76k297Q49m79n7J503
1770G92p38R72k21o91p3o49Q8p93J743n38Q72j270O17m71r20L69O63R94p13M49
$$ plain form
1790 482 1087 495 326 -974 930 207 -198 -125 -343 1589 124 831 -79 -251 -173 -885 -601 884 437
1809 437 -182 1146 1505 -1412 363 419 234 967 -571 556 4 747 -500 892 907 -302 650 535
1827 535 806 605 -626 80 -362 707 842 1178 -199 -403 128 -1172 -530 -647 1270 13 454 108
1845 108 -743 -304 211 -720 -341 -169 610 221 742 -1115 -122 167 -1723 178 -2463 884 593 56
1863 56 1384 -317 145 -1093 673 -344 518 1341 195 1132 -664 544 -456 -364 -457 36 1389 -654
1881 -654 1081 158 -61 -283 -1292 -66 -192 940 -261 -27 949 -201 173 -841 649 415 -165
1898 -165 1478 284 1184 -717 -575 454 -456 -482 -363 -144 759 -138 -182 -1084 -432 -2 435 488 17 -530
1918 -530 -49 898 -1479 603 -400 627 441 -354 438 1173 405 302 -415 1093 -584 349 -597 204
$$ packed form
1790D82O05n92j69j300J904p23m05P3k18J932j465P07r10j72P8p12K84J485m47
1809D37o19J328L59k917J775N6j85P33j538J127n52P43j247J392J5j209R52j15
1827E35K71k01j231P06m42J069J35L36j377k04N31j300O42j17J917j257M41l46
1845A08q51M39N15r31L79J72P79l89N21j857R93K89j890J901k641L347k91n37
1863E6J328j701M62j238J766j017Q62Q23j146R37j796J208j000R2r3M93J353k043
1881f54J735r23k19k22j009J226j26J132j201K34R76j150L74j014J490k34n80
1898a65J643j194R00j901J42J029r10k6J19K19R03q97m4r02O52M30M37N3m71n47
1918e30M81R47k377K082j003J027j86p95P92P35p68j03p17J508j677R33r46Q01
$$ plain form
1936 204 303 -270 52 321 930 -738 79 280 -537 982 5 -1083 -1423 128 708 -144 -68 29 271 -292
1956 -292 641 264 -395 692 -1093 607 -500 -857 -411 -1215 290 930 559 270 -121 802 -894 -40
1974 -40 -979 493 145 470 325 -666 1684 223 764 -90 -600 642 128 1727 -705 872 239 -789
1992 -789 -1395 -1058 1198 -505 874 -565 -195 999 -361 707 -1386 -362 -136 159 1297 508 -518
2009 -518 210 374 -94 -343 -98 270 1079 564 700 78 -715 487 568 1400 -670 604 752 -442 -134
2028 -134 -668 246 1287 526 1021 1443 713 -43 -161 273 28 138 437 972 397 -232 -439 -17 595 -309
2048 -309 -452 -726 216 876 288 -52 -254 461 386 -726 1127 -1591 1254 -955 -48 -1431 -442 1601
2066 1601 -960 627 -99 1416 129 -196 -840 -295 -156 -871 940 35 -362 -397 -1405 687 -374
$$ packed form
1936B04R9n73L22K69O09j668Q17K01q17J519r77j088l40J551N80q52P6R7K42n63
1956b92R33l77o59J087j785J700j107l57M46q04J505O40l71k89l91R23j696Q54
1974d0r39J472l48L25j45r91K350j461N41q54n10J242n14J599k432J577o33j028
1992g89o06L37K256j703J379j439L70J194j360J068k093J024K26K95J138p89j026
2009e18P28J64m68k49K45L68Q09n15J36o22p93J202Q1Q32k070J274J48j194L08
2028a34n34R14J041p61M95M22p30p56j18M34k45J10K99N35n75o29k07M22O12r04
2048c09j43k74R42O60n88l40k02P15p5j112J853k718K845k209R07j383R89K043
2066A601k561J587p26J515j287l25o44N45J39p15J811r05l97l5j008K092j061
$$ plain form
2083 -374 1546 290 224 327 -110 439 -863 -743 -571 650 -244 -164 -488 -135 474 -598 -848 337 -1137
2102 -1137 -66 -803 124 -325 -362 -53 700 83 -574 6 -50 335 -475 -226 -356 724 -631 -57 731
2121 731 909 670 448 657 -729 -633 -682 137 -1452 423 -193 -21 -103 -1293 -408 -5 502 -187 -394 509
2141 509 660 724 -477 214 -318 82 992 42 169 -274 277 -127 -625 153 385 480 -1032 655 -278 -725
2161 -725 1301 -767 1243 -833 -232 948 114 112 -216 154 -521 -40 761 -202 618 -186 1165 -259
2179 -259 -96 -470 -762 -229 -20 -222 247 959 443 362 658 -294 1157 -576 849 364 632 -158 -74 201
2199 201 -1031 -710 -503 1060 1106 -194 370 838 -424 184 -928 -41 -261 1310 -736 -101 -341 21
2217 21 -817 -1811 -66 -433 -19 1277 1628 97 -492 -1149 190 -302 796 66 -930 970 -880 149
$$ packed form
2083c74J920j256o6J03m37N49j302J20J72J221q94Q0l24L53O09j072k50J185j474
2102a137J071p37R27m49l7L09P53o17o57N80n6L85q10K49j30J080j355N74P88
2121G31J78k39k22K09j386R6m9Q19j589J875o16J72q2j190Q85M03N07o89k07R03
2141E09J51O4j201O91n32M00R10r50J27m43N51m04m98P78K32R5j512J687r33m47
2161g25K026k068K010k076O01J180q34kl28L70o75M81Q01r63Q20q04J351j424
2179b59J63l74k92N33K09k02M69P12n16q1K96r52J451j733J425m85K68p90Q4K75
2199B01j232L21K07J563M6j300N64M68j262O08j112Q87k20J571k046O35k40L62
2217B1q38r94J745l67M14J296L51j531n89o57J339m92J098p30r96J900j850J029
$$ plain form
2235 149 -647 950 144 1178 409 -1267 575 -510 -234 -916 141 105 -781 533 218 1244 -113
2252 -113 -1097 -601 -462 403 -678 491 -689 -900 -767 130 754 -741 -794 19 564 684 230 426 -335
2271 -335 -162 845 -1205 1438 -473 131 223 1118 538 700 -406 -624 1554 121 210 -1121 136 -209
2289 -209 -623 601 -777 659 759 256 69 -1504 -1052 -736 -430 37 290 851 -383 -657 -520 -73
2307 -73 -648 362 321 -739 278 -18 1838 -94 -1399 -158 737 413 30 577 211 402 898 -648
2325 -648 -1416 575 -618 105 333 1373 564 -930 85 175 635 201 814 -439 -304 1868 1199 -1037
2343 -1037 -556 643 -776 65 -264 115 1450 -247 459 -497 347 355 -267 446 -1269 465 427 -23 670
2362 670 -770 820 -340 528 201 352 -238 -153 400 -564 1097 -220 817 270 -560 638 -1322 -53
$$ packed form
2235A49p96J597q06J034p69j676J842j085K76o82J057l6q86J314l15J026j357
2252a13r84M96J39Q65j081J169j180k11J33Q97O24j495n3Q13N45J20m54J96p61
2271c35J73J007k050K643j911O04R2Q95n80J62j106k18K178j433Q9j331J257l45
2289b09m14J224j378J436J00n03j87j573M52L16L06M67K53N61j234k74J37M47
2307g3n75J010m1j060J017k96J856j932j305J241Q95l24l83N47l66J91M96j546
2325f48p68J991j193P23K28J040q09j494J015R0M60m34O13j253J35K172o69k236
2343a037M81J199j419Q41l29L79J335j697P06r56Q44Qo22P13j715J734l8m50O93
2362F70j440J590j160Q68l27J51n90Q5N53r64J661j317J037n47q30J198j960J269
$$ plain form
2380 -53 -1314 -322 167 57 617 -226 1049 -167 -77 115 113 -974 -400 -94 -250 -234 -129 -595 -341 -37
2400 -37 -252 -673 15 -491 -741 -135 122 -50 -320 -649 109 -283 699 51 116 -510 -713 1266 -97 371
2420 371 355 -547 632 -103 322 -785 -96 284 -258 1072 -88 538 549 859 -1170 -648 -446 -520 244
2439 244 354 -703 1134 -519 358 -1110 -331 1326 29 225 -1850 641 -1000 521 -487 755
2455 755 1432 -1007 -92 -1247 38 267 133 926 -1256 882 -563 144 -847 -215 169 -438 -81 -907
2473 -907 254 209 51 437 -126 751 58 -114 -548 781 762 -1292 699 36 515 -708 -399 35 -225
2492 -225 809 916 -300 -352 -337 45 -1575 1741 -333 698 488 -229 442 -110 -341 113 -515 513
2510 513 1297 780 -399 961 1186 -632 341 420 -36 529 242 -69 210 -538 100 1162 -281 346 -147
$$ packed form
2380e3j261R92M89j10N60q43J275j216R0J92kj087N74L06j56J6J05m66K54L04
2400c7k15m21O88n06k50O06K57j72k70l29P58l92R82o48O5o26k03J979j363M68
2420C71j6r02J179p35M25j107O89L80n42J330j160O26J1L10k029N22K02p4P64
2439B44J10j057J837j653Q77j468P79J657j297J96k075K491j641J521j008J242
2455G55O77k439R15j155J285K29j34P93k182K138j445P07r91O32L84o07L57q26
2473i07J161m5j58L86n63Q77o93j72m34J329j9k054J991o63M79j223L09M34k60
2492b25J034J07j216n2J5L82j620L316k074J031k10p17O71n52k31M54o28J028
2510E13P84n17j179J360K25j818R73P9m56N65k87l11K79p48O38J062j443O27m93
$$ plain form
2529 -147 69 -103 -540 -67 -267 -627 511 -201 453 -550 205 -1216 -178 -177 238 436 -898 1267 -621
2548 -621 71 271 192 298 85 -148 -265 62 -146 -337 143 529 128 558 -437 1052 -172 116 -635 198
2568 198 -265 -92 412 77 -51 -1146 1493 -218 -408 -35 -434 263 -543 126 1049 245 -402 593 322
2587 322 -606 369 649 -166 400 460 -68 -210 22 -238 44 579 1241 267 -722 -418 -104 -11 -273 -21 530
2608 530 -580 904 439 449 448 -282 -616 -82 373 1019 104 -47 -532 -306 -1117 -468 1183 269 83 799
2628 799 549 606 494 427 -1696 993 -913 436 -653 -30 1035 -1419 1304 -343 664 414 -1482
2645 -1482 301 -1011 -431 -1254 -235 1158 -563 855 -998 345 130 16 869 -1035 91 -1512
2661 -1512 12 88 711 -716 -317 552 9 255 777 -7 -671 -603 -59 -441 235 -14 -64 138 -1537 932
$$ packed form
2529a47K16j72m37M73k00l60J138p12O54j003P55j421J038JM15J98j334K165j888
2548f21O92K00p9J06k13k33j17L27k08j91M80L86m01M30r95J489j224K88p51Q33
2568A98m63J73N04l35j28j095K639j711j90L73l99O97q06O69R23q04o47R95k71
2587C22r28R75K80q15N66O0n28j42K32k60K82N35O62r74r89L04L14R3k62K52N51
2608E30j110J484m65J0jp30l34N34M55O46r15j51m85K26q11O49J651r14j86P16
2628G99k50N7j12o7k123K689j906J349j089O23J065k454K723j647J007k50j896
2645a482J783j312N80q23J019J393j721J418j853J343k15j14Q53j904J126j603
2661a512J524P6O23j427L99Q69n43K46N22p84o64O8N44l82O76k49n0K02j675K469
$$ plain form
2681 932 -617 426 -82 141 -126 414 -522 1043 474 -503 499 397 -714 -402 167 -491 -240 -368
2699 -368 265 -61 -786 -1328 669 177 -811 325 -118 127 -143 -267 112 -421 -30 338 -319 162 979
2718 979 -15 -101 386 33 336 12 -1202 1069 -1025 -137 -691 -185 51 70 -408 -1218 891 217 -161
2737 -161 74 159 1103 -1178 142 -137 378 269 -379 513 -1277 158 -977 610 -268 -294 1513 410
2755 410 145 -111 461 196 -210 -418 -567 925 -1112 507 435 -623 428 -393 -112 -959 781 712 -406
2774 -406 387 -518 768 583 449 -258 54 692 -544 467 -383 -628 529 -446 1468 -837 287 871
2792 871 420 65 -770 -191 630 -457 -523 -791 -388 -101 899 -595 266 -347 922 1052 -26 763 -324
2811 -324 -67 178 -1198 887 459 848 -281 220 392 -320 823 -435 -181 -135 736 487 -501 719
$$ packed form
2681I32j549J043n08K23k67N40r36J565n69r77J002j02j111L12N69o58K51j28
2699c68O33l26p25n42J997m92r88J136m43K45k70j24L79n33L91L68o57M81Q17
2718I79r94q6M87l53L03l24j214K271k094Q88n54N06K36J9m78q10K109o74l78
2737a61K35Q5R44k281J320k79N15j09o48Q92j790J435j135J587q78k6J807j103
2755D10k65k56N72k65m06k08j49J492k037J619p2j058J051q21K81q47J740o9j118
2774d06P93r05J286j85j34p07L12O38j236J011q50k45J157r75J914k305J124N84
2792H71m51l55q35N79Q21j087o6k68M03K87J000j494Q61o13J269J30j078P89j087
2811c24K57K45j376K085m28L89j129N01J72p12J143j258K54M6Q71k49r88J220
$$ plain form
2829 719 -851 -565 -581 479 -287 -117 490 699 381 199 -938 467 -386 838 544 -37 1092 -169
2847 -169 1672 -1355 -194 -767 -954 122 -419 356 16 334 655 -886 -8 -62 180 390 416 -563 170
2866 170 -165 -646 -437 642 -303 -96 -217 -626 635 1065 -841 450 -734 -348 -117 -1149 -430 -682
2884 -682 299 100 -631 -769 433 830 577 -203 -40 338 597 1264 111 450 212 994 -285 276 -458
2903 -458 17 -90 -337 1024 -513 -116 384 409 -17 -763 -1179 340 328 -673 695 114 -796 254 50
2922 50 694 -35 441 590 -951 16 -1468 -109 89 -311 -142 -994 473 -920 491 -1097 -1382 -243
2940 -243 -574 1137 -220 1423 549 -35 -367 -68 1036 -1767 619 -317 -636 -32 807 48 -1153 579
2958 579 -137 -693 30 -683 916 -29 880 -1491 138 321 108 842 -610 1917 -149 -1019 -88 -978
$$ packed form
2829G19j570K86j6J060p66J70O07K09l18j82j137J405q53J224k94n81J129j261
2847a69J841l027J161n73j87J076n41P75l40L18L21j541Q78n4K42K10K6r79P33
2866A70l35m81K09J079r45K07j21m09J261M30j906J291j184L86K31j032P19k52
2884f82R81j99p31j38J202L97k53p80J63L78K59O67j153L39k38P82j279N61p34
2903d58M75j07k47J361j537L97N00K5m26p46m16J519j2j001J368n81r10J050k04
2922E0O44p29M76J49j541R67j484J359J98m00J69q52J467j393J411j588k85J139
2940b43l31J711j357J643q74n84l32K99J104k803K386r36l19O04Q39p59j201J732
2958E79p16n56P23p13J599r45R09k371J629J83k13P34j452K527k066q70R31q90
$$ plain form
2976 -978 -330 -333 970 -3 610 -33 -1564 -813 -274 -828 668 -328 858 499 643 -1151 -273 292 -1270
2995 -1270 676 1103 1278 -549 558 355 -868 145 -549 265 -265 868 -209 -410 156 59 873 478
3013 478 -844 481 176 903 -476 117 206 -433 727 -52 127 -333 635 120 -813 -336 -533 231 -653
3032 -653 475 1008 636 235 -1320 1033 -516 -422 -574 404 281 39 946 -1174 -851 381 -38 1026
3050 1026 -243 -79 -392 194 -1197 -637 -131 -676 -704 178 1222 1114 -373 433 -963 695 -1032 -550
3068 -550 23 -205 419 79 -1022 -523 -50 735 641 771 276 742 64 -447 922 359 -85 134 513 -1107
3088 -1107 -114 683 -653 -704 101 849 559 657 -321 -206 41 -165 57 43 -187 791 125 -617 -542 -1302 39
3109 39 -180 -161 -463 983 -547 -1299 405 -358 1739 -704 990 821 135 -795 -809 289 -468 265 527
$$ packed form
2976i78O48lJ303r73O13o43j531P51N39n54J496r96J186l59J44j794Q78N65j562
2995a270J946M27J75j827J107k03j223J013o94Q14n30J133j077k01N66r7Q14l95
3013D78j322J325l05P27j379N93Q9o39J160p79J79m60R68n15r33M77j97P64q84
3032f53J128N33l72m01j555K353j549R4j52R78j23k42R07k120L23J232m19J064
3050A026j269J64l13N86j391N60N06n45k8Q82J044j08j487Q06j396J658j727M82
3068e50N73k28O24l40j101M99M73P85r4J30m95M66o78n11J369n63m44K19L79j620
3088a107R93P97j336n1Q05P48k90R8r78J15K47k06K22j4k30R78o66p42P5p60J341
3109C9k19J9l02J446j530p52J704p63K097k443J694j69o86r30j4J098p57P33K62
$$ plain form
3128 527 -1448 -283 -872 401 -302 349 142 21 821 -951 -503 892 79 19 -293 408 29 1012 290
3147 290 -346 87 -492 505 766 1667 380 1785 -631 -234 -464 -41 -50 -634 719 -163 -445 419 -688
3166 -688 965 -120 -70 494 30 -404 121 -253 -202 1339 -143 -1015 21 543 38 -398 -411 341 237
3185 237 620 -177 -458 404 -414 -581 450 207 1153 173 1420 -992 867 229 -236 968 1206 -894
3203 -894 -533 -590 -30 504 27 481 392 -529 437 1008 887 -266 -955 -349 -782 413 -24 318 1065 -1874
3223 -1874 797 -1044 -818 -654 -751 -88 -199 1285 -701 2025 -391 -171 -811 552 1133 611 906 -1113
3241 -1113 852 -1461 -930 1251 -228 1240 423 192 233 791 435 155 925 -298 233 -899 -508 359
3259 359 -2105 74 -289 -122 742 685 167 -666 170 290 -1249 49 65 974 658 689 -784 -616 392
$$ packed form
3128E27j975J165n89J273p03O51k07j21Q00j772M48J395q13o0l12P01l79R83p22
3147B90o36M33n79R97K61R01j287J405k416L97k30M23rn84J353q82k82Q64j107
3166f88J653j085N0N64m64m34N25l74N1J541j482q72J036N22n05m36j3P52j04
3185B37L83p97k81Q62q18j67J031k43R46r80J247k412J859o38m65J204K38k100
3203h94L61n7N60N34m77M54q9r21R66N71j21j153o89O06m33J195m37L42P47k939
3223a874K671j841K26J64r7O63j11J484j986K726k416K20o40J363N81n22K95k019
3241a113J965k313N31K181j479J468q17k31M1N58l56k80P70j223N31j132L91Q67
3259C59k464K179l63J67Q64n7n18q33Q36J20j539J298J6R09l16L1j473J68J008
$$ plain form
3278 392 -575 893 -96 548 427 923 155 74 138 407 -184 601 -159 -830 120 -907 -816 -271 358 -756
3298 -756 32 -880 157 116 -266 807 -224 235 -657 637 319 280 -287 -181 319 -862 -299 -363 552
3317 552 -373 -416 2045 -1566 587 -102 325 -7 -992 1422 -28 683 87 -121 1008 -1370 665 36
3335 36 806 -60 -265 1005 -1120 781 -398 -2007 199 238 229 310 136 -546 605 143 -287 -74 480
3354 480 559 219 26 485 -299 -577 155 -140 -519 503 646 -148 164 381 210 -419 550 -557 -297 308
3374 308 167 1058 -38 242 296 -823 427 -684 428 43 -905 1709 -360 599 -544 -81 445 -832
3392 -832 222 -110 211 -67 357 -333 639 -235 756 350 -43 -141 552 -1042 501 -1606 367 70 -54
3411 -54 822 -573 798 -616 464 713 -979 295 -943 1299 -809 49 727 -239 687 -97 938
$$ packed form
3278C92r67J468r89O44j21M96p68q1O4K69n91P85p60o71R50j027R1N45O29j114
3298g56P88r12J037m1l82J073j031M59q92J294l18l9n67J06N00j181N63o4R15
3317E52r25m3K461l611K153o89M27l32r85K414j450P11n96k08J129k378K035o29
3335C6P70q66k05J270k125J901j179j609K206L9rQ1j74o82J151m62m30K13N54
3354D80P9l40j93M59p84k78P32k95l79J022J43p94L12K17j71o29R69j107K60O05
3374C08j41Q91j096K80N4j119J250j111J112l85r48K614k069R59j143M63N26j277
3392h32J054l32L21k78M24o90R72q74R91m06l93r8O93j594J543k107J973k97j24
3411e4Q76j395J371j414J080K49j692J274j238K242k108Q58O78r66R26p84J035
$$ plain form
3428 938 -1107 1034 -550 827 1401 390 269 -168 77 -130 -49 212 -729 -427 -654 31 554 -739
3446 -739 614 -1517 1152 150 -780 -841 -70 328 -887 493 452 125 -136 -572 784 -833 728 -150
3464 -150 381 263 -217 140 -188 1405 -355 -428 1079 -864 687 -884 -108 -218 -39 888 -667 -442
3482 -442 -487 -612 343 -557 375 -534 966 -406 314 1363 -420 79 -626 969 -194 -139 968 -769
3500 -769 366 -131 898 218 139 527 -301 345 -200 851 568 579 149 -1580 185 -802 -997 95 704
3519 704 928 -241 1291 -580 966 -422 -764 -447 -529 -567 321 151 445 121 745 -1351 164 -617
3537 -617 462 19 -46 761 -1162 714 -174 458 -549 -461 -593 -1389 98 224 -470 -612 70 468 -1097
3556 -1097 -170 -876 715 139 481 941 -554 -192 -725 490 -418 -294 691 -236 528 812 25 -637 -1118
$$ packed form
3428I38k045K141j584J377N74j011j21m37K45k07Q1K61r41L02k27O85N23j293
3446g39J353k131K669j002r30o1P71L98j215J380m1l27k61m36J356j617J561q78
3464a50N31j18m80L57l28J593j760p3J507j943J551j571P76j10J79R27j555K25
3482d42m5j25R55r00R32r09J500j372P20J049j783M99p05J595j163N5J107j737
3500g69J135m97J029o80p9L88q28O46n45J051k83J1m30j729J765r87j95J092O09
3519G04K24j169J532j871J546j388l42L17q2l8Q88j70K94l24O24k096J515p81
3537f17J079m43o5Q07j923J876q88O32j007Q8j32p96J487J26o94j42O82L98j565
3556a097R27p06J591n76L42M60j495L62n33J215r08J24R85r27P64K84p87o62m81
$$ plain form
3575 -1118 -58 53 -751 -303 -687 631 -253 -561 -31 -1158 -53 28 372 -718 -148 -1237 1247 -922
3593 -922 -208 99 -523 405 -544 -1029 149 -68 1091 258 984 260 -740 224 245 539 16 903 -782
3612 -782 -238 487 -1504 1250 -623 -406 80 -222 598 515 837 -1234 -245 -40 127 392 -1202 20
3630 20 -139 -29 -59 261 -405 -1104 1129 -354 450 -1273 -517 -172 141 487 -1698 -336 242 261 -558
3649 -558 150 -106 -244 406 -1126 903 657 260 384 -143 400 -219 59 232 -378 384 92 -7 64 257
3669 257 -162 208 -61 -348 -624 345 -644 173 -1102 -516 725 -72 646 -58 -547 193 -175 259 319 -795
3689 -795 798 1141 -197 -737 -307 -1189 59 545 247 -461 -62 -323 404 1288 -90 884 -212 -362
3707 -362 18 -1192 65 -1292 1004 1001 968 670 -680 850 -448 395 797 825 1137 -836 1011 -417
$$ packed form
3575a118J060J11q04M48l84J318q84l08N30j127J105Q1L44j090N70j089K484k169
3593i22P14L07o22R28r49m85J178k17J159q33P26p24j000R64K1K94n23Q87j685
3612g82N44P25j991K754j873K17M86l02Q20q3L22k071R89K05J67K65j594J222
3630B0j59J10l0L20o66o99K233j483Q04j723P56L45L13L46k185J362N78J9q19
3649e58P08k56j38O50j532K029k46l97J24n27N43o19K78J73o10P62k92r9P1J93
3669B57m19L70k69k87k76R69r89Q17j275N86J241p97P18p04m89P40l68M34O0j114
3689g95J593L43j338n40M30q82J248M86k98p08L99k61P27Q84j378R74j096j50
3707c62L80j210J257j357K296ll3k98j350J530j298Q43M02K8L12j973J847j428
$$ plain form
3725 -417 578 668 -1518 -567 -1091 1058 165 727 -82 -535 988 -603 514 307 -22 -326 950 726
3743 726 -1563 -507 -165 -547 -1077 -169 -316 27 682 -524 -196 -100 -740 647 -201 640 -87 534 402
3762 402 -347 363 -8 93 -52 -134 297 -1225 202 203 712 -277 452 287 -1008 61 -612 331 517 713
3782 713 429 277 160 -411 -344 442 894 1347 -114 291 505 19 -914 -172 342 -597 -464 105 998 -6
3802 -6 -876 -132 -1403 -700 -482 -112 748 -904 1026 -698 156 -366 206 576 -483 987 359 964 123
3821 123 -430 890 -572 359 282 63 427 -1081 208 -299 391 -836 40 882 -1109 496 -620 1122
3839 1122 -233 -305 -1608 256 -222 -258 279 -621 698 364 -78 -524 -273 -179 -599 5 -435 -650 215
3858 215 -200 141 877 155 -41 -321 448 -467 -462 514 862 -497 467 651 -884 140 913 438 1576
$$ packed form
3725d17R95R0k186R51n24K149q93N62q09m53J523j591J117k07l29l04J276k24
3743G26k289J056L42l82n30R08j47L43O55j206L28R6o40J387q48Q41p27O21j32
3762D02p49P10l71J01j45q2M31j522J427JN09r89P29j65j295J069o73R43J86J96
3782G13k84j52j17n71O7P86M52M53j461M05K14m86r33P42N14r39J33N69Q93j004
3802fq70P44j271P03K18L70Q60j652J930j724Q54n22N72L70j059J470o28O05q41
3821A23n53J320j462R31p7k19L64j508J289n07O90j227Q76Q42j991J605j116J742
3839A122j355p2j303J864m78l6N37r00J319l34m42m46K51R4m20O04m40k15Q65
3858B15m15L41P36p22j96k80P69r15NR76L48j359R64J84j535J024P73m75J138
$$ plain form
3877 1576 293 1247 -1131 126 631 -721 487 -385 -326 260 891 311 -1149 514 -689 623 -167
3894 -167 -1554 509 132 276 894 -58 657 -521 960 139 1137 -447 879 3 -702 200 -1586 94
3912 94 -926 385 78 769 -201 -943 465 -289 -240 -186 595 760 481 458 -490 -375 -306 -5 548 -1736
3932 -1736 810 -604 -183 -397 37 1223 -582 528 90 -691 341 -14 1243 369 -108 -499 -189
3949 -189 1251 -293 500 -585 -203 -306 550 -52 411 -109 535 124 -346 913 -720 -908 -238 644
3967 644 -952 908 85 573 -284 668 902 511 137 -1031 1336 -410 365 749 -414 -379 -171 -19
3985 -19 -451 751 149 -580 1543 743 886 -647 -249 -955 -197 118 -1694 -579 -757 -697 -589 -101 1037
4004 1037 9 1212 -248 741 39 -764 435 -246 542 260 684 381 -302 -182 -538 533 -26 858
$$ packed form
3877A576j283R54k378J257N05j352J208q72N9N86O31n80j460J663j203J312p90
3894a67j387K063l77J44O18r52P15j178J481q21R98j584J326q76p05R02j786J680
3912I4j020J311l07O91r70p42J408p54M9N4P81J65k79k3r48J15O9L01N53k284
3932a736K546j414M21k14M34J186j805J110m38p81J032l55J257q74m77l91L10
3949a89J440j544P93j085L82j03Q56o02M63n20O44m11m70J259j633j88O70Q82
3967F44j596J860q23M88q57R52K34l91l74j168K367j746P75L84j163L5K08J52
3985a9m32J202o02p29K123q00J43j533L98p06P58L15j812J115j78O0J08M88J138
4004A037j028J203j460R89p02q03J199o81P88k82M24l03o83J20l56J071n59Q84
$$ plain form
4022 858 796 237 444 -738 -322 -363 1043 -786 448 -557 -287 1110 -147 538 -164 -371 806 136
4040 136 818 93 568 90 -321 539 -82 -441 -963 205 286 -455 823 -1064 984 -726 313 -843
4058 -843 496 -480 23 -854 -185 10 88 -214 -397 187 121 408 -901 45 -54 283 615 553 20 -433 -244
4079 -244 -854 532 -1363 -260 -101 -922 298 -65 1130 -40 -400 -838 -438 473 -1832 724 631 38
4097 38 -555 -613 1217 -1484 1346 130 -104 790 -177 -170 -2350 269 -288 515 -424 -1176 1610 -693 775
4116 775 -796 1382 -342 -1058 584 -417 531 -150 144 -123 284 -83 316 839 157 -610 -149 -224 1730
4135 1730 -115 633 570 -56 446 -904 579 -309 1165 1891 956 1004 -382 -204 -123 120 1019 -780 -493
4154 -493 -129 -53 80 216 -89 -463 -474 266 180 681 648 -127 -490 1685 682 523 683 -218 129 -690 -420
$$ packed form
4022H58o2n59K07j182M16m1J406j829J234j005K70J397j257O85p02k07J177o70
4040A36O82p25M75m78m11Q60o21l59n22J168Q1p41J278j887K048j710J039j156
4058h43J339r76N03q77O69J95P8l02j83N84o6K87j309R46r9L37L32o2n33m53J89
4079b44o10J386j895J103J59q21J220l63J195j170l60m38M00R11k305K556r3n93
4097C8n93n8J830k701K830j216k34Q94r67Pk180K619n57Q03r39p52K786k303J468
4116G75j571K178j724p16J642j001R48o81K94k67M07l67L99N23o82p67M61p5J954
4135A730j845P48o3o26N02j350J483q88J474P26r35M8j386J78Q1K43Q99j799K87
4154d93L64P6J33J36l05l74j1P40q6N01l3p75l63K175j003j59J60r01L47q19K70
$$ plain form
4175 -420 -210 -330 -594 -224 734 -283 -675 -303 463 934 -412 480 -640 553 -101 -906 198 -1088
4193 -1088 559 -1107 -629 -951 209 -29 -673 831 -856 471 -326 -961 -167 -565 68 -646 38 50
4211 50 -360 198 795 1087 -1202 660 -634 -789 -344 207 116 -491 -408 -786 901 324 218 1338 315
4230 315 827 -165 -411 547 -79 455 -898 535 246 -90 1648 -1060 619 -253 741 -489 322 474
4248 474 -1078 431 -675 101 58 797 1451 -104 1086 -177 -1353 248 -212 80 -854 42 544 10
4266 10 -714 -1222 791 -331 -129 1135 16 1358 -487 -223 -247 344 89 254 369 -37 1248 365
4284 365 125 -118 -626 413 -1116 569 450 1106 506 -346 112 -976 200 29 702 -17 -191 896
4302 896 -729 821 43 -444 982 -750 -556 -785 -651 -647 896 850 -94 318 -726 425 534 3 742
$$ packed form
4175d20K10j20k64L70R58j017l92L72P66M71j346Q92j120J193o54q05J104j286
4193a088J647j666M78l22J160k38o44J504j687J327p97o35P94l98O33p14O84J2
4211E0m10N58N97K92k289J862j294j55M45N51r1o07Q3l78J687n77j06J120j023
4230C15N12r92k46R58o26N34j353J433k89l36J738k708J679q72R94j230Q11J52
4248D74j552J509j106P76m3P39O54j555J190j263j176J601m60K92r34Q96N02n34
4266A0p24n08K013j122K02J264j119J342j845K64k4N91k55J65J15m06J285q83
4284C65k40k43n08J039j529J685j19O56o00q52M58j088J176j71O73p19j74J087
4302H96j625J550p78m87J426j732J94k29J34MJ543m6r44M12j044J151J09n31P39
$$ plain form
4321 742 -229 -185 -1115 482 -595 579 -373 196 498 -1571 745 -586 -649 -257 380 -358 -99 88 -1113
4340 -1113 -955 591 264 -359 -237 -246 1515 -424 -431 48 393 -440 571 -321 167 189 -759 446 456 444
4360 444 -1216 735 -582 -278 103 -136 -423 895 -646 711 335 212 85 -504 674 -818 1037
4377 1037 534 191 608 213 1483 -692 304 526 -547 -1028 -473 473 224 349 -168 -394 437 -1075
4395 -1075 -16 -895 1080 126 1 947 441 -435 -214 1165 -326 -46 -156 -735 1052 101 357 -341
4413 -341 701 495 350 830 348 1289 -80 914 -56 -621 404 -622 -425 15 146 362 12 333 -1352
4432 -1352 1012 276 -10 494 -63 -491 -434 563 -399 -87 679 -110 811 -409 -8 14 238 294 -800 474
4452 474 -1386 -1256 664 -577 866 -1217 -752 -641 -389 -792 -1139 549 -256 271 87 -861 1130 372
$$ packed form
4321G42r71M4r30J597j077J174r52N69L02k069K316j331o3L92O37p38K59J87j201
4340a113J58J546l27o23J22rJ761j939pM79L45q33J011q92M88K2r48J205J0j2
4360D44j660J951j317L04L81k39k87J318j541J357l76j23j27n89J178j492J855
4377A037n03l43M17l95J270k175R96K22j073m81N55R46k49J25n17k26Q31j512
4395a075J059q79J975r54j25R46n06q76K21J379j491K80j10n79J787r51K56o98
4413c41J042k06j45M80m82R41j369R94r70n65J025j026J97M40J31K16l50L21j685
4432a352K364p36k86N04n57m28N7R97r62L12P66p89R21j220M01K2K24N6j094J274
4452D74j860J30J920j241J443k083M65J11K52m03l47J688q05N27j84r48J991p58
$$ plain form
4470 372 197 -143 837 -342 -924 -486 -921 -290 -608 188 -244 -1141 460 -1620 -68 522 -284 -971 -570
4489 -570 411 -50 1498 -538 -49 117 -811 245 -619 455 -928 508 896 -1301 335 -634 266
4506 266 -371 -94 676 -808 1092 -337 358 -912 -568 -218 311 616 -355 168 391 -213 655 198 55
4525 55 1099 935 -192 881 207 466 215 185 1797 143 485 444 86 837 747 375 479 -514 -358 113
4545 113 256 -330 684 -21 -251 364 -313 234 111 -312 88 1108 1069 345 44 -429 85 1052 -1581
4564 -1581 422 740 -224 -64 -112 117 -305 -207 -566 1138 -555 -317 1578 -907 12 -539 189 -302 -670
4583 -670 -436 -339 345 -463 -1129 311 -498 1845 -307 560 -958 -322 -489 -1073 173 -569 81 -387 23
4602 23 416 -727 798 -156 -515 592 238 830 -164 -253 -117 1055 -682 -316 89 -1094 -85 119
$$ packed form
4470C72j75l40R80j179n82M38m35O31l18P96m32q97J601k080J552N90q06o87M01
4489e70R81m61J548k036M89J66r28J056q64J074j383J436L88k197J636r69R00
4506B66o37K77P70j484J900j429O95j270L44L50N29L05r71N23K23o04Q68m57j43
4525E5J044j64j127J073o74K59k51l0J612j654L42m1l58P51r0l72J04r93J56M71
4545A13J43n86J014p05k30O15o77N47j23m23M00J020l9p24l01m73N14R67k633
4564a581K003L18r64J60m8K29m22R8l59J704j693K38J895k485R19n51P28m91l68
4583f70K34R7O84q08o66J440q09K343k152Q67j518O36j67n84J246p42O50m68M10
4602B3L93j143J525r54l59J107l54N92r94q9J36J172j737L66M05j183J009K04
$$ plain form
4620 119 520 146 265 1066 -870 742 -1057 186 875 258 -1545 -361 -434 -826 753 -841 192
4637 192 51 487 723 -278 -286 159 -71 211 -84 -110 -1009 -65 625 -1109 730 -861 884 188 -306
4656 -306 -130 13 704 793 -177 -892 -574 690 -465 128 603 -155 -249 -361 -236 4 653 700 82 604
4676 604 288 392 773 -6 55 366 -277 -311 13 -376 -64 -609 513 -139 -411 434 -88 523 -1150 -432
4696 -432 905 -388 381 417 1261 -751 472 147 -757 1031 -1138 -96 461 1183 -738 -95 -230 -133
4714 -133 57 -314 685 757 -543 -83 427 332 -935 -185 1341 422 138 -8 -71 175 -83 475 -517 -435
4734 -435 -135 -76 531 -1031 710 -822 -249 -557 74 971 217 266 -743 93 -478 226 612 -583 208
4753 208 -258 -127 940 -165 -143 -813 1204 113 -1044 -939 177 41 -940 -367 -625 -121 352 513
$$ packed form
4620A19M01l74J19Q01j936J612j799J243O89o17j803J184p3l92J579j594J033
4637A92j41M36K36j001qM45k30K82k95k6q99R44O90j734J839j591J745o96m94
4656c06J76J43O91Q9r70p15L18J264j155N93M75p58r4j12J25K40O49M7o18N22
4676F04l16J04L81p79O1L11o43l4L24l89L12n45J122o52k72Q45n22O11j673P18
4696d32J337j293P69L6Q44k012J223l25r04J788k169J042N57P22j921O43j35R7
4714a33J90l71R99P2j300M60N10r5j267P50J526r19k84j46o3K46k58N58r92Q2
4734d35L00N9O07j562J741j532N73l08O31Q97p54M9j009Q36n71P04L86j195P91
4753B08m66J31J067j105K2o70K017j091j157J05J116j36r81N73k58N04M73J61
$$ plain form
4771 513 -113 -605 821 -107 1007 128 -957 1279 -419 262 -702 340 -16 -131 170 -858 1233
4788 1233 526 -586 -61 -259 821 465 32 -73 981 661 -169 829 216 469 -603 -454 278 -794
4806 -794 730 -50 892 480 -458 88 183 -361 -230 -19 -511 153 1027 339 276 -526 547 1062 727 -758
4826 -758 42 -612 -140 -773 -331 -907 816 447 -126 403 -462 -507 42 -161 -937 659 -1425 -664 312
4845 312 453 1056 -472 1109 -1147 -701 392 125 144 -221 1148 -458 183 542 -19 264 174 -509 813
4864 813 -1160 78 -247 600 13 -551 321 158 787 -1140 205 -786 -717 -245 -1169 359 -1240 431
4882 431 179 491 -474 -1186 321 -922 -119 -442 123 -118 25 1022 -477 77 -280 -259 765 148 605
4901 605 60 546 -339 1125 568 534 -1115 165 -8 -198 -1171 -417 -641 210 -275 -398 -358 -186 616 -269
$$ packed form
4771E13o26m92J426r28J114q79j085K236j698O81r64J042l56j15L01j028K091
4788A233p07j112N25j98J080l56m33j05J054l20q30R98o13K53j072J49P32j072
4806g94J524p80R42m12r38N46R5n44J31K11m92O64Q74o88o3q02J073N15l35j485
4826g58Q00o54M72o33M42n76J723l69n73N29q65m5N49k03p76J596k084P61R76
4845C12J41O03j528J581k256M46J093k67J9l65J369j606O41L59n61K83r0o83J322
4864H13j973J238l25Q47n87n64Q72j63O29j927J345r91O9M72r24J528j599J671
4882D31k52L12r65p12J507j243Q03l23N65k41J43R97j499N54l57K1J024o17M57
4901F05n45M86q85J464n57l4j649J280j73j90r73P54k24Q51m85j23M0J72Q02q85
$$ plain form
4921 -269 301 -1158 67 515 -330 267 299 225 -30 153 872 -2078 675 -212 150 -20 108 517 232
4940 232 -573 133 -155 369 241 1039 642 -246 -328 576 191 806 -209 140 677 -839 225 -651 -459
4959 -459 628 -1438 -313 -142 -519 102 -918 934 -403 251 171 -314 320 -658 -65 -333 837 21
4977 21 -421 74 177 166 -1552 189 -1181 -588 -849 140 1947 -324 670 -891 -965 15 -142 -368 -613
4996 -613 290 -586 -788 -19 -1197 831 -655 161 -479 357 838 768 1088 110 -163 259 1922 528 31
5015 31 497 -276 -108 -431 -266 -357 161 675 -916 -437 -932 -83 -26 517 1405 829 669 -154 1268 694
5035 694 -564 127 1018 359 -486 -154 202 -367 -430 -681 1043 -714 -55 435 -244 -876 -240 -111 634
5054 634 302 -9 478 -226 -544 -737 9 429 1299 -15 255 -492 168 395 -1501 1103 -753 -301 160
$$ packed form
4921b69N70j459J225M48q45N97L2p4k55J83P19k950K753q87L62j70J28M09k85
4940B32q05P06k88N24j28P98l97q88q2R04l85O15j015L49N37j516J064q76J92
4959d59J087k066J125J71l77O21j020J852j337O54q0m85O34r78N93k68J170q16
4977B1m42M95J03j1j718J741j370N93k61R89J807k271R94j561p4R80j57k26k45
4996f13R03q76k02P69j178K028j486Q16o40Q36M81p0L20r78k73M22J663j394m97
5015C1M66p73J68l23J65r1N18N14j591M79m95Q49N7N43Q88n76j60q23J422n74
5035F94j258O91Q91o59q45L32L56n69o3k51J724j757O59M90o79o32O36J29P45
5054F34l32l11M87p04l18j93P46M20Q70j314K70p47O60K27j896K604j856M52M61
$$ plain form
5073 160 -773 910 369 295 -1397 92 113 408 1433 -1156 782 -506 32 -628 -441 -337 374 827
5091 827 -456 729 -529 -721 953 -651 1 -249 537 -180 -83 396 -661 1245 230 369 129 -1024
5109 -1024 -394 177 -83 -29 6 -776 3 618 561 -924 -955 -1002 299 -45 406 68 1694 730 129 -303
5129 -303 -723 -558 943 -317 -669 -1184 -632 860 -63 715 -414 501 348 79 -475 -390 115 -886 -119
5148 -119 147 226 -188 622 562 124 -74 -226 460 330 109 -58 -201 461 -905 -208 662 466 -413 27
5168 27 331 -616 -503 32 1312 183 437 1014 -432 -74 -244 1032 785 -874 294 -791 410 -327
5186 -327 303 -149 203 173 -777 -887 -159 191 -202 839 -1042 -10 49 -785 -117 -965 741 612 -467
5205 -467 107 -815 388 56 188 197 26 -11 -49 -29 282 -1015 1072 -588 200 -37 -109 663 371 256 -281
$$ packed form
5073A60r33J683n41p4j692J489K1K95J025k589J938j288N38o60J87J04P11M53
5091H27j283J185j258j92J674j604O52k50P86p17R7M79j057J906j015J39k40j153
5109a024O30N71k60N4L5p82P79O15n7j485l1m7J301l44M51l38J626r64o01m32
5129c03m20J65J501j260l52n15N52J492r23P78j129R15j53k69n54Q5N05j001P67
5148a19K66P9m14Q10o0m38j98j52O86j30k21j67j43O62j366O97Q70j96q79M40
5168B7L04r47J13N35J280j129K54N77j446L58j70J276k47j659J168j085J201p37
5186c27O30m52L52l0r50j10P28L50l93J041j881J032N9q34O68q48J706j29j079
5205d67N74r22J203l32J32Rj71l7l8K0L11j297K087j660P88k37p2P72k92j15n37
$$ plain form
5226 -281 -56 215 -1062 -595 -290 572 659 -1177 373 -514 286 -1101 2005 15 -78 326 738 494 -219
5245 -219 981 -291 1057 1279 435 1133 -425 475 255 93 160 -1949 243 -1242 48 -444 975
5262 975 734 -701 608 -647 457 342 1033 1169 571 1755 -156 1208 -776 -114 156 -256 670
5279 670 -1449 578 94 267 -906 -690 -1083 492 789 397 491 701 564 -393 -85 -238 176 -160 489
5298 489 -1021 490 526 796 -320 -44 -945 -631 -997 153 -1225 267 911 -380 -1100 37 432 310
5316 310 -581 -194 626 -478 -449 103 -750 413 104 -77 545 -328 -88 -314 1527 -1134 300 -447 459
5335 459 526 -1201 462 -635 -178 379 1046 507 -149 752 494 -37 -178 93 26 297 874 8 -634 -576
5355 -576 107 894 -518 886 -604 -259 -537 -464 267 137 572 364 582 262 434 -890 -285 545 -1070
$$ packed form
5226b81K25K71j277M67L05Q62Q7j836J550q87Q00j387L106j990r3M04M12k44p13
5245b19J200j272J348K22q44O98j558R00k20j62O7k109K192j485J290m92J419
5262I75k41j435J309j255J104j15O91J36n98J184j911J364j984O62K70m12R26
5279F70k119K027m84J73j173K16l93J575K97l92R4K10j37r57L08j53M14l36O49
5298D89j510J511L6K70j116K76r01L14l66J150j378J492O44j291p20J137L95j22
5316C10q91L87Q20j104K9N52q53J163l09j81O22q73K40k26J841k661J434p47R06
5335D59O7j727J663j097M57N57O67n39o56R01k58n31j41K71o7K71N77q66o42N8
5355e76O83P87j412J404j490L45k78P3P31j30M35k08K18l20J72j324O05Q30j615
$$ plain form
5374 -1070 -504 -1229 -384 558 -298 909 -113 99 -152 -86 608 311 116 124 772 216 -742 671 647 1227
5394 1227 387 -133 678 -847 -224 -782 1143 -32 329 105 -1258 140 -491 143 446 -856 889
5411 889 -643 134 -1139 158 491 -949 -393 8 732 973 912 -438 22 -98 -1375 1118 999 1017
5429 1017 53 -917 120 -128 -498 17 -801 1141 418 789 -1426 -212 209 409 191 -828 393 136
5447 136 1033 -191 976 364 -176 536 -66 239 -426 166 1330 -185 -649 -778 325 887 -140 1142
5465 1142 -1382 38 562 746 -1034 1135 224 -455 -715 -200 -348 -481 -524 513 475 -223 357 627 -454
5484 -454 193 699 -662 301 -878 -590 -710 669 822 -313 8 -281 -598 28 560 670 -597 100
5502 100 -64 629 -273 683 322 -553 29 341 492 776 661 -80 -149 -664 -241 -1419 -868 1031 245 1296
$$ packed form
5374a070N66p25Q45R42q56J207j022K12k51O6O94k97j95QO48n56r58J413k4N80
5394A227q40n20Q11j525O23n58J925j175L61k24j363J398o31O34L03j302J745
5411H89j532P77j273J297L33j440N56M01P24K41o1j350M60j20j277K493j19J8
5429A017r64r70J037k48l70N15q18J942p23L71k215J214M21K00k18j019J221k57
5447A36Q97j224J167o12n40P12o02L05o65N92J164j515m64j29J103N62j027J282
5465A142k524J420N24J84j780K169r11o79k60N15j48j33m3J037l8o98N80K70j081
5484d54O47N06j361R63j179K88j20J379J53j135L21k89l17O26N32J10j267O97
5502A00j64O93r02R56l61q75N82L12J51K84j15p41o9n15M23j178N51J899p86J051
$$ plain form
5522 1296 117 593 -535 -10 -398 437 1372 -429 145 -60 793 513 527 234 -874 282 365 768 -90
5541 -90 485 -719 -913 1144 -336 1176 -1017 -920 -763 63 669 108 461 -1656 181 913 -388 998
5559 998 -747 -137 -1033 -498 -212 1338 316 -87 -262 -226 -393 -343 -84 20 410 -43 -538 -7 338 1077
5579 1077 704 -850 154 -842 263 1599 1133 435 -314 701 -1281 -376 261 -1087 -289 -711 488
5596 488 -84 68 -526 -406 354 -468 -738 654 -281 -217 1052 -107 343 -191 411 -716 652 -404
5614 -404 375 43 -102 357 -529 -597 -717 287 -163 49 892 -7 1131 -357 515 -568 -650 -789 -1341
5633 -1341 -56 -993 606 -989 -350 -6 -105 880 -552 -813 504 349 -101 -412 886 -852 764
5650 764 -549 92 -444 -261 369 -793 246 1102 106 282 321 311 -342 937 411 -279 1171 -484 309
$$ packed form
5522A296j179M76j128N25l88Q35R35j801N74k05Q53k80J4k93j108J156Q3M03q58
5541i0N75j204j94K057j480J512k193R7J57Q26O06n61L53k117J837P32j301J386
5559I98j745O10q96N35K86J550j022m03j75L6j67N0K59J04L90m53m95N31L45P39
5579A077l73j554J004r96J105J336m66o98p49J015j982R05O37j348P98m22J199
5596D88n72J52n94J20P60q22k70J392r35O4J269j159M50n34O02j127J368j056
5614d04P79l32j45M59q86o8j20J004m50K12Q43q99J138j488Q72j083q2j39n52
5633a341J285r37J599j595O39L44r9R85j432k61J317j55m50l11J298j738J616
5650G64j313O41n36J83O30j162J039Q56r96J76L9j0o53J279n26o90J450j655P93
$$ plain form
5669 309 -1054 421 -276 811 280 -749 288 -286 191 31 489 -39 -1034 -351 248 29 -196 181
5687 181 -722 -541 1334 153 -26 208 -271 511 -391 681 -1385 391 984 -1435 -214 -996 -366 -264
$$ packed form
5669C09j363J475o97J087n31j029J037n74M77j60M58n28r95O83N99k19k25L77
5687A81r03J81J875j181j79K34m79P82r02J072k066J776N93k419J221p82O30J02
$$ [...]
##END NTUPLES=NMR FID
##END=
