##TITLE=31P_DE-80H_X3
 64 sc D2O
 26.2.2025
##JCAMPDX= 6.0         $$ Bruker NMR JCAMP-DX V2.0
##DATA TYPE= NMR FID
##DATA CLASS= NTUPLES
##ORIGIN= UXNMR, Bruker Analytische Messtechnik GmbH
##OWNER= root
$$ XWIN-NMR		Version 3.5
$$ Thu Apr  2 10:59:58 2026 Russian Standard Time (UT+4h)  Yarkov@DPX200
##.OBSERVE FREQUENCY= 81.013821
##.OBSERVE NUCLEUS= ^31P
##.DELAY= (6, 6)
##.ACQUISITION MODE= SIMULTANEOUS
##.ACQUISITION SCHEME= undefined
##.AVERAGES= 64
##.DIGITISER RES= 17
##SPECTROMETER/DATA SYSTEM= spect
##.PULSE SEQUENCE= zgpg30
##.SOLVENT NAME= CDCl3
##.SHIFT REFERENCE= (INTERNAL, CDCl3, 0, 243.863)
##AUDIT TRAIL= $$ (NUMBER, WHEN, WHO, WHERE, WHAT)
$$ ##TITLE= Audit trail, XWIN-NMR		Version 3.5
$$ ##JCAMPDX= 5.01
$$ ##ORIGIN= Bruker BioSpin GmbH
$$ ##OWNER= Yarkov
$$ C:/Bruker/XWIN-NMR/data/yarkov2/nmr/P31/2/audita.txt
$$ ##AUDIT TRAIL=  $$ (NUMBER, WHEN, WHO, WHERE, WHAT)
(   1,<2026-04-02 10:59:12.87 +0400>,<Yarkov>,<DPX200>,
      <created by zg, POWCHK disabled, PULCHK disabled
       configuration hash MD5:
       00 E9 B6 7A A2 85 ED C7 34 08 36 98 17 FE 4E 26
       data hash MD5: 32K
       9C 3A 03 21 1A 31 FE 8B 65 7E E7 70 DB 20 19 AD>)
$$ ##END=
$$ 
$$ hash MD5
$$ 99 34 9F 46 6F 82 9D 86 62 A2 12 04 AA 00 B2 90
##$RELAX= 
##$RELAX= 
##$RELAX= 
##$RELAX= 
##$RELAX= 
##$RELAX= 
##$RELAX= 
##$RELAX= 
$$ Bruker specific parameters
$$ --------------------------
##$DU= <C:/Bruker/XWIN-NMR>
##$EXPNO= 2
##$NAME= <P31>
##$PROCNO= 1
##$TYPE= <nmr>
##$USER= <yarkov2>
##$AMP= (0..31)
100 100 100 100 100 100 100 100 100 100 100 100 100 100 100 100 100 100 
100 100 100 100 100 100 100 100 100 100 100 100 100 100 
##$AQSEQ= 0
##$AQ_mod= 1
##$AUNM= <au_zg>
##$AUTOPOS= <>
##$BF1= 81.014009
##$BF2= 200.13
##$BF3= 200.13
##$BF4= 200.13
##$BF5= 200.13
##$BF6= 200.13
##$BF7= 200.13
##$BF8= 200.13
##$BYTORDA= 1
##$CFDGTYP= 0
##$CFRGTYP= 5
##$CHEMSTR= <none>
##$CNST= (0..31)
1 1 145 1 1 1 1 1 1 1 1 1 1 1 1 1 1 1 1 1 1 1 1 1 1 1 1 1 1 1 1 1 
##$CPDPRG= <waltz16>
##$CPDPRG1= <>
##$CPDPRG2= <waltz16>
##$CPDPRG3= <>
##$CPDPRG4= <mlev>
##$CPDPRG5= <mlev>
##$CPDPRG6= <mlev>
##$CPDPRG7= <mlev>
##$CPDPRG8= <mlev>
##$CPDPRGB= <>
##$CPDPRGT= <>
##$D= (0..31)
0 1 0 0 0 0 0 0 0 0.06 0 0.03 2e-05 3e-06 0 0 0.0002 0 0 0 0 0 0 0 0 0 
0 0 0 0 0 0 
##$DATE= 1775113152
##$DBL= (0..7)
120 120 120 11 120 120 24 19 
##$DBP= (0..7)
150 150 150 150 150 150 150 150 
##$DBP07= 0
##$DBPNAM0= <>
##$DBPNAM1= <>
##$DBPNAM2= <>
##$DBPNAM3= <>
##$DBPNAM4= <>
##$DBPNAM5= <>
##$DBPNAM6= <>
##$DBPNAM7= <>
##$DBPOAL= (0..7)
0.5 0.5 0.5 0.5 0.5 0.5 0.5 0.5 
##$DBPOFFS= (0..7)
0 0 0 0 0 0 0 0 
##$DE= 6
##$DECBNUC= <off>
##$DECIM= 4
##$DECNUC= <off>
##$DECSTAT= 4
##$DIGMOD= 1
##$DIGTYP= 9
##$DL= (0..7)
0 0 52 120 120 21 21 25 
##$DP= (0..7)
150 150 150 150 150 150 150 150 
##$DP07= 0
##$DPNAME0= <>
##$DPNAME1= <>
##$DPNAME2= <>
##$DPNAME3= <>
##$DPNAME4= <>
##$DPNAME5= <>
##$DPNAME6= <>
##$DPNAME7= <>
##$DPOAL= (0..7)
0.5 0.5 0.5 0.5 0.5 0.5 0.5 0.5 
##$DPOFFS= (0..7)
0 0 0 0 0 0 0 0 
$$ [...]
##$SUBNAM1= <"">
##$SUBNAM2= <"">
##$SUBNAM3= <"">
##$SUBNAM4= <"">
##$SUBNAM5= <"">
##$SUBNAM6= <"">
##$SUBNAM7= <"">
##$SUBNAM8= <"">
##$SUBNAM9= <"">
##$SW= 400.765351723535
##$SWIBOX= (0..15)
0 1 3 0 0 0 0 0 0 0 0 0 0 0 0 0 
##$SW_h= 32467.5324675325
##$TD= 32768
##$TD0= 1
##$TE= 0
##$TE2= 300
##$TE3= 300
##$TEG= 300
##$TL= (0..7)
0 120 53 12 22 120 120 120 
##$TP= (0..7)
150 150 150 150 150 150 150 150 
##$TP07= 0
##$TPNAME0= <>
##$TPNAME1= <>
##$TPNAME2= <>
##$TPNAME3= <>
##$TPNAME4= <>
##$TPNAME5= <>
##$TPNAME6= <>
##$TPNAME7= <>
##$TPOAL= (0..7)
0.5 0.5 0.5 0.5 0.5 0.5 0.5 0.5 
##$TPOFFS= (0..7)
0 0 0 0 0 0 0 0 
##$TUNHIN= 0
##$TUNHOUT= 0
##$TUNXOUT= 0
##$USERA1= <user>
##$USERA2= <user>
##$USERA3= <user>
##$USERA4= <user>
##$USERA5= <user>
##$V9= 5
##$VALIST= <valist>
##$VCLIST= <CCCCCCCCCCCCCCC>
##$VD= 0
##$VDLIST= <DDDDDDDDDDDDDDD>
##$VPLIST= <PPPPPPPPPPPPPPP>
##$VTLIST= <TTTTTTTTTTTTTTT>
##$WBST= 1024
##$WBSW= 4
##$XGAIN= (0..3)
0 0 0 0 
##$XL= 0
##$YL= 0
##$YMAX_a= 31954
##$YMIN_a= -37821
##$ZGOPTNS= <>
##$ZL1= 120
##$ZL2= 120
##$ZL3= 120
##$ZL4= 120
##$ABSF1= 60
##$ABSF2= -190
##$ABSG= 5
##$ABSL= 3
##$ALPHA= 0
##$AQORDER= 0
##$ASSFAC= 0
##$ASSFACI= 0
##$ASSFACX= 0
##$ASSWID= 0
##$AUNMP= <proc_1d>
##$AZFE= 0.1
##$AZFW= 0.5
##$BCFW= 1
##$BC_mod= 2
##$BYTORDP= 1
##$COROFFS= 0
##$CY= 9.86611175537109
##$DATMOD= 1
##$DC= 1
##$DFILT= <>
##$DTYPP= 0
##$F1P= 182.462994727601
##$F2P= 168.069089081705
##$FCOR= 0.5
##$FTSIZE= 0
##$FT_mod= 0
##$GAMMA= 1
##$GB= 0
##$INTBC= 1
##$INTSCL= 1
##$ISEN= 30
##$LB= 1.5
##$LEV0= 0
##$LPBIN= 0
##$MAXI= 11.51145
##$MC2= 0
##$MEAN= 0
##$ME_mod= 0
##$MI= 1.244541
##$NCOEF= 0
##$NC_proc= 0
##$NLEV= 6
##$NOISF1= 0
##$NOISF2= 0
##$NSP= 1
##$NTH_PI= 0
##$NZP= 1
##$OFFSET= 243.8632
##$PC= 1.4
##$PHC0= 1739.601
##$PHC1= 73.15952
##$PH_mod= 0
##$PKNL= yes
##$PPARMOD= 0
##$PSCAL= 0
##$PSIGN= 0
##$REVERSE= no
##$SF= 81.0140731611343
##$SI= 65536
##$SIGF1= 0
##$SIGF2= 0
##$SINO= 80
##$SIOLD= 65536
##$SREGLST= <31P.CDCl3>
##$SSB= 0
##$STSI= 0
##$STSR= 0
##$SW_p= 25641.0256410257
##$SYMM= 0
##$S_DEV= 0
##$TDeff= 0
##$TDoff= 0
##$TI= <>
##$TILT= no
##$TM1= 0
##$TM2= 0
##$TOPLEV= 0
##$USERP1= <user>
##$USERP2= <user>
##$USERP3= <user>
##$USERP4= <user>
##$USERP5= <user>
##$WDW= 1
##$XDIM= 64
##$YMAX_p= 0
##$YMIN_p= 0
$$ End of Bruker specific parameters
$$ ---------------------------------
##NTUPLES= NMR FID
##VAR_NAME=  TIME,          FID/REAL,        FID/IMAG
##SYMBOL=    X,             R,               I
##VAR_TYPE=  INDEPENDENT,   DEPENDENT,       DEPENDENT
##VAR_FORM=  AFFN,          ASDF,            ASDF
##VAR_DIM=   16384,         16384,           16384
##UNITS=     SECONDS,       ARBITRARY UNITS, ARBITRARY UNITS
##FACTOR=    3.08e-05,      1,               1
##FIRST=     0,             0,               0
##LAST=      0.5045964,     0,               0
##MIN=       0,             -37821,          0
##MAX=       0.5045964,     31954,           0
$$ Real data points
##PAGE= N=1
##DATA TABLE= (X++(R..R)), XYDATA
0 0 0 0 0 0 0 0 0 0 0 0 0 0 0 0 0 0 0 0 0 0 0 0 0 0 0 0 0 0 0 -1 1 -1 1 -1 -1 -2 4 -2 6 -8 7 -5 7 -5 5 -7 11 -12 15 -14 12 -12
52 -12 14 -18 18 -19 22 -27 20 -24 23 -16 12 20 -99 392 8277 -37410 -37821 -10552 20767 31954 13521 -15079
74 -15079 -27714 -16156 8848 26145 20059 -3811 -25677 -23714 -5293 19635 27785 12987 -10736
87 -10736 -24214 -16075 2688 16788 16162 682 -15694 -15913 -1877 14955 18940 7016 -11142
100 -11142 -20825 -15253 2986 19374 17874 3333 -12585 -16355 -6126 8417 14889 7500 -7029
113 -7029 -16592 -11061 4552 16624 17417 2205 -12391 -18331 -9495 6271 16296 11985 -1785 -12097
127 -12097 -11900 -534 11432 10867 74 -10268 -14578 -5491 8876 16125 10307 -2149 -14098 -12549
141 -12549 -2089 10467 12438 1786 -7931 -12547 -5325 6267 13854 9734 -3672 -12031 -13581 -884
155 -884 9726 13153 6101 -3745 -9053 -6512 1042 8505 6232 -1057 -9444 -8984 -470 8318 10401
170 10401 3585 -6238 -10620 -6105 1264 8369 7807 1352 -4521 -4945 640 4671 4905 77 -5043 -6087
186 -6087 -1993 3544 5681 4506 558 -3990 -4823 -1891 1734 2029 1044 -1995 -1723 1047 2646 3396
202 3396 515 -1855 -2755 -2265 -552 440 1725 282 1155 267 79 1200 -1729 -2803 -3106 -553 1337
219 1337 2606 3553 302 -690 -1704 -2956 -1566 92 436 810 1464 725 811 1379 -291 580 -1123 -1825
237 -1825 -734 -1738 394 1137 1952 1152 153 -664 -2852 -1375 -1911 241 2343 3706 1990 -416 -2075
254 -2075 -2635 -1351 960 1809 686 -1475 -1727 -1129 2113 3665 2817 -956 -5829 -4927 -2644 2963 4247
271 4247 2811 -879 -4434 -3957 366 3455 4156 -308 -4637 -6405 -664 5922 8062 4134 -2186 -8137
287 -8137 -6562 1021 5717 7043 1781 -6668 -8112 -2900 6529 8161 5204 -4055 -9507 -7834 -1140
302 -1140 7600 8510 2651 -6032 -9633 -4411 3462 7678 6957 -1611 -8707 -8162 312 6139 9374 2648
318 2648 -6507 -9657 -4597 3196 9230 7080 -940 -7174 -6941 -735 6429 7936 2458 -5544 -8444
333 -8444 -4024 4083 9546 7709 -1807 -8198 -9221 -2853 4551 8385 4829 -4150 -7338 -4648 4031
348 4031 6709 6640 -1466 -6614 -7706 -2515 7065 8024 4972 -4987 -9143 -4779 944 9184 6003 -60
364 -60 -6611 -7487 -2878 6388 10536 5003 -4068 -10521 -8770 635 8771 9631 1915 -5803 -11305 -5280
380 -5280 5694 9376 6768 -3021 -9823 -9092 -1123 9770 10108 4187 -6386 -9897 -4389 3130 9016
395 9016 7119 -689 -7559 -7198 171 7986 8440 1224 -6727 -7982 -3684 4641 8122 7575 -2545 -7980
411 -7980 -6763 356 5988 6907 1987 -4123 -7133 -1683 4577 7727 4184 -3118 -7178 -6297 15 5629
427 5629 6799 1458 -3278 -5782 -3312 2512 5553 3300 -2826 -4945 -4831 1815 5205 5284 1353 -5604
443 -5604 -5651 -2199 3335 5821 3329 -1386 -4678 -4411 -111 4626 5628 310 -3275 -5927 -1824 2788
459 2788 5575 4400 154 -4141 -6327 -1092 3227 5270 3134 -1222 -4691 -2537 1307 4185 3645
474 3645 -1187 -4232 -5293 -1395 3930 5019 2613 -2241 -5411 -3532 622 4071 3995 -176 -2947 -2643
490 -2643 232 3279 3553 1350 -2618 -2427 -3592 792 2393 1881 -365 -2301 -2069 101 1537 2046
506 2046 35 -2584 -2193 15 732 2274 1389 -513 -2026 -1354 449 1740 704 -714 -2411 -1839
522 -1839 49 2189 1806 80 -1053 -1895 -731 1555 1927 2298 -451 -1841 -2234 162 1434 1570 141
539 141 -977 -1101 -1434 721 1356 1948 -164 -1100 -1709 -896 189 -209 -630 -1125 -391 447 -362 222 -854
558 -854 -97 344 1045 1055 61 -415 -508 -41 474 1145 1236 -1871 -1068 -1464 141 631 575 919 -1734 -623
578 -623 -321 -17 -126 -797 -1009 -1160 -126 1020 2458 1758 1182 -1043 -410 -1220 856 2643 386 -1253
596 -1253 -2597 -2619 223 2170 2955 579 -1641 -3225 -1754 2062 2066 3375 592 -2844 -3385 -1486 2994
613 2994 4569 1755 -1925 -4029 -2338 -798 3743 3965 693 -3621 -4663 -887 3871 5388 2734
628 2734 -882 -4200 -3285 931 4234 4025 3 -4300 -4898 -1064 4933 5106 1952 -2642 -6117 -3375
644 -3375 933 4581 3554 760 -4168 -3584 -614 2677 4877 1823 -1773 -4711 -3266 1211 3765
659 3765 3876 -287 -4605 -5291 -1795 2117 4164 1563 -1718 -5946 -3876 186 5172 3897 371 -3327
675 -3327 -5428 -538 2386 5311 2294 -1224 -4859 -5259 -148 4490 5788 1057 -4448 -4134 -3043 2163
691 2163 5191 5028 -1649 -3787 -4602 -2710 3601 5112 2376 -1756 -4657 -3726 87 4664 3450 -107
707 -107 -3912 -4418 -1598 1818 5033 1737 -2066 -5064 -2329 1233 3924 2774 -1350 -3373 -3676 -1046
723 -1046 3896 3788 2326 -3141 -4712 -2270 1803 4658 3704 -120 -3734 -4040 -942 3445 5839 981
739 981 -2267 -4021 -2184 822 3302 2396 -403 -3232 -3254 -502 3629 3934 481 -1938 -4115 -458
755 -458 1539 3488 1103 -829 -3554 -1716 385 3883 3686 -471 -2500 -3772 -2226 1565 3285 2136
771 2136 -346 -2387 -2996 264 2365 2820 1118 -1437 -2772 -2393 388 2663 4214 771 -2466 -3635
787 -3635 79 1939 3060 1920 -981 -5018 -2080 816 2946 2619 320 -1563 -3410 -1888 1046
802 1046 3065 1659 -1535 -2505 -771 170 1531 3320 203 -1680 -2393 -951 977 1682 1072 -283
818 -283 -2530 -797 -409 1529 2143 -368 -394 -1565 -459 1313 1592 997 -238 -1501 -1534 688 2491
835 2491 1960 624 -3149 -563 -548 915 499 -269 -506 -2150 -1467 1815 2324 337 -63 -671 -1800 -1080
853 -1080 892 1732 929 -621 -874 -610 279 340 1106 -661 -1202 -1067 -412 -78 -232 -1084 -385 174 1102
872 1102 649 -267 -975 -420 696 1019 1377 -876 -772 -1232 153 724 906 1121 -1267 -2011 -981 -386
890 -386 1646 636 -270 -1002 244 -873 484 662 -344 -1286 -1532 610 224 1438 145 -461 -506 -2128
908 -2128 -555 1138 1525 394 -1246 -921 -868 103 1896 2526 236 -1556 -1705 -1411 562 2535 2122
925 2122 -445 -2355 -2604 -440 2499 2684 1462 -438 -2283 -1320 73 2135 2083 -26 -2114 -2064 109
942 109 2809 1550 1200 -1020 -2544 -1790 -716 2449 3041 -41 -1673 -1685 -557 2810 3180 895 -711
959 -711 -2591 -1502 -458 2366 2343 -612 -2366 -2816 -475 2154 2811 395 -1075 -3559 -2005 1178
975 1178 2670 1601 -913 -2063 -2192 -1335 2110 3026 125 -1872 -2580 -805 69 3173 858 -891
991 -891 -1455 -3211 200 1251 2863 63 -1856 -2644 -2552 414 2904 1813 330 -1537 -2595 -1256
1007 -1256 1325 2835 1224 -1318 -2983 -771 -596 1449 1543 -279 -573 -1485 -410 443 1734 845 -41
1024 -41 -2538 -1935 711 420 2614 1349 -1715 -1962 -816 1524 1260 2702 -371 -2944 -1870 -482
1040 -482 2455 2001 369 -1175 -1994 -101 -26 2670 868 424 -1915 -2812 -179 1339 2433 325 -1621
1057 -1621 -2430 -1517 566 2437 499 -1020 -1583 -1707 -137 1283 1063 1113 -1510 -2003 -315 675 1752
1074 1752 591 -1374 -2726 -1274 775 2078 3558 399 -812 -2655 -449 1157 1091 1590 -154 -1381
1090 -1381 -1876 -519 1643 2818 365 -1822 -2906 -1187 1055 1465 1121 1055 -675 371 757 514 1467
1107 1467 -397 -608 -273 -1669 -130 1576 459 -599 -604 -1277 857 360 876 1937 27 -372 -1039
1124 -1039 -392 -467 1109 -41 221 -939 27 -296 -859 -211 -108 -78 193 -442 224 1449 11 -162 -190
1143 -190 -170 -27 114 173 -273 -1064 -895 1028 535 -787 873 -46 -309 -949 -924 1656 -1134 -80 -1212
1162 -1212 212 89 240 776 -631 -326 -564 301 -1026 -631 512 634 -687 -662 862 431 231 -20
1180 -20 242 -53 -523 -1006 -747 696 142 -520 -201 -25 -1583 -87 -639 543 -579 1021 -530 -593
1198 -593 -530 336 462 -250 17 -319 -263 -699 -345 -162 -221 -273 -1177 -523 -425 990 1334 -44 243 -1077 510
1219 510 -447 1609 -42 -1364 -661 -1338 -328 1220 1612 1035 -1732 -424 -1897 732 1753 397
1235 397 398 -2146 -975 -654 1031 1068 -236 578 -1800 -510 259 135 2007 620 499 306 -1315 1132
1253 1132 1108 572 -1035 -800 -759 6 888 568 611 -1946 194 167 1576 1347 -76 -113 -370 -1385 400
1272 400 2014 607 -216 -623 -1337 -574 -356 1115 669 -523 -2211 -1582 1644 1037 -130 377 -833
1289 -833 -312 -1010 534 1539 560 -1085 -1561 -2175 -388 1518 461 516 64 -1268 -149 1049 3241
1306 3241 1216 1063 -1237 -680 1919 1236 1368 13 -1451 -519 -1433 5 1700 582 -599 -896 -265
1323 -265 508 2333 409 1143 -1184 -2011 -544 -402 1501 445 225 -1109 -547 1097 376 1171 -140
1340 -140 -590 -1039 -621 1121 859 1078 35 -760 -824 -278 1832 756 475 -1019 -2441 -502 -512 1073
1358 1073 1064 -187 -937 -176 -1219 216 2005 -846 -124 -375 -644 247 55 1373 556 -1582 -1966 481
1376 481 122 755 1082 -1273 -1486 -337 1219 1748 880 437 -1181 -37 17 613 1774 16 90 -1301
1394 -1301 -1287 1186 1906 2291 -985 -1381 -631 -62 807 1305 712 -201 -561 -987 -75 652 890 320 81
1413 81 21 -122 892 1333 703 -268 -642 -601 580 740 810 -768 -853 -1420 16 -875 864 1053 -572 498
1433 498 -701 1169 24 515 990 -808 -367 -1399 604 -354 -15 -980 625 -467 -847 917 483
1450 483 -407 1141 -339 -827 -1216 106 1605 -985 407 -965 -127 -422 -484 -5 -1267 -78 -20 189
1468 189 830 653 162 -980 -22 -613 350 1605 73 335 -556 705 -98 -1009 614 -329 171 -141
1486 -141 422 -85 -510 -521 75 730 320 -303 -23 -445 -44 -554 773 438 522 -387 61 59 201 1076 719
1507 719 362 451 -446 625 -1285 522 -126 -1462 -583 321 337 510 -169 -199 1048 1344 -1115 326 996
1526 996 -421 -1401 -294 -57 -98 631 -696 -413 -239 -553 20 -865 -65 138 -880 -552 -375 -67 234
1545 234 789 -1150 -179 -355 -13 -114 1585 -210 -1393 6 -396 -664 544 749 597 401 1 -273
1563 -273 770 166 -595 260 11 982 -620 50 -425 -242 543 297 -1021 386 456 -281 -753 -754 679
1582 679 707 27 -996 310 -1543 302 -177 333 1124 662 799 -1434 192 41 759 892 -750 136
1600 136 -214 -180 -949 -785 766 -431 -109 473 1059 1390 265 -603 -654 -239 509 1156 -102 -434 -1600
1619 -1600 -1140 -94 618 1254 -566 -243 -695 -1233 1241 1164 633 130 -1152 -321 -659 473 1212 297
1637 297 -810 -1015 -1265 -386 722 218 362 -313 -1068 1503 -85 801 278 -268 -693 -393 102 968 425
1656 425 341 -368 265 -437 356 309 -680 -205 -32 -1000 -731 1258 623 245 -550 -869 -418 278 1265 239
1676 239 -510 207 -465 1025 -1080 1493 -96 -1031 -590 -420 535 491 1377 -151 48 -246 1751 1392
1694 1392 -592 428 742 -1384 -381 395 1447 -255 -182 -1232 -1421 62 -153 1413 17 -736 -1269
1711 -1269 -1998 -173 49 501 1051 -657 -1109 -517 -47 955 -668 -42 -202 -109 264 385 392 523 -113
1730 -113 -281 1109 -111 631 -654 -224 453 -1493 -1190 157 704 531 -78 -413 -395 -574 -164 372 694
1749 694 -254 -778 -854 1333 -486 151 -751 -231 -627 35 -277 -591 262 -759 779 114 1044 848 275
1768 275 -425 196 446 1432 346 219 -1080 -57 325 263 955 567 391 -771 978 250 1069 1017 -198
1787 -198 282 -329 136 788 1090 -66 258 1044 356 -149 204 -323 91 186 611 -617 55 341 493 155
1807 155 -242 664 15 -538 1058 -247 142 383 314 -91 451 413 -383 57 -986 -419 165 549 -861
1826 -861 119 361 -1117 498 -580 -504 82 -127 1550 -629 279 -135 877 505 -19 -201 -509 310
1844 310 -495 193 531 -116 874 -180 393 95 1418 527 510 997 -980 -555 -299 99 134 212 322 -911
1864 -911 -342 259 -524 -184 -116 569 -174 420 -95 -99 416 -454 366 187 120 -124 -554 116 36 663 -1105
1885 -1105 -607 -49 -743 270 -1464 1412 323 -309 -36 -154 -887 -1653 -466 -556 92 -192 -552 -588 -616
1904 -616 1114 1243 270 957 -435 -400 35 -28 460 107 499 -814 -116 402 -132 -931 81 -846 -616
1923 -616 164 -85 1440 248 -600 470 -18 -106 73 717 1847 -626 -876 -385 88 198 -636 610
1941 610 -654 -271 -677 168 -241 -316 -542 -188 569 -631 -51 -293 758 -456 123 548 -415 394 -181
1960 -181 -919 154 171 638 273 158 -661 211 530 -739 536 703 81 -38 -261 370 -828 -263 825
1979 825 -759 254 -62 914 -64 -306 -59 -174 -543 -269 512 16 436 -165 -304 1149 -656 887
1997 887 -415 278 849 -1020 263 -898 -405 175 -132 166 518 -391 -807 769 731 628 -1045 12
2015 12 793 378 95 249 -320 -1016 -18 470 600 160 -442 -472 -536 -213 756 340 1394 -4 -201 659
2035 659 136 646 -402 1458 -981 -121 457 -533 1042 240 1190 224 56 1703 1392 682 -1333 420
2053 420 662 1419 883 284 644 238 -936 -203 -367 998 -964 256 229 -292 -72 -122 827 -35 647
2072 647 -783 326 51 -347 -271 -310 421 -389 -13 -351 -3 111 371 166 -912 309 47 211 498
2091 498 592 289 -54 24 1408 -512 -230 -518 142 -1069 166 225 -125 1274 -303 274 53 564 -151
2110 -151 578 -75 -37 -579 -68 233 634 453 962 3 287 -798 464 1528 -744 -68 727 -314 761
2129 761 -740 -729 -1328 162 -80 -185 -972 -259 -269 -294 742 -229 -308 106 -232 797 -795 -567 -514 -938
2149 -938 -325 -593 1219 82 -292 -507 -444 -418 -554 1478 -515 -290 -251 125 -816 -86 378 -773 -648
2168 -648 328 -629 -223 304 -489 -277 -120 -592 254 -227 -150 -324 -260 424 783 -279 529 -285 252 -396
2188 -396 -331 -668 555 395 -630 -382 -175 497 676 -77 -542 -288 299 672 -699 -481 -184 164 -878
2207 -878 545 432 -222 866 217 60 -197 -170 -464 -787 464 740 685 -1140 -9 909 -906 662
2225 662 -230 -245 -667 -94 916 -50 983 -1208 380 -1492 239 -81 246 -207 295 -754 -1045 168
2243 168 255 -62 -78 166 -122 -654 -550 517 512 785 -103 139 -929 326 333 -82 109 -229 116 -34 114
2264 114 553 -511 464 764 20 65 -230 186 199 -782 871 -437 51 -107 286 -1165 468 753 1073
2283 1073 365 -338 -488 -33 -318 -401 26 451 345 -755 -1115 504 779 -337 1253 -305 988 512
2301 512 -250 -318 310 402 -119 349 -495 -129 5 -299 838 52 1046 280 -71 813 -198 114 -649 128
2321 128 980 703 323 -402 839 -567 605 -159 -226 -689 -307 339 -560 -38 -1304 340 -311 -734 -187
2340 -187 -1310 302 -244 781 -52 -950 867 -732 1003 -173 860 1013 -11 293 326 618 -231
2357 -231 1 -430 -27 338 -325 -97 846 -272 -244 -241 -291 -291 -694 -1006 -48 484 -498 -51 -403 -292 1247
2378 1247 -1405 -354 375 50 727 223 -126 -123 88 -1227 431 -248 -352 -128 -127 158 421 96 495 -256
2398 -256 -415 -301 666 -521 -256 -747 442 307 802 -491 -1525 1049 -914 -1230 369 790 299 -161
2416 -161 1140 871 -329 315 703 -167 263 -638 160 -323 492 -202 1297 -595 -231 392 971 10 89
2435 89 -666 -208 629 -242 -79 480 83 653 1166 -472 -783 -215 -227 -901 663 -36 -179 -278 -410 408
2455 408 -851 332 -1067 -539 1262 -242 1042 -772 486 -191 -298 37 -420 244 -719 -235 346
2472 346 520 151 -244 1038 -576 489 109 -498 -533 -628 653 422 -772 1012 -755 806 -1361 315
2490 315 -459 -495 -458 -668 -89 -1774 65 -884 -355 162 -195 1292 -675 -388 70 446 106 709 833
2509 833 -73 60 -763 -739 167 -163 141 -845 823 -107 -1274 421 -718 299 -775 -968 -72 -607
2527 -607 926 -884 -749 -762 219 1001 301 660 -533 649 -490 560 328 -1216 -908 -589 -246 -276
2545 -276 -807 -187 379 324 399 -457 492 444 1009 134 799 134 -48 33 -63 -673 529 710 -160 -768 234
2566 234 -6 208 -1429 144 -802 -305 834 -60 61 -75 78 35 -773 -91 -587 182 79 -97 -534
2585 -534 131 466 -1055 613 -251 -31 202 -679 -161 -133 -426 -382 -254 603 275 -14 37 912 -8 35 -476
2606 -476 -705 -142 -806 406 -702 -811 -633 -1218 389 94 -1260 -49 308 -469 -448 230 -520 187 -456
2625 -456 421 81 336 118 -740 5 -262 22 -52 -613 283 466 1326 47 78 20 -448 -41 1146 -238
2645 -238 -103 621 -245 -106 -334 -927 1080 145 926 385 1270 528 925 1109 242 -663 -212 -92 207 -229
2665 -229 80 1032 -1478 -817 202 -357 -108 -391 682 -348 -243 -228 500 247 76 -1568 78 1099
2683 1099 598 -86 -928 -615 196 -154 73 166 1249 848 -963 343 -556 904 -92 -308 -843 -465 505
2702 505 -755 70 -1112 111 -2 1339 913 -518 722 -580 -17 -88 -387 -995 270 514 -718
2719 -718 835 482 361 483 416 1574 819 -738 -138 -544 41 65 -630 139 -923 972 -848 -80 -593
2738 -593 -312 730 -648 -614 -398 302 268 -846 798 391 -1498 -879 119 102 400 -858 -395 705 -1169
2757 -1169 -347 393 1426 424 -847 248 -580 794 -320 416 -254 -476 549 944 558 -523 -590
2774 -590 552 -438 286 -669 244 252 -386 -287 158 918 -1231 -77 -668 -1052 -212 -438 -471 -837 213 557
2794 557 -607 136 -155 648 75 -1068 -643 -255 382 -27 -239 444 816 -172 72 -541 -282 1633 -530
2813 -530 406 77 -456 527 -162 762 -229 78 -119 289 -550 72 349 -29 89 -184 19 -449 -1146 -112
2833 -112 -1223 246 598 443 -183 -370 145 50 219 59 -797 -204 68 642 607 762 -387 690 1176
2852 1176 -858 -286 181 602 689 -439 378 318 771 36 -389 1104 -546 703 -575 -928 -454 509
2870 509 166 -321 458 148 1124 -297 -14 466 -444 751 -2 -350 -784 -247 274 -297 -679 -142 146
2889 146 -154 370 -917 -2123 -109 -1462 187 534 -653 52 -292 -523 614 153 521 810 198 1094
2907 1094 -514 990 -1136 662 -332 -369 -243 39 704 -84 -579 -452 -47 -2 351 428 235 651 -304
2926 -304 -919 268 529 444 -807 19 -877 404 226 -342 576 -255 785 399 -144 -350 484 -462 -20
2945 -20 -510 -125 280 -1436 1138 -61 -1301 355 917 726 135 -1092 -1488 -824 59 -878 -741 -255
2963 -255 320 728 -703 349 -1512 -390 -226 415 17 -963 -671 -374 685 783 -206 443 -434 -315 257
2982 257 -362 382 -328 -1586 332 533 402 -129 -478 -451 803 -95 329 364 624 64 359 274 -328 823
3002 823 619 -127 203 -795 1358 -145 -177 76 -342 -672 -1252 110 -155 123 -92 -131 -318 -1458 428
3021 428 432 75 -10 50 347 -1561 47 -487 289 950 601 384 -403 252 -323 -334 1524 206 -703 1109
3041 1109 -485 757 -251 -334 291 976 -722 -535 85 -656 -838 -616 735 -495 -237 343 494 -793
3059 -793 -537 2025 20 -95 -909 468 296 -880 414 855 -642 -501 -397 -399 73 1030 -430 610
3077 610 558 -214 673 -950 112 2 1218 984 486 339 285 -709 227 -486 102 654 744 -1186 444
3096 444 -822 -707 -79 -139 428 131 573 31 -597 1620 386 89 -594 490 -18 -1147 1716 -952
3114 -952 -859 1325 482 -558 -575 -201 -238 205 141 -40 897 -1359 -87 -355 -584 -93 540 1383 71 412
3134 412 -309 624 975 -584 -297 833 146 -937 20 -874 -606 -357 508 219 -203 466 381 277 1096
3153 1096 375 41 -736 -371 165 -914 1626 -176 332 -357 22 -68 -441 -494 -802 537 -1186 -693 -625
3172 -625 -291 1444 -824 -191 -341 149 679 -221 -387 115 490 -196 -215 91 -897 983 936 269 -366 751
3192 751 157 -1297 52 -770 -310 934 290 1071 -889 -33 -35 47 -537 505 37 -761 564 -318 -388
3211 -388 312 -951 -773 -211 177 -676 -783 -69 -93 124 -924 -1045 -521 349 891 837 902 -536 -363 -540
3231 -540 230 -57 622 865 249 709 351 -570 -107 -550 324 -264 -607 -396 447 -58 -509 1141 -57
3250 -57 -528 134 -477 -67 -629 341 -1019 716 879 -339 -38 187 110 -673 -139 -676 -512 609 -126
3269 -126 348 -469 -881 -53 509 1483 -736 -20 -777 -958 300 317 -36 -1238 84 -1128 -120 -53 304
3288 304 242 -1167 132 -52 257 449 501 752 -475 756 238 -454 600 -522 803 -498 148 820
3306 820 1125 -28 -29 -270 -933 -351 -526 481 -1072 -787 779 162 -34 -42 919 301 -240 -46 -358 -770
3326 -770 486 377 248 -593 -264 -411 -548 643 334 1213 -906 758 1084 -635 540 -1285 -914 164
3344 164 -377 339 442 721 -584 -619 -103 -612 -48 666 -283 -1290 -1136 -402 283 16 227 103 -156 544
3364 544 -772 368 240 -810 -770 -760 731 -243 728 -548 -411 523 379 157 122 413 245 980 99
3383 99 -68 1118 888 -1319 -44 88 811 -143 -329 -410 -976 348 -632 202 -69 -28 1314 224 277
3402 277 -761 -580 -203 -168 313 -850 -873 235 755 -20 -705 1255 314 114 -386 193 413 -712 -601
3421 -601 363 -649 -787 381 -637 -448 -493 -503 -565 -193 -682 731 -363 -557 -62 -708 182 284 94
3440 94 -148 1601 122 -402 -300 803 371 444 -135 -141 369 -136 -540 -260 -190 771 -52 -430 1221 -352
3460 -352 -377 -687 -156 -612 273 302 -523 88 -568 -143 -570 -142 605 -180 -466 -522 166 965 -341 298 -260
3481 -260 1229 -608 725 -661 264 -448 -211 -836 -755 935 193 -307 59 269 -282 -232 627 -1477 678
3500 678 1097 -108 498 -1418 257 -916 151 -23 -570 357 495 339 44 -108 186 595 -50 -597
3518 -597 930 -32 287 95 -97 -56 -643 1008 199 -333 785 79 299 687 287 92 195 584 -743
3537 -743 166 967 -155 887 66 -540 -310 1173 751 670 208 -814 -201 264 766 119 -505 25 54
3556 54 1272 -58 243 -64 -183 75 -527 11 802 839 -42 270 952 -870 -99 1956 -201 915 589
3575 589 -83 -137 976 10 188 866 -753 -679 245 -1334 180 -252 -746 2 1066 -699 594 -1168
3593 -1168 -540 -169 36 743 -150 45 -389 531 767 -948 519 364 -407 -623 -238 731 -484 -503 -81
3612 -81 665 300 -560 -2 1238 850 419 -112 291 573 102 -94 411 317 290 -495 -971 858 -1054 -247
3632 -247 -792 60 -494 -138 -174 67 -169 503 467 100 611 189 102 -472 610 -155 720 269 208 -589 47
3653 47 -729 418 -122 -79 1002 -550 758 105 36 -41 -552 440 -290 -83 502 126 426 -1282 514
3672 514 4 -271 512 587 161 -258 591 489 169 -294 -555 441 -303 121 -976 662 439 -83 -124 352
3692 352 1539 130 -499 -307 693 1159 272 383 760 980 175 -449 -544 -1114 482 -1264 1453 -608
3710 -608 -1650 528 319 -480 491 -721 52 83 70 818 745 -854 -688 -337 -120 244 -516 -1203 -196
3729 -196 -270 821 -176 809 -723 -606 -1027 817 -55 -350 1073 -766 -138 -287 -552 -835 -39 847 471
3748 471 -316 46 -269 -131 423 382 -754 1403 -600 -46 1151 269 512 -700 -8 117 356 -866
3766 -866 617 905 47 -286 348 333 1607 -942 396 478 -350 820 -829 688 378 -1211 -190 -99
3784 -99 600 -658 -544 231 -1192 688 872 -15 -1645 763 193 245 -550 13 -221 265 684 -162 928
3803 928 394 -240 -430 -804 902 -160 467 -431 267 -1037 -718 -495 657 103 -637 291 -82 258 -594
3822 -594 -308 -1019 473 -148 1487 96 -806 143 -137 178 -193 160 74 -438 -489 565 -1249 -254 -266
3841 -266 -1092 -123 -308 329 -52 355 -220 -516 -85 -296 -670 1539 95 -488 727 551 -371 -20 -501
3860 -501 -564 -601 -231 496 458 -382 -142 -300 19 -647 -401 89 -925 436 -1012 1087 -435 -327 -300 -445
3880 -445 347 381 1560 -785 1147 -532 81 668 -945 888 -68 -1131 14 -334 -378 -855 -1495 1023
3898 1023 -182 615 -377 97 -405 247 517 170 804 -1211 -125 266 -65 683 212 307 -436 -54 -137
3917 -137 337 -546 -1073 -403 201 226 -202 -385 -405 -416 -209 -967 -981 448 -1121 519 -30 446 162 201 -271
3938 -271 -661 550 408 815 -766 1108 -622 -305 797 183 -536 -397 588 -168 605 602 384 1275 256
3957 256 -185 -667 1191 315 319 1068 211 765 -568 -90 418 -506 -236 127 613 467 746 -58 -118 529
3977 529 -343 -236 20 33 694 460 -5 -307 -52 679 -411 578 529 879 -170 -1627 905 780 -153
3996 -153 491 509 -257 9 599 -395 482 861 444 444 -786 -127 -389 -531 -415 55 265 203 -266 390 -583
4017 -583 -387 51 1560 221 232 531 524 463 -144 -546 200 48 -592 543 1 926 503 194 821 -919
4037 -919 51 -520 -600 437 -442 276 -226 176 -488 -44 51 -48 393 -1062 -501 155 -405 1594 -1179 174
4057 174 -165 817 286 -12 -151 -12 -149 -197 414 -1004 244 174 -974 704 91 -1125 -386 64 -953
4076 -953 -63 -819 -137 226 1426 -900 350 -1098 98 -690 -390 -297 -1171 342 -342 204 -84 -1484
4094 -1484 -289 836 -409 104 455 320 401 -891 401 -196 149 399 1043 -763 -200 -426 137 -1147
4112 -1147 248 299 -392 360 -420 -103 291 496 854 162 1367 -1040 220 -264 -134 -181 80 60 -175
4131 -175 1046 -1089 109 -130 -618 -279 -952 648 173 -313 1612 -410 1272 -220 -154 -107 139 215
4149 215 334 583 355 -91 -680 -287 1091 1108 294 -571 1293 395 -421 1038 -743 -83 65 -389 411
4168 411 -522 258 -1447 1072 431 -381 1090 -494 752 -582 -240 -1153 -643 330 -42 48 40 717 730
4187 730 860 915 -83 1381 -219 -197 -30 -32 627 -225 43 -258 417 -163 -914 440 -1740 164 -730 647
4207 647 595 -587 752 102 -55 653 172 1245 -756 977 -200 366 -1251 493 237 -309 -313 -381 505
4226 505 -303 -108 496 -478 370 -1060 -459 243 1250 420 -876 1323 139 341 790 190 -528 -549 -1154
4245 -1154 -720 705 749 -528 144 117 715 -862 382 -411 361 112 -964 -690 -755 -64 848 -283 219
4264 219 -960 847 -525 -53 1048 -154 -247 -706 383 71 -5 350 147 -278 -321 -232 -454 -649 976
4283 976 -739 1177 442 -261 332 -778 348 204 -96 415 -13 536 -1290 677 43 590 -201 206
4301 206 196 671 1748 51 -501 -869 1087 176 -1082 736 -829 -277 -272 -594 625 -1174 271 -1055
4319 -1055 426 -223 6 -609 -328 546 591 -190 430 -1079 -463 49 485 -176 281 -260 -161 600 56 278
4339 278 -1243 466 -120 -675 -332 -1068 -47 35 -406 19 -985 156 -247 146 465 766 -414 -436 407
4358 407 -961 380 -172 -25 -406 -1050 -264 -634 -107 -417 -140 778 -636 -688 401 -145 -134 378 -701
4377 -701 -154 111 -1362 -239 -566 -267 536 301 64 -1061 -396 688 -491 -417 -728 -461 513 -109 -256
4396 -256 -1198 979 -599 185 -135 809 194 588 -536 401 -86 62 361 -741 221 251 774 1195 -58
4415 -58 84 -702 107 -213 -229 -5 43 -79 978 -555 -300 -10 -67 71 -98 457 -180 287 -588 152 182
4436 182 174 -309 -142 -20 431 587 66 -450 -454 -638 611 544 997 291 -490 1346 -28 1 -453 -1475 -794
4457 -794 -537 322 611 -1026 -1729 85 886 -452 323 -139 284 347 316 253 468 -30 717 389 673 -347
4477 -347 1462 -659 1146 -711 573 -92 -487 615 468 1538 -485 175 -909 -50 873 -971 -356
4494 -356 402 78 -594 470 1273 -381 -137 218 603 -408 -170 -637 -765 1083 -1693 -959 468 57
4512 57 576 -369 101 -126 -59 1127 -853 1606 -302 -202 -650 422 583 -645 -92 682 -47 716 496
4531 496 -169 -756 264 -459 409 159 693 -140 688 -236 -49 196 124 -436 -31 970 -120 -23 -140 71
4551 71 -602 -592 -1433 -211 258 -996 390 -1311 115 -971 -285 -196 -1798 -799 -502 519 -501 807
4569 807 87 792 502 -338 -469 51 507 -742 871 957 824 -910 -39 123 -120 -352 290 -206 -1187
4588 -1187 477 639 312 235 179 -459 1271 441 -1094 -794 -518 159 -1873 159 744 293 -294 -100 691
4607 691 -600 739 -1098 -730 610 -428 239 -5 -264 7 269 -225 -949 316 35 399 308 341 601
4626 601 -351 17 -456 387 695 1164 437 -644 786 135 722 -643 -877 -355 -1096 -406 833 954 -352
4645 -352 535 -201 -823 792 -335 226 -1086 -431 378 -920 -225 421 106 -778 263 234 698 87 584
4664 584 112 234 -64 -18 -615 1002 -179 -260 27 -252 1176 45 -282 47 -359 751 -15 -231 -158
4683 -158 268 -1779 -151 242 668 428 -347 181 216 965 -208 -1 954 -82 1007 160 -494 245 -677
4702 -677 149 247 1400 -571 -103 -385 -818 1219 150 669 -288 -589 339 -57 -130 -276 59 -7 -739 232
4722 232 600 -351 -249 493 1165 263 -215 758 1102 946 366 17 -522 -174 338 1708 868 285 -427 -894
4742 -894 1345 25 -258 -413 173 724 -375 -201 -685 805 1203 1056 -335 -929 70 -798 168 23
4760 23 625 171 893 1169 259 -1049 264 -46 734 -259 -353 908 266 -370 237 169 358 748 59 1001
4780 1001 774 -768 413 124 -197 309 463 296 -162 1106 -5 1045 -856 631 -30 5 131 100
4798 100 -292 53 -149 272 -784 -47 210 -638 -975 -121 357 98 120 133 170 16 -80 777 -474 1436
4818 1436 -79 20 71 -1002 646 -1324 -278 955 151 292 -1091 -654 -117 -472 -247 754 92 577
4836 577 -265 1574 121 -1307 885 -98 -404 -206 -735 417 1108 118 105 42 321 -3 204 120 169 373
4856 373 -236 624 -964 -433 -503 184 1848 -126 -87 279 -74 323 -623 871 645 -18 158 371 442 207
4876 207 213 -50 -398 797 -871 546 -569 525 -612 -183 837 532 -1329 21 314 75 168 -706
4894 -706 -266 -211 -1263 566 -323 1580 593 -436 671 462 225 -549 -587 -442 244 -670 -965 485 -501
4913 -501 -660 -196 272 675 -307 1376 -624 597 221 -198 -144 -657 -864 230 -303 614 -1326 -66
4931 -66 183 483 95 686 88 -1001 -57 133 356 93 -287 -240 174 747 -442 101 508 1197 -1051 -416
4951 -416 145 -377 -532 -885 1062 -600 169 251 -624 131 -130 -898 504 157 -229 677 255 -1235 956
4970 956 992 17 308 844 -176 -57 -101 -193 1126 46 1978 179 -264 594 -242 -47 249 -1309 131
4989 131 88 -276 866 919 241 -3 1014 -291 -1028 -113 -889 526 -116 -425 140 -1351 446 -1037
5007 -1037 -738 58 -763 574 431 487 1471 553 -88 -1120 513 -661 -55 47 205 -405 -896 682
5025 682 485 448 -188 999 469 245 944 -455 -11 -146 574 345 -967 -439 -218 -95 -442 458 302
5044 302 -279 936 -735 1121 21 -317 578 -762 454 356 -218 199 -1238 602 -907 -381 -381 1020
5062 1020 -223 -772 -564 -219 489 -1078 27 718 1263 558 796 328 171 574 1054 -1284 269 383
5080 383 1376 -926 841 -292 163 1027 62 -453 13 -186 109 579 -731 -311 5 671 67 -219 -602
5099 -602 103 -922 -173 948 111 431 -824 380 -709 418 4 -222 1262 310 -542 -633 140 -727
5117 -727 -1033 -130 30 -431 537 -857 817 82 209 -374 441 123 -912 249 -118 1080 -906 1172
5135 1172 -317 1298 -44 -412 104 697 1256 -366 -934 135 83 297 -26 13 305 -199 1293 393
5153 393 -449 486 -638 246 -338 857 -656 -572 -370 90 133 -1023 -37 -538 318 -108 -463 -641 -1353
5172 -1353 294 131 438 -165 -55 789 252 478 -117 -281 -509 365 853 142 -782 -1082 126 789 418
5191 418 -596 1200 -1614 -163 240 -16 -601 101 -370 420 919 -302 367 -216 311 289 -123 266 -481
5210 -481 95 -414 301 -760 421 -526 75 -87 -658 454 -832 235 -267 222 244 -473 651 -39
5228 -39 233 507 -152 355 174 563 -194 1006 -777 16 -340 0 563 -83 -354 40 297 411 84 -638
5248 -638 497 -1094 -101 -52 80 875 18 -784 -1409 104 -100 -275 -51 -695 42 357 175 -371 -432 893
5268 893 640 630 -1 -568 -94 174 -431 296 180 -133 -908 -600 1131 -258 -515 -1004 -375 -623 -401 317
5288 317 25 -251 -508 41 526 443 -677 -128 57 497 -963 1580 745 317 363 -143 802 115 377 -337
5308 -337 369 -929 16 21 368 -862 -282 610 -555 547 1562 -248 -71 -854 394 -794 214 -452
5326 -452 -1296 -892 -1080 147 -131 402 -945 6 -48 -680 -66 -357 -96 -288 421 681 -771 585 -370
5345 -370 -288 982 342 374 -83 -120 228 564 1101 -136 -59 -193 -354 376 -87 331 -465 100 -268 -623 640
5366 640 -50 424 -352 316 -1728 -565 279 -642 1013 639 480 -1181 -159 1204 19 384 -633
5383 -633 -137 264 -2 526 -1138 45 -558 693 -1005 -1126 482 -78 509 282 153 666 -733 171
5401 171 -743 249 -83 -750 -1045 506 27 54 -446 -367 -134 121 -3 -405 -154 304 -719 140 1014 55
5421 55 1376 -167 394 921 1160 -20 302 -248 98 749 -91 -823 464 -321 -426 -871 119 -1008 998
5440 998 -155 -1135 -15 -168 -279 4 49 -374 705 1079 -54 -256 -575 -89 577 560 -374 1511 -801
5459 -801 -53 787 -26 20 693 1077 182 -44 -113 273 -775 535 483 -675 215 -658 267 76 1432 -752
5479 -752 -831 -336 -434 59 -766 982 991 392 45 1189 177 -205 389 226 93 692 -460 -133 117 147
5499 147 -19 -26 -43 -446 216 -900 -519 -551 -705 -77 -291 502 -42 -328 -1079 35 125 15 -181 116 -965
5520 -965 242 654 136 404 -1211 -487 -341 380 -1773 -20 -868 395 339 -174 857 -867 -513 -242
5538 -242 -343 132 -1576 115 389 322 136 -1834 273 -405 -301 -188 1325 -465 -1161 552 400 608
5556 608 381 361 -842 213 92 -559 -213 135 -209 -554 222 240 -9 -201 -747 -427 -235 290 340 -1211
5576 -1211 679 -757 277 -235 -130 1065 310 145 -560 -17 166 -16 -457 113 905 277 -1039 -686
5594 -686 318 -1137 21 28 228 -427 200 -424 -539 -68 606 437 636 193 -346 226 245 775 -97 237
5614 237 -779 89 187 127 504 767 -1261 831 62 403 -456 290 36 -65 72 -409 1442 -428 245
5633 245 -125 130 1014 -1054 -56 -496 -187 -280 -581 -493 -116 -197 -754 -169 55 176 1039 -1152 203 386
5653 386 337 -155 -1256 496 -864 870 -556 1716 -390 -1444 -679 -738 1112 -731 273 -495 358
5670 358 585 -65 67 455 420 607 488 -737 861 373 1105 -1185 322 -199 1384 -1160 705 525
5688 525 -1063 237 -353 952 -590 30 95 -581 462 841 -192 -259 297 270 -235 432 171 -337 673
5707 673 -1543 1137 -151 -3 -92 436 -434 -941 218 -668 47 -811 -1136 336 -345 484 -775 -1181
5725 -1181 349 172 9 -173 319 -158 -565 -507 615 990 -154 -789 477 -592 552 -577 848
5742 848 -343 12 329 -984 -50 74 -1097 340 -752 -813 414 -211 -522 654 307 -378 124 1861
5760 1861 -473 -603 297 -977 -57 -799 -674 -171 -372 579 -134 -68 -431 5 -425 -682 -419 278 716
5779 716 -951 -962 -139 497 -202 208 198 -258 -236 -295 203 -72 439 -77 675 -669 1439 213 -175 809
5799 809 52 279 198 -505 -396 964 457 844 -636 49 604 463 193 -424 -313 359 497 -529 205
5818 205 609 -1001 308 -221 -282 279 -742 1195 193 595 -257 -780 66 -620 957 387 -433 143
5836 143 -812 -168 13 -296 -368 27 759 602 1750 -518 -74 171 -325 -712 -648 122 -226 847 501 -217
5856 -217 -568 -347 -613 -730 308 938 321 590 -361 754 -323 808 1112 256 -59 -859 481 55
5874 55 -341 269 -19 117 -191 722 53 169 210 -283 -230 -378 -864 -688 0 -584 -440 373 -184 87 -86
5895 -86 -5 -233 -4 -646 -1041 -250 126 -16 237 -318 405 477 732 -506 -283 218 1057 -539 814 616
5915 616 252 1135 324 -267 -18 377 378 19 -407 387 -596 1091 193 -239 -929 320 947 -697 442
5934 442 415 260 -828 248 1009 -1065 146 492 350 -381 64 583 -342 -611 32 -839 -53 361 402
5953 402 -288 -57 -123 362 45 -320 -238 -1360 820 15 -1164 1030 -401 1476 -93 646 510 -344
5971 -344 658 -1159 -102 -143 -745 1382 591 -10 204 40 -415 -101 -125 192 -96 -1380 502 -672
5989 -672 741 19 -688 -170 514 -56 465 1552 -201 -376 -205 -305 -48 -65 746 408 -1124 1255 230
6008 230 674 -255 -418 -71 -353 -261 -154 8 386 -272 448 383 357 -1456 -589 -132 104 262 -719 87 159
6029 159 431 812 1264 137 -558 382 -67 -676 -443 472 37 -363 423 -238 681 -602 153 593 -380
6048 -380 147 21 142 -81 278 524 330 -850 45 898 506 -1047 -426 1124 329 282 -849 -145 -783
6067 -783 961 -105 -127 -41 431 -250 67 -40 -515 -431 500 444 -178 -797 -850 513 201 758 -408 -100
6087 -100 747 -769 -911 -649 317 283 363 -334 170 -92 22 1376 -400 1704 -188 -246 392 88 905
6106 905 -982 649 -495 377 -678 -488 1638 -1453 861 -68 -211 641 -135 -26 -686 333 536
6123 536 785 -146 470 -612 341 516 -726 -16 -571 -489 -594 791 814 -175 -286 -152 -106 662 89 388
6143 388 -1252 -441 231 -474 811 4 232 -1064 84 -430 -797 159 -1134 1121 -51 1213 162
6160 162 -1059 1087 -492 -354 301 -69 -36 -462 -162 -504 -710 -201 -8 -634 -18 -72 259 309 585 716
6180 716 915 367 114 730 -199 -498 6 401 -83 -208 483 -467 630 -359 215 -554 -21 112 198 256
6200 256 492 443 126 9 375 783 -105 -111 722 356 783 -765 79 206 191 196 -78 -1452 -215 304 -1392
6221 -1392 -1349 285 129 485 290 -936 623 -425 -231 -120 154 -292 769 -46 -412 -568 -301 1118
6239 1118 -234 -550 1119 541 -200 85 1399 -1057 7 567 1473 385 -1157 525 -439 -677 94
6256 94 -55 535 149 556 -354 -327 7 -1267 816 372 -885 352 -212 -300 -347 151 -452 -465 289 -539
6276 -539 521 -31 503 -649 -429 -634 -221 803 -456 -580 898 -32 -303 611 48 353 744 112
6294 112 -622 427 -252 843 876 554 364 -330 -279 -1318 1066 -1015 -197 -706 -867 -177 -237 228 -1417
6313 -1417 154 -710 -281 -396 -480 -282 1075 134 79 -291 809 -62 590 -400 241 306 425 281 196 -197
6333 -197 21 578 -413 150 221 -265 1179 291 259 -690 -466 280 -1022 712 -765 527 -573 -636 1005
6352 1005 127 -138 187 -1216 -339 542 348 -251 -1344 -121 -698 810 48 140 -416 -993 253 -302
6370 -302 603 597 -917 283 -923 -404 -354 -594 -815 167 -654 -309 -707 171 49 -109 -10 175 -342 1084
6390 1084 254 -517 -521 546 -239 523 340 1061 802 -378 -180 15 -137 -85 16 -314 -290 178 -325 -504
6410 -504 57 514 357 146 -133 1047 -448 251 -383 -127 47 -338 95 -522 350 -527 -572 -302 -324 -166
6430 -166 400 -689 -552 658 394 -868 198 -419 -524 -829 -184 -51 -239 1083 -1448 -206 182 -186
6448 -186 -384 -69 -114 -843 1191 -375 96 383 -691 1127 -259 254 -275 -845 153 -240 -453 -369 -694
6467 -694 -243 -613 -47 -299 272 -61 375 -483 1149 -919 -47 290 -639 12 -212 -452 507 -1070 -821
6486 -821 81 -502 125 31 547 133 273 -115 411 -179 -449 207 -1061 1128 463 450 677 510 583 410
6506 410 570 1139 604 59 195 96 81 -79 546 143 526 -138 514 -94 -112 -605 -1656 430 -922 50
6526 50 84 -369 -565 -726 -752 170 -1 109 770 753 -85 443 -317 -161 1376 -431 611 385 -509 -567 431
6547 431 -1115 38 -82 -93 718 -123 562 -137 -633 -766 -1416 -200 -758 51 646 -175 -668 267 -815
6566 -815 -276 216 176 462 -228 -385 651 160 193 716 -1221 508 1279 512 -1807 386 -133 -1203 344
6585 344 159 261 -497 -205 128 723 748 -981 422 441 -84 400 -499 287 202 -226 337 -223 -95 -517
6605 -517 214 -111 -986 1260 -13 451 -429 569 -156 -329 44 4 -131 202 -654 -651 -142 -895 659 1053
6625 1053 -534 -528 429 267 -635 -772 -62 -667 172 -927 -622 -268 -650 579 578 627 -186 497 -32 789
6645 789 620 -834 677 -307 -185 -366 550 -96 -1100 97 227 369 -708 -470 540 348 296 995
6663 995 6 -481 -919 -202 -358 603 -109 -143 854 -518 -51 -341 -1138 305 -1310 844 -455 650
6681 650 -955 1326 366 63 438 124 -100 194 296 -1056 752 1006 735 527 -5 223 -137 297 493
6700 493 -403 -6 -661 500 -279 584 -666 -590 -367 -15 -777 -118 -723 99 797 460 -82 -825 -595 384
6720 384 18 -208 728 360 -194 1048 -30 -45 -120 13 84 -330 1447 102 133 117 133 -942 -700 905
6740 905 -867 -329 -643 724 420 -521 -107 115 377 -1221 846 -214 448 125 256 278 -601 -128 -617
6759 -617 -242 -128 519 628 -478 356 855 -1011 965 -166 518 -745 278 91 243 -4 -180 380
6777 380 411 -288 -712 161 -76 -16 44 1209 123 461 438 76 770 -22 -532 123 -297 -479 125 -61 3
6798 3 688 -573 590 329 -355 165 -391 -235 -402 219 -45 58 291 -11 349 687 -192 -58 797 -812
6818 -812 88 -127 -458 641 -398 -388 826 416 223 307 818 -477 696 940 -44 582 -236 421 374
6837 374 -1457 39 130 225 -738 58 -380 1 -274 -728 231 451 872 -293 580 147 -534 -603 -516 -118
6857 -118 -658 385 382 -635 281 462 1498 411 -557 -184 -497 -76 -73 1018 422 330 433 -850 158
6876 158 518 619 265 -667 337 -119 -191 -902 -257 -218 613 -604 -321 -631 -629 31 -303 116 938 -212
6896 -212 -529 -771 1170 -97 -599 396 -41 537 -268 -10 197 -438 1009 -174 52 -154 235 793 -220
6915 -220 -89 -460 -206 845 527 -777 -282 871 -832 -368 346 -57 703 1421 836 -1015 255 -706
6933 -706 -425 236 -1551 605 -782 -765 154 -848 -275 865 1518 -136 225 -234 -183 963 533 -309
6951 -309 -580 1344 211 652 1009 -1145 267 507 299 278 -38 -23 -705 899 77 -1007 817 -641
6969 -641 159 -398 -936 -356 -1369 376 -451 -1018 178 1204 -455 -814 934 -377 916 -751 -81
6986 -81 167 183 1557 -423 174 -514 -112 276 -209 -228 -520 -932 199 -118 -732 -1756 190 379 -57
7005 -57 -481 934 261 -745 757 84 525 -1138 -389 1173 -488 -181 544 360 -404 127 153 342 333
7024 333 -332 327 -186 468 -164 -17 575 -60 -291 -110 -362 757 -344 -406 402 -1652 991 501 623
7043 623 -558 -401 -592 549 750 845 -381 145 -100 -1062 1510 567 -934 -107 896 363 -538 -1103
7061 -1103 281 -798 605 663 345 -222 -356 504 267 392 325 468 -265 -109 -372 -795 -370 -1341 387
7080 387 280 -728 448 -329 990 921 -969 424 -1531 -290 -770 859 -524 -175 616 -418 1332
7097 1332 -218 844 -370 -382 -502 -79 66 -212 342 541 507 345 -65 615 1052 175 6 573 1166
7116 1166 199 -674 -535 -308 36 392 1182 -783 78 -2136 34 618 38 -482 -1441 487 -194 -403
7134 -403 -585 -1342 339 -121 266 -971 223 142 -78 1600 353 574 -639 4 11 -15 766 532 668
7153 668 1220 57 -81 69 954 208 282 -26 -503 57 1011 328 -415 1202 -216 -921 -304 304 547
7172 547 41 53 684 557 1178 773 802 -134 1448 -208 -522 571 -7 723 249 126 174 845 1015 -155
7192 -155 -473 122 67 -185 251 735 -1105 346 208 -1224 505 -986 591 -559 115 68 306 233 439
7211 439 315 305 654 2 398 346 358 19 -487 -749 251 -90 -258 -308 181 -163 777 -504 604 737
7231 737 -184 13 -166 -161 -720 -914 867 -1176 -410 -44 1143 761 15 616 -707 -667 -183 482 -862
7250 -862 -1131 -272 -107 375 -365 43 -123 661 273 -640 -292 -653 40 682 -1146 -64 308 -827 -162
7269 -162 470 259 -459 850 -509 275 -297 336 -302 44 -451 -1084 600 -403 -77 454 -373 1267
7287 1267 208 -103 323 -191 -1006 223 123 -847 -758 220 925 423 -741 -253 15 207 106 -183 1140
7306 1140 822 541 428 571 281 -918 -100 -129 1135 42 72 -437 -881 645 20 -241 112 219 -228
7325 -228 -81 300 421 169 -447 -476 -46 -387 251 599 390 -370 -221 17 -235 -264 195 -569 -7 819 345
7346 345 353 458 -643 854 -470 -887 -384 288 -378 676 -587 662 -145 -155 1026 420 -276 -429 1216
7365 1216 478 -369 7 -199 97 699 1154 -635 1035 -228 -1157 -171 -421 -748 -652 1502 -672 698
7383 698 80 -391 -96 -471 311 110 37 414 -859 21 -465 1073 -1730 -97 775 126 -263 851 528
7402 528 -210 1138 -846 -69 394 232 -844 121 381 684 -1661 -851 13 352 -325 -845 917 127
7420 127 123 -877 221 -517 -197 661 -514 -86 143 717 697 5 -74 590 498 362 456 436 -480 -63 375
7441 375 918 -151 147 -106 -217 622 -632 752 193 352 390 -638 529 -27 606 -387 1172 797
7459 797 -1712 -114 -518 228 -305 -166 -167 -518 -244 -545 715 -21 -572 1288 1075 218 -28 -394 -641
7478 -641 75 -306 -61 226 -156 159 -605 498 86 -610 311 427 -304 1128 269 350 363 1389 -50
7497 -50 -3 555 -769 -143 -1065 437 -169 -317 339 -211 -117 -927 -605 -1072 45 754 -814 690 -366
7516 -366 -667 16 -574 465 -219 66 -387 640 159 121 188 -48 260 128 496 1133 -173 84 647 -527
7536 -527 54 -573 -690 -508 551 20 398 -419 -17 426 -637 611 -9 422 292 1080 638 272 757
7555 757 165 -41 -582 197 529 278 -106 49 789 732 1698 -452 168 440 -709 884 738 212 459
7574 459 -536 -355 -658 293 -121 -446 610 -1244 -499 -20 -291 984 -14 728 -582 200 -110 594 1249
7593 1249 487 -144 405 1291 -1930 -893 106 788 547 -708 -131 -211 -325 84 313 626 138 -163 152
7612 152 -813 113 -52 516 702 701 609 -1966 -681 -129 -455 64 -1066 169 -95 -55 -823 55 -272 238
7632 238 46 20 37 -1302 454 -469 -946 938 3 -613 244 713 187 35 -950 -831 -282 -45 1015
7651 1015 1045 -1164 -178 -603 1014 -634 42 -207 305 12 -803 783 477 523 35 409 196 -141 -174
7670 -174 199 27 955 384 -81 -1128 493 -400 -159 200 -735 1122 -272 -28 1040 -10 -98 142
7688 142 309 209 -437 220 -833 -1464 112 879 -134 112 386 -655 571 -150 -629 -56 347 273 -796
7707 -796 955 747 91 -1035 -652 333 -734 -222 35 289 194 -517 499 -1055 624 -269 1148 -339
7725 -339 -41 713 -1012 157 -166 411 -413 -359 614 -1071 932 240 678 -585 475 -544 108 588
7743 588 -335 -234 -229 -627 777 -778 -11 40 375 -820 -439 589 -14 -1430 -315 -795 -663 -244 -291
7762 -291 268 57 -202 -177 560 -550 -537 -303 -41 548 -943 -120 248 223 109 687 481 -375 943 -549
7782 -549 973 -103 461 83 6 1407 -93 963 -87 497 810 -522 1132 -1295 -557 -278 -155
7799 -155 -455 -93 1389 -532 424 228 232 -471 -1068 290 -341 526 -129 -241 -285 283 1199 -252 -151 131
7819 131 37 -1076 -847 -318 -1037 1186 -1619 -339 -70 -1415 -563 -236 -139 -333 -281 -339 -318 161 -712 667
7839 667 -514 -538 0 -103 -491 -203 -1100 -354 -305 -409 -581 388 537 430 223 2 -656 56 89 261 -822
7860 -822 63 -768 -19 -655 554 -731 12 -28 -224 373 -425 405 -393 -166 753 1004 732 1407 -388
7879 -388 -172 -590 343 29 1623 371 303 522 -1156 -324 957 -648 436 450 820 -236 233 -350
7897 -350 -47 -1130 345 -679 439 -274 5 152 -596 496 42 219 497 -359 144 -679 -350 -402 -308
7916 -308 254 939 -1402 106 183 705 -796 564 158 -449 789 925 -359 -451 -107 -237 -502 -985 657
7935 657 169 -470 763 572 -280 -861 1168 372 -387 397 214 -338 1191 -1095 27 -478 -1431 -1219
7953 -1219 187 -569 405 133 -864 -305 -384 206 -593 924 -411 8 -236 -710 -815 338 276 -137 -519
7972 -519 141 1088 -247 -394 144 252 667 -1324 454 -309 192 1114 -235 -350 -835 -772 -294 -52 495
7991 495 -295 5 819 -553 -142 -705 -994 1278 378 479 -497 773 -237 664 628 -16 879 511 99
8010 99 -276 -513 636 -675 274 439 409 367 -554 257 -793 -251 -538 -904 -71 -557 -39 172 659 144
8030 144 -313 273 130 -54 529 -595 -139 594 220 -1066 925 153 448 626 79 260 584 -459 535
8049 535 29 -807 -163 -160 402 -1047 679 -739 889 -224 954 -1158 -333 71 -906 -14 -367 290
8067 290 538 878 49 426 1794 -89 1253 -397 -648 344 657 934 -992 587 -707 581 966
8084 966 490 2057 -510 -344 486 -832 375 8 56 67 817 -282 11 75 -190 709 -483 367 -635
8103 -635 -43 394 841 543 -439 931 -559 191 321 -243 3 -1583 334 342 1112 -344 -711 -526 320
8122 320 -32 631 -338 1025 331 89 882 -1089 238 -1111 1060 -433 -446 -574 -321 605 52 1003
8140 1003 -472 396 34 -845 -521 -577 210 -611 -16 -1185 -565 1096 808 865 -196 -880 71 286 -503
8159 -503 152 1149 526 -82 -914 495 985 -613 -58 165 375 497 -804 1212 965 476 564 -332 -532
8178 -532 -566 -409 -731 946 -908 -613 444 123 113 -591 268 -1228 -124 -4 -1107 -563 -835 -255 87
8197 87 327 -704 -684 184 -445 707 -365 87 -230 -574 -518 -1004 720 483 600 80 -1028 697 418
8216 418 1328 -57 -243 1000 -354 141 -717 7 -89 -212 100 65 258 -149 -919 837 19 342 -209
8235 -209 1562 326 -231 91 -578 211 -565 -360 292 -1518 -310 -85 5 -750 -187 77 -647 669 -194
8254 -194 186 297 847 517 -1131 720 -669 -96 235 -1018 -958 -183 88 105 162 -274 -599 153 -107 -217
8274 -217 362 235 165 583 461 176 -651 -530 582 -158 -160 -1008 -76 512 -175 825 -854 -775 -1044 72
8294 72 1363 -213 222 -335 852 200 -1358 -385 -1 472 143 538 -508 -329 -215 -798 545 878
8312 878 285 284 -418 71 -795 421 1040 -753 726 251 175 -732 -241 1050 -795 -365 -101 353 693
8331 693 -28 -604 431 -110 -90 404 -77 -521 402 274 408 -319 141 502 -78 -672 -517 -439 581 -1450
8351 -1450 -373 -336 430 -145 647 354 -25 143 305 459 -751 808 -494 -132 475 -124 170 -822 1096
8370 1096 484 -281 120 -650 94 -474 214 345 183 523 52 -1350 114 -179 689 -893 135 201 801
8389 801 -614 505 -318 930 420 677 778 -426 528 -7 489 201 -365 497 -401 1031 -39 611
8407 611 123 -427 722 -771 270 584 -318 676 -268 -604 572 213 754 -1396 -614 -1093 251 -82
8425 -82 820 689 -694 685 -489 561 680 -604 -548 -158 -626 444 1466 -491 -681 -189 -90 682
8443 682 -106 -347 720 -304 98 -391 686 448 459 241 -614 680 -375 -234 -812 -86 336 458 989
8462 989 1038 -649 -635 211 -430 -173 378 -502 1152 -480 58 252 -1007 181 -4 -95 -586 -1703 539
8481 539 488 659 -962 -116 -52 244 451 928 769 -36 603 335 895 309 -23 -676 318 34 -4 14 195
8502 195 -215 -680 -395 -126 732 -1010 -740 -233 -193 -642 616 764 -612 430 664 1078 641 -464 482
8521 482 -139 -670 199 -76 240 -395 968 -1276 122 -389 -9 -105 888 1198 -461 291 176 815 228
8540 228 242 227 -1136 293 -272 385 650 280 686 163 551 -268 561 -234 -371 -533 538 348 -658
8559 -658 344 547 713 301 359 -399 -169 -328 549 -1150 14 -601 -583 -65 -268 -505 444 -24 976
8578 976 715 541 440 -242 313 -242 27 32 399 1443 -747 -269 645 11 775 -295 -184 788 -25 -273
8598 -273 173 846 -159 -55 -333 -109 -350 -613 -765 -476 165 833 -45 346 281 695 -397 650 532
8617 532 -534 -148 91 924 -256 -1190 381 -285 1384 -141 -328 689 695 1099 -1112 717 -520 49
8635 49 1926 -99 370 -380 723 -263 147 -636 -338 1422 -873 -243 -88 -179 433 -870 933 -1393
8653 -1393 -1451 623 224 456 -92 444 -713 264 -205 -906 455 311 39 -941 544 -934 -99 595
8671 595 -213 -156 -332 1259 -355 -265 248 -576 -213 -271 -265 885 -795 334 -90 -330 769 -549 281
8690 281 -46 183 302 179 602 -531 17 758 -290 517 1137 524 -17 -30 -600 264 -1011 -417 668
8709 668 544 277 9 -103 -107 -984 -643 -1420 198 689 531 -273 -336 -247 722 541 -472 -838 -556 178 5
8730 5 -1086 424 -1080 72 399 -214 646 -145 629 -438 741 41 -296 806 -1262 797 552 -284
8748 -284 -187 -61 352 -638 -78 33 -450 221 -275 625 -911 212 354 -777 -723 -454 334 -1318 386
8767 386 325 136 -34 -1023 4 66 -481 75 85 167 -686 -549 -572 833 -546 731 9 -29 -111 -73 772
8788 772 -98 -514 1075 -849 120 1049 17 -160 1465 -51 -344 234 -561 -252 -433 -870 592 351
8806 351 681 -475 839 580 -112 -309 -1019 744 8 301 -360 -189 -271 -1002 -1159 1002 741 -713 351
8825 351 635 130 144 -605 427 648 132 1072 -582 243 -230 376 820 180 871 478 873 399 -299 -220
8845 -220 328 -180 1394 1128 175 324 -416 -663 122 -261 -537 -176 -353 -37 -1170 83 85 -742 -459 -657
8865 -657 126 -40 152 919 -187 -724 -160 293 754 -186 1603 -438 948 -392 124 -397 329 251 864
8884 864 -122 -277 1212 110 480 215 690 476 -201 -1074 -70 -362 -756 864 -287 -714 -370 -85
8902 -85 -227 258 -4 -172 16 124 -177 130 -317 -40 -307 -1038 934 -263 374 319 -9 409 259 953
8922 953 194 225 -775 355 -240 -952 653 -416 -333 51 219 22 -34 -327 -154 12 393 -547 251 338
8942 338 -326 548 484 -220 116 -855 -766 -599 6 -1114 213 -297 624 -386 28 885 540 205 -1129
8961 -1129 -661 -602 148 153 -935 249 -45 -319 -97 342 -405 -28 1026 48 85 -901 -867 -343 -792 -141
8981 -141 322 24 -655 -463 1429 -327 399 -451 -92 -22 -264 -396 -466 -39 -380 -741 494 -1266 157
9000 157 -858 901 -810 408 172 45 723 -653 -118 -56 96 -319 343 74 26 -731 894 1123 748
9019 748 838 -274 131 -545 -728 288 -89 815 301 -582 85 -14 136 599 131 119 -3 79 134 -562 -95
9040 -95 305 -213 -121 1268 269 -630 278 390 511 -68 780 599 214 311 50 730 -773 -133 774 -477
9060 -477 1298 -1075 -24 615 260 1334 521 -233 -385 605 220 -1050 720 -942 -126 -23 262 -45
9078 -45 -196 231 94 618 -522 -26 987 34 -835 -1042 283 -987 1258 251 -390 227 -273 24
9096 24 -9 465 -733 -763 1534 -294 193 -302 305 -944 -1046 -600 -1012 449 377 93 71 -373 662 -819
9116 -819 720 752 -105 218 885 104 124 -227 -331 -53 516 -329 1039 299 173 442 -164 308 -1501 366
9136 366 -1522 -280 -863 -156 -624 533 -208 337 55 -718 406 1503 -420 992 -6 -171 143 306
9154 306 667 -412 -215 -301 462 691 -1654 392 155 -86 -643 380 -157 390 898 -628 -183 1124
9172 1124 162 -335 665 705 -32 -241 -237 334 993 -1123 879 -904 489 -174 78 962 -29 155 33
9191 33 356 743 942 33 -611 268 -433 -457 -203 16 -147 -893 577 383 196 -779 -72 692 -684 -301
9211 -301 -507 111 154 151 -489 159 778 -1069 -4 -199 248 240 -325 -738 -70 431 -13 -1086 1216 -299
9231 -299 -828 -290 163 12 1241 32 166 291 330 -166 285 -1080 -33 -69 -718 -319 -560 -240 -371
9250 -371 235 352 -8 -256 -103 870 -380 -207 360 -605 -281 -12 108 -277 951 -380 234 -506 1224
9269 1224 598 -1836 -982 -585 -229 365 -527 642 -1879 -6 -218 -212 -412 -165 605 -1148 314 846
9287 846 50 8 -91 -49 -472 498 541 -198 982 -211 1035 752 402 44 -566 -623 -845 67 -1244 1101
9307 1101 -331 -279 -25 -221 863 178 292 -415 345 -87 -228 1112 323 73 215 -127 1053 -137
9325 -137 796 453 -734 417 -184 -989 -717 44 169 -133 -72 -476 58 505 -369 97 -202 -865 490
9344 490 -106 -650 -35 42 582 329 483 439 389 804 -707 190 610 -344 26 -109 3 379 -597 858
9364 858 248 569 4 -92 -1117 -819 750 -397 -321 788 340 -158 -342 508 -172 413 7 -47 -129 -389
9384 -389 -3 -2598 -4 -203 810 103 -407 240 -103 605 -661 -322 631 82 187 -620 1160 131
9402 131 62 355 1356 -916 -337 944 1087 191 71 1171 618 -657 198 -193 -334 58 -488 288 69
9421 69 -569 448 340 -371 -79 52 146 -1229 825 -60 -102 -861 133 -351 -287 194 -937 888 -898
9440 -898 1513 -218 -533 -436 -145 162 315 214 -560 -542 346 -669 -215 -27 -87 241 -911 249 -941
9459 -941 -419 180 463 218 377 -456 -285 -233 56 -51 10 -546 329 158 -663 1193 -89 622 -745 -178
9479 -178 -719 -106 748 -383 588 32 1076 484 617 -79 -747 953 -273 270 -172 691 -315 -191
9497 -191 -473 -2029 -416 -87 66 -1204 -846 883 458 -314 -103 118 -110 -993 242 -383 -124 172
9515 172 94 -527 -309 -699 -371 643 425 -199 -336 -16 264 110 -663 -348 -430 660 -413 -184 -411 1352
9535 1352 340 -493 569 361 923 -522 680 206 -188 804 52 715 -656 426 -531 703 -184
9552 -184 -660 363 -287 -784 -297 420 704 -653 288 -106 748 233 31 -383 288 -180 -519 -988 335
9571 335 402 448 -275 -385 178 153 624 -1152 453 -573 70 1015 -450 56 -744 -726 -152 -31 472 -73
9591 -73 366 -793 203 445 446 755 -78 45 155 515 743 -388 1165 141 530 -114 -719 -460 -309 1581
9611 1581 -297 -114 679 116 -166 1213 298 697 -436 -248 237 -799 353 273 119 1108 -266 1621
9629 1621 85 636 424 -447 789 589 -551 421 450 107 -107 -82 21 32 9 -1437 -532 290 -157 -863
9649 -863 30 -712 -1213 463 -678 -395 567 -631 -778 126 463 -954 320 -1437 -1027 -679 6 285
9667 285 -291 -94 -276 489 1185 -87 -241 715 526 -901 -350 269 -589 -586 231 552 -1457 -755 -325 437
9687 437 115 -216 294 -382 -454 79 -1106 1 -832 68 398 -323 1812 -691 140 -291 792 -27 -315
9706 -315 771 -141 855 151 966 -697 -269 500 -545 126 -219 278 514 411 708 158 594 -238 -434
9725 -434 1014 -145 1058 256 433 -755 253 892 -1193 -240 -533 -227 -186 -685 -401 -703 520 79
9743 79 174 521 -431 -240 -206 -590 -316 -316 -95 714 1106 -1539 -489 -728 -408 368 -326 12 360 668 -40
9764 -40 163 532 56 147 -599 92 8 -508 -311 109 594 -493 53 180 441 968 893 367 -213 309 -121
9785 -121 -206 294 -440 -1008 -751 -87 584 -427 1051 -129 -268 -130 -997 -561 695 -44 -42 729 -338
9804 -338 -190 -526 45 -178 -304 149 -862 42 809 -434 -459 -409 943 -86 -180 575 74 318 496 46
9824 46 247 -1322 922 -64 353 104 -669 489 314 1151 -217 -258 -262 -386 -64 -1680 557 70 61 87
9844 87 412 -470 154 477 -871 619 392 126 -222 207 -1795 -1381 -54 -843 198 356 691 -252 36
9863 36 824 452 -663 -107 -627 825 -630 -546 11 -177 234 577 9 -779 416 -254 283 235 564 61
9883 61 364 747 -1328 -650 568 -153 162 216 72 38 253 67 -1015 -382 -66 17 319 -929 -497 -195
9903 -195 428 -363 112 -222 -1854 1124 -1478 758 372 -1036 -406 1 289 -1077 365 1252 -655
9920 -655 593 136 173 -104 329 -1194 844 -579 -50 -341 -1299 424 -874 133 -232 -491 -1090 172
9938 172 275 680 -6 415 951 821 -977 115 937 39 516 44 75 594 -309 686 91 -505 -727 677
9958 677 589 586 -633 -235 -204 -554 -307 -145 177 -30 65 -516 -568 -271 -347 -698 -118 -381 452 273 -1086 -345
9980 -345 149 -412 -789 410 -907 -492 -807 -59 -600 -688 -677 -213 1262 1219 -2072 -1256 453 -1 324
9999 324 256 -669 91 -443 -190 144 -502 663 266 434 -813 925 334 -703 286 -325 431 -39 -870
10018 -870 289 -960 -454 -548 -38 -505 -1 -255 -484 258 -997 447 694 7 736 385 -369 167 -135
10037 -135 570 765 35 217 33 628 942 -1166 187 238 -1904 446 -167 -650 1054 -22 -698 351
10055 351 -689 183 -895 771 -728 315 -1324 685 520 -1138 -645 -626 452 864 -104 722 -371
10072 -371 -235 -567 -202 898 -1640 -760 -1368 870 -768 301 -42 -72 697 -930 411 474 -348 174
10090 174 610 541 -103 323 314 -389 686 -1120 215 -29 -600 -486 -367 1175 275 26 125 -199 105 -536
10110 -536 575 -551 847 156 -1197 561 806 -543 272 -1243 -405 -467 -252 961 615 164 1385
10127 1385 422 269 807 748 579 556 104 -323 143 1062 585 6 -795 169 252 -499 374 868 -514 180
10147 180 1150 674 -613 -219 -503 47 59 -320 722 347 605 -1776 1165 695 837 76 -1167 554
10165 554 481 555 -369 -550 -57 166 -457 -17 -702 610 -207 -223 -141 -10 -520 -281 -45 -147 140 -537 -125
10186 -125 318 362 678 -101 341 -506 -505 78 -526 -794 -351 367 -821 1027 -621 1060 -730 -693 123
10205 123 138 -818 -995 -674 -482 11 509 -517 119 104 842 172 346 653 1046 -439 240 51 159 -736
10225 -736 -1009 446 -742 373 173 -707 -338 897 110 987 -1078 280 691 786 -443 564 100
10242 100 1002 157 -471 -502 1616 -717 653 841 -473 396 137 -217 486 41 7 287 542 944 -465
10261 -465 718 1227 304 -415 641 81 947 -1233 329 -416 1163 -1028 143 -133 175 -433 289
10278 289 -546 1178 53 143 -582 -220 -213 -120 699 945 -199 -571 873 279 965 28 605 873 -129
10297 -129 -1569 80 68 -636 71 314 -440 -665 -424 440 279 136 485 -1120 -612 738 -292 683
10315 683 656 -261 -761 -26 406 -180 982 -154 -534 271 -799 145 -362 643 653 -459 -8 -315 1565
10334 1565 -752 616 -79 -309 -268 -435 1396 -55 -758 -501 -354 856 -230 946 817 -225 94
10351 94 -29 214 -855 897 -1517 119 -316 -1370 1345 -759 177 68 177 1 -358 191 -686 -102
10369 -102 -6 264 130 -1141 -182 -369 -494 267 -378 -16 303 -109 401 352 662 223 -675 -376 255 -438
10389 -438 311 -266 -1089 791 -558 962 -644 465 545 534 321 60 1234 51 358 -430 6 -214
10407 -214 815 -243 128 902 1211 -1114 81 -279 628 -403 -549 276 -107 1898 269 -118 949
10424 949 498 14 -339 749 -337 -713 719 -377 -202 565 -519 -615 -7 -327 -262 -268 328 736 542
10443 542 -144 310 -37 1038 -432 -306 -866 -988 271 -430 555 -114 1172 720 15 43 -198 209 -721
10462 -721 98 1330 376 -158 505 221 -976 396 -119 -194 -128 -434 -90 -578 -152 162 -390 -4 531
10481 531 436 -433 146 471 -71 -40 991 -368 -871 -269 716 68 1483 -1712 140 136 351 339 -544 -161
10501 -161 -1363 -137 -1174 161 -528 781 -252 -562 -1187 99 214 544 -709 -198 63 948 -574
10518 -574 -403 298 -1161 285 107 -118 -274 415 949 -380 -847 723 -481 -68 -106 1028 -1426 646
10536 646 -94 49 -355 -1016 654 -657 352 467 -392 258 674 -2072 -1580 289 -308 -377 388 -595
10554 -595 -177 -60 172 -147 293 -242 -382 808 574 357 -844 -27 208 90 -465 104 1267 111
10572 111 -628 -807 60 1576 -45 339 -794 148 212 -710 -249 621 -740 -250 -294 1161 393 -588 38
10591 38 -472 906 -156 1210 -318 1319 -780 152 1179 -1159 -365 -339 365 -269 -448 -845 -605 835
10609 835 -443 36 122 -404 -432 2 -358 924 -577 84 61 -1151 -1223 540 -693 -213 240 -210 324
10628 324 -692 -372 -450 291 245 13 215 -609 -1158 -364 -204 466 -290 -1130 42 680 -492 -693 220
10647 220 -991 128 -6 393 -450 433 -1270 -116 406 -188 685 647 -410 416 -79 770 -115 863
10665 863 -585 765 363 -774 409 -215 643 -250 199 214 -25 274 25 -672 641 -537 -35 -400
10683 -400 -26 -125 -583 -585 -478 254 -1009 172 44 -95 865 -414 -26 516 923 673 124 514 60 1068
10703 1068 -589 34 -218 -227 183 463 -509 -2146 306 -999 -268 30 -882 544 110 -41 -1085 -455
10721 -455 -84 -254 280 -510 159 -458 -488 331 -620 -579 515 673 -45 -634 537 -1693 618 114 -886
10740 -886 -193 807 -335 -363 -402 -55 211 -254 -165 414 143 -310 449 504 -416 -255 -159 129 565 322 -736
10761 -736 560 -1441 -471 -762 -619 -86 7 538 -264 320 -649 -541 -441 -1135 484 -354 654 -1195
10779 -1195 466 211 -118 -242 1059 -905 -377 475 -832 -761 -24 246 657 490 -870 817 192 1303
10797 1303 371 306 -494 530 -396 -337 772 -361 -515 493 60 941 -611 646 -179 568 -840 455
10815 455 187 -133 403 -238 1058 47 -637 -879 -842 666 168 44 734 507 660 -346 670 -284
10833 -284 -642 -331 258 556 104 -710 -734 -82 246 -167 -805 613 604 -959 -229 827 672 881 334 -175
10853 -175 -429 818 555 -951 572 -537 278 -653 -653 -120 -443 -584 260 -286 -774 350 64 -482 832
10872 832 -134 -577 99 1389 -442 -881 504 -371 -99 -622 957 -32 507 573 -269 -816 -38 120 491
10891 491 389 908 -777 -1364 24 -565 1044 411 1596 -224 1207 -1150 445 1399 361 597 753
10908 753 -101 77 -204 583 -1385 89 -124 227 -103 -385 518 -119 -163 -367 100 608 -476 -168 32
10927 32 132 555 -234 1039 -1021 1113 -43 -1049 -469 -23 -89 -31 405 335 -281 81 -537 -427 -991
10946 -991 56 1189 -6 125 -65 1351 355 -11 -277 -263 461 276 -369 -1023 -931 147 -129 650 -164
10965 -164 97 321 507 192 820 -248 40 654 -148 5 -46 -255 1167 -727 -176 71 -82 285 51
10984 51 -106 -88 1663 -409 944 -1111 49 1426 -448 -255 -10 -1394 -1512 425 494 45 -311 -351
11002 -351 68 -190 464 250 -124 852 404 416 -211 -134 -36 -185 42 495 607 189 -882 766 -284 210
11022 210 129 -81 1202 30 -311 -555 386 -67 256 -735 -598 -171 371 -247 -516 522 -23 -188 288
11041 288 -113 1610 -652 -667 313 -10 -872 500 793 -753 -383 87 -303 500 -390 667 -566 -400
11059 -400 732 310 824 628 1020 230 -322 -51 -63 190 -511 -727 -440 -379 266 -236 -314 188 -178 227
11079 227 -397 60 986 -615 -336 -475 408 -151 932 509 -177 -278 -508 -941 -415 -404 -603 706 400
11098 400 19 838 476 274 50 361 202 -604 -972 -552 -486 1130 -1249 184 -893 164 -402 384
11116 384 -291 -367 1137 9 -382 -945 -539 -109 983 -608 205 348 1144 -102 424 597 987 -597
11134 -597 1022 -503 -165 -741 89 448 -892 307 -661 6 -130 26 347 800 -649 -362 -173 -749
11152 -749 -474 -227 528 -265 -629 -975 326 804 -215 208 636 929 -11 791 -583 446 -579 574
11170 574 755 -409 401 -1272 825 86 730 -282 -119 -772 -187 250 -201 234 431 -141 63 -1070
11188 -1070 6 -508 34 -303 -364 460 56 71 700 -1162 -494 315 946 -1323 -339 -27 -142 -317 -397
11207 -397 1168 368 1084 -232 1190 923 449 -226 -353 -464 -691 367 -638 -491 -201 -1494 216
11224 216 -443 247 -24 -574 1566 -272 -539 -655 -2 -860 -616 539 -638 -373 334 21 -85 -564
11242 -564 -1526 425 -422 703 -1677 -453 56 -30 -145 -431 719 -450 1587 -1002 677 -147 -130
11259 -130 -223 -537 477 298 344 -845 213 215 921 -45 -204 257 -277 153 455 527 -357 -1010 712 456
11279 456 140 794 -1332 443 -674 321 270 242 -204 799 830 -388 382 -262 226 743 17 -1618 -1635
11298 -1635 -32 -103 -861 -573 756 878 -401 -409 429 105 -361 232 1369 -8 304 617 -339 400 13
11317 13 -703 -623 522 385 -1371 -752 -1319 503 -344 -542 371 468 181 391 606 -272 60 756 94 910
11337 910 -1020 741 374 -762 64 -375 995 1052 -612 -128 -220 -760 -1396 -188 -581 -275 -216 -1161 796
11356 796 -74 1182 906 188 418 -853 577 -872 435 -318 69 1016 428 -309 -376 -411 12 20 -88
11375 -88 186 -371 27 1274 686 51 1176 -165 749 -362 129 276 509 314 393 -453 883 241 618
11394 618 -416 -161 1274 324 -974 -676 423 -833 243 148 686 452 169 364 433 1162 -570 69
11412 69 -1015 368 -270 814 -210 -1501 261 290 942 623 120 184 -364 158 -417 543 -148 -409 -650
11431 -650 -99 870 64 -219 588 -1008 266 403 1258 490 353 69 91 771 -1069 237 396 -586 195
11450 195 -450 228 15 165 -170 -582 383 -297 -413 605 428 204 -363 798 272 36 -780 604 263
11469 263 33 -129 -259 7 -988 797 85 701 1466 -694 -707 253 -784 22 -1114 -130 774 10 -168
11488 -168 -520 380 -451 167 594 503 244 -336 1368 146 -809 -479 -945 110 123 -466 97 -688 -317
11507 -317 -326 285 -629 891 -198 -567 -149 499 -283 289 385 417 690 356 -130 454 -394 -182 579 324
11527 324 -110 406 -263 -188 -298 -392 629 593 -648 -534 -198 -990 1180 -576 -1185 208 640 42 919
11546 919 -338 283 149 -88 509 -665 700 -1535 390 -517 -1008 -10 -881 -128 359 1052 -195 -498
11564 -498 566 -798 -202 475 -253 386 -95 253 444 -759 -830 -755 -448 491 425 -83 -623 1207 -302
11583 -302 -425 430 1035 203 341 -27 675 448 -94 -112 171 808 1091 26 -167 166 -140 -1013 -40 624
11603 624 166 204 84 133 239 -206 -77 802 -773 -611 -25 -445 23 -43 -522 1117 -524 193 -11 -300
11623 -300 -150 -554 35 -46 -597 -1 -218 -1239 808 886 64 -634 278 -1214 186 648 1382 -203 1217
11642 1217 38 881 66 -968 213 215 367 1056 -508 -1121 -1093 687 -388 -365 -166 -196 172 -1974 629
11661 629 368 -1193 358 -892 339 -26 -293 648 -62 147 -1113 405 -54 427 37 -657 -392 1148
11679 1148 907 -1113 570 527 -24 -335 -129 260 -1349 341 574 -206 -298 4 94 1044 674 -650 -677
11698 -677 113 -229 1159 258 -787 -344 -106 -588 -107 -583 -526 133 -157 -809 873 -622 -952 -541 661
11717 661 341 -547 269 371 108 -712 892 662 625 41 -555 1261 503 93 -716 -202 -576 -162 -316
11736 -316 324 -311 564 3 490 360 271 245 -1019 294 208 214 100 221 305 -967 42 691 -412 -215
11756 -215 -61 557 -1341 -483 -226 247 364 -455 463 435 -95 475 -438 -310 -589 -338 -361 761 -222 -570
11776 -570 -151 -277 -118 772 119 -312 432 -294 -500 364 -97 -335 657 404 -327 -390 -165 456 -563 215
11796 215 -246 198 -534 -188 42 697 19 -607 -584 600 -197 -640 83 -99 -345 536 -163 623 -763
11815 -763 -9 -211 -288 -141 -383 960 231 315 627 355 -419 46 168 1492 -675 1409 -230 870
11833 870 -652 240 -500 -17 -60 -70 369 -577 -177 -137 -243 -57 -853 869 -74 631 303 -171 164 -431
11853 -431 819 -60 -121 404 -686 -180 -1075 -974 -203 15 298 714 -279 -48 -78 -274 -1548 291 -484
11872 -484 -657 64 -336 60 -127 165 -1197 -58 460 468 100 -353 -396 608 7 -546 -211 -684 -593 1359
11892 1359 -359 130 -515 777 530 -404 812 487 -243 -184 -130 -912 -895 95 -297 -590 -731 -58 1696
11911 1696 -836 -92 -720 853 400 -259 300 634 62 229 910 433 -617 -995 960 -819 158 572
11929 572 -1752 888 321 -556 -609 -72 -121 186 -223 54 -226 960 328 1323 295 369 123 -665 -1067
11948 -1067 -285 -78 -325 -392 135 -1282 520 -459 -686 967 -1200 429 -478 466 512 -590 -244 618
11966 618 -20 -827 915 142 18 -262 -776 -238 -843 -459 -345 333 178 135 110 1253 265 -234 -1330
11985 -1330 199 182 498 -554 1735 35 -20 499 -942 553 -785 -436 349 71 -169 187 -399 -282
12003 -282 156 50 313 442 -1118 644 -1167 360 -992 -1121 -544 -796 -125 -210 -857 566 -351 706
12021 706 -495 618 213 -268 965 -449 228 807 -1273 322 -105 -603 554 -148 -484 723 -1229
12038 -1229 807 691 -776 551 629 416 534 113 -499 157 1385 -414 792 -71 -15 -232 678 382
12056 382 -384 -450 -1356 455 776 43 -112 389 -701 594 -606 620 -81 -66 175 1065 150 -274 213
12075 213 -537 299 180 768 763 756 -253 -559 1173 554 -693 497 -38 937 -683 -13 343 -1073 605
12094 605 -360 64 -985 156 -836 -486 -169 -1152 -4 314 1490 179 205 61 -58 -245 -746 -58
12112 -58 1375 -669 -194 65 -190 -856 342 27 -333 -73 -227 -9 -429 -1131 514 180 -24 221 -586
12131 -586 -218 187 -873 -391 549 -649 -281 -906 -19 54 -379 471 380 213 349 -1205 -372 -924 892
12150 892 -1320 -1368 -220 -265 674 276 -232 317 -128 -485 -173 175 176 967 -115 258 84 112 753 -525
12170 -525 -300 -1147 924 -698 -526 356 -19 -995 -272 -171 8 -490 668 -696 -114 -135 -876 165
12188 165 324 -202 524 -36 -127 320 -227 151 -257 -1523 -183 99 -193 -889 -330 726 107 -294 12
12207 12 -524 618 -799 245 -709 375 521 1305 -142 -734 28 373 -794 460 -126 579 -161 -877
12225 -877 -682 -1014 405 -105 350 278 -404 157 174 128 -49 -1217 -1274 461 432 -392 326 -50 875 -850
12245 -850 -522 137 -1090 -705 700 909 501 -868 -252 328 -53 840 -41 -352 154 458 -670 950
12263 950 30 831 -1483 903 224 -319 364 0 311 -44 -56 -587 22 434 1129 345 818 -902 -988
12282 -988 -514 128 -560 279 -1194 -425 -778 -459 195 266 -262 -552 -922 137 -711 -557 326 1044 577
12301 577 160 245 755 553 -989 -60 -903 429 317 329 -25 -292 697 -202 -169 486 -421 844 503 606
12321 606 -619 885 738 -312 953 946 -763 1035 738 -529 -536 327 21 275 1339 -709 361 -900
12339 -900 439 897 593 779 -789 197 -367 723 -205 -445 671 -655 5 -48 -299 283 231 1124 -7
12358 -7 1585 -317 758 -505 882 -69 -104 -104 -329 135 745 384 640 -757 470 446 -701 -309 209
12377 209 854 -10 1120 -419 -100 -488 853 274 -103 -596 189 398 -193 648 472 -165 424 -105 -54
12396 -54 356 424 -435 -256 -188 440 501 -553 406 414 -687 -352 -367 228 574 -1157 376 306 -246 338 185
12417 185 -184 -1071 -313 -1288 -224 1507 -720 -4 121 125 823 849 -317 53 400 -1361 761 -391
12435 -391 -734 -364 298 282 491 839 -110 -392 57 1343 0 -261 595 -498 -492 1117 -998 -354 -633
12454 -633 431 -909 907 912 -361 497 -294 925 -159 -1138 -41 105 124 -468 158 -287 -250 566 -113
12473 -113 514 -154 -670 -292 429 -912 -765 -245 1515 258 -229 -526 1595 -67 1617 -804 377
12490 377 1290 -584 363 -4 -495 -1053 1110 -316 -971 493 494 -977 423 293 -199 13 -274 -50
12508 -50 1179 1250 151 795 -140 -454 3 -797 98 -583 504 -286 566 754 694 -1488 -375 -628 481
12527 481 1315 -170 478 -201 -566 129 448 486 -541 -545 461 287 540 -1147 1369 540 -808 21 -922
12546 -922 34 -498 415 174 183 85 254 -121 -270 351 -706 -1048 1108 -562 -233 -278 143 361 449 -721
12566 -721 402 84 -135 25 -1253 -430 669 176 -787 388 -572 872 201 156 -634 190 457 816
12584 816 957 601 -373 509 -10 -570 28 406 -37 939 -333 426 733 -1246 -362 -362 320 -572 -272 612
12604 612 547 679 -56 146 -894 433 790 163 31 -865 766 293 174 22 -6 127 -1247 875 23
12623 23 -338 513 -9 459 191 -715 -175 -227 -456 -290 368 240 -761 -431 -318 322 -832 -37 -266 597
12643 597 1296 -40 42 -630 -150 1014 211 114 336 -127 957 696 -25 321 -550 -1165 344 159 376
12662 376 -230 -55 -1368 -1415 716 584 368 -335 -299 -92 935 123 -163 -110 438 280 1230 39 425
12681 425 -506 728 -198 769 -917 -217 518 -201 303 -25 -117 281 179 -288 -666 -976 -557 -24 930
12700 930 -1144 -15 -585 -367 370 -73 -117 343 -685 548 1556 437 -613 -228 521 -187 243 -782
12718 -782 -790 -836 -176 8 375 23 -342 1622 -660 690 367 128 -14 449 656 -1193 637 -1582 652
12737 652 -842 -354 -553 -374 224 -582 781 357 -16 -265 1043 240 -414 54 -182 -221 381 -335 -5
12756 -5 600 808 160 -216 680 -357 247 -534 -327 -715 455 279 -419 -257 -595 283 423 -234 64 43
12776 43 644 -330 5 -134 3 -292 -128 523 -62 1225 -267 638 956 322 1302 -49 618 -474 -942
12795 -942 -336 -190 141 -796 708 390 368 -346 -1113 671 -1258 916 394 -899 -291 -356 -553 301 -207
12814 -207 -393 -308 -484 -292 -341 79 442 294 134 -119 392 -355 -753 -512 -92 -654 406 -775 212 649
12834 649 -509 554 -167 1263 -561 -1039 -547 -775 625 -519 -16 70 649 702 1090 345 -260 104
12852 104 -241 697 -124 200 236 -82 -810 -229 35 19 417 -254 -60 725 -88 -350 -225 -214 -439 -545 -291
12873 -291 45 -1501 753 -262 600 -123 -597 -513 -46 714 -153 343 123 176 625 -10 659 -43 -401
12892 -401 57 -190 685 -67 651 -168 616 189 -114 -59 -810 194 139 1362 -86 300 302 727 715 -250
12912 -250 -1318 547 -871 354 -597 -692 51 -198 -151 -165 681 -42 -352 419 -265 139 604 894 -358
12931 -358 -339 -289 417 829 -1084 896 -261 1979 578 -683 777 394 1289 120 585 446 676 111
12949 111 620 845 -554 1281 -61 -432 -197 442 260 -194 -2 -91 -1017 20 -155 759 -653 -1437
12967 -1437 890 -349 471 -634 -98 -406 -199 442 555 -29 -1113 -429 -38 585 1015 -174 -133 -2
12985 -2 -580 152 581 -163 -54 823 -639 -615 327 495 -444 -678 271 390 -626 70 -1056 892 -988
13004 -988 -82 -438 597 -569 -349 175 -254 526 -61 -62 -444 -598 -259 315 959 275 155 92 31 570
13024 570 -7 -451 -187 198 -856 -1054 -879 -439 473 -375 73 759 -150 1152 -122 -111 72 -571 971
13043 971 -481 322 153 204 -105 62 -212 287 491 478 -214 392 -218 -50 114 483 -63 -118 -497 342
13063 342 -366 50 423 -262 876 1180 235 1582 -509 805 760 -247 689 -229 -535 -1047 -180 88
13081 88 -74 382 367 227 917 499 -178 -27 -138 0 624 -1016 -513 216 713 114 -440 -335 751 337
13101 337 932 -242 205 -348 567 -191 1129 502 303 1002 -226 1087 132 215 -1428 -1147 -226 361
13119 361 229 -99 763 -682 741 1116 -495 729 -384 34 722 -884 1009 598 591 504 -1099 59
13137 59 259 1031 -487 -367 375 85 543 -1048 -32 531 -1337 729 869 1654 -552 707 -305
13154 -305 64 -524 217 -113 263 516 471 125 507 1333 562 -47 11 -473 -474 931 936 -163 -570 517 -464
13175 -464 649 -435 -739 -261 -584 1154 -613 273 -909 -764 91 -387 353 362 1230 -535 -52 206
13193 206 -900 1137 934 161 -170 -72 -576 -452 335 -236 460 628 251 642 -11 1755 -249 -277 -343
13212 -343 449 265 -442 404 546 -392 395 -1305 230 -106 -299 816 -126 909 674 -129 -253 -223 -523
13231 -523 -320 -2036 826 277 926 911 -359 378 971 -650 470 341 134 1554 -80 514 162 -152
13249 -152 366 178 31 -852 963 -1138 -105 -99 -457 23 510 883 114 -651 978 -184 -247 -184 -96 -241
13269 -241 349 -121 -572 450 -995 209 -631 50 -650 -1478 -225 -821 -229 336 -295 -349 -545 1257
13287 1257 306 -815 -892 614 635 421 275 -678 -1067 30 -280 542 -308 270 -828 -411 -14 -440 231
13306 231 321 724 -555 796 -6 93 475 103 -285 45 -772 361 331 303 -473 -473 -706 -518 82 -1782
13326 -1782 679 -1148 109 -784 445 283 70 1187 -855 904 466 564 -618 293 -437 -297 53
13343 53 -492 304 -420 27 1018 -1229 235 186 695 498 59 177 -937 870 433 -226 899 -820
13361 -820 -22 -467 641 -178 392 1171 -488 561 -45 118 542 -635 -688 -391 217 941 86 292 -533
13380 -533 68 -763 164 37 -539 822 -1417 -251 387 399 685 195 -175 -703 612 106 430 -1186
13398 -1186 139 -1100 -502 195 -313 380 756 838 1438 -316 117 609 -50 -110 173 405 -615 -68 -1037
13417 -1037 549 -576 611 649 -742 -8 -481 1069 218 205 -368 534 603 -788 480 -853 -59 233
13435 233 749 910 1114 -431 297 273 111 214 69 -473 -783 -312 180 -230 -758 340 -1235 811 -376
13454 -376 -316 561 -646 719 -321 285 618 -1177 422 -313 265 375 1638 -628 1163 900 -658
13471 -658 -28 -881 -580 712 21 -149 -862 -34 -167 121 88 26 -22 -498 -817 -626 460 157 230 311 -948
13492 -948 -601 -332 -500 835 -64 126 736 -777 88 -362 285 -216 -491 1034 -525 943 562 36
13510 36 472 1294 -640 -128 556 172 -438 123 -447 186 -298 331 184 508 -694 837 -549 1373
13528 1373 755 140 307 -241 -823 -315 -39 672 362 -527 597 -562 -81 -422 658 -841 120 -770
13546 -770 811 708 -35 1729 -365 1173 -211 306 84 -691 286 -972 16 -215 50 1150 -567
13563 -567 238 -433 501 367 -609 1291 -354 -65 383 -227 163 125 1114 -254 596 764 -236 -544 -117
13582 -117 1039 185 615 -378 -390 904 -469 254 736 470 -61 -197 1695 -795 252 -1132 -92
13599 -92 1005 441 650 225 377 463 847 -797 -726 497 79 104 999 -571 1183 -592 924 73 540
13618 540 -487 -165 -215 -345 1441 -188 625 -545 -327 -574 -48 152 -929 348 610 -701 130 -613
13636 -613 2039 -68 1 417 434 258 -1189 157 -350 -56 -105 64 883 182 507 1105 188 636 -419
13655 -419 400 -39 21 -185 931 -95 -898 -84 -138 1104 110 -951 586 -717 -478 -13 -325 324
13673 324 463 679 439 -962 -1020 305 191 -38 -280 -266 213 -477 332 -581 282 486 -814 489 -868
13692 -868 542 -931 -154 732 190 475 -1694 -737 -953 -777 -56 -654 -373 -1195 32 -184 937 -7
13710 -7 806 36 -220 -350 155 -630 798 317 1671 259 -36 332 -1029 -442 -847 240 -431 308 -931
13729 -931 -200 622 -177 1368 184 -577 -200 -347 -400 -431 376 -740 33 606 567 -556 -330 758 -165
13748 -165 365 448 -451 770 47 -313 -558 204 -108 46 -579 -137 227 114 25 -613 469 457 417 -255
13768 -255 -218 40 1206 -485 943 -232 105 550 -849 716 267 -20 1246 124 625 -859 510
13785 510 -441 -545 -615 92 938 -402 616 -1173 -193 -802 -520 -759 -35 613 -1036 513 -380 128
13803 128 598 -351 -682 329 934 -366 351 -1006 -94 -120 -113 759 422 13 -323 -963 52 154 -305
13822 -305 -1007 659 169 -423 -120 895 -1252 -1 -134 -424 -772 -22 -590 -392 723 -956 791
13839 791 -638 383 -81 -290 23 -321 294 -518 415 290 -590 162 -185 597 -204 367 447 -626 -399
13858 -399 -263 -80 363 763 545 -180 1075 4 169 -313 -4 -652 -1080 702 -1474 287 -481 761
13876 761 -717 -630 820 -466 -314 356 -756 164 -93 -344 -1429 481 -365 -736 186 -119 262 44
13894 44 925 938 153 320 164 1799 -406 -303 124 206 675 484 357 875 738 -573 -798 -104 -444 -978
13914 -978 -112 174 -717 535 1078 705 450 -960 164 443 563 815 -357 258 105 -346 25 -629
13932 -629 -9 -533 932 -1223 393 920 -619 908 427 540 249 -739 166 164 484 -598 130 -266
13950 -266 -281 405 -293 -41 -307 486 839 1098 -157 -53 -290 39 -822 -431 -156 -336 -92 -144 -423 -228
13970 -228 -136 -583 532 -403 488 -786 1071 -860 -939 413 -681 259 -250 350 235 -819 -120 -498
13988 -498 453 -245 -997 758 19 -710 7 -284 -343 -578 137 -673 53 890 12 -439 -51 727 -219 818
14008 818 -351 -734 295 -510 -382 667 -59 -986 131 -268 -343 377 335 610 -212 509 40 163 1178
14027 1178 -425 -294 592 281 65 316 905 -1414 481 347 188 48 -267 756 535 -557 907
14044 907 -10 992 -174 72 -192 -73 -153 234 818 -511 246 -442 -132 110 -309 264 436 -591 -741
14063 -741 -224 359 88 -356 -275 768 754 -371 -184 214 177 -634 958 509 -203 119 -556 693 -706
14082 -706 168 -101 -262 -554 -500 839 -530 -416 -27 -460 107 -101 508 -214 79 -649 -565 266 -978
14101 -978 128 191 346 374 1443 476 349 123 364 61 152 70 579 -1228 -205 156 543 949 -83
14120 -83 97 -270 -136 63 -178 -85 924 94 339 -282 544 683 22 160 -427 -111 -603 656 419 -69
14140 -69 -1052 591 184 171 -346 330 299 138 273 303 87 -570 -244 -80 80 -316 26 85 78 -716 548
14161 548 529 96 -220 1166 130 -102 995 -1102 268 -391 265 -179 -526 288 -621 394 269 517
14179 517 698 -980 622 637 1020 481 -211 166 -166 -1449 -1008 -378 -432 367 492 -162 19 -240 -445
14198 -445 -1053 498 641 -565 -522 -35 1683 274 -1143 -185 -113 1270 -687 239 225 -417 -40 -46 250
14217 250 -331 393 -425 152 434 -454 717 1268 -464 384 -274 -110 176 129 -262 -783 538 157 -708
14236 -708 -527 590 631 -617 383 1004 -576 314 259 178 -708 1360 -830 356 662 -197 -41 -423
14254 -423 -524 260 704 54 -25 1221 607 624 -918 411 -342 -824 -15 -608 126 -604 -169 397 -512
14273 -512 9 1064 894 -337 395 408 -618 706 -487 1019 680 -239 -228 -349 977 -1095 -281 -1021
14291 -1021 790 -127 -650 -28 557 -265 -258 758 37 -218 1341 -781 -710 202 -489 677 464 300 -695
14310 -695 275 271 406 -119 -11 857 -552 -903 757 -415 -513 583 32 -397 342 131 -296 239 -1497
14329 -1497 568 -968 51 -133 -39 520 -300 243 -970 -315 -756 -448 201 -357 -617 -1066 220 1144
14347 1144 -108 1464 -1059 417 118 -558 -122 -725 826 -350 328 -2066 -636 -162 210 -34 -445
14364 -445 227 -995 1409 -738 -15 -33 -989 304 -7 534 -841 -505 454 892 295 124 -584 331
14382 331 562 586 -147 238 1125 -146 -599 82 -5 -144 366 61 -124 -43 -468 386 1801 -480 -817 -208
14402 -208 457 -717 568 -983 54 33 533 -629 -321 1420 -173 -40 -261 602 -268 -1052 209
14419 209 -447 29 613 240 1168 251 755 -498 -417 -551 -169 646 -232 3 -101 -200 -1235 -33 -164
14438 -164 -1569 -242 -230 326 -136 -366 292 -391 -688 1222 581 -62 -585 -709 -2 -87 -90 -379 -149 1059
14458 1059 -145 359 718 85 -1047 878 -10 -356 -1193 -1175 346 -53 314 -842 300 -268 1312
14475 1312 820 -330 543 616 -161 793 -869 71 -93 -221 -338 782 588 -1207 406 289 -77 825
14493 825 -10 606 28 -567 -87 221 248 169 115 -61 515 618 1049 666 -538 -614 785 -266 -242 1033
14513 1033 -343 545 266 -565 28 -917 -26 1056 -336 519 -494 745 -1007 -481 -219 358 -220
14530 -220 -650 562 10 65 344 -380 427 -1099 96 -269 -175 -108 122 672 -476 -85 -871 359 402
14549 402 452 96 792 360 -374 -598 803 922 1001 -791 1175 -445 -440 291 139 -374 -273 -140 -529 730
14569 730 -194 -473 -142 -213 -509 47 762 -112 -488 281 -5 939 -411 -90 -357 -840 789 -407 854
14588 854 -1155 669 202 -463 194 -412 178 604 -546 985 -265 755 501 -366 -165 250 -67 -1059
14606 -1059 171 239 -694 936 -423 -321 -445 109 184 362 256 -374 138 -857 80 -719 77 -219 -107
14625 -107 915 822 -1485 217 -305 702 637 -1182 509 250 55 -313 162 425 15 -807 539 138
14643 138 -503 -128 -1552 -380 370 -160 -376 -34 -1140 -566 176 257 107 612 616 897 -391 154 1391
14662 1391 122 47 164 -422 370 809 -286 347 1502 -953 418 -316 -951 -1748 -581 521 241
14679 241 275 -635 -402 185 -731 -1112 -133 536 -775 -366 -326 -550 49 -516 661 -272 -999 899 650
14698 650 620 -193 1123 697 128 904 616 1273 -92 1011 295 -443 -67 -130 136 -404 225 467 -773
14717 -773 1578 -475 530 36 -99 -1230 -175 -470 455 37 -1365 -676 698 778 -305 218 -683
14734 -683 -439 238 844 39 -476 473 651 292 254 -574 -493 1165 -264 447 100 -398 -64 -370 305 -636
14754 -636 -169 -576 97 -111 959 1615 -979 420 -5 -308 1157 -685 623 186 130 -217 239 -40
14772 -40 -1032 -40 931 1388 523 -936 393 559 1018 -872 484 628 -164 257 79 315 926 -281
14790 -281 44 -277 -146 -559 420 -42 -314 -475 -294 -253 -385 -446 -103 87 895 155 263 -341 646 -300
14810 -300 336 760 -285 384 -132 23 -662 430 -78 501 53 265 2 -106 415 -779 776 232
14828 232 3 421 -319 129 458 73 -180 374 -336 -762 -476 342 -162 1494 301 -129 -1141 140
14846 140 738 -1030 350 -201 41 23 -453 580 -628 -84 -768 -264 936 205 403 65 505 -150
14864 -150 417 939 -389 -804 -55 705 839 -621 660 153 743 121 307 412 -83 -341 -1267 -74
14882 -74 -151 511 -44 -583 -346 -323 949 1046 301 226 -486 339 -342 647 800 82 1197 -57 -727 43
14902 43 1221 350 463 527 75 449 333 1026 -384 -449 -120 162 887 1347 -600 326 468 18 -348 217
14922 217 -110 500 576 325 -186 -223 69 -1091 1035 -231 71 635 -859 -808 23 -699 692 121 446
14941 446 306 1269 -658 226 -758 -512 1399 252 456 -706 -398 -107 298 -742 481 679 -221 -310
14959 -310 360 399 296 -152 -655 -593 -1042 -396 -430 138 -199 -1180 -608 440 353 487 -18 1317 -723 -536
14979 -536 -341 241 -126 339 877 -637 -128 795 568 -169 -192 -865 148 152 -353 682 559 550 466 471 230
15000 230 284 605 789 -1216 648 133 -591 -585 1270 131 -203 321 -564 636 -7 -282 -274 -571 -103 78
15020 78 -27 -404 99 -124 -571 414 -285 125 -106 -728 -133 330 1113 199 -12 -707 533 -1395 311
15039 311 328 -447 -551 -1392 -563 -223 -627 901 -56 -66 287 2000 -89 -657 -5 -218 285 -885 589
15058 589 -296 -37 92 -1359 1201 735 390 -294 284 -104 -883 348 -383 263 -1211 51 629 -1196
15076 -1196 16 -899 -1017 75 28 -971 -177 -95 -1140 35 439 -278 -811 -519 575 -369 931 -371
15094 -371 -742 198 -536 -309 299 -1555 107 -651 -333 -595 1625 1121 792 -82 -463 349 -946 3
15112 3 30 12 149 -1302 -485 -316 336 -388 151 -373 349 -34 -726 33 572 -442 472 749 809 23 -164
15133 -164 684 -424 302 -253 819 154 1158 -353 248 961 -768 42 -257 -81 -225 -674 -384 189
15151 189 -89 -523 381 -329 -468 326 -110 -651 -939 -986 37 -411 802 -255 -489 353 -377 -1180 -177
15170 -177 -1 1 -51 246 -403 -230 259 -905 -610 2 -377 -1146 -257 -480 75 552 145 -124 540 602 -671
15191 -671 -94 -1016 916 540 591 -653 -336 663 -641 -607 417 228 -314 1097 -368 -320 103 433 -1009
15210 -1009 667 362 638 -32 281 740 -1203 -118 405 445 493 -355 1117 -443 156 106 531 -122 -1045
15229 -1045 615 -1380 212 -1152 -224 161 -533 371 -374 -54 266 399 -440 -43 88 22 -332 34
15247 34 669 -144 268 1232 76 -18 909 -437 1357 166 492 156 749 -277 -855 325 399 700 -306
15266 -306 308 137 317 -263 -723 -74 -523 -489 -1246 1352 -38 -133 -245 -37 168 -448 -114 997 -91
15285 -91 -317 528 598 215 -29 183 745 1261 -79 511 -662 -66 52 1097 527 -1020 -195 648 604
15304 604 -133 -988 -33 136 -882 1309 -1099 100 -598 347 1236 -797 1654 -290 360 -1750 223
15321 223 -183 -49 -452 389 325 -11 -462 -300 158 346 -415 131 -753 -367 -153 -160 594 -876 -203 -474
15341 -474 531 -1110 -286 -958 58 1130 848 1215 821 -256 -147 -207 -93 -556 81 837 -313 651
15359 651 340 579 53 -439 -661 -873 -456 -211 749 518 -20 1122 -457 266 -699 -131 -150 836 194
15378 194 750 984 -811 357 -25 -55 -1180 589 1082 459 -468 746 -187 -233 -190 64 -997 -528 -260
15397 -260 -301 -230 105 851 -139 249 766 -205 424 -983 289 -420 -599 -693 -625 1930 -901 655 -584
15416 -584 34 -384 -648 -428 -706 1225 373 -572 491 -1187 -192 -1258 582 476 -524 257 -217 272
15434 272 262 410 -693 -113 -399 -879 330 488 -627 -995 142 58 147 733 -733 233 -173 -272 -465
15453 -465 -72 163 -220 -409 -545 -1065 658 274 1069 1087 928 411 -73 967 -385 -884 -777 -684 736
15472 736 -745 -91 -373 1043 -415 -192 -426 662 1292 120 -129 -29 -1013 288 -137 -108 971 29
15490 29 -19 -719 -613 -692 581 -517 -585 -4 -1201 -183 -165 34 43 84 -398 -136 369 -73 -156 147 -94
15511 -94 -295 -818 -266 -876 962 -1942 -48 -40 -718 -262 -88 1485 -429 111 -500 -686 -277 -201 7
15530 7 -824 -90 252 -911 408 -407 433 775 708 1117 140 12 -889 -457 599 862 567 485 1251 -486
15550 -486 -93 290 661 99 75 -355 -711 -753 62 -152 19 -245 -476 183 -178 818 -205 240 -224 437
15570 437 -66 519 1138 -182 402 -1145 527 -717 -1541 1077 -504 225 -1069 155 315 -298 850
15587 850 -145 96 -315 -78 904 60 271 -1162 -514 -655 -611 337 -510 743 -30 422 -106 526 -285
15606 -285 308 646 -189 -316 -162 49 482 749 664 38 -839 1050 46 -63 -300 1199 -134 599 -871
15625 -871 -857 947 -1104 1843 299 575 -125 970 580 -402 408 -986 568 777 -17 -442 783
15642 783 -332 -145 316 890 -98 -678 -507 702 128 526 316 869 119 -697 177 -248 -832 133 -484
15661 -484 452 460 -114 922 -513 -1329 -614 -391 -311 -661 -670 73 -812 -1049 127 -1108 -888 -378 684 -147
15681 -147 609 302 -607 -152 -688 -1036 880 132 865 319 -161 628 -219 859 338 332 -496 -340 456 352
15701 352 462 722 -234 740 -218 -323 -812 -273 263 855 103 752 -724 -952 630 -1361 520 -595
15719 -595 904 483 -561 -909 -79 -601 -307 435 991 142 -687 -1070 -506 319 31 42 -39 1105 254
15738 254 -456 268 872 -392 -158 -151 47 -663 -105 -183 448 -57 965 -784 -222 -371 -67 -110 -172 -93 39
15759 39 522 340 -922 713 -9 -545 -238 -175 -192 216 2006 -1135 132 -557 -1300 176 978 92 -211
15778 -211 920 539 -282 575 -394 909 -13 -184 -314 -534 1141 -1239 888 -324 -293 -115 -1265 -393
15796 -393 -295 796 782 633 280 -174 548 317 442 371 192 -159 971 -298 -444 392 -482 -81 -108 -1458
15816 -1458 -430 -569 -533 127 54 1139 509 374 386 -203 31 213 72 -557 543 839 -177 -757 263
15835 263 467 916 288 -451 -170 -500 -310 114 -238 -1103 377 -204 449 -96 410 -444 476 -134 -25
15854 -25 138 -463 232 -1086 -143 263 360 299 -449 226 -578 51 293 627 223 171 548 -707 997 341
15874 341 701 832 45 -196 -1061 -58 13 -152 669 -763 564 1070 742 701 -512 778 43 151 -312
15893 -312 490 338 -151 -113 -993 -403 -570 66 -788 335 902 -903 -182 -493 -168 374 -821 67 166
15912 166 -487 -796 158 785 -466 1123 -1018 -117 -489 -82 531 -1244 -334 -693 -940 -473 -244 -112
15930 -112 -1008 522 146 -398 -206 -451 733 -15 825 -164 1206 442 -290 323 -295 -705 1203 -832
15948 -832 137 1007 1173 -485 911 -57 659 -24 -886 95 -642 1293 -835 -488 -495 -991 308 545 127
15967 127 147 -69 803 373 -180 -371 -1068 -690 432 402 -483 -206 130 -154 -331 -585 245 466 1420 -282
15987 -282 -263 -1130 -661 -357 -222 214 216 -263 -892 -1 -344 -846 518 -728 -68 921 1183 852 -526 32
16007 32 -778 -494 -476 -589 52 -103 1160 -843 1089 -346 -268 201 -195 -298 -304 -532 836 208 -315 356
16027 356 -104 -158 380 -90 -364 -182 477 -756 -691 -92 367 -1048 398 -430 -116 895 310 602 321
16046 321 -654 -678 663 -490 -378 -243 -564 955 646 30 430 -337 -456 -7 -192 212 1024 356 -1145
16065 -1145 -654 -311 -682 310 99 365 174 188 -171 -404 816 -132 170 596 240 -333 -36 -228 216
16084 216 -224 -429 -718 571 -632 215 416 53 -258 647 32 27 -676 -256 -86 -854 350 -415 -417 459
16104 459 -590 1 -192 -764 719 -386 422 -254 -731 31 536 711 -489 -481 491 -13 620 69 185
16123 185 -135 483 -422 671 -88 -307 -547 11 -357 507 -476 -392 1359 -507 -863 33 -1107 819
16141 819 222 -10 19 37 -152 47 36 415 370 877 38 -454 282 -133 -376 -27 -318 222 441 -866 464
16162 464 -732 424 -735 110 -184 33 383 -398 919 921 553 219 -433 319 338 -11 1121 -773 357
16181 357 -963 202 -450 -317 -614 -1086 480 -924 348 -644 125 251 -1133 -491 -620 -169 -227 -29
16199 -29 1327 -103 323 -665 -938 611 -66 533 -1307 441 -1159 -170 -41 19 792 655 145 -687
16217 -687 -198 -1160 -594 -813 204 -31 153 -69 407 -175 318 -521 -719 -632 -526 -167 -508 1001 -100
16236 -100 242 724 134 -14 35 19 215 -612 -1009 -1067 1031 362 232 -194 -1594 -682 -492 1243 -620
16255 -620 -385 550 386 -167 -652 463 -305 311 76 51 452 -12 -224 -143 -977 -741 309 333 -390 768
16275 768 -183 -61 740 -318 424 -76 390 326 582 -949 -890 903 137 -74 426 28 14 900 -442
16294 -442 187 336 159 -602 -43 246 153 -74 -549 -158 730 122 -335 363 480 -697 -664 -434 828 -128
16314 -128 46 -308 -384 -621 330 95 396 -165 -686 -603 -115 -601 787 -685 115 923 -499 -691 -846
16333 -846 -653 -702 -252 -899 1036 -564 -172 -572 177 -37 -100 -317 -682 388 847 -1244 -463 -818 -460
16352 -460 673 -285 -98 -540 619 -154 122 454 -51 906 348 -8 223 233 -984 80 196 -20 1857
16371 1857 -179 1328 171 598 669 -15 -167 -765 885 121 -40 -327
16383c27
$$ Imaginary data points
##PAGE= N=2
##DATA TABLE= (X++(I..I)), XYDATA
0 0 0 0 0 0 0 0 0 0 0 0 0 0 0 0 0 0 0 0 0 0 0 0 0 0 0 0 1 -2 3 -8 15 -22 27 -28 32 -35 37 -39 46 -52 60 -70 76 -83 88
45 88 -99 112 -120 132 -153 165 -185 206 -227 251 -283 321 -359 411 -482 575 -690 869 -1160 1697
65 1697 -3042 8955 25606 -15852 -33509 -27075 4065 26165 23744 604 -23766 -26412 -6406
78 -6406 16863 27770 11579 -12718 -28548 -19623 4123 23716 24382 5750 -15273 -21460 -8253
91 -8253 10850 18372 9086 -8356 -18835 -12112 5078 18571 18990 1499 -16032 -20405 -9671 8677
105 8677 18831 12442 -3663 -15276 -12697 -771 13183 14090 1654 -13222 -17709 -6758 9052
118 9052 20234 12813 -2675 -15500 -16199 -2973 10676 14272 4758 -7714 -12243 -6040 6848 15026
132 15026 8715 -4416 -15761 -14177 -2430 12443 16162 6932 -6667 -13436 -8670 2211 11941
145 11941 9623 -2543 -12305 -11733 -742 11389 14104 4950 -6329 -12917 -10145 1564 11043 11483
159 11483 1973 -7538 -8472 -3534 5144 8136 3188 -5016 -9955 -6371 1516 10188 7868 1549 -7801
174 -7801 -9136 -2903 3917 6239 4304 -3310 -5744 -2128 3022 5939 4035 -2619 -6582 -6257 -1183
189 -1183 5478 5660 3370 -1642 -3642 -2418 -507 1483 67 -490 -2410 -111 2422 3477 3611 -7
205 -7 -892 -2342 -1069 -83 -380 1471 1301 1282 2049 1476 347 -1530 -3083 -2624 -885 379 1595 2152
223 2152 299 355 -882 -1757 -1776 -981 134 -1107 555 727 1632 816 641 616 -114 -693 -79 -605 -212
242 -212 341 2481 1078 2871 -1291 -3193 -3060 -1816 -30 1562 2746 2021 -371 -2721 -2626 1112 1951
259 1951 715 -169 -2969 -2152 -1054 3335 4505 3239 -1455 -5989 -5334 -1531 3299 4957 1312 -2714
275 -2714 -3702 -1610 3197 5457 1838 -2507 -8010 -6395 957 6099 7906 1516 -4861 -7764 -3281
290 -3281 3759 7628 5231 -303 -6827 -6228 527 7536 8780 2129 -5335 -10652 -4744 2589 10101
305 10101 7916 189 -6708 -8399 -2151 5176 8831 3861 -4811 -9703 -5407 3979 8466 7751 -2150
320 -2150 -9024 -8441 -2479 6223 9328 4755 -4143 -8024 -4967 2919 8663 6143 -253 -8413 -7403
335 -7403 -578 6841 10250 4200 -2543 -9638 -6720 291 5869 6701 34 -5917 -7436 -775 5393
350 5393 6624 4791 -3981 -8911 -6714 1265 9418 7810 3057 -6053 -8425 -3617 3944 8151 5286
365 5286 -4384 -10332 -7173 1702 8935 10823 2280 -6475 -11650 -5711 4097 10837 8038 -1016 -9250
380 -9250 -8732 -408 8184 10175 3389 -6498 -10524 -6078 3139 10333 7642 -663 -8074 -9023 -2227 5288
396 5288 8675 2441 -5251 -8236 -4110 3960 6938 5541 -1635 -7827 -8122 169 6954 8669 3715
411 3715 -3764 -8019 -6016 3383 7190 5047 -1305 -7437 -6209 706 6715 7555 2695 -4168 -7648
426 -7648 -4143 1993 6369 4865 -1067 -5218 -4637 1329 4235 5016 1269 -3317 -5893 -3475 2441 5711
442 5711 4595 -399 -5373 -4886 -215 3644 4163 1880 -2919 -6735 -1578 1578 5161 4772 -345 -4965
458 -4965 -5653 -736 3633 6289 3740 -2107 -5201 -4744 1652 3939 5111 -568 -3525 -4707 -1881 3458
474 3458 3963 3712 -1335 -5602 -4314 -612 4564 3476 899 -3255 -4124 -786 1742 4102 1798 -2019
490 -2019 -4227 -1685 1714 2635 3094 672 -3096 -3177 -1596 1565 1272 1088 -1663 -2481 -878 611 3629
507 3629 1636 244 -2984 -1416 319 1444 2324 86 -259 -1786 -13 715 1511 507 -2013 -2624
523 -2624 -117 1693 2007 148 -912 -1897 -2049 -151 532 1764 660 -579 -2475 -1054 479 1549
539 1549 2009 -922 -1895 -927 661 820 -40 2101 411 451 46 501 -520 -253 413 -790 662 156
557 156 936 -1646 -1422 -702 -1372 459 119 -1143 -1927 -482 421 1033 843 -129 -792 -912 -1588 847 2242
576 2242 153 553 -129 -1063 -865 1334 468 -123 -1452 -1521 40 1459 1036 1432 -952 -1216 -1405 435
594 435 1695 2900 548 -1468 -2193 -2883 -204 2276 1790 -330 -2885 -2979 -3086 1808 4452 2632 -1374
611 -1374 -4429 -3408 -756 3755 4757 470 -2866 -5100 -1404 2706 3885 881 -1537 -4342 -4455
626 -4455 1685 4269 4547 1054 -3451 -5434 -2419 2561 3776 3586 -1800 -4983 -3759 1245 4977 4385
642 4385 763 -3435 -4656 -1151 1754 5070 2176 -2205 -5069 -3329 754 3547 4566 796 -3135
657 -3135 -6623 -2449 2734 4246 3307 -1744 -3724 -4306 350 3398 4828 2145 -2671 -4925 -1385 1904
673 1904 5702 2287 -1435 -5057 -4342 998 3954 5916 1688 -2537 -6666 -3645 2417 4898 5253 -952
689 -952 -4159 -3673 -1185 2888 4648 2431 -2170 -5093 -4591 147 4779 3953 1040 -4517 -3932 -2505
705 -2505 2909 4437 2867 -747 -4415 -3854 357 3561 3923 -156 -2720 -4169 -425 3201 5004 3588
721 3588 -1211 -3680 -3554 1198 4711 4219 813 -2830 -5067 -2902 3564 4986 1741 -1419 -5003 -3482
737 -3482 -857 4208 3782 -102 -2526 -3714 -741 2379 3737 2974 -1150 -3301 -3016 1104 4486 2848
753 2848 -856 -4127 -2217 -164 1654 2984 608 -2615 -3022 -1972 2143 3643 3140 -285 -3497 -3316
769 -3316 -535 2143 3471 1945 -2698 -2639 -2731 459 2982 2966 150 -3064 -3417 -2157 2576 2391 2513
786 2513 -386 -2968 -2430 32 3427 2028 1196 -2302 -2992 -1777 1508 3038 1935 167 -2802 -3319
802 -3319 637 2121 2059 2064 -2060 -3238 -2391 1841 2144 1291 -277 -2594 -3131 -199 2224 2232 5 -1215
820 -1215 -1937 -872 -65 1892 1143 367 -691 -2942 870 785 1740 -934 507 -2129 -363 1575 1395
837 1395 659 -464 -1686 -551 35 1406 1442 -77 -722 -2212 -468 316 1249 1537 -269 -1361 -2470
854 -2470 -86 1226 942 532 -580 -537 -9 43 -481 1114 -625 465 582 882 -659 -603 205 887 957
873 957 970 443 -660 -58 574 -82 1147 1227 -491 -747 -1409 1139 743 481 497 -1678 -1107 -37 921
892 921 641 -143 -717 -692 386 396 851 1077 54 -674 -716 -278 565 816 857 -1257 -1617 -1799 71 1157
912 1157 1448 484 -1815 -1370 -503 825 1733 1834 1413 -1689 -1299 -1217 3170 2317 1184 -381 -1854 -123
930 -123 -123 1217 1975 1275 -247 -2334 -444 -154 2514 955 -636 -2150 -2309 795 1982 2073 -612 -1286
948 -1286 -1417 -767 1762 3145 1849 -172 -3212 -1577 -266 3027 2129 66 -1306 -3282 70 1394
964 1394 2425 1010 -1127 -2046 -2539 -601 2083 1144 803 -1830 -1747 43 1977 2320 1506 -1682 -2294
981 -2294 -2354 155 1581 1533 516 -1589 -1224 197 2402 2208 451 -1317 -2508 -1026 1468 1725 2722
998 2722 -123 -2760 -2306 -1371 1269 2697 1309 -988 -1732 -1578 -471 1957 1100 763 -1262 -1753 -153
1015 -153 116 1393 376 3 -2068 -2185 151 642 1717 259 -1383 -2058 -1384 733 2302 1981 -42
1032 -42 -1272 -2468 -1468 1730 2376 216 -1483 -1590 -1400 -489 2510 1122 157 -2296 -2027 -397 637
1049 637 1873 546 -328 -2235 -1291 -171 824 2159 837 -856 -2573 -628 2073 839 639 -1082
1065 -1082 -704 -1410 386 1198 133 337 -2501 -2269 49 861 1681 -387 -960 -1556 -987 1849 1713 1556
1083 1556 -482 -1570 -1705 33 761 490 1038 -1347 -790 -199 1029 1802 1044 -359 -173 -1360 -709
1100 -709 524 1404 1013 201 -334 -917 -123 1076 915 1136 397 -366 0 476 412 664 -291 -329 85 5
1120 5 930 -16 615 -606 -654 -924 -243 15 326 -96 -814 -571 2 949 1404 5 519 -1330 -554 -1077
1140 -1077 784 521 -814 -119 236 612 217 47 128 -2275 626 218 389 1142 498 -769 -1345 340
1158 340 542 957 481 418 -593 -1158 189 929 293 -1207 -127 312 -1276 1174 162 443 -131 -665
1176 -665 -104 52 1036 -495 293 -458 -491 1261 -746 -162 -1480 347 -931 586 1162 -401 -368 -608
1194 -608 -171 271 -119 -124 271 -927 -1894 46 1117 -863 1056 320 19 -794 -847 -161 696 -295 -323 -1570
1214 -1570 624 513 1345 -709 -853 -794 -679 898 1080 199 -1362 -270 -1108 480 1711 2653 -144
1231 -144 440 -1125 -1162 1149 1060 -376 -508 -1791 -1263 195 925 1186 -660 1164 -1416 233 413 126
1249 126 1747 -435 -901 -163 1064 -387 349 -516 -482 -811 -845 894 548 -243 313 -534 -703 -1592 1535
1268 1535 2438 432 -852 -1599 -96 92 922 1668 173 -1544 -1797 -780 1290 962 90 -1119 -1363
1285 -1363 -855 770 320 1431 -465 -1732 -1242 -437 539 749 1185 -651 -1405 184 -255 1206 258
1302 258 -902 -1446 -1287 491 121 1812 153 -864 -2347 -1176 219 1513 2005 522 -168 -500 -164
1319 -164 624 1192 932 -832 -1864 79 2038 1212 514 869 -817 654 402 -48 1786 -61 503
1336 503 -2198 -794 672 1340 1610 -164 -839 -1174 -957 814 1252 1469 -617 235 -1191 510 1440
1353 1440 180 685 -2150 -1270 -436 286 2170 788 -270 -1054 -607 48 386 1071 -86 -1095 -875
1370 -875 -1167 1023 1103 -253 156 -1550 -777 1016 1042 224 -135 -1620 -1101 892 1539 1562 1063 597 -1644
1389 -1644 -807 3 1011 1184 -79 -1557 -2337 -1221 259 734 887 -132 -745 -358 304 2038 1323
1406 1323 1537 -1714 -1661 -1060 901 1218 -377 -563 -1272 -935 513 989 2 161 265 -1287 -188 1104
1424 1104 223 704 1006 -1400 92 709 247 753 1025 -845 1 -598 468 -49 -231 240 -264 35
1442 35 -389 180 119 1296 -298 -455 317 808 226 297 1336 1010 -159 -56 768 804 409 596 -129 -372
1462 -372 -134 436 -69 -96 -483 -459 36 76 -43 -561 -456 -55 -404 311 169 -511 209 45 -1505 551
1482 551 133 1 -312 420 105 -1316 -814 -588 947 -886 421 202 1282 -403 -812 1003 132 545
1500 545 471 282 -419 -319 267 -236 599 234 218 762 724 188 -487 717 688 -178 67 -195 245 1356 -492
1521 -492 527 116 1081 -368 366 740 -192 985 -254 -77 -177 1339 1221 857 209 -635 -270 -835
1539 -835 794 847 -249 -171 -265 371 622 643 1404 -1643 221 -687 808 50 -175 -305 -848 35 -378 693
1559 693 592 -91 410 -507 599 132 52 959 -10 -601 815 545 832 -334 -363 -534 1272 229 879
1578 879 -517 1528 180 174 -197 -49 124 339 245 -83 -1967 309 572 62 450 -97 414 -91 887
1597 887 -127 738 -610 100 -564 241 610 159 -519 -87 -422 485 -37 -697 1064 -264 20 -919 1408
1616 1408 1138 1353 -261 -493 316 -250 563 1052 364 -1028 -1644 -1010 -710 1134 660 861 -29 -749 -365
1635 -365 -248 1184 566 -133 -894 -810 706 1397 657 264 -942 -947 -657 210 1060 221 -477 -681 -42 -725
1655 -725 1591 301 1651 -130 -851 -660 -597 761 146 311 -518 -171 -159 -300 1787 943 504 -976
1673 -976 -110 963 974 1783 -1385 405 285 -899 164 364 301 -1741 -25 -1283 409 727 -42 236
1691 236 -782 -547 196 439 -294 165 48 -165 619 -67 -157 265 -1389 -20 -1258 -253 337 -325 -562
1710 -562 -1249 -165 -800 414 -97 -946 582 -772 -306 -1130 -291 716 284 -43 -377 6 -979 726
1728 726 1176 -164 -320 -317 251 159 -660 -333 -243 633 -1264 452 76 -238 611 -121 -411 -1183 116 -1503
1748 -1503 -15 -586 320 1400 122 133 66 343 -403 -175 -379 396 243 -293 387 -393 -388 161 -1396 -247
1768 -247 468 -796 189 -80 -287 -350 -58 636 -422 -1256 -400 -506 -303 -476 482 -275 -452 -612 -585 310
1788 310 235 558 390 -40 1461 89 884 -300 -653 -716 -43 451 718 1630 -176 1036 -73 579 -1729
1807 -1729 -501 -539 -169 -204 -1025 161 -49 477 -499 -683 -3 -231 407 -851 994 632 -470 27 280
1826 280 877 1230 473 351 -460 1053 311 435 760 608 293 -1423 431 -499 154 -575 -782 124 -1074
1845 -1074 369 -356 24 151 -672 733 -683 -500 316 467 704 -80 -45 -502 217 -275 236 261 -705
1864 -705 1141 174 -224 -1028 -233 371 -820 -856 -1122 -241 564 279 -735 448 508 142 424 920 601
1883 601 -79 -1336 776 -519 161 -626 -87 959 -792 604 -893 -57 -118 -92 83 -753 447 -887
1901 -887 -47 -848 306 68 330 648 165 1408 -300 -452 863 418 168 788 482 762 -1128 -440
1919 -440 -1036 123 -345 -497 -188 -449 747 -323 746 474 423 -1275 -844 922 -346 291 -421 -665
1937 -665 231 -233 1232 1523 -378 -494 47 -446 -849 -8 -68 -35 -428 -1053 332 379 1041 -81 -418 264
1957 264 -587 -398 361 373 574 -1535 200 -518 88 -880 100 -641 -470 90 452 -533 238 -381 -1438
1976 -1438 -432 -219 -449 613 212 259 95 -1295 98 -399 1501 -308 932 20 272 853 -1207
1993 -1207 1533 -1038 -67 172 425 478 -297 129 213 -223 360 156 681 890 448 -1456 164 -436 889
2012 889 482 844 -299 -1037 -495 550 42 -536 -140 196 191 -146 -573 56 56 -141 -26 96 487 -56 19
2033 19 191 -115 314 -835 1249 578 -583 -609 -696 675 -265 524 19 -79 892 258 269 1108 33 -222
2053 -222 -615 707 206 -62 -244 372 6 -1251 205 347 -118 711 -665 -588 -245 -857 -116 693 -257
2072 -257 -693 190 -631 58 73 -710 364 -1000 -720 -1261 1273 -29 -441 1070 -1042 -14 -11 -59 206
2091 206 -202 -1099 46 -632 479 1212 1035 385 484 1048 -51 619 -27 554 -1183 -429 602 696 -227
2110 -227 970 511 -363 -416 -54 -183 998 89 981 -649 447 -554 181 -83 -798 721 -503 -93
2128 -93 -374 320 -463 -412 568 -1297 1181 -163 218 -285 -820 472 -1343 80 88 -547 700 1838 -206
$$ [...]
16383d93
##END NTUPLES=NMR FID
##END=
