##TITLE=31P_DE-80H_X3
 64 sc D2O
 26.2.2025
##JCAMPDX= 6.0         $$ Bruker NMR JCAMP-DX V2.0
##DATA TYPE= NMR FID
##DATA CLASS= NTUPLES
##ORIGIN= UXNMR, Bruker Analytische Messtechnik GmbH
##OWNER= root
$$ XWIN-NMR		Version 3.5
$$ Mon Jul 20 14:45:21 2026 Russian Standard Time (UT+4h)  Yarkov@DPX200
##.OBSERVE FREQUENCY= 81.013821
##.OBSERVE NUCLEUS= ^31P
##.DELAY= (6, 6)
##.ACQUISITION MODE= SIMULTANEOUS
##.ACQUISITION SCHEME= undefined
##.AVERAGES= 64
##.DIGITISER RES= 17
##SPECTROMETER/DATA SYSTEM= spect
##.PULSE SEQUENCE= zgpg30
##.SOLVENT NAME= D2O
##.SHIFT REFERENCE= (INTERNAL, D2O, 0, 243.863)
##AUDIT TRAIL= $$ (NUMBER, WHEN, WHO, WHERE, WHAT)
$$ ##TITLE= Audit trail, XWIN-NMR		Version 3.5
$$ ##JCAMPDX= 5.01
$$ ##ORIGIN= Bruker BioSpin GmbH
$$ ##OWNER= Yarkov
$$ C:/Bruker/XWIN-NMR/data/yarkov2/nmr/P31/2/audita.txt
$$ ##AUDIT TRAIL=  $$ (NUMBER, WHEN, WHO, WHERE, WHAT)
(   1,<2026-07-20 14:36:01.56 +0400>,<Yarkov>,<DPX200>,
      <created by zg, POWCHK disabled, PULCHK disabled
       configuration hash MD5:
       00 E9 B6 7A A2 85 ED C7 34 08 36 98 17 FE 4E 26
       data hash MD5: 32K
       92 47 14 6C 90 B1 F2 75 3A 02 23 B9 4D 2F 45 5D>)
$$ ##END=
$$ 
$$ hash MD5
$$ 92 D5 C5 56 EF 59 B1 33 26 D2 94 7D 8E 48 DB 28
##$RELAX= 
##$RELAX= 
##$RELAX= 
##$RELAX= 
##$RELAX= 
##$RELAX= 
##$RELAX= 
##$RELAX= 
$$ Bruker specific parameters
$$ --------------------------
##$DU= <C:/Bruker/XWIN-NMR>
##$EXPNO= 2
##$NAME= <P31>
##$PROCNO= 1
##$TYPE= <nmr>
##$USER= <yarkov2>
##$AMP= (0..31)
100 100 100 100 100 100 100 100 100 100 100 100 100 100 100 100 100 100 
100 100 100 100 100 100 100 100 100 100 100 100 100 100 
##$AQSEQ= 0
##$AQ_mod= 1
##$AUNM= <au_zg>
##$AUTOPOS= <>
##$BF1= 81.014009
##$BF2= 200.13
##$BF3= 200.13
##$BF4= 200.13
##$BF5= 200.13
##$BF6= 200.13
##$BF7= 200.13
##$BF8= 200.13
##$BYTORDA= 1
##$CFDGTYP= 0
##$CFRGTYP= 5
##$CHEMSTR= <none>
##$CNST= (0..31)
1 1 145 1 1 1 1 1 1 1 1 1 1 1 1 1 1 1 1 1 1 1 1 1 1 1 1 1 1 1 1 1 
##$CPDPRG= <waltz16>
##$CPDPRG1= <>
##$CPDPRG2= <waltz16>
##$CPDPRG3= <>
##$CPDPRG4= <mlev>
##$CPDPRG5= <mlev>
##$CPDPRG6= <mlev>
##$CPDPRG7= <mlev>
##$CPDPRG8= <mlev>
##$CPDPRGB= <>
##$CPDPRGT= <>
##$D= (0..31)
0 1 0 0 0 0 0 0 0 0.06 0 0.03 2e-05 3e-06 0 0 0.0002 0 0 0 0 0 0 0 0 0 
0 0 0 0 0 0 
##$DATE= 1784543761
##$DBL= (0..7)
120 120 120 11 120 120 24 19 
##$DBP= (0..7)
150 150 150 150 150 150 150 150 
##$DBP07= 0
##$DBPNAM0= <>
##$DBPNAM1= <>
##$DBPNAM2= <>
##$DBPNAM3= <>
##$DBPNAM4= <>
##$DBPNAM5= <>
##$DBPNAM6= <>
##$DBPNAM7= <>
##$DBPOAL= (0..7)
0.5 0.5 0.5 0.5 0.5 0.5 0.5 0.5 
##$DBPOFFS= (0..7)
0 0 0 0 0 0 0 0 
##$DE= 6
##$DECBNUC= <off>
##$DECIM= 4
##$DECNUC= <off>
##$DECSTAT= 4
##$DIGMOD= 1
##$DIGTYP= 9
##$DL= (0..7)
0 0 52 120 120 21 21 25 
##$DP= (0..7)
150 150 150 150 150 150 150 150 
##$DP07= 0
##$DPNAME0= <>
##$DPNAME1= <>
##$DPNAME2= <>
##$DPNAME3= <>
##$DPNAME4= <>
##$DPNAME5= <>
##$DPNAME6= <>
##$DPNAME7= <>
##$DPOAL= (0..7)
0.5 0.5 0.5 0.5 0.5 0.5 0.5 0.5 
##$DPOFFS= (0..7)
0 0 0 0 0 0 0 0 
$$ [...]
##$SUBNAM1= <"">
##$SUBNAM2= <"">
##$SUBNAM3= <"">
##$SUBNAM4= <"">
##$SUBNAM5= <"">
##$SUBNAM6= <"">
##$SUBNAM7= <"">
##$SUBNAM8= <"">
##$SUBNAM9= <"">
##$SW= 400.765351723535
##$SWIBOX= (0..15)
0 1 3 0 0 0 0 0 0 0 0 0 0 0 0 0 
##$SW_h= 32467.5324675325
##$TD= 32768
##$TD0= 1
##$TE= 0
##$TE2= 300
##$TE3= 300
##$TEG= 300
##$TL= (0..7)
0 120 53 12 22 120 120 120 
##$TP= (0..7)
150 150 150 150 150 150 150 150 
##$TP07= 0
##$TPNAME0= <>
##$TPNAME1= <>
##$TPNAME2= <>
##$TPNAME3= <>
##$TPNAME4= <>
##$TPNAME5= <>
##$TPNAME6= <>
##$TPNAME7= <>
##$TPOAL= (0..7)
0.5 0.5 0.5 0.5 0.5 0.5 0.5 0.5 
##$TPOFFS= (0..7)
0 0 0 0 0 0 0 0 
##$TUNHIN= 0
##$TUNHOUT= 0
##$TUNXOUT= 0
##$USERA1= <user>
##$USERA2= <user>
##$USERA3= <user>
##$USERA4= <user>
##$USERA5= <user>
##$V9= 5
##$VALIST= <valist>
##$VCLIST= <CCCCCCCCCCCCCCC>
##$VD= 0
##$VDLIST= <DDDDDDDDDDDDDDD>
##$VPLIST= <PPPPPPPPPPPPPPP>
##$VTLIST= <TTTTTTTTTTTTTTT>
##$WBST= 1024
##$WBSW= 4
##$XGAIN= (0..3)
0 0 0 0 
##$XL= 0
##$YL= 0
##$YMAX_a= 9294
##$YMIN_a= -10962
##$ZGOPTNS= <>
##$ZL1= 120
##$ZL2= 120
##$ZL3= 120
##$ZL4= 120
##$ABSF1= 60
##$ABSF2= -190
##$ABSG= 5
##$ABSL= 3
##$ALPHA= 0
##$AQORDER= 0
##$ASSFAC= 0
##$ASSFACI= 0
##$ASSFACX= 0
##$ASSWID= 0
##$AUNMP= <proc_1d>
##$AZFE= 0.1
##$AZFW= 0.5
##$BCFW= 1
##$BC_mod= 2
##$BYTORDP= 1
##$COROFFS= 0
##$CY= 9.86611175537109
##$DATMOD= 1
##$DC= 1
##$DFILT= <>
##$DTYPP= 0
##$F1P= 182.462994727601
##$F2P= 168.069089081705
##$FCOR= 0.5
##$FTSIZE= 0
##$FT_mod= 0
##$GAMMA= 1
##$GB= 0
##$INTBC= 1
##$INTSCL= 1
##$ISEN= 30
##$LB= 1.5
##$LEV0= 0
##$LPBIN= 0
##$MAXI= 11.51145
##$MC2= 0
##$MEAN= 0
##$ME_mod= 0
##$MI= 1.244541
##$NCOEF= 0
##$NC_proc= 0
##$NLEV= 6
##$NOISF1= 0
##$NOISF2= 0
##$NSP= 1
##$NTH_PI= 0
##$NZP= 1
##$OFFSET= 243.8632
##$PC= 1.4
##$PHC0= 1571.676
##$PHC1= 109.1595
##$PH_mod= 0
##$PKNL= yes
##$PPARMOD= 0
##$PSCAL= 0
##$PSIGN= 0
##$REVERSE= no
##$SF= 81.0140731611343
##$SI= 65536
##$SIGF1= 0
##$SIGF2= 0
##$SINO= 80
##$SIOLD= 65536
##$SREGLST= <31P.CDCl3>
##$SSB= 0
##$STSI= 0
##$STSR= 0
##$SW_p= 25641.0256410257
##$SYMM= 0
##$S_DEV= 0
##$TDeff= 0
##$TDoff= 0
##$TI= <>
##$TILT= no
##$TM1= 0
##$TM2= 0
##$TOPLEV= 0
##$USERP1= <user>
##$USERP2= <user>
##$USERP3= <user>
##$USERP4= <user>
##$USERP5= <user>
##$WDW= 1
##$XDIM= 64
##$YMAX_p= 0
##$YMIN_p= 0
$$ End of Bruker specific parameters
$$ ---------------------------------
##NTUPLES= NMR FID
##VAR_NAME=  TIME,          FID/REAL,        FID/IMAG
##SYMBOL=    X,             R,               I
##VAR_TYPE=  INDEPENDENT,   DEPENDENT,       DEPENDENT
##VAR_FORM=  AFFN,          ASDF,            ASDF
##VAR_DIM=   16384,         16384,           16384
##UNITS=     SECONDS,       ARBITRARY UNITS, ARBITRARY UNITS
##FACTOR=    3.08e-05,      1,               1
##FIRST=     0,             0,               0
##LAST=      0.5045964,     0,               0
##MIN=       0,             -10962,          0
##MAX=       0.5045964,     9294,            0
$$ Real data points
##PAGE= N=1
##DATA TABLE= (X++(R..R)), XYDATA
$$ plain form
0 0 0 0 0 0 0 0 0 0 0 0 0 0 0 0 0 0 0 0 0 0 0 0 0 0 0 0 0 0 0 0 0 -1 -2 2 -3 5 -2 2 -1 2 -4 8 -9 9 -9 12 -13 10 -10 10 -10 14 -16
53 -16 20 -17 21 -26 32 -36 38 -48 57 -74 95 -137 250 -10962 4753 2743 -146 -2167 -5270 -2855 158
74 158 3574 2947 4006 1672 -1828 -3927 -4483 -1693 181 3359 4703 2282 -349 -2506 -3485 -1938
90 -1938 -536 2349 2904 3884 676 -657 -3162 -3105 -1734 67 3506 3108 2152 293 -2001 -4474 -3253
107 -3253 -968 1370 3587 3135 1374 -696 -3282 -1722 -1394 704 3249 2559 975 -1375 -1167 -4131
123 -4131 -2010 -383 2845 3976 1850 1531 -2208 -2262 -2619 -1248 1508 1994 2838 202 420 -2547 -2335
140 -2335 -2042 -354 2120 3338 2237 545 -802 -2337 -1653 175 -700 2759 2399 397 -73 -682 -2690
157 -2690 -726 114 1905 1406 2419 -1191 -1516 -2339 -1025 366 1527 2191 457 500 -1623 -2155 -1676
$$ packed form
0@%%%%%%%%%%%%%%%%%%%%%%%%%%%%%%%jjMnQpMlLoJ2j7J8j8K1k5K3k0K0k0K4l0
53a6L6l7L8m7N8o8P4q6J05j31J69k32L87j1212J5715k010k889k021l103K415L013
74A58L416o27J059k334l500k099n56K790J874L178J344k421k631k157r79J547
90a938J402K885N55R80l208j333k505N7J371J801L439l98r56j859k294k473J221
107c253K285K338K217m52j761k070k586J560L28K098K545o90j584k350K08k964
123d131K121J627L228J131k126l19l739n4l57J371K756M86Q44k636K18k967K12
140b335K93J688K474J218j101j692j347j535O84J828q75L459l60k002m70o09k008
157b690J964Q40J791m99J013l610l25q23J314J391J161O64j734M3k123n32M79
$$ plain form
174 -1676 -632 1115 1051 1831 646 -781 -1070 -1816 -1736 408 301 2114 1537 -137 -2154 -1858 -3054 -751
192 -751 1239 2544 2903 -326 -397 -2074 -1772 -2111 863 1993 822 2102 -1026 -1162 -1775 -861 -9 195
210 195 2018 700 909 -1087 -2182 -1048 -746 978 952 1604 595 583 -1602 -1385 -1369 -776 1173 1009
228 1009 860 167 -759 -2632 -2223 -56 1249 1094 1605 33 513 -2087 -2533 -849 -1315 1622 669 -173
246 -173 -104 -2085 -2325 -1821 65 -154 2437 1473 -613 -340 -2063 -181 -1353 493 1673 1478 622 1041
264 1041 -234 -1550 -193 -319 1193 1495 1418 900 -1115 -2631 -1136 -1325 15 880 1366 361 -1020
281 -1020 -1822 -1099 -69 -341 1673 2374 638 125 -784 -1300 -2256 -377 1396 890 1302 -734 -684 -2210
299 -2210 -789 201 427 1086 2669 1067 -1526 -1281 -1348 -1220 382 1162 1689 -17 -1635 -1130 -2237 -1578
$$ packed form
174a676J044J747o4P80j185j427k89p46Q0K144j07J813n77j674k017K96j196K303
192g51J990J305L59l229p1j677L02l39K974J130j171J280l128j36o13R14Q52K04
210A95J823j318K09j996j095J134L02J724k6O52j009j2k185K17J6N93J949j64
228A009j49o93r26j873M09K167J305j55N11j572M80k600m46J684m66K937r53q42
246a73O9j981k40N04J886k19K591r64k086K73j723J882j172J846J180j95q56M19
264A041j275j316J357j26J512L02p7n18k015j516J495j89J340Q65M86j005j381
281a020q02P23J030k72K014P01j736n13r09n16r56J879J773n06M12k036N0j526
299b210J421R90K26O59J583j602k593K45o7J28J602P80N27j706j618N05j107O59
$$ plain form
317 -1578 -810 1699 1769 1156 1334 -1407 -559 -2736 -811 -295 807 2409 758 616 -1452 -1034 -1778 -170
335 -170 830 1374 2890 -111 626 -1762 -714 -1071 -899 1411 883 1119 -627 -795 -1227 -1988 -852 1032
353 1032 797 952 266 -148 -1597 -437 -919 649 1422 1587 212 -703 48 -700 -543 -581 1415 1394 1238
372 1238 1767 82 -1297 -1046 -396 596 2087 1042 261 227 -1654 -1016 -155 -359 1717 1448 307 599
390 599 -1946 -823 -1288 -896 -59 1523 600 881 194 -1425 -1699 443 -206 1004 215 709 -465 -1162
408 -1162 -1673 -1345 -773 309 1825 1335 696 -843 -1071 -295 -184 1097 327 42 615 214 -183 -2474
426 -2474 -303 572 1194 1849 1297 1179 -86 -654 15 -124 3 786 336 73 -429 -914 -1984 -261 -705
445 -705 1689 1029 397 -1049 -549 -232 -829 213 553 1700 1512 1596 -606 -684 -489 -614 278 1677 1013
$$ packed form
317a578P68K509P0o13J78k741Q48k177J925N16J102J602j651j42k068M18p44J608
335a70J000N44J516l001P37k388J048l57J72K310n28K36j746j68m32p61J136J884
353A032k35J55o86m14j449J160m82J568P73J65j375r15P51p48J57l8J996k1j56
372A238N29j685j379K51O50R92J491j045p81l4j881O38Q61k04K076k69j141K92
390E99k545J123m65L92Q37J582r23K81o87j619k74K142o49J210p89M94j174o97
408a162n11L28N72J082J516m90o39j539k28P76J11J281p70k85N73m01l97k291
426b474K171Q75O22O55n52j18j265n68O69j39J27P83m50k63n02m85j070J723m44
445g05K394o60o32j446N00L17n97J042L40J147j88Q4k202p8J95j25Q92J399o64
$$ plain form
464 1013 1031 247 -222 -957 -369 -369 573 1192 927 1059 -687 -1281 -1008 -1006 970 -70 1544 403 -244 -310
484 -310 -1020 -216 -1282 -230 984 1796 594 -1177 21 -2059 -448 -1019 1074 1890 -241 -291 -787
501 -787 328 -631 -399 306 843 115 -885 -358 -983 -738 -982 -1129 49 398 376 -501 -179 -216 -609 568
521 568 -567 669 1008 -567 -558 -1205 362 160 82 826 909 23 -760 -2080 -30 -123 528 134 952 407
541 407 -127 -412 -597 -214 -268 621 -596 30 960 -434 -644 -840 1862 375 414 -240 -512 -598 -1183 -13
561 -13 -962 -839 501 327 678 -434 -240 133 -1052 -460 258 582 286 -35 -684 -125 -1043 -235 422 1062
581 1062 404 -749 -212 -412 -823 95 117 193 484 591 842 -523 35 -1355 97 326 310 838 -12 1591
601 1591 -781 -366 -523 -280 949 203 701 -1205 -146 -352 -1360 -28 -51 1374 -104 406 -83 -1111
$$ packed form
464A013J8p84m69p35N88%R42O19k65J32j746n94K73KJ976j040J614j141o47o6
484c10p10Q04j066J052J214Q12j202j771J198k080J611n71K093Q16k131n0m96
501g87J115r59K32P05N37p28j000N27o25K45k44j47J178L49k2q77L22l7l93J177
521E68j135J236L39j575Ro47J567k02p8P44Q3q86p83j320K050r3O51l94Q18n45
541D07n34k85j85L83n4Q89j217O26R30j394k10j96K702j487L9o54k72q6n85J170
561a3r49J23J340j74L51j112J94L73j185N92P18L24k96l21o49N59r18Q08O57O40
581A062o58j153N37k00m11R18K2P6K91J07K51j365N58j390J452K29j6N28q50J603
601A591k372M15j57K43J229p46M98j906J059k06j008J332k3J425j478N10m89j028
$$ plain form
619 -1111 -239 -698 -400 463 1244 1425 -645 253 -365 -431 -502 -35 1287 -600 958 -248 -1347 -1903 -198
638 -198 801 -872 512 19 -444 -273 -566 -69 -520 1113 351 750 259 -164 578 30 316 478 572 856
658 856 -201 1165 -353 -403 -269 -280 -4 605 1105 -882 -42 -614 -862 -371 -142 -117 -297 537 -247 -61
678 -61 -451 122 -195 -1211 702 29 589 340 -771 -1241 -445 715 221 433 719 -1058 615 -1000
696 -1000 -649 -352 535 2166 269 81 -194 -268 -606 352 -507 341 449 -190 -455 -549 -112 328 -434 605
716 605 337 1209 -899 -337 -626 -1243 3 380 -901 689 382 100 -1106 199 -1078 315 192 261
734 261 277 324 -434 -484 313 -49 -666 855 -1101 415 -737 -525 -279 -969 318 -413 1045 -71 664
753 664 271 -1155 574 -1114 -1379 281 -116 1958 46 830 -386 43 136 436 376 54 75 1303 -346
$$ packed form
619a111Q72m59K98Q63P81J81k070Q98o18o6p1M67J322j887J558j206j099n56J705
638a98R99j673J384m93m63J71k93M97m51J633p62L99m91m23P42n48K86J62R4K84
658H56j057J366j518n0J34j1K76O09N00j987Q40n72k48M91K29K5j80Q34p84J86
678f1l90N73l17j016J913o73N60k49j111m70P96J160m94K12K86j777J673j615
696a000L51K97Q87J631j897j88k75p4l38R58q59Q48J08o39k65r4M37M40p62J039
716F05k68Q72k108N62k89o17J246L77j281J590l07k82j206J305j277J393j23O9
734B61J6M7p58n0P97l62o17J521j956J516j152K12K46o90J287p31J458j116P35
753F64l93j426J729j688k65J660l97K074j912P84j216M29R3L00o0l22K1J228j649
$$ plain form
772 -346 -150 -37 466 -977 428 353 -560 1207 -1095 -152 573 22 -1392 96 553 8 1040 -728
790 -728 479 -143 11 1271 -592 -28 -1058 -373 -860 -1411 448 -1164 374 -1185 -125 71 1081
807 1081 1125 -335 805 42 -114 -362 364 458 537 688 118 617 -669 564 44 1317 1379 -823 71
826 71 421 -582 167 -282 -21 925 209 -865 167 47 -810 -279 -1391 -731 234 -40 417 -1013 -140
845 -140 -600 -365 -407 -1039 658 548 1411 820 -549 -224 -1745 95 -259 -180 -236 245 1606 -310 -46
864 -46 -1093 -997 -187 1274 838 61 -443 1026 -638 608 -1071 258 -708 450 195 -381 -423 -8 238
883 238 518 343 -363 556 216 -1056 131 -73 1323 342 -364 332 -1095 -24 -144 53 477 -164 -352
902 -352 722 1013 -531 -304 52 -1491 356 -438 745 -57 -916 199 -207 -253 -200 395 830 141 618
$$ packed form
772c46J96J13N03j443J405p5r13J767k302R43P25n51j414J488M57n45J032j768
790g28J207o22J54J260j863N64j030O85m87n51J859j612J538j559J060J96J010
807A081M4j460J140p63j56k48P26R4P9J51n70M99j286J233n20J273O2k202Q94
826G1L50j003P49m49K61R46p16j074J032j20q57N31j112O60R65k74M57j430Q73
845a40m60K35m2o32J697j10Q63n91j369L25j521J840l54P9n6M81J361j916K64
864d6j047R6Q10J461m36p77n04J469j664J246j679J329r66J158k55n76m2M15K46
883B38K80j75p06R19l40j272J187k04J396r81p06O96j427J071j20J97M24o41j88
902c52J074K91j544K27L56j543J847p94J183q02q59J115m06m6N3N95M35o89M77
$$ plain form
921 618 -263 -251 -393 175 -672 120 581 418 989 -115 -649 381 -1936 538 -39 27 168 330 -402 -938
941 -938 -432 25 243 522 585 323 -813 339 1110 934 -880 846 696 -27 897 -563 1075 -239
959 -239 388 -582 -400 -500 -274 1323 -818 -367 -219 713 926 -690 267 193 844 -1010 -497 290 -1089
978 -1089 348 945 153 -49 -799 34 634 -246 -804 364 1089 -734 -817 -944 33 157 -892 814 -191
997 -191 529 -276 328 510 -239 -198 798 595 672 -340 -267 -69 1315 261 81 370 617 825 -247 363
1017 363 -1453 -203 -370 -603 787 -701 1424 -320 -1044 767 230 386 -1244 740 58 -308 336
1034 336 -831 -187 -484 205 -1582 -453 -1127 -98 -70 -615 -478 -16 -278 -293 969 865 -1204 291
1052 291 -130 -368 -200 -413 487 -1072 110 755 542 -338 -828 44 -179 -1070 -596 279 453 58 184
$$ packed form
921F18q81J2j42N68q47P92M61j63N71j104n34J030k317K474n77O6J41J62p32n36
941i38N06M57K18K79O3k62j136J152P71j76j814J726j50p23R24j460J638j314
959b39O27r70J82j00K26J597k141M51J48R32K13j616R57p4O51j854N13P87j379
978a089J437N97p92k02p50Q33O00q80n58J168P25j823q3j27R77J24j049J706j005
997a91P20q05O04J82p49M1R96k03P7j012P3J98J384j054j80K89K47K08j072O10
1017C63j816J250j67k33J390j488K125j744p24J811n37J56j630J984o82l66O44
1034C36j167O44k97O89j787J129o74J029K8n45J37M62k62j5J262j04k069J495
1052B91m21k38J68k13R00j559J182O45k13q80m90Q72k23q91M74Q75J74l95J26
$$ plain form
1071 184 334 851 -923 394 709 -530 1208 15 1191 -490 1110 -78 -55 435 -1002 -168 592
1088 592 -421 894 -506 1086 -504 -665 306 91 -188 -229 828 -602 -206 863 -478 5 -377
1105 -377 -127 26 1458 -179 -457 632 -129 299 -70 569 130 -328 -71 -580 94 -1277 -771 -644 -474
1124 -474 746 -455 108 609 55 709 -657 219 136 -939 -691 -664 1179 -1057 1222 25 -351 -567
1142 -567 -712 870 -1653 -296 -769 -106 -861 -137 770 -1052 573 -777 -157 620 -563 539 700
1159 700 530 -483 42 -118 -292 1980 -693 190 286 -132 -245 195 1258 -423 659 -985 -1090 39
1177 39 -290 108 -738 -405 -126 580 369 -868 526 -116 -446 -42 236 -262 -830 929 461 330 -241
1196 -241 898 -153 -283 2038 -654 1626 -499 -443 -412 -144 727 144 204 -354 -72 631 -176 249 120
$$ packed form
1071A84J50N17j774J317L15j239J738j193J176j681J600j188K3M90j437Q34P60
1088E92j013J315j400J592j590j61R71k15k79m1J057j430L96J069j341M83l82
1105c77K50J53J432j637k78J089p61M28l69O39m39m58K57n09O74j371N06J27J70
1124d74J220j201N63N01n54O54j366Q76q3j075K48K7J843k236K279j197l76k16
1142e67j45J582k523J357m73O63p55P24R07j822J625j350O20P77j183J102J61
1159G00j70j013N25j60j74K272k673Q83R6m18j13M40J063j681J082j644j05J129
1177C9l29L98q46L33K79P06k11j237J394o42l30M04K78m98n68J759m68j31n71
1196b41J139j051j30K321k692K280k125N6L1K68Q71n83O0n58K82P03q07M25j29
$$ plain form
1215 120 519 -63 -884 9 0 499 150 -295 34 -657 14 583 591 -53 -716 1181 128 598 -491 118
1235 118 508 376 -750 38 -539 -349 331 -169 1123 1253 -869 1065 -234 28 79 -580 287 -67 1489
1254 1489 -160 348 -539 113 80 -1404 -192 -1120 372 -559 -29 546 -476 349 -782 319 34 -123
1272 -123 -142 -465 285 639 360 81 -80 -593 175 469 473 770 217 -845 202 -752 -1129 -714 -863 109
1292 109 561 -178 -583 -915 -90 -212 161 -606 605 -939 1441 640 -786 -535 -804 -125 -306 113 -112
1311 -112 296 -142 -382 -116 444 -574 200 -459 -278 -580 516 -489 -426 703 34 -180 -263 1214 -80
1330 -80 96 407 -188 767 35 -232 84 -667 105 -318 388 -209 70 235 -948 791 -25 187 -213 -611
1350 -611 204 -667 -521 -489 -180 -261 57 560 451 286 401 139 -1131 221 377 -479 224 -374 -666 448
$$ packed form
1215A20L99n82q21Q93rM99l49m45L29o91O71N69Qo44o63J897j053M70j089O09
1235A18L90j32j126P88n77J90O80n00J292J30k122J934j299K62N1o59Q67l54J556
1254A489j649N08q87O52l3j484J212r28J492r31N30N75j022Q25j131J101k85j57
1272a23j9l23P50L54k79k79j61n13P68K94MK97n53j062J047r54l77M15j49R72
1292A09M52p39m05l32Q25j22L73p67J211j544K380q01j426K51k69O79j81M19k25
1311a12M08m38k40K66N60j018P74o59J81l02J096j005O3J129o69k14q3J477j294
1330h0J76L11n95R55p32k67L16p51P72m23P06n97K79J65j183J739q16K12m00l98
1350f11Q15q71J46L2L09q1L18N03j09j65J15k62j270J352J56q56P03n98k92J114
$$ plain form
1370 448 -100 -232 509 947 -806 631 -110 154 899 -1227 1484 -416 192 -289 -89 -34 -1231 -198
1388 -198 568 755 -2027 -231 -910 537 15 -311 -238 -809 -937 -635 -512 1684 -476 -445 60 -769 389
1407 389 251 -492 -453 -440 100 483 801 -202 489 512 -176 -267 29 201 -1029 418 -300 -195 278 266 864
1428 864 1231 -681 -947 -250 27 -612 788 -126 15 95 167 -460 -970 921 -829 358 -2 194 434
1447 434 560 1190 109 -368 -257 342 -405 -300 864 135 741 193 -58 -535 41 223 358 185 1104
1466 1104 -294 28 611 180 -842 -123 795 461 618 705 -54 -1813 280 855 399 500 -474 1027
1484 1027 -661 -15 35 452 1268 94 -140 718 -535 716 166 484 623 366 458 815 -26 -241 1492
1503 1492 869 -47 -400 -471 499 -144 -437 -325 143 -838 33 24 589 -102 361 -502 541 -247 1127 -702
$$ packed form
1370D48n48j32P41M38j753J437p41K64P45k126K711j900O08m81K00N5j197J033
1388a98P66J87k782J796o79J447n22l26P3n71j28L02J23K196k160L1N05q29J158
1407C89j38p43L9J3N40L83L18j003O91K3o88r1K96J72j230J447p18J05M73j2N98
1428H64L67j912k66O97K77o39J400r14J41Q0P2o27n10J891j750J187l60J96K40
1447D34J26O30j081m77J11N99p47J05J164p29O06n48k51m77N76J82J35j73R19
1466A104j398L22N83m31j022P19R18l34J57Q7p59j759K093N75m56J01r74J501
1484A027j688O46N0M17Q16j174k34Q58j253J251n50L18J39k57R2L57q41k15J733
1503A492o23r16l53p1R70o43k93J12M68r81Q71rN65o91M63q63J043p88J374j829
$$ plain form
1523 -702 -1187 480 -477 -663 -520 427 -1051 -138 729 862 -748 -257 274 -434 570 -324 -152 977
1541 977 -457 -664 -1128 -75 133 -378 637 44 296 350 411 -595 365 599 -841 -229 -290 282 802
1560 802 -301 1881 -1137 850 -343 95 51 -1377 542 -391 386 -539 -502 474 -594 41 -557 1239
1578 1239 540 -264 429 -1427 282 61 -102 -358 428 303 -441 -441 172 -150 -1201 -393 -596 549 527
1597 527 -43 -150 513 -193 -67 -291 361 496 187 277 -993 49 134 -746 -434 -917 43 -50 285 -933
1617 -933 33 103 -190 403 -12 254 -893 -148 -778 534 -87 -486 -239 181 7 -818 201 811 -677
1636 -677 492 154 906 211 37 -270 -228 589 -657 -556 133 -139 703 -31 170 -857 244 409 123
1655 123 178 -435 288 -810 242 -408 -763 -651 -141 480 -487 1236 363 -376 1342 -1264 22 1187
$$ packed form
1523g02m85J667r57j86J43R47j478R13Q67J33j610M91N31p08J004q94J72J129
1541I77j434k07m64J053K08n11J015n93K52N4O1j006R60K34j440O12o1N72N20
1560H02j103K182l018J987j193M38m4j428J919r33P77r25L7R76j068O35n98J796
1578A239o99q04O93j856J709k21j63k56P86j25p44%O13l22j051Q08k03J145k2
1597E27n70j07O63p06J26k24O52J35l09R0j270J042Q5q80L12m83R60r3L35j218
1617i33R66P0k93N93m15K66j147P45o30J312o21l99K47M20j74q25J019O10j488
1636f77J169l38P52o95j74l07M2Q17j246J01O89k72Q42p34K01j027J101J65k86
1655A23N5o13P23j098J052o50l55J12N10O21r67J723q73p39J718k606J286J165
$$ plain form
1673 1187 847 -41 -857 37 -677 398 803 -819 309 -7 -752 -475 1381 454 45 -167 -1023 461
1691 461 -341 -574 394 -905 235 221 235 204 -491 -216 86 958 -865 1217 -751 -393 405 -532 -19
1710 -19 298 -20 87 121 -283 250 611 -1007 297 97 1190 -205 238 744 -287 -26 -893 83 -92
1729 -92 -194 1312 -1680 694 -767 -1013 -118 -897 348 -601 438 268 75 1232 -1011 168 -30
1746 -30 -1203 -405 -9 388 -205 928 -746 -815 -216 3 461 -172 484 931 498 -394 -506 -168 459 -51
1766 -51 -181 -694 -295 269 377 -1158 1064 116 -246 431 -268 317 493 430 -422 588 -330 -163 575 1037
1786 1037 452 710 -1521 -944 -428 551 -391 483 -165 -407 1198 747 -106 -325 -123 187 -283 356 -773
1805 -773 506 -864 -294 -38 -613 254 -559 526 -939 723 -531 -206 983 -16 340 -34 -619 242
$$ packed form
1673A187l40q88q16Q94p14J075M05j622J128l16p45K77J856r27m09k12q56J484
1691D61q02k33R68j299J140j4J4l1o95K75L02Q72j823K082j968L58P98r37N13
1710a9L17l18J07L4m04N33L61j618J304k00J093j395M43N06j031K61q67R76j75
1729i2j02J506k992K374j461k46Q95p79J245r49J039j70j93J157k243J179j98
1746c0j173P98L96L97n93J133j674o9N99K19M58o33O56M47m33q92j12L38O27n10
1766e1j30n13L99N64J08j535K222r48l62O77o99N85J76o3q52J010r18J67P38M62
1786A037n85K58k231N77N16R79r42Q74o48k42J605m51q53k19K02L10m70O39j129
1805g73J279j370N70K56n75Q67q13J085j465J662j254L25J189r99L56l74n85Q61
$$ plain form
1823 242 -971 869 296 -670 696 -1077 897 -226 1103 -91 1248 301 -938 -777 -703 120 -1136
1840 -1136 1257 701 738 -364 220 -69 -122 -348 1252 134 328 -1612 330 222 76 194 493 789
1858 789 -588 540 1 649 -155 -268 -571 -484 1524 -332 1458 -535 -838 962 -435 -38 -602 -368
1876 -368 1539 -813 992 -699 -388 6 -261 708 -541 766 -377 -52 544 -224 1242 1156 288 445
1894 445 -394 -96 -1228 -44 -435 563 -217 117 908 -371 149 294 -673 -110 956 -285 -1028 881
1912 881 -891 -260 -338 402 1039 -992 -224 -1000 -38 -663 231 -430 -834 -581 -233 791 732 -68 88 685
1932 685 128 32 226 924 867 204 -244 -82 -718 84 480 873 615 -1344 230 850 6 522 327 763
1952 763 -992 490 -1458 15 326 -74 229 266 -214 42 -263 287 25 119 -115 -414 1013 -822 308
$$ packed form
1823B42j213J840n73r66J366j773J974j123J329j194J339r47j239J61P4Q23j256
1840a136K393n56L7j102N84k89n3k26J600j118J94j940J942j08j46J18K99K96
1858G89j377J128n39O48q04j13l03Q7K008j856J790j993l03J800j397L97n64K34
1876c68J907k352J805j691L11L94k67R69j249J307j143L25N96p68J466q6q68J57
1894D45q39K98j132J184l91R98p80L34P91j279N20J45r67N63J066j241p43J909
1912H81j772O31p8P40O37k031P68p76R62o25Q94o61m04K53L48J024n9q00J56N97
1932F85n57r6J94O98n7o63m48J62o36Q02L96L93k58j959J574O20q44N16j95M36
1952G63j755J482j948J473L11m00L03L7m80K56l05N50k62R4k34k99J427j835J130
$$ plain form
1971 308 123 37 464 -313 -377 -293 49 691 -151 -769 720 -508 -610 659 98 1035 -354 -207 18 -1439
1991 -1439 441 257 200 576 -374 -271 -180 882 -84 168 373 1094 -221 -1221 191 -1389 1250 -1179
2009 -1179 -68 -552 -695 1204 -910 -1001 -214 -82 377 72 45 -608 -323 519 346 -513 -934 -115 -342
2028 -342 639 -1265 -107 -231 -243 1699 199 7 -814 -941 1065 -408 -446 -649 110 803 -330 219
2046 219 -292 762 -341 -111 50 208 340 -588 178 1204 119 -250 276 465 360 89 48 -55 -64 -494
2066 -494 -128 -740 339 -506 -256 1344 -331 657 -683 1447 -369 61 669 70 308 -246 -151 -398
2084 -398 387 -51 96 -159 151 -54 628 -1438 396 -1004 182 -946 670 -356 -769 767 -1507
2101 -1507 -587 206 360 91 32 -200 -315 434 -740 328 660 59 1088 248 447 -299 59 350 -251
$$ packed form
1971C08j85q6M27p77o4Q4L42O42q42o18J489j228j02J269n61R37j389J47K25j457
1991a439J880j84n7L76r50J03R1J062r66K52K05P21j315j000J412j580K639k429
2009a179J111m84j43J899k114r1P87J32M59l05k7o53K85Q42j73q59m21Q19k27
2028c42R81j904J158j24j2J942j500j92q21j27K006j473l8k03P59O93j133N49
2046B19n11J054j103K30J61J58J32r28P66J026j085l69N26J89j05k71m1j03rm30
2066d94L66o12J079q45K50J600j675R88j340K130j816M30O08n99K38n54R5k47
2084c98P85m38J47k55L10k05O82k066J834j400J186j128J616j026m13J536k274
2101a507R20P93J54k69n9k32j15P49j174J068L32o01J029q40J99p46L58K91o01
$$ plain form
2120 -251 -277 -970 420 12 -13 -1617 -460 -304 125 1063 301 518 -373 -68 -338 -376 -248 792 -280
2139 -280 843 26 586 -149 -426 563 99 957 -1369 456 7 490 297 -193 -343 -1499 1224 389
2157 389 -80 351 -1266 -246 -837 -204 546 -846 824 640 -330 -217 221 1212 790 -24 -858 -74 -1094
2176 -1094 1355 -429 -508 313 -1053 212 370 807 -1202 -635 322 -388 106 -283 -400 717 -1602 44
2194 44 -599 718 -198 -121 272 305 -140 618 -660 694 -409 -39 -627 -276 -327 753 -906 251 -216
2213 -216 -214 555 -10 807 -1392 197 -819 -18 643 -1013 -460 -933 -66 -120 66 -88 -961 190 6
2232 6 -398 181 -308 449 110 532 431 -392 213 -202 755 -11 -678 -62 125 824 -652 43 329 -713
2252 -713 -999 64 165 -227 -203 167 405 -461 -87 -207 -90 122 -10 358 -640 -707 1463 -857 1292
$$ packed form
2120b51k6o93J390m08k5j604J157J56M29R38p62K17q91L05k70l8J28J040j072
2139b80J123q17N60p35k77R89m64Q58k326J825m49M83j93m90j50j156K723q35
2157C89m69M31j617J020n91O33P50j392J670j84r70J13M38R91m22q14q34P84j020
2176a094K449j784p9Q21j366J265J58M37k009N67R57p10M94l89j17J117k319J646
2194D4o43J317r16P7L93L3m45P58j278J354j103L70n88L51n1J080j659J157m67
2213b16KP69n65Q17k199J589j016Q01O61j656N53m73Q67n4J86j54q73J151j84
2232Fm04N79m89P57l39M22j01q23O05m15R57p66o67O16J87O99j476O95K86j042
2252g13k86J063J01l92K4L70K38q66L74j20J17K12j32L68r98o7K170k320K149
$$ plain form
2271 1292 -16 -72 269 246 610 -1009 1100 64 86 697 -417 78 567 262 158 480 138 -1052 1340
2290 1340 691 249 -891 381 213 -579 772 -489 -519 537 -226 -559 -502 -271 28 166 889 228 619
2309 619 -1260 1320 -466 -525 278 -243 100 264 -272 30 327 1073 -587 -626 -111 -1140 440 -368 -725
2328 -725 -734 -146 254 -794 -899 -216 416 -155 251 -358 -608 725 -105 996 -446 -187 267 537 -208
2347 -208 414 1109 -160 -52 -310 -317 615 -148 251 671 -418 -372 105 319 -170 910 -746 -1039 438
2366 438 -569 78 -371 854 600 483 -112 316 768 36 736 -557 1046 1114 -415 24 -930 171
2384 171 -678 139 -519 328 478 -296 944 39 602 -315 -245 972 -975 395 146 -374 -1161 391 810
2403 810 -826 610 17 52 610 -261 578 -172 -370 -639 -201 476 251 -363 -509 1285 -734 -20 -411
$$ packed form
2271A292j308n6L41k3L64j619K109j036K2O11j114M95M89l05j04L22l42j190K392
2290A340o49m42j140J272j68p92J351j261l0J056p63l33N7K31K99J38P23o61L91
2309F19j879K580j786n9Q03n21L43J64n36L02K97P46j660l9N15j029J580q08l57
2328g25rN88M00j048j05O83O32n71M06o09k50J333q30J101j442K59M54K70p45
2347b08O22O95j269J08k58pR32p63L99M20j089M6M77K14m89J080j656k93J477
2366D38j007O47m49J225k54j17n95M28M52p32P00j293J603O8j529M39r54J101
2384A71q49Q17o58Q47J50p74J240r05N63r17P0J217j947J370k49n20p87J552M19
2403H10j636J436n93L5N58q71Q39p50j98k69M38O77k25o14j46J794k019P14l91
$$ plain form
2422 -411 -121 236 81 255 353 255 -96 -995 -14 234 486 35 -12 -5 -95 -1015 1181 623 352 -613 -79 -1089
2444 -1089 930 -493 352 -251 849 247 -971 189 -806 -190 -290 -183 398 360 802 607 23 787
2462 787 -474 685 -404 913 -287 -737 515 441 -65 -47 -140 28 1393 1166 -485 234 -145 410
2480 410 -961 -548 -370 170 -235 -1056 1350 615 -573 259 -95 -148 -113 523 -514 -686 -364 1132 771
2499 771 -672 278 327 579 1533 10 1509 -620 -329 -350 322 244 -27 915 -618 129 209 -170 -615 189
2519 189 -180 -1274 402 -427 166 175 -503 339 394 97 219 494 295 475 346 493 -513 58 -655 220
2539 220 41 272 -529 -610 185 -513 -55 -392 -477 -392 -149 -425 84 699 -577 353 265 -332 1638 294
2559 294 80 848 145 771 -262 567 -429 -300 -1064 397 -859 -1468 -188 -1169 21 -608 -109 481
$$ packed form
2422d11K90L57j55J74R8r8l51q99R81K48K52m51m7Pr0r20K196n58k71r65N34j010
2444a089K019j423Q45o03J100o02j218J160r95O16j00J07N81l8M42j95n84P64
2462G87j261J159j089J317j200m50J252p4n06J8r3J68J365k27j651P19l79N55
2480D10j371M13J78N40m05q21K406p35j188Q32l54n3L5O36j037j72L22J496l61
2499G71j443R50M9K52R54j523J499k129K91k1O72p8k71R42j533P47Q0l79m45Q04
2519A89l69j094J676q29N93Ro78Q42N5k97J22K75j99J80j29J47j006N71p13Q75
2539B20j79K31q01q1P95o98M58l37q5Q5K43k76N09O15j276R30q8n97J970j344
2559B94k14P68p03O26j033Q29r96J29p64J461j256o09J280r81J190o29M99N90
$$ plain form
2577 481 283 445 -474 1003 249 -462 223 -595 1476 -3 300 -6 -1069 200 -519 335 -198 923
2595 923 825 553 568 -238 114 -579 -350 177 345 1 -379 386 -269 286 -692 -896 1185 -400 -16 -196
2615 -196 345 176 -1050 217 -81 77 -523 -550 1201 -995 1177 -630 -283 174 -71 1054 46 -296
2633 -296 -535 -149 446 -1329 180 -622 567 -360 -361 768 -465 639 -779 416 -256 179 357 -1252
2651 -1252 -31 -543 153 -228 353 1163 -852 1184 526 -62 -370 -390 987 -153 27 -427 721 500
2669 500 141 103 -234 958 -541 431 -422 355 1082 -1162 188 -213 -352 371 81 26 -317 1229 349
2688 349 -447 -1029 -494 173 107 437 -705 121 145 339 1413 -413 -310 -990 288 -518 -61 505 -385
2707 -385 330 777 641 -363 -932 952 341 854 -322 -243 -859 -380 289 -79 -473 277 -740 -829 -212
$$ packed form
2577D81j98J62r19J477p54p11O85q18K071j479L03l06j063J269p19Q54n33J121
2595I23r8k72J5q06L52o93K29N27J68l44l80P65o55N55r78k04K081j585L84j80
2615a96N41j69j226J267k98J58o00k7J751k196K172j807L47M57k45J125j008l42
2633b96k39L86N95j775J509q02J189r27jJ129j233J104j418J195o72M35J78j609
2651a252J221n12O96l81N81Q10k015K036o58n88l08k0J377j140J80m54J148k21
2669E00l59l8l37J192j499R72q53P77P27k244J350m01j39P23k90n5l43J546q80
2688C49p96n82N35O67o6L30j142Q26K4J94J074j826J03o80J278q06M57N66q90
2707c85P15M47j36j004n69J884o11N13j176P9o16M79O69l68l94P50j017q9O17
$$ plain form
2726 -212 -196 -165 1081 161 344 1001 -809 355 -1393 -88 -700 77 1306 -285 463 -203 -596 871
2744 871 -440 -297 -1371 206 -165 -278 -474 -538 1127 -217 -855 -326 807 103 -880 646 -505 292
2762 292 -177 -473 554 -843 -110 82 -220 170 -445 -159 -469 335 -677 1138 68 -63 -1285 -961
2780 -961 250 -734 -902 -921 526 329 -1604 596 -122 -521 -135 160 916 -1457 543 104 -198 716
2798 716 -355 140 251 -312 -1038 -77 270 521 527 -211 89 -19 505 -1001 -575 -467 461 429 69 -197
2818 -197 1478 -718 341 -315 -3 552 -834 800 -91 71 -81 -9 78 -675 157 -75 437 1244 469
2837 469 -362 -580 112 -1061 -146 -163 -337 541 429 857 -750 191 1639 632 -311 138 671 -1037 -281
2856 -281 -405 -280 289 266 456 -643 -663 -478 -47 334 -395 746 -541 308 -221 -697 520 -1120 633
$$ packed form
2726b12J6L1J246r20J83O57j810J164j748J305o12P77J229j591P48o66l93J467
2744H71j311J43j074J577l71j13j96o4J665j344o38N29J133p04r83J526j151P97
2762B92m69k96J027j397P33J92l02L90o15K86l10Q04j012J815j070j31j222L24
2780i61J211r84j68j9J447j97j933K200p18l99L86K95P56k373K000m39l02R14
2798G16j071M95J11n63p26R61L47K51Op38L00j08N24j506M26J08R28l2l60k66
2818a97J675k196J059o56L12N55j386J634q91J62j52P2Q7p53Q32k32N12Q07p75
2837D69q31k18O92j173R15j7j74Q78j12M28j607R41J448j007r43M49N33j708P56
2856b81j24J25N69k3J90j099k0J85M31L81p29J141j287Q49n29m76J217j640J753
$$ plain form
2875 633 -943 -397 753 -1234 471 -916 -205 -826 171 459 -651 75 -323 432 -290 -77 -392 60
2893 60 1133 288 1058 125 593 -82 -8 1054 -773 724 -843 26 -215 -478 714 573 227 -1131
2911 -1131 692 415 -466 259 670 954 375 -547 -1026 -218 356 -931 1077 30 -669 645 -72 791
2929 791 354 1104 288 -751 1159 -167 633 186 743 -968 -73 1434 335 124 -422 986 282 -227
2947 -227 908 -74 5 -220 344 389 -810 869 -549 2095 1195 96 59 327 899 -941 563 195
2965 195 -258 196 -166 932 -811 -201 254 364 1146 -89 956 -615 -75 -48 361 1036 283 369 30
2984 30 649 -712 86 613 287 -84 -479 -60 -1068 537 -843 508 -5 -247 590 617 379 -815 -930
3003 -930 22 -88 -869 -484 -403 -48 -771 970 -479 83 -856 -201 234 791 374 316 -94 -57 -281 -366 -400
$$ packed form
2875F33j576N46J150j987J705j387P11o21R97K88j110P26l98P55p22K13l15M52
2893F0J073q45P70r33M68o75P4J062j827J497j567Q69k41k63J192j41l46j358
2911a131J823k77q81P25M11K84n79r22m79Q08N74j287K008j047o99J314p17Q63
2929G91m37P50q16j039J910j326Q00m47N57j711Q95J507j099k11n46J408p04n09
2947b27J135r82P9k25N64M5j199J679j418K644r00j099l7K68N72j840J504l68
2965A95m53M54l62J098j743O10M55J10P82j235J045j571N40K7M09O75p53Q6l39
2984C0O19j361P98N27l26l71l95M19j008J605j380J351n13k42Q37K7k38j194j15
3003i30R52j10p81L85Q1L55p23J741j449N62r39O55M35N57m17n8m10L7k24q5l4
$$ plain form
3024 -400 -139 1430 339 1163 -165 1192 -227 -102 111 10 162 -491 264 -33 52 547 -254 -208 173
3043 173 1197 91 -191 788 -379 322 -894 -366 947 148 131 577 -354 -127 1323 -515 293 348
3061 348 -803 -227 -320 -623 -505 -229 107 -373 366 -1151 1178 601 604 574 -360 -487 -889 -237 144 570
3081 570 -162 -196 64 -1201 614 -217 -521 -90 -554 123 -622 131 -94 143 -468 -609 447 63 102 1094
3101 1094 746 -455 9 495 -47 -133 442 15 1092 -1019 575 -742 -167 380 -505 -1339 -590 24
3119 24 -729 925 1245 -736 617 -254 306 -459 31 236 -926 313 -131 265 -438 1019 31 -1499
3137 -1499 1373 -913 818 1302 -1302 775 296 1074 123 -312 -354 -459 732 -392 991 -313 245
3154 245 592 -646 174 8 350 -390 -443 262 -943 710 -622 -191 -253 -224 224 -236 -169 -622 92 207
$$ packed form
3024d00K61J569j091Q24j328J357j419J25K13j01J52o53P55k97Q5M95q01M6L81
3043A73J024j106k82R79j167P01j216N28J313p99j7M46r31K27J450j838Q08N5
3061C48j151N76r3l03J18K76L36m80P39j517K329n77Ll0r34j27m02O52L81M26
3081E70p32l4K60j265J815q31l04M31m64O77p45P53k25K37o11j41J056l84L9R92
3101A094l48j201M64M86n42q6N75m27J077k111J594j317N75N47q85q34P49O14
3119B4p53J654L20j981J353q71N60p65M90K05j162J239m44L96p03J457r88j530
3137a499K872k286J731M84k604K077m79P78r51m35m2j05J191j124J383j304N58
3154B45L47j238Q20j66L42p40n3P05j205J653j332M31o2K9M48m60O7m53P14J15
$$ plain form
3174 207 -408 -711 62 1543 259 977 703 -351 179 -341 717 -321 432 484 -175 1462 -773 587
3192 587 783 128 410 -195 223 -693 790 546 1001 652 -666 612 221 -26 160 -1163 345 -855
3210 -855 -920 231 339 686 -714 478 -1413 119 -139 837 1339 -394 -251 -241 348 402 -197 510 147
3229 147 506 -700 207 856 443 -569 -615 -74 -529 1453 -236 870 -22 -85 1039 -31 215 869
3247 869 -712 -397 251 906 -947 -75 -962 -569 -295 -538 -273 -899 -128 982 -405 322 -533 477
3265 477 -3 263 -668 1402 930 -321 170 -647 8 -123 -53 262 -263 -161 -240 -65 -17 224 -282 29
3285 29 295 164 746 -438 -112 504 228 585 -1235 116 97 -771 616 -276 -137 -924 120 -3 -619
3304 -619 -954 -1261 -245 -1059 -135 -1155 92 428 -1594 1268 -62 709 -274 260 -144 168 495 -216
$$ packed form
3174B07o15l03P73J481j284P18k74j054N30n20J058j038P53N2o59J637k235J360
3192E87J96o55K82o05M18r16J483k44M55l49j318J278l91k47J86j323J508j200
3210h55o5J151J08L47j400J192j891J532k58R76N02j733J43J0N89N4n99P07l63
3229A47L59j206R07O49m13j012m6N41m55J982j689J106q92o3J124j070K46O54
3247H69j581L15O48O55j853Q72q87L93K74k43K65o26P71J110j387P27q55J010
3265D77m80K66r31K070m72j251M91q17O55j31P0L15n25J02p9J75M8K41n06L11
3285B9K66j31N82j184L26O16k76L57j820J351j9q68J387q92J39p87J044j23o16
3304f19l35l07J016q14R24j020J247L36k022K862j330P71r83N34m04L12L27p11
$$ plain form
3322 -216 39 687 -22 1121 -109 -508 -54 487 1725 -966 1082 -125 258 -473 893 853 -679 -327
3340 -327 -105 -309 -730 367 -160 -435 -469 -1225 -223 -320 -600 389 -68 1594 222 659 741 24 313 281
3360 281 874 -1429 -724 184 -998 1268 -1062 -388 -538 -242 368 -195 194 -532 637 -580 -468 257
3378 257 -69 818 -56 -255 -178 -1212 395 -608 -416 -1349 -482 49 -216 174 4 665 -252 -143 608
3397 608 -579 941 -760 -51 135 979 758 -116 20 -654 152 363 -848 -160 355 541 -28 325 467
3416 467 -1057 346 -912 -770 174 266 92 660 875 -330 756 468 -800 391 -317 1382 216
3433 216 721 -1244 101 -501 642 -636 -332 1196 -937 -139 -525 -625 -177 357 141 -1185 -721 -299
3451 -299 776 622 689 1682 -30 -258 99 -755 689 -607 904 399 224 -99 -729 1562 255 -71
$$ packed form
3322b16K55O48p09J143j230l99M54N41J238k691K048j207L83p31J366m0j532L52
3340c27K22k04m21J097n27k75l4p56J002r7k80R89m57J662j372M37Q2p17K89l2
3360B81N93k303P05R08j182K266k330O74j50K96O10n63L89p26J169j217J12P25
3378B57l26Q87q74j99P7j034J607j003J92r33Q67N31k65L90j70O61r17J09P51
3397F08j187J520j701P09J86Q44k21q74J36o74Q06K11j211O88N15J86n69L53J42
3416D67j524J403j258J42R44R2j74N68K15j205J086k88j268J191p08J699j166
3433B16N05j965J345o02J143j278L04J528k133P98l86j00M48N34k16j326M64M22
3451b99J075j54O7R93j712k28L57q54J444j296J511n05j75l23o30K291j307l26
$$ plain form
3469 -71 -828 85 -547 -867 -1223 195 9 -151 270 519 -112 459 -400 -316 222 -409 -213 -276 -488 766
3489 766 -589 337 575 1187 -174 270 -1111 23 -263 -62 262 -304 418 8 -110 468 351 989 -1033
3508 -1033 88 -56 -203 284 44 916 306 -650 468 -559 -213 -300 30 -569 164 -650 -285 890 -803
3527 -803 959 -523 61 -321 -57 127 659 991 -383 -1566 120 154 -18 -932 1129 758 459 695
3545 695 -504 -394 -1139 678 764 -133 274 -976 -700 -149 485 -478 -1057 -674 -1295 986 -659 174 -991
3564 -991 -44 205 -217 463 -103 -77 1023 401 -27 461 254 -969 84 300 -396 52 -603 -250 -347 -49
3584 -49 234 -245 175 -19 -722 134 295 435 -34 80 -72 214 525 -120 -481 -566 104 -768 -510 -738 -24
3605 -24 162 -683 374 -946 348 179 174 885 -1224 341 -1283 -211 -382 -124 -504 323 681 -1480
$$ packed form
3469g1p57R13o32l20l56J418j86j60M21K49o31N71q59Q4N38o31J96o3k12J254
3489G66j355R26K38O12j361M44j381J134k86K01L24n66P22m10j18N78j17O38k022
3508a033J121j44j47M87k40Q72o10r56J118j027L46q7L30n99P33q14L65J175j693
3527h03J762j482N84l82K64J84N32L32j374j183J686L4j72r14K061l71k99K36
3545F95j199J10p45J817Q6q97M07j250K76N51O34r63n79L83o21K281j645Q33j165
3564i91R47K49m22O80n66K6J100o22m28M88k07j223J053K16o96M48o55L53r7K98
3584d9K83m79M20j94p03Q56J61J40m69J14j52K86L11o45l61q5O70q72K58k28P14
3605b4J86q45J057j320J294j69nP11k109J565j624J072j71K58l80Q27L58k161
$$ plain form
3623 -1480 -22 85 84 575 -513 838 -65 532 18 -401 840 -60 108 -438 130 1285 -217 -265 224
3642 224 1218 -588 -608 -93 -258 -206 -1176 547 -545 -221 -1284 -804 1077 -695 64 796 -926 587
3660 587 -474 850 -1126 1080 849 502 -410 -557 1535 -1130 75 -915 73 17 -743 49 -605 -840
3678 -840 -44 -428 478 -1124 -437 331 -564 -665 -452 -518 537 128 117 -1026 -500 -287 -121 -4 628 273
3698 273 121 710 -541 -464 48 54 -720 19 -1338 90 379 -353 -289 320 -309 1229 -996 475 -653
3717 -653 -441 353 775 433 -620 -340 -384 1094 1101 -149 731 -101 560 -814 600 427 -883 -329 -532
3736 -532 231 823 -859 454 -166 -192 -1331 1010 341 321 1062 -678 258 -473 772 -288 -759 514
3754 514 -629 -1134 -1155 -699 -584 -233 1071 -352 78 -821 59 660 -651 -1076 565 103 -97 -172 -921
$$ packed form
3623a480J458J07jM91j088J351r03N97n14m19J241r00J68n46N68J155j502m8M89
3642B24R94j806k0N15j65N2r70J723j092L24j063M80J881j772P59P32j722J513
3660E87j061J324j976K206k31l47r12j47K092k665J205r90R88n6p60P92o54k35
3678h40P96l84R06j602O87P68q95j01K13o6J055m09j1j143N26K13J66J17O32l55
3698B73j52N89j251P7N12Op74P39j357J428K89p32O4O09o29J538k225J471j128
3717f53K12P94M22l42j053K80m4J478Pj250Q80q32O61j374J414j73j310N54k03
3736e32P63N92j682J313o20k6j139K341o69k0P41j740R36p31J245j060m71J273
3754E14j143n05k1M56J15L51J304j423M30q99Q80O01j311m25J641m62k00p5p49
$$ plain form
3773 -921 -686 725 -280 135 432 857 -336 -90 -112 -879 -264 680 -1077 49 70 448 -785 -269 178
3792 178 -27 -160 514 571 -678 -624 -1334 400 670 -1012 952 634 -59 -380 -928 -171 -467 631 -738
3811 -738 316 671 78 714 -913 593 356 -80 1002 812 80 362 1063 -499 216 -45 111 559
3829 559 -250 1349 298 709 -1043 -519 158 481 548 -1238 -33 215 49 688 -393 494 778 346
3847 346 49 386 627 178 993 369 -493 876 -877 962 -797 947 1069 -169 -833 -264 -138 -1227
3865 -1227 -45 464 346 -151 911 30 51 -23 177 126 -39 -218 82 -79 262 182 179 -572 -9 318 -237
3886 -237 -335 -183 355 829 -676 -359 -182 -850 491 477 1195 63 321 -1042 -1216 -1423 -760 -39 -424
3905 -424 64 -235 -633 667 462 59 46 413 452 -469 279 -263 291 -548 1333 -1223 -437 -399 -816 -37
$$ packed form
3773i21K35J411j005M15K97M25j193K46k2p67O15R44j757J126K1L78j233N16M47
3792A78k05j33O74N7j249N4p10J734K70j682J964l18o93l21n48P57k96J098j369
3811g38J054L55n93O36j627J506k37m36J082j90p32K82P01j562P15k61J56M48
3829E59q09J599j051M11j752N24O77L23O7j786J205K48j66O39j081Q87K84m32
3847C46k97L37K41m49Q15o24q62J369j753J839j759J744J22j238o64N69J26j089
3865a227J182N09j18m97J062q81K1p4K00n1j65j79L00j61L41q0lp51N63L27n55
3886b37r8J52N38M74j505L17J77o68J341j4P18j132K58j363j74k07O63P21l85
3905d24M88k99l98J300k05m03j3L67L9r21P48n42N54q39J881k556P86L8m17P79
$$ plain form
3925 -37 -96 552 -1260 -11 -645 -572 1086 -543 265 204 -534 272 246 724 -244 -526 -138 407 922 -595
3945 -595 54 -473 -256 -566 -165 350 -215 -174 -331 54 -584 -28 -136 419 236 110 -227 302 -882 -142
3965 -142 -613 69 -543 -706 1281 -334 698 191 -385 -818 -911 316 123 525 -152 46 -475 134 611
3984 611 -557 1253 -22 290 690 -387 452 -845 677 302 21 436 -249 -646 -26 525 -915 6
4002 6 340 -842 501 676 -871 253 43 -8 -458 645 -374 354 -305 -794 1328 -841 260 -923
4020 -923 -433 841 -809 1252 602 -29 -1026 326 -250 -253 -477 97 45 -58 -303 -341 441 -160 -1930 454
4040 454 174 -19 329 -391 652 -285 1723 -303 -77 -3 96 -391 -559 697 -609 -423 255 -229 174
4059 174 -900 1009 177 -364 1090 -770 -1051 -385 467 -483 495 2 -149 -137 -151 -288 -291 245 853 314
$$ packed form
3925c7n9O48j812J249o34P3J658j629Q08o1p38Q06k6M78r68k82L88N45N15j517
3945e95O49n27K17l10M01N15n65M1j57L85o38N56j08N55j83j26l37N29j184P40
3965a42m71O82o12j63J987j615J032n07n76m33r3J227j93M02o77J98n21O09M77
3984F11j168J810j275L12M00j077Q39j297J522l75k81M15o85l97O20N51j440R21
4002FL34j182J343J75j547J124k10n1m50J103j019P28o59m89K122k169J101j183
4020i23M90J274j650K061o50o31r97J352n76lk24N74n2j03k45l8P82o01j770K384
4040D54k80j93L48p20J043r37K008k026K26P4R9m87j68J256j306J86O78m84M03
4059A74j074J909q32n41J454j860k81O66Q52r50R78m93j51J2j4j37lN36O08n39
$$ plain form
4079 314 477 -171 -396 536 -416 1137 552 -66 -657 597 65 -591 591 603 1011 -251 940 -89
4097 -89 -76 225 -273 643 -610 171 293 -1275 -237 -756 -130 469 538 -660 -1108 995 -636 -269 -1166
4116 -1166 216 840 38 836 -1654 -58 -25 -112 502 118 699 734 -135 -990 -529 880 687 -134 -237
4135 -237 731 73 42 1264 -759 185 637 -233 1274 -496 720 -333 1609 674 197 1624 425
4152 425 951 -475 -167 -341 -457 -990 -944 -235 -161 872 -1743 856 1160 -1087 -324 1144 156 94 95 -22
4172 -22 492 70 318 -1313 -161 -1257 716 -834 515 -568 -114 113 -1027 -10 -831 -433 1007
4189 1007 742 -515 142 269 559 162 -186 174 -994 -1548 461 248 310 266 164 -367 -723 -291 -953
4208 -953 45 -571 108 4 -31 580 194 411 -321 257 833 -1477 1342 159 -431 952 189 642 -966
$$ packed form
4079C14J63o48k25R32r52J553n85o18n91J254n32o56J182J2M08j262J191j029
4097h9J3L01m98R16j253P81J22j568J038n19O26N99O9j198m48K103j631L67q97
4116a166J382O24q02P98k490J596L3q7O14l84N81L5q69q55M61J409j93q21j03
4135b37R68o58l1J222k023R44M52q70J507j770J216j053J942r35m77J427j199
4152D25N26j426L08j74j16n33M6P09P4J033k615K599L04k247P63J468r88o2Jj17
4172b2N14m22K48j631J152j096J973j550J349j083M54K27j140J017q21L98J440
4189A007k65j257O57J27K90l97l48L60j168n54K009k13O2m4j02n31l56M32o62
4208i53R98o16O79j04l5O11l86K17p32N78N76k310K819j183n90J383p63M53j608
$$ plain form
4227 -966 197 -1367 65 -204 -27 -412 622 494 425 495 431 -1443 733 -771 877 -296 -429 491
4245 491 155 1133 -484 197 -519 663 -467 -750 344 -723 184 -230 283 424 -597 327 154 623
4263 623 160 -1105 156 -2005 251 -760 568 162 227 848 -53 -221 -396 41 1315 -263 1431
4280 1431 -734 -149 14 -59 -238 -569 418 -1175 1175 1297 -249 83 -138 298 -1497 334 -385 -623
4298 -623 1091 792 179 -931 -449 208 -2184 1149 -211 182 -58 780 41 239 -37 -513 -268 -1015
4316 -1015 -173 -267 -126 221 455 142 -462 -147 -501 22 1157 -1421 490 -380 -70 330 199 648 -124
4335 -124 134 -220 -422 -29 -999 53 -313 -916 -1373 85 -230 -500 390 -846 917 -523 -161 -245 202
4354 202 906 188 983 267 274 905 -667 -250 -598 -440 1424 -3 1178 -139 -235 -769 -35 123 -604
$$ packed form
4227i66J163j564J432k69J77l85J034j28o9P0o4j874K176j504J648j173j33R20
4245D91l36R78j617O81p16J182j130k83J094j067R07m14N13J41j021R24j73M69
4263F23m63j265J261k161K256j011J328m06O5O21r01j68j75M37J274j578J694
4280A431k165N85J63p3j79l31R87j593K350J22j546L32k21M36j795J831p19k38
4298f23J714k99o13j110M82O57k392L333j360L93k40Q38p39J98k76m76K45p47
4316a015Q42r4J41L47K34l13o04L15l54N23J135k578J911q70L10M00j31M49p72
4335a24K58l54k02L93r70J052l66o03m57J458l15k70Q90j236J763j440L62q4M47
4354B02P04p18P95p16PO31j572M17l48J58J864j427J181j317r6n34P34J58p27
$$ plain form
4373 -604 -154 -513 428 -55 -266 412 -393 -458 -134 366 -1314 1486 -111 -816 -691 189 -4 453 1176
4392 1176 -338 -195 789 -1550 -236 317 -21 611 -9 -671 -89 -60 -606 -1 -702 -193 68 -894 356
4411 356 -1118 13 339 -309 669 711 -232 931 961 -539 -1265 261 -1052 536 643 -949 271 -926
4429 -926 341 125 169 352 -806 432 -512 -275 301 263 -195 -843 -195 -428 554 -5 525 187 25 871
4449 871 -379 522 734 -67 407 -79 25 -286 388 -537 -290 885 323 578 -420 54 149 94 -412 459
4469 459 432 102 168 173 -326 461 -1331 1288 -343 -84 196 -237 182 414 286 -1410 427 1823 268
4488 268 616 118 399 -304 80 -266 -216 -405 -49 142 365 795 325 115 540 141 116 55 340 -214 -1631
4509 -1631 -124 -97 389 -487 -348 708 923 259 692 369 228 -503 273 -1032 1171 -247 -637 -170
$$ packed form
4373f04M50l59R41m83k11O78q05o5L24N00j680K800j597p05J25Q80j93M57P23
4392A176j514J43R84k339J314N53l38O32o20o62N82K9n46O05p01N09K61r62J250
4411C56j474J131L26o48R78M2r43J163L0j500p26J526j313J588J07j592J220j197
4429i26J267k16M4J83j158J238r44K37N76l8m58o48O48k33R82n59N30l38j62Q46
4449H71j250R01K12q01M74m86J04l11O74r25K47J175n62K55r98M74R5n5n06Q71
4469D59k7l30O6Nm99P87j792K619j631K59K80m33M19K32j28j696J837J396j555
4488B68L48m98K81p03L84l46N0j89L56J91K23M30m70k10M25l99k5o1K85n54j417
4509a631J507K7M86q76J39J056K15o64M33l23j41p31P76j305K203j418l90M67
$$ plain form
4527 -170 623 -30 -273 -15 426 145 -517 -638 162 -981 751 -90 316 391 -361 806 -238 -615 -141
4546 -141 -370 -216 -308 -1443 -151 183 87 -254 430 -601 1186 -289 -220 124 -574 849 -84 -241 429
4565 429 837 524 -1045 180 -1142 653 -926 -293 990 238 -224 131 256 -718 756 30 -215 1343
4583 1343 -1264 392 274 -98 139 -494 1468 -255 8 -210 -666 417 199 50 -1335 -333 166
4600 166 -264 172 -82 866 -684 130 454 -760 590 206 370 -22 -41 368 -562 -140 -164 123 -307 943
4620 943 -433 -366 930 210 11 -218 -650 -376 -247 1124 498 -192 -229 -160 -173 544 428 -709 917 -342
4640 -342 334 1160 277 405 -368 -137 -49 24 542 -166 -797 -219 -497 51 181 730 -902 -166 108 537
4660 537 -628 363 102 -1803 1069 -521 982 1653 -822 784 -667 -610 102 250 -622 -841 825
$$ packed form
4527a70P93o53k43K58M41k81o62j21Q00j143J732q41M06P5p52J167j044l77M74
4546a41k29J54r2j135J292L34r6l41O84j031J787j475O9L44o98J423r33j57O70
4565D29M08l13j569J225j322J795j579O33J283p52m62L55J25r74J474p26k45J558
4583A343k607J656j18l72K37o33J962j723K63k18m56J083k18j49j385J002M99
4600A66m30M36k54R48j550Q14L24j214J350l84J64l92j9M09r30M22k4K87m30J250
4620I43j376O7J296p20j99k29m32K74J29J371o26o90l7O9j3P17j16j137J626j259
4640c42O76Q26q83J28p73K31Q8P3N18p08o31N78k78N48J30N49j632P36K74M29
4660E37j165R91k61j905K872j590J503O71k475J606j451N7P12J48q72k19J666
$$ plain form
4677 825 -1707 1618 -659 -592 -336 -462 343 -198 1130 150 1668 -287 -200 579 -454 939 -84 148
4695 148 -69 -308 673 462 110 609 -1372 833 -174 451 74 1058 -64 -169 1270 -5 312 -730
4713 -730 -169 217 610 -470 496 -1219 -864 254 36 -1049 -511 309 116 23 -712 347 -51 403 -617
4732 -617 355 769 -151 -923 314 34 -1135 991 -78 -890 -352 324 1669 81 -593 -133 333 822
4750 822 -1202 10 -895 784 -450 -411 982 -714 730 -793 386 -338 369 -600 558 -98 -1
4767 -1 191 12 -403 278 -28 383 390 -1067 -746 -993 255 -952 -449 -967 949 481 -25 546 -543 394
4787 394 -751 -529 -220 66 44 -640 435 894 387 -853 -539 -183 -121 460 556 -233 153 -519 1048 408
4807 408 -122 168 -1096 280 -202 809 684 -347 129 -414 104 -551 105 -1054 -153 -218 664 528 21
$$ packed form
4677H25k532L325k277O7K56j26Q05n41J328r80J518j955Q7P79j033J393j023K32
4695A48k17k39R81k11l52M99j981K205j007O25l77R84j122j05J439j275L17j042
4713g30N61L86L93j080R66j715L55J118k18j085N38Q20j93r3p35J059l98M54j020
4732f17R72M14r20p72J237k80j169K126j069q12N38O76J345j588o74M60M66M89
4750H22k024J212r05J679j234L9J393j696J444j523J179p24P07r69J158o56R7
4767aJ92j79m15O81l06M11Pj457L21k47J248j207N03n18J916m68n06N71j089R37
4787C94j145K22L09K86k2o84J075M59n07j240L14L56O2N81R6p89L86o72J567o40
4807D08n30K90j264J376m82J011j25j031M76n43N18o55O56j159R01o5Q82j36n07
$$ plain form
4826 21 2132 14 227 601 -54 462 -179 487 567 403 -376 308 650 496 1092 189 -369 801 -109 906
4846 906 -78 276 154 -228 -333 -1005 1438 965 -70 -143 1139 -1071 -132 73 -71 -470 -256 148 1548
4865 1548 242 -1 -1069 821 -37 875 -256 -1270 -30 -1214 215 -24 -931 1371 -973 879
4881 879 647 504 -314 -639 735 86 755 100 -216 469 923 182 -615 -616 82 -1129 523 -398 -564 -714
4901 -714 970 100 -453 -83 -181 -459 395 162 -799 -257 -817 -19 355 629 -395 -55 -1370 992 -533
4920 -533 252 201 1202 680 -681 -41 226 -245 103 -185 647 102 579 855 558 543 364 -15 -323 387
4940 387 -608 568 1225 400 236 -67 532 -553 317 358 -843 662 -741 1177 -551 -479 -540 -514 -796
4959 -796 -336 -111 -644 1303 1121 -273 916 -879 578 -1069 -204 422 201 605 -228 817 387 349
$$ packed form
4826B1K111k118K13L74o55N16o41O66Q0j64p79O84L42j54N96r03n58J170r10J015
4846I06r84L54j22l82j05o72K443m73j035p3J282k210R39K05j44l99K14M04J400
4865A548j306k43j068J890q58R12j131j014J240j184J429k39r07K302k344J852
4881H79k32j43q18l25J374o49O69o55l16O85M54p41p97jO98j211J652r21j66j50
4901g14J684q70n53L70r8k78Q54k33r61N42n60P98L74K74j024L40j315K362j525
4920e33P85n1J001n22j361O40K67m71L48k88Q32n45M77K76k97j5j79l79l08P10
4940C87r95J176O57q25j64l03N99j085Q70M1j201J505j403J918j728P2o1K6k82
4959g96M60K25n33J947j82j394J189j795J457j647Q65O26k21M04q33J045m30l8
$$ plain form
4977 349 900 62 202 -753 -684 539 -487 41 -330 776 -330 -83 336 -422 -667 -333 386 -721 247
4996 247 155 -12 -716 -667 634 -898 302 -2 -81 318 -309 -13 -531 -262 -1025 -312 -331 -713 665 -29
5016 -29 -8 41 -700 1431 558 809 -474 -898 1137 -412 1172 121 814 -271 45 166 -546 165 -177
5035 -177 -55 -1287 -661 672 -460 167 -45 215 194 -7 -421 -171 -250 -166 98 -9 -798 237 -290 -505
5055 -505 -991 113 1032 49 450 -1014 1369 -315 309 -176 -403 96 -325 854 -1179 946 254 -1652
5073 -1652 -431 -1138 68 470 30 740 -340 264 375 -514 100 -132 -761 -437 156 -1074 785 -590
5091 -590 602 1269 486 56 -621 -405 -1152 -270 898 789 154 459 -9 76 826 381 325 1346 -251
5110 -251 443 231 -999 703 669 692 -333 388 120 -222 -230 -1196 269 86 139 -752 431 182 432 710
$$ packed form
4977C49N51q38J40r55O9J223j026N28l71J106j106K47M19p58k45L34P19j107R68
4996B47r2j67p04M9J301j532J200l04p9L99o27K96n18K69p63P13j9l82J378o94
5016b9K1M9p41K131q73K51j283m24K035j549J584j051O93j085L16J21p12P11l42
5035a77J22j232O26J333j132O27k12K60k1k01m14K50p9Q4K64j07p89J035n27k15
5055e05m86J104R19r83M01j464K383j684O24m85k27M99m21J179k033K125o92j906
5073a652J221p07J206M02m40P10j080O04J11q89O14k32o29L24N93j230J859j375
5091e90J192O67p83m30o77K16p47Q82J168j09o35L05m68Q5P50m45n6J021j597
5110b51O94k12j230J702l4K3j025P21k68l42qr66J465j83N3q91J183k49K50K78
$$ plain form
5130 710 265 -431 1235 -435 602 -445 716 -874 -255 -303 164 716 -111 133 -88 -378 -665 -262
5148 -262 1309 306 7 411 3 1013 -258 -550 -942 -212 321 -156 -593 -1048 -19 -525 -493 -249 382
5167 382 -349 273 -407 -1045 -208 406 -1253 -834 -466 941 -283 -447 -580 -251 1093 -269 -576 -792
5185 -792 520 -428 -1091 443 -469 -372 519 847 -513 -307 64 -439 -179 719 -871 259 -924 171
5203 171 -203 -108 642 720 626 -98 689 -1201 -970 836 -41 -387 -522 121 292 1141 -1087 82 867 -430
5223 -430 705 252 1015 529 1057 999 -719 77 -11 -588 -35 -286 598 -261 525 -196 157 377 -101 661
5243 661 85 -1102 1046 179 616 -280 1348 -432 -914 -301 -571 826 -730 259 -612 -545 -67 624
5261 624 755 -1825 730 857 834 599 776 268 546 -88 751 726 1108 -827 -378 -607 826 -1112 -985
$$ packed form
5130G10m45o96J666j670J037j047J161j590O19m8M67N52q27K44k21k90k87M03
5148b62J571j003k99M04m08J010j271k92l92P30N33m77m37m55J029n06L2K44O31
5167C82p31O22o80o38Q37O14j659M19L68J407j224j64j33L29J344j362l07k16
5185g92J312r48o63J534r12R7Q91L28j360K06L71n03K60Q98j590J130j183J095
5203A71l74R5P50P8r4p24P87j890K31J806q77l46j35O43J71Q49k228J169P85j297
5223d30J135m53P63m86N28n8j718P96q8n77N53k51Q84q59P86p21L53K20m78P62
5243F61n76j187K148q67M37q96J628j780m82O13k70J397j556R89q71O7M78O91
5261F24J31k580K555J27k3k35J77n08K78o34Q39k5L82j935M49k29J433j938J27
$$ plain form
5280 -985 -213 -894 3 -527 259 -1293 474 -191 334 416 -743 -163 -123 -45 696 21 -364 -1196 941 -1242
5300 -1242 532 313 -402 1312 239 50 -685 -568 611 -296 418 -134 -923 260 -1055 1018 -795
5317 -795 457 321 -601 350 -95 1041 222 276 4 -590 546 -123 9 -1012 767 -92 -832 -41 -311
5336 -311 -12 -27 141 -631 -182 1211 -193 870 142 837 271 421 -640 -985 -60 387 -511 884 -433
5355 -433 402 -1100 3 25 -196 -46 -37 -42 -498 -863 90 -18 -21 -721 451 99 47 -1329 125 321 -969
5376 -969 664 -259 244 549 907 351 -60 545 264 951 424 -209 163 -225 619 999 -302 -972 716
5395 716 238 -830 591 184 659 -425 -395 1607 304 6 -34 -149 325 -257 611 -186 236 -969 -181
5414 -181 -271 -608 990 -551 888 -448 -686 -523 -772 590 -81 395 -923 -233 -315 -222 241 -404 81
$$ packed form
5280i85P72o81Q97n30P86j552J767o65N25Q2j159N80M0P8P41o75l85q32K137k183
5300a242J774k19p15J714j073j89p35J17J179r07P14n52p89J183j315K073j813
5317g95J252j36r22R51m45J136q19N4k72n94J136o69J32j021J779q59p40P91k70
5336c11K99j5J68p72M49J393j404J063p28O95n66J50j061l45R25M47q98J395j317
5355d33Q35j502J103K2k21J50Rnm56l65R53j08lp00J172l52n2j376J454J96j290
5376i69J633r23N03L05L58n56m11O05k81O87n27o33L72l88Q44L80j301o70J688
5395G16m78j068J421m07M75j084L0K002j303k98m0j15M74n82Q68p97M22j205P88
5414a81r0l37J598j541J439j336k38J63k49J362o71M76j318O90q2R3M63o45M85
$$ plain form
5433 81 -238 -202 -411 -551 899 572 755 -483 -827 -259 361 389 -1030 134 657 -447 -199 -1080 -99
5452 -99 -433 -415 -591 -221 -246 -1270 847 -117 1088 325 832 376 -913 531 -1279 -363 164 -163 253
5471 253 -615 728 -660 -66 -1534 -221 916 9 849 -95 -834 46 562 -225 -526 1030 -587 226
5489 226 330 296 679 -58 -660 3 138 447 1965 1301 -557 329 134 -524 -105 -558 661 -551 169
5508 169 266 -302 730 227 487 -387 676 755 -399 486 -637 651 -278 485 -237 369 176 -397 770
5527 770 416 15 1561 162 -616 -1059 990 -345 423 752 -291 988 -854 58 598 406 568 -123
5545 -123 718 -926 -483 -1323 -465 531 -44 1743 -654 1376 15 54 205 -593 18 451 396 431 -906
5564 -906 -605 -19 1049 -1177 -17 542 -585 -10 -338 334 216 -613 -116 -665 59 689 38 383 1125
$$ packed form
5433H1l19L6k09j40J450l27J83j238l44N68O20K8j419J164N23j104K48q81R81
5452i9l34J8j76L70k5j024K117r64J205p63N07m56j289J444j810R16N27l27M16
5471B53q68J343j388N94j468J313J137r07Q40r44p39Q80N16p87l01J556j617Q13
5489B26J04l4L83p37o02O63J35L09J518o64j858Q86j95o58M19m53J219j212P20
5508A69R7n68J032n03K60q74J063P9j154Q85j123J288r29P63p22O06j93n73J167
5527G70l54m01J546j399p78m43K049j335P68L29j043J279j842R12N40j92J62o91
5545a23Q41j644M43q40Q58R96n75J787k397K030j361L9J51p98O11M33n5L5j337
5564i06L01N86J068k226J160N59j127N75l28O72j18q29M97n49P24O30o51L45P42
$$ plain form
5583 1125 -214 -737 -118 93 1935 -563 -508 433 -92 495 -407 82 145 321 850 545 107 -50 673
5602 673 832 272 393 -201 510 -393 107 101 -978 1020 -47 731 -5 401 313 -79 -49 -445 -467 -345 -59
5623 -59 22 499 598 718 -30 425 63 -56 -354 1299 -728 73 1085 -561 272 -226 1145 -497 156
5642 156 622 -142 519 -802 1023 36 -670 -96 477 672 -2 1527 -166 270 -296 -685 -347 41 223
5661 223 -32 -33 285 60 372 44 1214 478 -156 -220 -54 82 -92 -128 -41 192 -679 -34 48 -149 762 -512
5683 -512 433 182 -1504 -105 -408 -316 -521 180 854 133 -754 -238 572 110 49 -874 -318 397 -559 -155
5703 -155 -196 235 99 86 487 92 -373 -676 -32 -183 -352 728 -66 174 203 530 51 8 -207 -347 -497
5724 -497 -657 -334 963 -653 610 50 -682 395 693 753 -1330 -187 96 419 -869 -1230 1028 236
$$ packed form
5583A125j339n23O19K11J842k498N5R41n25N87r02M89O3J76N29l05m38j57P23
5602F73J59n60J21n94P11r03N00oj079J998j067P78p36M06q8l92L0l96k2J22K86
5623e9Q1M77R9J20p48M55l62j19k98J653k027Q01J012j646Q33m98J371j642O53
5642A56M66p64O61j321J825r87p06N74N73J95o74J529j693M36n66l89L38L88J82
5661B23k55jL18k25L12l28J170p36o34o4J66J36j74l6Q7K33q71O45Q2j97R11j274
5683e12R45k51j686J399l03R2k05P01O74p21q87N16Q10m62o1r23N56P15r56M04
5703a55m1M31j36j3M01l95m65l03O44j51j69J080p94K40K9L27m79m3k15j40j50
5724d97j60L23J297j616J263n60p32J077K98O0k083J143K83L23j288l61K258p92
$$ plain form
5742 236 14 3 -64 -45 341 -54 -711 167 -633 130 136 -437 422 -293 -107 509 230 -704 -400 541 -164 1115
5764 1115 490 649 -374 -330 94 15 -96 328 -285 730 346 393 982 584 380 -388 405 -632 -252 -501
5784 -501 381 554 -148 355 33 -420 -35 -1327 114 -746 258 213 1417 147 175 247 130 394 -1274
5803 -1274 239 147 650 134 -312 814 -276 204 524 -855 861 -340 717 -872 144 476 -583
5820 -583 686 -1081 668 834 1215 -2 -1585 220 -22 -499 -740 216 -151 -249 273 -699 -87 -305
5838 -305 143 -536 277 192 -459 625 -277 17 122 -448 342 -844 8 -489 86 1054 559 522 -943 710
5858 710 -835 -271 256 -1087 614 -323 1265 -385 -1206 984 -542 -74 -383 393 469 154 361 -255
5876 -255 -687 513 46 -888 -1240 491 -712 -153 840 159 874 -731 -73 -1397 1254 81 449 -390
$$ packed form
5742B36k22j1o7J9L86l95o57Q78q00P63On73Q59p15J86O16k79r34L04R41p05J279
5764A115o25J59j023M4M24p9j11M24o13J015l84M7N89l98k04p68P93j037L80k49
5784e01Q82J73p02N03l22m53L85j292J441q60J004m5J204j270K8P2j17K64j668
5803a274J513r2N03n16m46J126j090M80L20j379J716j201J057j589J016L32j059
5820e83J269j767J749J66L81j217j583J805k42m77k41R56l67r8N22r72O12k18
5838c05M48o79Q13q5o51J084r02K94J05n70P90j186Q52m97N75R68m95l7j465J653
5858G10j545N64N27j343J701r37J588j650q21K190j526M68l09P76P6l15K07o16
5876b55m32J200m67r34l52J731j203N59R93o81P15j605O58j324K651j173L68q39
$$ plain form
5894 -390 -1331 1946 -603 -94 -253 -477 743 -286 1129 -1011 890 -336 440 124 691 -199 -1102
5911 -1102 -107 77 683 914 -1225 -372 -178 178 482 -213 1362 -405 1016 -403 354 1008 -1092 250
5929 250 -60 327 -603 -285 -27 -1240 696 831 255 -46 -1278 603 -241 197 558 -514 88 -169
5947 -169 508 -439 -551 -344 -203 -261 79 797 174 5 -1234 548 336 63 496 -292 801 -167 595
5966 595 248 -793 -391 -1833 1102 107 1207 3 244 149 226 735 -763 254 254 -1166 882 -240
5984 -240 -73 -277 544 7 -923 -304 285 57 -542 -944 945 -28 -756 -485 619 466 -36 1201 -255
6003 -255 424 -1080 359 -410 44 -368 7 868 -443 386 184 -1577 -8 -1313 235 -161 -349 1161
6021 1161 -698 254 -227 348 -635 -640 613 69 957 -1307 237 82 -252 -2 -745 1393 -1413 705
$$ packed form
5894c90r41L277k549N09j59k24J220j029J415k140J901j226P76l16N67q90r03
5911a102R95J84O06K31k139Q53J94L56L04o95J575j767J421j419P57O54k100J342
5929B50l10L87r30L18K58j213J936J35n76l01j232J881q44M38L61j072O02k57
5947a69O77r47j12K07J41n8L40P18o23j69j239J782k12k73M33p88J093r68P62
5966E95l47j041M02j442K935r95J100j204K41r5P7N09j498J017%j420K048j122
5984b40J67k04Q21n37r30O19N89k28n99m02J889r73p28K71J104j53n02J237j456
6003b55O79j504J439p69M54m12L75Q61j311Q29k02j761J569j305J548l96j88J510
6021A161j859R52m81N75r83nJ253n44Q88k264J544j55l34K50p43K138k806K118
$$ plain form
6039 705 241 31 582 480 843 -1207 -40 184 -430 -294 515 -173 -252 593 445 357 863 -67 -456 157
6059 157 145 81 -1253 -956 -700 180 -235 -620 -148 -198 -372 -567 639 -317 360 -525 721 -576 -316 591
6079 591 160 -154 432 -986 -151 -923 -182 475 -374 197 -776 1294 -132 782 36 -202 166 -924 -809
6098 -809 -111 -150 -468 -642 -690 271 -209 -948 -378 -261 -163 617 1341 673 -492 1026 708 -792 795 -892
6118 -892 143 -799 53 170 -708 1257 180 615 -448 344 246 -1 256 -536 34 128 533 -907 623
6137 623 137 -1316 -572 190 -202 -517 935 556 460 -245 937 -99 100 -788 949 -160 264 -239
6155 -239 -1306 -90 221 -27 779 -831 406 478 -1085 -973 -62 68 118 978 451 -150 13 -160 -305
6174 -305 -232 533 -203 583 446 1008 -545 -471 996 40 766 92 -1246 1101 -803 371 -415 150 767
$$ packed form
6039G05m64k10N51j02L63k050J167K24o14J36Q09o88p9Q45j48q8N06r30l89O13
6059A57j2o4j334K97K56Q80m15l85M72n0j74j95J206r56O77q85J246j297K60R07
6079E91m31l14N86j418Q35p72P41O57q49N71r73K070j426R14p46k38L68j090J15
6098h09O98l9l18j74m8R61m80p39N70J17R8P80P24o68j165J518l18j500J587j687
6118h92J035r42Q52J17q78J965j077M35j063P92r8k47K57p92N70R4M05j440J530
6137F23m86j453P44P62l92l15J452l79r6p05J182j036J99q88J737j109M24n03
6155b39j067J216L11k48Q06j610J237P2j563J12R11J30N0Q60n27o01J63j73j45
6174c05P3P65p36P86j37N62j553P4J467r56P26o74j338K347j904J174p86N65O17
$$ plain form
6193 767 521 430 -94 338 371 305 233 418 -260 -322 612 894 -1038 -121 86 66 1317 1004 985 -97 302
6214 302 32 -614 -303 -346 -1379 -128 -475 420 444 143 366 -443 901 -112 -673 524 -525 607
6232 607 181 1248 883 -814 -787 -431 507 -225 -181 117 -56 -354 -1626 -215 -332 229 -89 -73 208 494
6252 494 185 -387 716 259 476 536 -358 144 -842 544 -341 -604 975 365 623 -362 -101 -295 -26
6271 -26 -373 -125 925 -146 567 -508 93 858 -970 -652 -41 -1071 532 -377 628 14 -488 662
6289 662 282 752 612 -5 -157 504 734 -252 43 -722 -646 312 -313 849 -288 -175 -183 746 156 234 -329
6310 -329 -161 -157 -532 -118 160 -479 -303 -90 722 242 193 -259 -568 -288 162 1434 -190 426 -342 445
6330 445 837 677 438 -835 675 -179 90 -505 -654 -184 586 466 119 386 -1254 95 424 426 1080
$$ packed form
6193G67k46r1n24M32L3o6p2J85o78o2R34K82j932R17K07k0J251l13j9j082L99
6214C02k70o46L11m3j033J251l47Q95K4l01K23q09J344j013n61J197j049J132
6232F07m26J067l65j697K7L56R38p32M4K98j73k98j272J411j17N61l18J6K81K86
6252D94l09n72J103m57K17O0q94N02r86J386q85k63J579o10K58r85K61j94K69
6271b6l47K48J050j071P13j075O01P65j828L18O11j030J603r09J005o14n02J150
6289F62l80M70j40o17j52O61K30r86K95p65P6R58o25J162j137J13qR29n90P8n63
6310c29J68Ml75M14K78o39J76K13Q12m80m9m52l09K80M50J272j624O16p68P87
6330D45L92j60k39j273J510q54K69n95j49M70P70j20l47K67j640J349L29KO54
$$ plain form
6349 1080 367 -942 125 -1095 289 952 530 -64 -1102 -721 -680 140 -92 589 484 700 381 -261
6367 -261 -11 92 19 -794 322 -220 -1219 -969 -16 -225 36 -1236 -627 -1207 559 -415 -335 10 170 246
6387 246 -631 104 442 -1 279 -786 745 -1004 636 -843 -208 288 -645 1180 -166 1278 -482
6404 -482 -1193 -238 -1049 -760 1187 622 367 1046 -343 -99 -217 -1211 -654 -175 1114 -113 68 362 -216
6423 -216 -521 -192 218 1733 -163 -236 -1208 -609 455 -878 -60 209 709 1622 -869 376 -326 853
6441 853 -798 1155 496 164 -159 -1292 474 237 -379 -815 337 -151 -437 628 469 -965 561
6458 561 379 514 -70 859 168 -119 17 -184 -164 257 -88 -934 -1267 -139 -1183 312 -1372 -285 72
6477 72 -438 666 -1423 233 169 -169 220 -191 -285 166 28 -435 -220 -661 -973 829 -216 77 622
$$ packed form
6349A080p13j309J067j220J384O63m22n94j038L81M1Q20k32O81j05K16l19o42
6367b61K50J03p3q13J116n42r99K50R53k09K61j272O09n80J766r74Q0L45J60P6
6387B46q77P35L38m43K80j065J531j749J640j479O35M96r33J825j346J444j760
6404d82p11R55q11K89J947n65k55O79j389K44j18r94N57M79J289j227J81K94n78
6423b16l05L29M10J515j896p3r72N99J064j333Q18K69N00R13k491J245p02J179
6441H53j651J953o59l32l23j133J766k37o16m36J152m88k86J065j59j434J526
6458E61j82J35n84R29o91k87J36k01K0M21l45q46l33J128j044J495j684J087L57
6477G2n10J104k089J656o4l38L89m11r4M51j38m63K15m41l12J802j045K93N45
$$ plain form
6496 622 -398 -30 -766 -206 -425 370 -642 805 -322 1322 -842 -290 1293 -482 -875 -127 -198 1093
6514 1093 -338 -1095 -32 -81 358 163 345 -795 -553 -38 904 513 -35 277 -783 -8 53 -8 328
6533 328 419 173 -737 1243 -577 -191 -371 -1731 -231 233 -17 236 -957 74 -1153 -187 1004 379
6551 379 257 -72 48 -476 -563 275 -457 -103 -580 204 299 -536 482 -1276 608 -458 864 -377 542
6570 542 249 -273 963 -340 742 -55 -710 651 893 -622 -158 541 -1258 -102 -700 -643 1140 -263
6588 -263 729 224 702 639 632 280 -767 946 -1051 1103 -585 -252 381 -385 -88 -1200 -10 -453 -254
6607 -254 99 -117 329 -547 29 -139 -171 381 -592 1080 -193 198 -229 -169 245 -1268 510 -894 -32
6626 -32 -605 -1028 142 172 -519 -728 -175 119 -477 291 -594 486 65 -721 682 -729 507 -259 154
$$ packed form
6496F22j020L68p36N60k19P95j012J447j127J644k164N52J583j775l93P48p1J291
6514A093j431p57J063m9M39j95J82j140K42N15R42l91n48L12j060P75O1o1L36
6533C28R1k46r10J980j820L86j80j360J500M64k50K53j193J031j227R66J191o25
6551C79j22l29J20n24q7Q38p32L54m77P84R5q35J018j758J884j066J322j241R19
6570E42k93n22J236j303J082p97o55J361K42j515M64O99j799J156n98N7J783j403
6588b63R92n05M78o3pl52j047J713j997K154j688L33O33p66K97j112J190m43J99
6607b54L53k16M46q76N76j68l2N52r73J672j273L91m27O0M14j513J778j404Q62
6626c2n73m23J170L0o91k09N53K94n96P68q85J080m21p86J403j411J236p66M13
$$ plain form
6645 154 -371 207 -153 442 -10 381 827 271 -1043 729 -104 852 -932 -818 -658 -629 645 -1606 799
6664 799 -6 278 178 201 -173 -21 282 533 602 -50 -506 903 -575 -147 -1306 -438 890 -670 1043
6683 1043 -1466 184 -394 148 -80 -222 448 -298 -185 -347 -236 1632 -1147 548 -730 -169 511 -1450
6701 -1450 -144 -432 861 260 -322 -832 110 484 -239 1076 -1272 252 -242 -325 929 -1110 686
6718 686 -370 518 264 854 -451 -623 -712 631 -84 -349 -1130 -172 49 -305 -633 -280 508 879 683
6737 683 -136 1008 141 -1857 136 -302 -344 -1037 -141 784 355 1065 415 424 83 -628 725 -748 -250
6756 -250 -842 -714 388 -317 -52 138 99 -287 319 -59 264 1059 1006 990 -696 911 -4 -413 121 -53
6776 -53 834 345 -267 -309 169 277 -221 970 -150 772 1434 -669 37 -386 373 -1035 1482 437 -269
$$ packed form
6645A54n25N78l60N95m52L91M46n56j314J772q33R56j784J14J60K9J274k251K405
6664G99q05K84j00K3l74J52L03K51O9o52m56J409j478M28j159Q68J328j560J713
6683A043k509J650n78N42k28j42O70p46J13j62J11J868k779J695j278N61O80j961
6701a450J306k88J293o01n82n10R42L74p23J315k348J524m94q3J254k039J796
6718F86j056Q88k54N90j305j72q9J343p15k65p81R58K21l54l28L53P88L71j96
6737F83q19J144q67j998J993m38m2o93Q96R25m29P10o50Rl41p11J353j473M98
6756b50n92J28J102p05K65J90l9l86O06l78L23P95n3j6j686J607r15m09N34j74
6776e3Q87m89o12m2M78J08m98J191j120R22O62k103P06m23P59j408K517j045p06
$$ plain form
6795 -269 -117 -249 956 1168 -315 -107 1460 -204 -779 1111 535 683 -21 -1308 -413 -204 401 394 296
6814 296 -323 -1335 -65 740 -369 -27 468 842 -676 653 290 441 466 691 -411 -361 -30 -295 904
6833 904 -1006 -701 -69 -589 211 29 160 -702 -1123 -124 259 -46 -275 -405 -278 -97 502 -276 -9 -271
6853 -271 -303 -114 -1333 233 -154 1019 -952 -452 1083 -256 153 -1202 -200 -960 304 -1261 -979
6870 -979 1066 -428 616 22 -1105 52 364 1419 -608 -625 -455 -807 704 -603 14 -319 628
6887 628 -121 644 1144 -572 870 262 119 91 -21 -1190 -1000 163 -705 561 -85 -1223 225 -1184
6905 -1184 243 -251 589 606 -498 912 1247 1781 225 441 403 -766 -232 327 771 -828 570 -619
6923 -619 -1348 397 -263 -1013 87 71 158 -520 480 -1243 -449 48 -344 768 348 -331 440 423 136
$$ packed form
6795b69J52j32J205K12j483K08J567j664n75J890n76J48p04j287Q95K09O05pr8
6814B96o19j012J270Q05j109L42M95L74j518J329l63J51K5K25j102N0L31k65J199
6833I04j910L05O32n20Q00j82J31q62m21R99L83l05k29j30J27J81N99p78K67k62
6853b71l2J89j219J566l87J173j971N00J535j339M09j355J002p60J264j565K82
6870i79K045j494J044n94j127J157L12J055k027j7J70l52J511j307O17l33R47
6887F28p49P65N00j716J442o08j43k8j12j169J90J163q68J266o46j138J448j409
6905a184J427m94Q40J7j104J410L35N34j556K16l8j169N34N59M44j599J398j189
6923f19p29J745o60p50J100j6Q7o78J000j723P94M97l92J112m20o79P71j7k87
$$ plain form
6942 136 -1031 -9 -391 -424 -446 -347 -372 583 446 -512 10 1024 166 813 420 -435 -367 -134 -249 -118 -313
6963 -313 -755 882 -201 -49 -464 119 74 -280 246 -873 -616 -641 310 672 -338 896 -284 170 -533
6982 -533 78 1476 -614 1206 510 -303 -142 410 99 -347 18 -582 643 -807 -457 205 -687 587
7000 587 -61 -552 205 -344 1746 -905 604 475 58 397 134 1010 489 710 -871 703 240 85
7018 85 320 194 577 176 160 -129 -409 759 -1659 -681 172 324 521 -672 658 -853 937 -783
7036 -783 -870 482 -1058 1358 365 -114 193 -555 644 -168 257 -158 273 69 582 1069 -1006 323
7054 323 -1285 850 1067 -461 438 117 590 -737 384 -307 -70 532 286 980 -135 -211 250 -292
7072 -292 1212 257 340 -254 640 564 -134 1513 -1077 563 -208 392 805 229 970 474 1058 -181 478
$$ packed form
6942A36j167J022l82l3k2R9k5R55j37r58N22J014q58O47l93q55O8K33j15J31j95
6963c13m42J637j083J52m15N83m5l54N26j119K57k5R51L62j010J234j180M54p03
6982e33O11J398k090J820o96q13J61N52l11m46L65o00J225j450L50O62q92J274
7000E87o48m91P57n49K090k651J509j29m17L39k63Q76n21K21j581J574m63j55
7018H5K35j26L83m01j6k89k80J168k418R78Q53J52J97j193J330j511J790j720
7036g83q7J352j540K416r93m79L07p48J199q12M25m15M31k04N13M87k075J329
7054C23j608K135K17j528Q99l21M73j327J121o91K37O02k46O94j115p6M61n42
7072b92J504r55Q3n94Q94p6o98J647k590J640p71O00M13n76P41m96N84j239O59
$$ plain form
7091 478 135 162 -290 -160 275 103 431 385 222 530 -692 380 -481 -431 707 414 810 -452 265 -693
7111 -693 -193 -311 -186 -118 66 -633 -43 97 -382 -264 798 271 -441 -459 -810 433 -1309 -756 -473 -109
7131 -109 319 -447 320 794 -201 -741 -354 636 -267 780 710 -388 530 -289 -992 -108 71 892 450 268
7151 268 -188 515 -872 467 -651 892 -736 -886 157 -1320 460 -35 345 -737 39 435 -830
7168 -830 1008 -100 175 -58 -1645 531 -966 8 730 -96 -89 -1596 185 -81 1254 -355 -1124 964
7186 964 -721 358 -994 1438 -649 -824 781 -160 65 -508 665 -293 459 1660 18 194 164
7203 164 654 -860 -1015 -324 -1077 145 -253 -20 213 -98 -569 -1129 515 -960 104 -633 -679 -124 478
7222 478 485 -674 216 101 152 1152 301 -338 -390 797 448 -62 701 -485 635 -215 -154 388 -565 449
$$ packed form
7091D78l43K7m52J30M35j72L28m6j63L08j222J072q61N0J138k93L96j262P17r58
7111f93N00j18J25O8J84o99N90J40m79J18J062n27p12j8l51J243j742N53K83L64
7131a09M28p66P67M74r95n40L87R90r03J047p0j098R18q19p03Q84J79Q21m42j82
7151B68m56P03j387J339j118J543j628j50J043j477J780m95L80j082P76L96j265
7168h30J838j108K75k33j587K176j497R74P22q26Pj507J781k66J335j609p69K088
7186I64j685J079j352K432k087j75J605r41K25n73J173r58P52J201j642J76l0
7203A64M90j514j55O91p53J222l98K33K33l11m71n60J644j475J064p37m6N55O02
7222D78Pj159Q90j15N1J000q51o39n2J187l49n10P63j186J120q50O1N42r53J014
$$ plain form
7242 449 -833 -730 -1203 237 213 -347 748 -82 675 161 -364 -50 -523 256 -384 604 372 623 -185
7261 -185 120 12 -1385 -507 471 -113 390 -905 681 515 -1128 454 112 216 776 619 -142 144
7279 144 -292 -143 1078 448 689 237 762 1326 -490 865 -363 610 -189 204 1388 426 791 217
7297 217 -276 1439 662 -207 48 316 -1214 -221 611 23 395 -1202 -105 113 -700 -79 -684 366
7315 366 -249 127 -253 -121 54 -1087 413 864 1011 840 -508 -221 -850 63 -271 -184 130 -253 -495
7334 -495 -556 541 -868 1228 146 -186 -458 -179 967 -512 350 708 402 762 -823 -29 -101 249
7352 249 436 -948 638 -686 -312 76 574 423 804 774 532 -47 -268 197 64 -870 -566 201 689
7371 689 -69 -722 386 -388 380 237 639 49 -499 495 472 608 -284 993 -811 15 269 -502 -439 -227
$$ packed form
7242D49j282J03m73J440k4n60J095q30P57n14n25L14m73P79o40R88k32K51q08
7261a85L05j08j397Q78R78n84N03j295J586j66j643J582l42J04N60j57p61K86
7279A44m36J49J221o30K41m52N25N64j816J355j228R73p99L93J184r62L65n74
7297B17m93J715p77q69K55K68j530R93Q32n88L72j597J097K18q13O21o05J050
7315C66o15L76l80J32J75j141J500M51J47j71j348K87o29R13l34Q7L14l83k42
7334d95o1J097j409K096j082l32k72K79J146j479Q62L58l06L60j585P94p2L50
7352B49J87j384J586j324L74L88M98j51L81l0k42n79k21M65j33r34L04P67M88
7371F89p58o53J108p74P68j43M02n90n48R94k3J36q92J277j804Q26K54p71O3K12
$$ plain form
7391 -227 306 -114 472 -492 -742 -1284 -305 -456 -34 -173 748 -829 -258 -994 453 -296 -442 -174 -718
7410 -718 329 -303 -300 343 -1172 -38 567 1194 -497 -395 579 -36 25 -215 -215 6 187 -881 -496 1073
7430 1073 -280 234 -593 -922 384 -1077 -385 23 13 -60 7 314 -409 58 283 -281 27 749 127 -1336
7450 -1336 990 628 -1139 -528 -727 -180 8 221 -527 -137 784 1437 1746 645 -301 -1035 -1749 621
7468 621 484 -142 -1183 756 199 449 688 -171 919 247 -371 474 -266 -98 266 119 303 523 603
7487 603 -1338 -378 215 697 -319 -10 -637 485 419 244 48 -941 584 108 353 545 -864 -459 -654
7506 -654 -218 -389 606 -255 -53 178 -1441 1007 -658 171 1114 588 491 645 -12 414 -1134 430 -410
7525 -410 248 410 -189 -2 -896 1116 -1651 -244 -126 949 665 -492 365 -1614 -787 1220 -609
$$ packed form
7391b27N33m20N86r64k50n42R79j51M22j39R21j577N71p36J447p49j46K68n44
7410g18J047o32LO43j515J134O05O27j691J02R74o15O1k40%K21J81j068L85J569
7430A073j353N14q27l29J306j461O92M08j0p3O7L07p23M67K25n64L08P22o22j463
7450a336K326l62j767O11j99N47J88K13p48L90R21O53L09j101r46p34p14K370
7468F21j37o26j041J939n57K50K39q59J090o72o18Q45p40J68L64j47J84K20Q0
7487F03j941R60N93M82j016L09o27J122o6j75j96r89J525m76K45J92j409M05j95
7506f54M36j71R95q61K02K31j619K448j665Q29R43n26r7J54o57M26j548J564q40
7525d10O58J62n99J87q94K012k767J407J18J075k84j157Q57j979Q27K007j829
$$ plain form
7542 -609 1433 18 881 -130 -58 -294 393 -152 -788 1203 -240 351 -93 -572 1009 -122 923 436
7560 436 -905 134 61 1023 -814 767 -830 516 1224 -881 48 -707 -368 345 -778 -741 454 1553
7578 1553 -748 -310 21 358 737 324 756 -144 600 89 60 557 302 1335 -1233 -12 -1063 -892
7596 -892 1017 -857 699 -145 -46 -14 -205 497 -711 32 -805 -163 -66 -559 1326 230 -55 -328 -414
7615 -414 -465 -734 888 508 659 453 67 1200 -1276 915 -614 132 -41 -1221 -339 523 934 -957
7633 -957 613 -537 -757 -446 -854 1015 -355 -942 -898 -908 325 -264 792 -660 -368 617 -54 513
7651 513 -520 571 162 255 515 -635 697 -422 4 53 55 424 -519 -690 -1365 -137 -307 95 -135
7670 -135 -1022 943 -271 -580 -1039 -747 -1212 -749 426 -204 48 -854 -267 796 -61 259 -395 419 -1148
$$ packed form
7542f09K042j415Q63j011P2k36O87n45o36J991j443N91m44m79J581j131J045m87
7560D36j341J039p3R62j837J581j597J346P08k105R29p55L39P13j123L7J195J099
7578A553k301M38L31L37L79m13M32r00P44n11k9M97k55J033k568J221j051J71
7596h92J909j874J556q44R9L2j91P02j208P43q37O42R7m93J885j096k85k73q6
7615d14n1k69J622l80J51k06l86J133k476K191j529P46j73j180Q82Q62M11j891
7633i57J570j150k20L11m08J869j370n87M4j0J233n89J056j452K92R85o71N67
7651E13j033J091m09R3K60j150J332j119M26M9KL69r43j71o75J228j70M02k30
7670a35q87J965j214l09m59K92m65M63J175o30K52r02N87J063q57L20o54Q14j567
$$ plain form
7689 -1148 -566 976 223 607 92 66 1187 -484 705 -766 575 104 187 761 899 498 -462 68
7707 68 59 117 1417 291 603 162 327 -39 -591 599 -579 -578 -1154 -570 964 -517 1022 -132 -71 -65
7727 -65 -127 -723 -426 187 -280 519 -597 1028 -204 129 -283 -233 20 -762 -214 70 178 550 -1569 -81
7747 -81 -863 -1226 630 -364 713 -1556 -682 429 892 -873 452 193 390 280 -529 -137 -327 -313 1122
7766 1122 -49 220 300 846 747 -387 2 -1123 327 338 -876 995 673 765 177 -394 941 -1189
7784 -1189 717 -1190 640 -1105 -110 309 360 681 -645 389 52 582 150 36 -200 -877 1082 1174
7802 1174 74 -535 -16 358 -99 751 8 -234 364 569 1023 393 -665 79 -147 -711 -302 351 317
7821 317 1085 -1108 614 -737 -1156 236 -1250 -1000 368 573 1181 -1520 729 -268 -179 637 241 745
$$ packed form
7689a148N82J542p53L84n15k6J121j671J189j471J341m71Q3N74J38m01r60N30
7707F8rN8J300j126L12m41J65l66n52J190j178Jn76N84J534j481J539j154O1O
7727f5o2n96K97O13m67P99j116J625j232L33m12N0K53p82N48K84J08L72k119J488
7747h1p82l63J856r94J077k269Q74J111M63j765J325k59J97j10q09L92j90J4J435
7766A122j171K69Q0N46r9j134L89j125J450J1j214J871l22R2n88n71J335k130
7784a189J906j907J830j745R95M19N1L21j326J034l37N30m32j14k36o77J959R2
7802A174j100o09N19L74m57Q50p43k42N98K05M54o30j058P44k26n64M09O53l4
7821C17P68k193J722j351m19J392j486K50J368K05O08k701K249r97Q9Q16l96N04
$$ plain form
7839 745 -1576 95 -1623 278 -411 -864 10 -771 1074 -625 -488 -168 -74 -227 -246 -141 -430 -249 -772
7858 -772 45 599 99 537 30 1005 703 -440 -296 -581 -52 -899 764 142 -324 1568 -1103 -506 -243
7877 -243 -953 1148 -518 428 614 146 -289 450 -140 498 351 -485 796 -472 88 720 30 -215 87
7896 87 603 1059 -875 -1167 -1178 -374 1382 -1111 626 -461 538 1 639 1033 491 909 130 287 -498
7915 -498 451 -400 -1440 906 -47 -62 -247 918 -610 -527 821 -634 1224 233 75 -35 549 -78
7933 -78 91 832 184 401 27 -628 1020 842 69 14 98 -1057 -1206 -609 -448 88 -590 85 -368 -646
7953 -646 80 662 70 -95 37 722 747 367 -855 -10 805 -206 774 -64 797 -382 376 1004 -424
7972 -424 252 375 1355 -488 562 467 -819 1114 727 -261 674 -354 -204 229 496 -644 -186 -577
$$ packed form
7839G45k321J671j718J901o89m53Q74p81J845j699J37L20R4j53j9J05k89J81n23
7858g72Q17N54n00M38n07R75l02j143J44k85N29q47J663o22m66J892k671N97K63
7877b43p10K101j666R46J86m68m35P39n90O38j47q36J281j268N60O32o90k45L02
7896H7N16M56j934k92j1Q04J756k493J737j087R99n37O38L94n42M18p79J57p85
7915d98R49q51j040K346r53j5j85J165j528Q3J348j455J858r91j58j10N84o27
7933g8J69P41o48K17l74o55J648j78p73n5Q4j155j49N97J61N36o78O75m53k78
7953f46P26N82n92j65J32O85K5l80j222Q45Q15j011R80q38Q61j179P58O28j428
7972d24O76J23R80j843J050r5j286J933l87r88R35j028J50M33K67j140M58l91
$$ plain form
7990 -577 650 275 1174 290 -187 327 -364 214 -348 -832 1387 -1127 -317 37 -350 68 -965 496
8008 496 -799 -402 -1067 -1297 803 -403 1362 -1945 1352 -660 -338 -29 -848 829 -71 -310 -1301
8025 -1301 -1143 744 -561 883 43 1496 -334 603 -452 -12 462 -898 1044 -580 -79 754 -799
8042 -799 492 612 -198 1047 348 584 -1554 908 308 -728 -225 -107 1143 -482 517 -1178 8
8059 8 67 -666 335 -653 452 -236 1138 386 -238 526 -953 7 185 -976 231 -1189 70 267
8077 267 -1149 802 -182 414 277 181 -278 322 716 -299 62 -908 537 -269 404 -22 -586 -560 -1119
8096 -1119 -159 919 146 122 -358 11 640 378 410 375 480 199 786 -692 -104 713 -751 101 -757 -106
8116 -106 -982 72 216 -564 134 182 957 24 905 5 339 165 -1023 377 295 117 70 194 52 -464
$$ packed form
7990e77J227l75Q99q84m77N14o91N78n62m84K219k514Q10L54l87M18j033J461
8008D96j295L97o65k30K100j206J765l307L297k012L22L09q19J677r00k39r91
8025a301J58J887j305J444q40J453j830R37j055M40M74j360J942j624N01Q33j553
8042g99J291J20q10J245o99K36k138K462o00j036N03J18J250j625R99j695J186
8059HN9p33J001r88J105o88J374p52o24P64j479R60J78j161J207j420J259J97
8077B67j416J951r84N96j37r6m59O00L94j015L61r70J445q06O73m26n64K6n59
8096a119R60J078p73k4m80L69O29k62L2l5J05k81N87j478N88Q17j464Q52q58O51
8116a06q76J054J44p80O98M8P75r33Q81r00L34j74j188J400q2j78m7J24j42n16
$$ plain form
8136 -464 -210 -1106 72 260 -360 552 662 718 -1477 168 -118 519 443 -891 440 650 305 138 625
8155 625 173 -354 -393 -363 74 170 340 231 -294 101 -291 904 -822 -46 102 238 310 -82 -1069 1503
8175 1503 -428 343 -510 27 704 -958 -49 -626 1579 941 883 73 -553 -172 -1047 -435 -191 -992 -390
8194 -390 -183 423 -422 -585 -274 -458 1152 -132 -1178 168 597 -102 -384 -168 -1201 252 -215 -71
8212 -71 -1071 -636 1055 -1647 101 718 -1065 -368 -161 233 -387 130 -400 -118 -337 354 879 380 -744
8231 -744 655 1015 23 288 415 565 -646 -750 171 -859 1049 189 -592 -327 254 -469 -313 369 649
8250 649 -690 -219 -1135 1032 561 455 145 805 -94 -125 906 1358 -1054 690 75 334 -58 -625 1152
8269 1152 -757 312 -341 265 -27 270 -108 -225 160 -838 -552 907 -1300 507 474 112 252 17
$$ packed form
8136d64K54q96J178J88o20R12J10N6k195J645k86O37p6j334J331K10l45j67M87
8155F25m52n27l9L0M37R6J70j09n25L95l92J195j726P76J48J36P2l92r87K572
8175A503j931P71q53N37O77j662R09n77K205o38n8q10o26L81q75O12K44q01O02
8194c90K07O06q45j63L11j84J610j284j046J346M29o99k82K16j033J453m67J44
8212g1j000M35J691k702J748O17j783O97K07L94o20N17n30K82k19O91N25m99j124
8231g44J399L60r92K65J27J50j211j04R21j030J908q60p81K65N81p23J56O82K80
8250F49j339M71r16K167m71j06l10O60q99l1J031M52k412J744o15K59l92n67J777
8269A152j909J069o53O06k92K97l78j17L85r98K86J459k207J807l3l62J40k35
$$ plain form
8287 17 -73 -835 486 67 -161 -178 185 -113 -286 183 169 1327 493 368 -292 -1299 -196 -824 -456 168
8307 168 8 840 -520 577 -860 -31 -552 1108 235 -964 -457 -1174 -372 -314 -146 1404 335 792
8325 792 720 358 -437 -85 511 144 -177 -337 177 1356 -124 -632 -476 164 -79 314 1025 -773 -1325
8344 -1325 -142 796 -1343 1361 600 -370 1580 -282 220 -593 158 711 388 1468 -159 343 264 -223
8362 -223 -710 289 594 99 1206 -40 4 214 294 443 -389 -133 -491 429 721 944 917 553 1439 576
8382 576 -382 -253 76 18 -141 -736 -250 -598 514 191 -139 -281 -196 428 -438 762 -1095 455 -764
8401 -764 154 -97 -635 438 -288 811 -483 586 -548 183 -786 -419 265 -536 3 966 -891 580
8419 580 -745 41 -486 -325 160 -227 1351 -566 472 515 702 724 -746 408 -29 688 742 -357 -94
$$ packed form
8287A7r0p62J321m19k28j7L63k98j73M69j4J158q34j25o60j007J103o28L68O24
8307A68j60Q32j360J097j437Q29n21J660q73j199N07p17Q02N8J68J550j069M57
8325G92p2l62p95L52N96l67l21j60N14J179j480n08J56O40k43L93P11j798n52
8344a325J183R38k139K704p61r70J950j862N02q13P51N53l23J080j627N02p9m87
8362b23m87R99L05m95J107j246M4K10Q0J49q32K56l58R20K92K23k7l64Q86q63
8382E76r58J29L29n8j59n95M86l48J112l23l30j42Q5O24q66J200j857J550j219
8401g64R18k51n38J073p26J099j294J069j134P31r69L67O84q01N39R63j857J471
8419E80j325P86n27J61M85l87J578j917J038M3J87K2j470J154m37P17N4j099K63
$$ plain form
8438 -94 245 837 -509 -1114 -78 -368 -392 114 -20 1145 65 320 -121 438 -274 590 9 50 984 -821
8458 -821 33 378 499 -335 -1027 -95 -661 416 -35 -1348 745 -46 176 -590 573 -818 296 -903
8476 -903 -1059 774 731 819 -776 -484 -190 904 -231 -1269 562 139 -74 -625 482 427 -265 -168 -1351
8495 -1351 426 136 -133 1289 -264 -1238 -685 186 -35 450 903 -1083 53 -935 997 1115 1220 252
8513 252 398 809 -8 -282 810 -1152 773 -346 283 329 -493 -93 -1072 466 -1366 217 -261 976
8531 976 423 -148 -109 -588 578 -124 -314 -491 36 1022 243 784 -434 93 -291 -407 98 1191 -243
8550 -243 1172 -762 307 713 845 -327 -380 -24 156 232 -670 1002 -242 -392 -597 -130 254 276 412
8569 412 -482 -65 312 -452 207 -770 537 374 -308 302 345 987 -101 64 564 116 177 359 520 -617
$$ packed form
8438i4L39N92j346o05J036k90k4N06j34J165j080K55m41N59p12Q64n81M1R34j805
8458h21Q54L45J21q34o92R32n66J077m51j313K093p91K22p66J163j391J114j199
8476i03j56J833m3Q8j595K92K94J094j135j038J831m23k13n51J107n5o92R7j183
8495a351J777k90k69J422j553r74N53Q71k21M85M53j986J136r88J932J18J05r68
8513B52J46M11q17k74J092j962J925j119O29M6q22M00r79J538j832J583m78J237
8531I76n53n71L9m79J166p02j90j77N27R86p79N41j218N27l84j16N05J093j434
8550b43J415j934J069M06J32j172n3L56J80P6r02J672j244j50k05M67L84K2J36
8569D12q94M17L77p64O59r77J307j63o82O10M3O42j088J65N00m48O1J82J61j137
$$ plain form
8589 -617 458 272 -81 416 -237 668 -621 -83 345 -29 1123 -794 -244 10 -811 107 673 -277 -895
8608 -895 -42 -1509 23 -146 80 601 -1270 564 301 -79 826 -85 1554 -1158 1328 -321 208
8625 208 955 -2 365 -522 274 223 301 1022 337 169 -285 -888 -512 1071 1049 25 -39 90 -584 607
8645 607 -493 874 667 -315 406 580 598 113 827 736 1474 335 776 713 -595 666 -1242 320 788
8664 788 -179 -643 -1034 -8 271 804 130 -702 -7 -476 323 -727 1312 104 390 914 -312 -80
8682 -80 728 -294 -470 -301 412 374 -841 -488 1149 -625 -462 69 51 673 393 -77 233 -938 1318
8701 1318 -427 675 -857 479 278 -1210 518 -719 1123 -244 -587 -194 -806 334 -781 -355
8717 -355 -324 739 196 -33 406 267 -311 174 90 343 -367 896 1038 590 477 590 379 154 65 -1593
$$ packed form
8589f17J075j86l53M97o53R05j289N38M28l74J152j917N50K54q21R18N66r50o18
8608h95Q53j467J532j69K26N21j871J834k63l80R05r11J639k712K486j649N29
8625B08P47r57L67q87P96n1P8P21o85j68m54o03L76J583k2j024o4J29o74J191
8645F07j100J367k07r82P21J74J8m85P14r1P38j139M41o3j308J261j908J562M68
8664G88r67m64l91J026K79N33o74q32O95m69P99j050K039j208K86N24j226K32
8682h0Q08j022j76J69P13l8j215L53J637j774J63N31j8O22k80m70L10j171K256
8701A318j745J102j532J336k01j488J728j237J842j367l43L93o12J140j115M26
8717c55L1J063n43k29M39j39n78M85q4K53p10J263J42m48j13J13k11k25q9j658
$$ plain form
8737 -1593 98 326 -59 861 -1078 -763 507 267 957 -446 -304 -852 -190 613 734 1691 88 -1042
8755 -1042 144 -188 1073 975 -337 -278 416 141 263 17 275 396 -961 144 -432 -108 -370 -78 281
8774 281 -353 517 -1164 214 -63 -552 282 17 742 -138 -1002 244 -513 34 106 -258 -1045 41 -247
8793 -247 -282 431 -1010 -59 -501 -599 836 -95 -346 -1544 194 -576 -314 -724 -33 658 -914 47 -216
8812 -216 -152 464 -1333 31 -1107 -274 257 -306 450 -106 281 -346 -766 -592 -1123 -634 -380 1241 511
8831 511 -672 -620 -517 -230 -313 143 -144 -1067 -243 -22 278 -161 -95 -1582 566 -243 320 807 -303 -141
8851 -141 -868 -295 431 -1473 1096 -1517 117 -423 372 304 9 808 -353 315 -149 -705 -380 -98 327
8870 327 36 -197 -683 -1050 526 580 1110 174 -550 -507 -162 330 -901 640 -538 72 -699 -560 745
$$ packed form
8737a593J691K28l85R20j939L15J270k40O90j403J42n48O62Q03J21R57j603j130
8755a042J186l32J261r8j312N9O94k75J22k46K58J21j357J105n76L24k62K92L59
8774B81o34Q70j681J378k77m89Q34k65P25q80q64J246p57N47P2l64p87J086k88
8793b47l5P13j441R51m42r8J435r31k51j198J738p70K62m10O91O91j572R61k63
8812b16O4O16j797J364j138Q33N31n63P56n56L87o27m20J74n31M89K54J621p30
8831E11j183N2J03K87q3M56k87r23Q24K21L00m39O6j487K148q09N63M87j110J62
8851a41p27N73P26j904K569k613J634n40P95o8k95P99j161O68m64n56L25K82M25
8870C27k91k33m86l67J576N4N30r36p24M3L45M92j231J541j178O10p71J39J305
$$ plain form
8889 745 -1143 15 -159 -48 212 -1178 244 -1187 308 687 143 373 -20 -70 -1625 -308 -45 -392
8907 -392 -817 341 881 -236 -1002 107 -873 -128 -723 237 -547 -565 -11 249 301 522 656 756 499 665
8927 665 134 503 -204 -426 66 -781 -202 -1004 941 -343 303 142 -376 -1052 837 351 -745 602
8945 602 473 -8 -347 -178 326 -734 406 -167 -49 827 -65 251 -637 -882 208 -1009 1744 90
8963 90 1185 -164 846 1057 -439 1443 148 562 -1042 672 501 -247 200 -26 375 -258 -104 59
8981 59 -40 627 753 586 -71 143 731 -434 67 128 512 -698 -171 62 447 843 -375 280 350 -1003
9001 -1003 -15 385 -89 -1393 545 -216 -381 661 -561 642 -182 350 472 -60 -174 -364 80 510
9019 510 -401 141 1340 -1374 -516 53 -1614 765 559 -1025 786 32 -1155 35 860 290 204 -471
$$ packed form
8889G45j888J158j74J11K60j390J422j431J495L79n44K30l93n0j555J317K63l47
8907c92m25J158N40j117p66J109r80P45n95R60p84j8N54K60N2K21J34J00k57J66
8927F65n31L69p07k22M92q47N79q02J945j284O46j61n18o76J889m86j096J347
8945F02j29m81l39J69N04j060J140n73J18Q76q92L16q88k45J090j217K753j654
8963I0J095j349J010K11j496J882j295M14j604J714j71p48M47k26M01o33J54J63
8981E9r9O67J26j67o57K14N88j165N01O1L84j210N27K33L85L96j218O55P0j353
9001a003R88M00m74j304J938p61j65J042j222J203q24N32J22n32j14j90M44M30
9019E10r11N42J199k714Q58N69j667K379k06j584J811p54j187J190Q25n70q6o75
$$ plain form
9037 -471 -401 -242 528 -62 626 -837 -40 301 1000 -63 79 384 -557 848 240 197 -856 -93 -399
9056 -399 -813 -371 957 -567 416 73 42 343 1575 -627 334 179 -258 348 -344 369 628 320 62
9075 62 -431 -793 -660 210 -69 615 -81 -96 166 -63 287 -846 1034 -135 -682 1156 -529 1296 -432
9094 -432 1028 -661 5 428 -352 -381 -887 481 -591 810 576 -513 312 58 -499 456 -929 19
9112 19 -389 387 -395 -791 -830 -329 576 -373 1079 707 51 991 -462 -230 74 856 -717 -119 1094
9131 1094 -303 -184 791 -203 521 930 187 -942 -1090 441 -256 11 -554 237 -741 473 -442 -598
9149 -598 -178 -183 920 -529 82 224 -359 494 -45 983 155 -186 -226 590 -91 -904 823 -857 -432
9168 -432 629 669 1336 -1424 152 202 -866 452 -577 595 -882 704 -1025 246 348 645 708
$$ packed form
9037d71P0J59P70n90O88j463P97L41O99j063J42L05r41J405o08m3j053P63l06
9056c99m14M42J328j524R83l43l1L01J232k202R61j55m37O06o92P13K59l08k58
9075F2m93l62J33Q70k79O84o96j5K62k29L50j133J880j169n47J838j685J825j728
9094d32J460j689O66M23p80k9n06J368j072J401k34j089Q25k54n57R55j385R48
9112A9m08P76p82l96l9N01R05r49J452l72o56R40j453K32L04P82j573N98J213
9131A094j397J19R75r94P24M09p43j129j48J531o97K67n65P91r78J214r15j56
9149e98M20nJ103j449O11J42n83Q53n39J028q28l41m0Q16o81q13J727j680M25
9168d32J061M0O67k760J576N0j068J318j029J172j477J586j729J271J02K97O3
$$ plain form
9185 708 -183 162 770 774 185 1115 790 652 -1005 108 625 1018 18 724 -391 -554 -62 38 -537
9204 -537 -529 -134 337 -4 -1079 771 515 322 1436 -1523 566 -374 -293 -1023 -255 942 -310 868
9222 868 -889 -303 -443 -116 -5 266 256 -787 568 171 -132 -127 -424 378 188 -98 1134 -535 -667
9241 -667 -578 555 203 -1110 -76 -236 722 -214 -159 308 -819 1008 -1203 128 -751 487 546 -298
9259 -298 687 -135 1677 -211 306 472 -81 160 -885 -247 140 -1397 525 -365 -170 -312 -406 -59 -130
9278 -130 1203 -777 1627 758 -1463 -15 -304 280 -145 227 -294 617 -487 -93 565 -260 236 89
9296 89 50 158 -331 1016 -738 612 -245 239 -166 924 56 265 -202 -646 234 197 191 -491 106 -345
9316 -345 293 -201 -938 -281 699 470 -104 448 33 428 -49 -648 -709 397 1032 -697 266 60 174 109
$$ packed form
9185G08q91L45O08Mn89R30l25j38j657J113N17L93j000P06j115j63M92J00n75
9204e37QL95M71l41j075J850k56j93J114k959K089r40Q1p30P68J197j252J178
9222H68j757N86j40L27J11K71j0j043J355l97l03Nk97Q02j90k86J232j669j32
9241f67Q9J133l52j313J034j60R58r36N5M67j127J827k211J331q79J238N9q44
9259b98R85q22J812j888N17J66n53K41j045O38L87j537J922q90J95j42r4L47p1
9278a30J333j980K404q69k221J448k89N84m25L72n21R11j104L94O58q25M96j47
9296H9l9J08m89J347j754J350q57M84m05J090q68K09m67m44Q80l7oo82N97m51
9316c45O38m94p37O57R80k29n74N52m15L95m77n99o1J106O35j729R63k06J14o5
$$ plain form
9336 109 322 642 -776 460 -647 288 -241 0 94 -1105 90 -789 -85 -377 -128 -364 -509 1073
9354 1073 -323 456 610 273 -124 -978 705 -362 915 -225 431 -480 -306 1035 143 -410 -370 928
9372 928 105 4 1096 -2492 -61 527 -1085 -54 244 822 -808 896 521 -290 841 69 1867
9389 1867 -734 282 -283 587 92 -568 312 105 636 -543 -137 137 -583 211 -816 -364 48 288
9407 288 995 -754 822 474 1394 571 -722 815 -275 -15 -206 76 -180 -777 1433 -680 -824 -365
9425 -365 183 483 -518 840 13 870 1345 -81 66 -376 -147 485 -343 835 -939 -252 1402 294
9443 294 833 -403 371 -1188 1064 -321 206 662 -667 -617 -376 644 -536 274 -365 121 -582 -1261
9461 -1261 -35 -733 622 -738 316 -525 -86 254 -395 831 -240 614 288 148 -56 -842 636
$$ packed form
9336A09K13L20j418J236j107R35n29K41R4j199J195q79P04k92K49k36j45J582
9354A073j396P79J54l37l97q54J683j067J277j140O56r11J74J341q92n53M0J298
9372I28q23j01J092l588K431N88j612J031K98N78j630J704l75q11J131p72J798
9389A867k601J016n65Q70m95o60Q80k07N31j179M06K74p20P94j027M52M12K40
9407B88P07j749J576l48R20q23j293J537j090K60j91K82k56n97K210k113j44M59
9425c65N48L00j001J358q27Q57M75j426J47m42K29O32q28J178j774O87J654j108
9443B94N39j236P74j559K252j385N27M56j329N0K41J020j180Q10o39M86p03o79
9461a261J226o98J355j360J054q41M39L40o49J226j071Q54l26j40k04p86J478
$$ plain form
9478 636 231 -656 999 -945 -391 119 686 -191 372 -422 -220 64 -287 651 -665 642 152 -177 586
9497 586 -605 438 950 -582 766 -4 234 -415 -518 1423 -637 422 -230 -911 372 -78 127
9514 127 392 277 -1098 -1098 766 -872 101 -347 453 -105 -317 325 -82 -882 -1318 -451 -1057 -697 -130 -331
9534 -331 1218 -182 -45 389 -703 -663 -469 1061 -687 315 -515 107 -566 -459 -88 -1269 625 -1001
9552 -1001 -950 700 -1341 198 -659 -440 961 304 733 753 946 -498 613 -575 780 -384 -221
9569 -221 207 379 -624 517 -889 152 -559 -240 -1143 -198 372 -339 1000 -201 -54 312 -791 81
9587 81 -289 193 -1007 487 -4 -296 -516 -908 384 -327 72 -334 -344 1189 49 477 187 19 773
9606 773 -307 31 -849 -261 -401 1205 758 -674 319 -838 483 38 1175 86 140 811 -713 -119
$$ packed form
9478F36m05q87J655j944N54N10N67q77N63p94K02K84l51R38j316J307m90l29P63
9497E86j191J043N12j532J348p70K38o49j03J941k060J059o52o81J283m50K05
9514A27K65j15j375%J864j638R73m48Q00n58k12O42m07q00m36Q67o06L60N67k01
9534c31J549j400J37M34j092M0J94J530j748J002q30O22o73J07L71j181J894j626
9552a001N1J650k041J539q57K19J401o57M29K0J93j444J111j188J355j164J63
9569b21M28J72j003J141j406J041p11L19r03R45N70p11J339j201J47L66j103Q72
9587H1l70M82j200J494m91k92k20l92J292p11L99m06j0J533j140M28k90j68P54
9606G73j080L38q80N88j40J606m47j432R93j157J321m45J137j089N4O71j524N94
$$ plain form
9624 -119 -293 346 -74 223 -229 -947 -125 -529 672 452 -703 12 95 1040 -1079 -46 291 -928 452
9643 452 -908 232 -789 -651 1225 -739 -569 870 643 -487 258 354 -842 1224 176 167 133 19
9661 19 -115 -1064 150 -144 424 -8 -800 428 -614 783 -1329 422 -81 186 360 300 69 48 -218
9680 -218 -688 -1347 882 -825 1523 626 -334 150 -512 394 -1329 79 -27 855 604 220 498 -1
9698 -1 -35 600 -96 919 -704 58 -385 417 288 315 319 229 645 172 -461 -196 330 777 -469 -494 -757 -7
9720 -7 -381 667 287 -869 453 -548 -165 -657 -443 1040 -1179 -865 175 126 566 -718 86 -574
9738 -574 -379 -401 -361 126 348 1031 -1479 190 677 503 86 -342 454 -1201 -29 1134 -269 880
9756 880 -661 631 -270 640 -968 -295 -11 -137 642 -99 400 -935 -908 490 83 756 617 224 -480
$$ packed form
9624a19j74O39m20K97m52p18Q22m04J201k20j155P15Q3R45k119J033L37j219J380
9643D52j360J140j021J38J876j964J70J439k27j130P45R6j196K066j048rl4j14
9661A9j34r49J214k94N68m32p92J228j042J397k112J751n03K67J74o0k31k1k66
9680b18m70o59K229j707K348q97r60M84o62R06j723J408j06Q82k51l84K78m99
9698al4O35o96J015j623P62m43Q02j29K7Mr0M16m73o33K65N26M47j246k5k63P50
9720gl74J048l80j156J322j001L83m92K14J483k219L14J040m9M40j284Q04o60
9738e74J95k2M0M87K22O83k510J669M87j74m17m28P96j655J172J163j403J149
9756H80j541J292r01R10j608O73K84j26P79p41M99j335K7J398m07O73j39l93p04
$$ plain form
9775 -480 353 851 370 1170 -633 -167 358 -414 -124 422 -355 -482 73 -561 32 271 -459 92 301 400
9795 400 -223 -119 312 142 265 387 160 934 -512 1002 112 -66 -5 -291 -52 -295 1266 -725 1605
9814 1605 -45 222 610 619 101 -548 471 687 -493 922 -652 427 -774 497 -297 -197 54 -455
9832 -455 -469 224 80 -284 -310 200 295 -210 -1325 624 108 -41 638 4 870 960 943 543 169 315 -1067
9853 -1067 -154 -1038 -1017 300 -374 32 -544 1239 -53 186 893 -809 257 -1077 -838 -272 -951 -174
9871 -174 -779 312 296 -129 -778 -251 -152 -337 103 -498 300 241 116 529 -146 180 -218 -3 -577 -595 979
9892 979 -113 -86 342 -154 -199 -430 6 248 141 286 -679 517 243 17 -547 -398 -191 -154 -663 -865
9912 -865 -13 617 -682 723 -558 -876 -783 332 -225 216 258 -583 -249 -829 509 -867 -1055 655
$$ packed form
9775d80Q33M98m81Q00j803M66N25p72K90N46p77j27N55o34N93K39p30N51K09R9
9795D00o23J04M31j70J23J22k27P74j446J514q90j78O1k86K39k43J561j991K330
9814A605j650K67L88Rn18o49J019K16j180J415j574J079j201J271p94J00K51n09
9832d55j4O93j44l64k6N10R5n05j115J949n16j49O79o34Q66R0j7m00l74J46j382
9853a067R13q84K1J317o74M06n76J783j292K39P07j702J066j334K39N66o79P77
9871a74o05J091j6m25o49N27R9j85M40o01P98n9j25M13o75L26l98K15n74j8J574
9892I79j092K7M28m96m5k31M36K42j07J45r65J196k74k26n64J49K07L7n09k02
9912h65Q52O30j299J405j281l18R3J115n57M41M2q41L34n80J338j376j88J710
$$ plain form
9930 655 -562 -449 -772 529 -1066 -91 1251 -498 686 -362 117 -910 -32 407 81 797 -569
9947 -569 560 -121 -756 944 150 -211 -222 797 -673 -1895 -319 -722 1163 -1016 476 908 833 86
9965 86 74 654 207 760 614 1258 -323 762 -330 -640 713 -498 -54 -1329 149 729 -101 -556
9983 -556 956 -339 -6 -544 -74 -35 918 -80 62 402 -181 250 8 -611 62 -1087 571 -42 676
10002 676 218 -179 599 -1073 -26 -528 906 803 -54 613 -1203 276 -1382 236 388 -1425 1218
10019 1218 -716 938 -223 22 228 -373 459 -177 -514 -281 68 430 -194 -105 287 1049 -640 292
10037 292 -823 173 654 -565 667 -200 384 293 -88 1296 -535 1015 -1041 445 678 510 648
10054 648 -335 119 -726 -271 -288 -89 451 -873 322 411 -615 1889 309 207 -625 357 223 169 -5
$$ packed form
9930F55j217J13l23J301j595R75J342j749J184j048M79j027Q78M39l26P16j366
9947e69J129o81o35J700p94l61j1J019j470j222J576m03J885k179J492M32p5p47
9965H6j2N80m47N53j46O44j581J085j092l10J353j211M44j275J478N80q30m55
9983e56J512j295L33n38M70L9R53r98J42L40n83M31k42o19O73j149J658o13P18
10002F76m58l97P78j672J047n02J434j03q57O67j816J479j658J618J52j813K643
10019A218j934J654j161K45K06o01Q32o36l37K33L49L62o24Q9L92P62j689R32
10037B92j115R96M81j219J232q67N84r1l81J384j831J550k056J486K33j68J38
10054F48r83M54q45M55j7J99N40j324J195Q9j026K504j580j02q32R82j34n4j74
$$ plain form
10073 -5 -529 3 86 -669 405 -1438 1323 -859 970 290 241 229 173 1012 582 766 -591 -16 -129 153
10093 153 -309 989 1057 24 341 186 -183 518 -1129 520 601 -156 595 -1323 46 -343 409 -575
10111 -575 132 257 68 -41 -90 -393 813 -907 661 -548 597 -1017 332 540 -142 590 -1616
10128 -1616 731 -1122 -32 -279 629 100 -741 311 543 416 -526 -593 955 -281 721 -1644 -17
10145 -17 -1395 -892 9 -853 322 -438 -88 405 1118 862 -252 136 47 -190 546 -35 950 40 -62
10164 -62 -408 -418 -825 -429 174 -148 -586 600 -550 548 -1342 -3 221 715 811 726 124 -594 349
10183 349 -84 137 -671 463 -301 177 -141 479 -458 573 -1010 1454 -1351 606 854 3 183 -393
10201 -393 86 21 -525 60 -428 649 176 -523 -606 -246 676 -308 623 -1158 930 178 204 -314 -653 895
$$ packed form
10073en24N32Q3p55J074j843K761k182J829o80m9j2n6Q39m30J84j357N75j13K82
10093A53m62J298O8j033L17j55l69P01j647J649Q1p57P51j918J369l89P52r84
10111e75P07J25j89j09m9l03J206j720J568j209J145j614J349K08o82P32k206
10128a616K347j853J090k47R08n29q41J052K32j27r42o7J548j236J002k365J627
10145a7j378N03R01q62J175p60L50M93P13k56j114L88q9k37P36n81R85r10j02
10164f2l46j0m07L96O03l22m38J186j150J098j890J339K24M94R6q5o02p18R43
10183C49m33K21q08J134p64M78l18O20r37J031j583K464k805J957K48q51J80n76
10201c93M79o5n46N85m88J077m73o99q3L60R22r84R31j781K088p52K6n18l39J548
$$ plain form
10221 895 -1342 -305 -529 719 -844 -770 696 -661 410 -617 -542 -282 -526 23 -1135 35 -265
10238 -265 -65 -344 -393 136 -769 1371 -449 1448 397 136 176 -429 986 -305 -670 640 -107 -129
10256 -129 -846 176 -227 -413 325 13 619 170 441 -155 80 748 -1090 2308 16 213 354 -718
10274 -718 -510 -764 -69 863 337 138 -609 975 145 -231 -489 194 985 186 1062 -423 70 -304 900
10293 900 831 837 -67 511 899 -952 -36 764 -701 918 -318 -70 957 209 172 -943 1027 -155
10311 -155 -226 -8 632 226 -549 672 -377 -485 -78 -46 -32 -223 1074 -30 -249 265 -630 132 -369
10330 -369 198 -923 -38 -609 -1738 1103 -772 1056 271 239 1574 -237 225 131 964 346 -312 250
10348 250 -538 97 840 36 -789 535 753 -780 -161 633 1210 -601 -459 -556 -1322 -18 -207 855
$$ packed form
10221H95k237J037k24J248j563P4J466j357J071j027P5K60k44N49j158J170l00
10238b65K00k79m9N29r05K140j820J897j051k61M0o05J415j291l65J310p47k2
10256a29p17J022m03j86P38l12O06m49K71n96K35O68j838L398k292J97J41j072
10274g18K08k54O95R32n26j99p47J584q30l76k58O83P91p99Q76j485M93l74J204
10293I00o9Or04N78L88j851R16Q00j465J619j236K48J027p48l7j115J970j182
10311a55p1K18O40m06p75J221j049j08M07L2J4j91J297j104k19N14q95P62n01
10330c69N67j121Q85n71j129K841j875J828p85l2J335j811M62r4Q33o18o58N62
10348B50p88O35P43q04q25J324K18j533O19P94N77j811J42r7p66J304j89J062
$$ plain form
10366 855 -12 -157 748 579 911 352 965 519 -1286 -155 332 423 802 -568 714 65 1143 34
10384 34 48 -943 238 533 26 452 -468 208 -197 -726 382 -173 1164 -524 -132 -342 -83 -416 -735
10403 -735 713 -1278 282 257 240 94 -1154 102 -367 385 637 163 884 -1145 1047 -390 -598 -734
10421 -734 -1010 1281 324 25 -1021 -636 -872 -491 1413 440 -812 15 680 44 -744 -117 283 1387
10439 1387 -647 357 -99 -398 228 -437 665 -895 387 -269 -371 -330 -1158 -47 -228 191 3 587
10457 587 749 -236 -5 -129 575 1049 -1367 311 70 -872 1017 321 441 323 91 -1397 -809 619
10475 619 163 596 -114 -30 -39 994 -69 -256 650 -7 -195 -567 -576 141 318 539 -1231 714 95 -552
10495 -552 337 82 1372 -990 373 573 -1387 -133 -766 1113 13 397 901 -666 366 -312 142
$$ packed form
10366H55q67j45R05j69L32n59O13m46j805J131M87R1L79j370J282o49J078j109
10384C4J4r91J181K95n07M26r20O76m05n29J108n55J337j688L92k10K59l33l19
10403g35J448j991J560k5j7j46j248J256m69P52K52m74P21k029K192j437k08j36
10421g34k76K291r57k99j046L85k36L81J904r73j252Q27O65o36p88O27M00J104
10439A387k034J004m56k99O26o65J102j560J282o56j02M1q28J111j81M19j88N84
10457E87J62r85K31j24P04M74k416J678k41r42J889o96J20j18k32j488N88J428
10475F19m56M33p10Q4rJ033j063j87R06o57j88l72rP17J77K21j770J945o19o47
10495e52Q89k55J290k362J363K00j960J254o33J879j100L84N04j567J032o78M54
$$ plain form
10512 142 -496 226 -1597 332 1 -582 -310 -36 45 26 -90 1362 -176 662 -783 637 268 -809
10530 -809 284 -178 1026 -350 995 -185 -268 878 -169 1451 -308 -761 -30 -341 910 760 667
10547 667 -237 401 826 -1174 -422 -100 416 -83 39 -39 -296 10 89 1 1097 -260 634 -39 -140 -606
10567 -606 -385 772 -562 -726 -875 221 -526 618 -850 -64 -107 -908 826 934 14 187 -416 974
10585 974 -786 -123 590 91 -361 -313 -295 -628 154 -439 792 386 -272 309 -519 666 891 72 458
10604 458 -448 1683 -1119 -291 433 200 205 -832 -480 -653 80 768 184 596 521 355 109 -138 -869 43
10624 43 79 -887 264 -753 690 -989 -195 42 714 340 -285 530 -423 629 736 -1356 434 291
10642 291 -904 546 -597 1134 468 -798 254 -130 208 37 -372 143 -174 -1123 -337 676 23
$$ packed form
10512A42o38P22j823J929l31n83K72K74Q1j9j16J452j538Q38j445J420l69j077
10530h09J093m62J204j376J345j180q3J146j047J620j759m53P31l11J251j50r3
10547F67r04O38M25k000P52L22N16m99J22p8k57L06P9q8J096j357Q94o73j01m66
10567f06K21J157j334j64j49J096p47J144j468P86m3q01J734J08r20J73o03J390
10585I74j760O63P13m99m52M8J8l33P82n93J231m06o58N81q28J185K25q19L86
10604D58r06K131k802Q28P24k33Nj037L52j73P33O88n84M12p5j66k46k47p31R12
10624D3L6r66J151j017J443j679P94K37O72l74o25Q15r53J052J07k092J790j43
10642B91j195J450j143J731o66j266J052l84L38j71m09N15l17r49P86J013o53
$$ plain form
10659 23 -185 -66 520 649 -984 356 -709 28 1560 -634 1512 15 412 -434 592 -807 -170
10676 -170 -107 -778 -1002 365 828 -791 35 -117 -517 503 -215 800 -237 -755 -138 91 452 -757
10694 -757 154 -344 -494 -326 -1224 -857 -791 -42 114 -11 92 8 742 255 963 1151 379 -198 -89 543
10714 543 -226 91 -650 -431 375 -443 401 -1190 180 523 -652 -253 -419 -337 -10 837 -1212 -725 834
10733 834 824 203 1020 1204 196 532 -217 -423 732 -370 -74 -392 9 -266 -120 -567 934 -244
10751 -244 127 -749 578 471 359 -733 -213 969 -395 132 -392 164 -530 -446 1260 532 652 190
10769 190 1150 7 -1377 -99 42 551 677 -88 749 -599 731 -1380 -202 -19 -991 -30 -246
10786 -246 523 66 -275 -1121 -521 110 -533 939 -726 589 -35 -434 113 -228 892 -1255 -784 -119
$$ packed form
10659B3k08J19N86J29j633J340j065P37J532k194K146j497L97q46J026j399O37
10676a70O3o71k24J367M63j619Q26j52m00J020p18J015j037n18O17K29L61j209
10694g57R11m98j50J68q98L67O6P49J56j25J03q4P34m87P08J88p72n77J09O32
10714E43p69L17p41K19Q06q18Q44j591J370L43j175L99j66Q2L27Q47k049M87J559
10733H34j0o21Q17J84j008L36p49k06J155j102K96l18M01k75J46m47J501j178
10751b44L71q76J327j07j12j092N20J182j364N27n24N56o94Q4J706p28J20m62
10769A90R60j143j384J278J41N09J26p65Q37j348J330k111J178J83r72R61k16
10786b46P69m57l41q46O00O31o43J472j665J315o24l99N47l41J120k147M71O65
$$ plain form
10804 -119 -1048 1186 -183 987 -538 407 -476 -189 435 863 331 778 -16 -850 -228 -362 -824 102
10822 102 -36 1093 -343 111 9 -1095 -246 -43 435 281 -61 -469 -24 689 -1684 67 189 -350
10840 -350 -713 -367 431 356 140 1065 -268 -506 512 -1087 1249 -285 -957 -289 266 867 -39 -60 -113
10859 -113 176 -315 -486 -86 -75 -22 -926 579 -908 1639 -631 -63 -86 -1161 322 -1240 404 -1133
10877 -1133 -680 745 11 374 -480 895 21 -830 505 -396 -331 -1382 50 -498 332 -567 -32 -389
10895 -389 -1067 462 -631 210 1184 -380 201 -223 700 800 287 -370 -552 667 -1752 -807 -709 -697 1247
$$ packed form
10804a19r29K234j369J170j525R45q83K87O24M28n32M47p94q34O22j34m62R26
10822A02j38J129j436M54j02j104Q49K03M78j54l42m08M45P13k373J751J22n39
10840c50l63L46P98p5k16R25j333k38J018j599K336j534o72O68N55O01r06k1n3
10859a13K89m91j71M00J1N3r04J505j487K547k270N68k3j075J483j562J644j537
10877a133M53J425p34L63q54J375q74q51J335r01O5j051J432n48Q30q99N35l57
10895c89o78J529j093Q41R74j564N81m24R23J00n13o57j82J219k419R45R8J2J944
$$ [...]
16383b2
##END NTUPLES=NMR FID
##END=
