##TITLE=31P_DE-80H_X3
 64 sc D2O
 26.2.2025
##JCAMPDX= 6.0         $$ Bruker NMR JCAMP-DX V2.0
##DATA TYPE= NMR FID
##DATA CLASS= NTUPLES
##ORIGIN= UXNMR, Bruker Analytische Messtechnik GmbH
##OWNER= root
$$ XWIN-NMR		Version 3.5
$$ Wed Jul 22 14:24:27 2026 Russian Standard Time (UT+4h)  Yarkov@DPX200
##.OBSERVE FREQUENCY= 81.013821
##.OBSERVE NUCLEUS= ^31P
##.DELAY= (6, 6)
##.ACQUISITION MODE= SIMULTANEOUS
##.ACQUISITION SCHEME= undefined
##.AVERAGES= 64
##.DIGITISER RES= 17
##SPECTROMETER/DATA SYSTEM= spect
##.PULSE SEQUENCE= zgpg30
##.SOLVENT NAME= D2O
##.SHIFT REFERENCE= (INTERNAL, D2O, 0, 243.863)
##AUDIT TRAIL= $$ (NUMBER, WHEN, WHO, WHERE, WHAT)
$$ ##TITLE= Audit trail, XWIN-NMR		Version 3.5
$$ ##JCAMPDX= 5.01
$$ ##ORIGIN= Bruker BioSpin GmbH
$$ ##OWNER= Yarkov
$$ C:/Bruker/XWIN-NMR/data/yarkov2/nmr/P31/2/audita.txt
$$ ##AUDIT TRAIL=  $$ (NUMBER, WHEN, WHO, WHERE, WHAT)
(   1,<2026-07-22 14:23:17.37 +0400>,<Yarkov>,<DPX200>,
      <created by zg, POWCHK disabled, PULCHK disabled
       configuration hash MD5:
       00 E9 B6 7A A2 85 ED C7 34 08 36 98 17 FE 4E 26
       data hash MD5: 32K
       02 1A 88 58 90 CA 1F 42 E9 07 0C 9C 68 5D A7 27>)
$$ ##END=
$$ 
$$ hash MD5
$$ F3 FC 3C 3C A6 AF ED 9B DE 91 68 1B 2E AF E5 52
##$RELAX= 
##$RELAX= 
##$RELAX= 
##$RELAX= 
##$RELAX= 
##$RELAX= 
##$RELAX= 
##$RELAX= 
$$ Bruker specific parameters
$$ --------------------------
##$DU= <C:/Bruker/XWIN-NMR>
##$EXPNO= 2
##$NAME= <P31>
##$PROCNO= 1
##$TYPE= <nmr>
##$USER= <yarkov2>
##$AMP= (0..31)
100 100 100 100 100 100 100 100 100 100 100 100 100 100 100 100 100 100 
100 100 100 100 100 100 100 100 100 100 100 100 100 100 
##$AQSEQ= 0
##$AQ_mod= 1
##$AUNM= <au_zg>
##$AUTOPOS= <>
##$BF1= 81.014009
##$BF2= 200.13
##$BF3= 200.13
##$BF4= 200.13
##$BF5= 200.13
##$BF6= 200.13
##$BF7= 200.13
##$BF8= 200.13
##$BYTORDA= 1
##$CFDGTYP= 0
##$CFRGTYP= 5
##$CHEMSTR= <none>
##$CNST= (0..31)
1 1 145 1 1 1 1 1 1 1 1 1 1 1 1 1 1 1 1 1 1 1 1 1 1 1 1 1 1 1 1 1 
##$CPDPRG= <waltz16>
##$CPDPRG1= <>
##$CPDPRG2= <waltz16>
##$CPDPRG3= <>
##$CPDPRG4= <mlev>
##$CPDPRG5= <mlev>
##$CPDPRG6= <mlev>
##$CPDPRG7= <mlev>
##$CPDPRG8= <mlev>
##$CPDPRGB= <>
##$CPDPRGT= <>
##$D= (0..31)
0 1 0 0 0 0 0 0 0 0.06 0 0.03 2e-05 3e-06 0 0 0.0002 0 0 0 0 0 0 0 0 0 
0 0 0 0 0 0 
##$DATE= 1784715796
##$DBL= (0..7)
120 120 120 11 120 120 24 19 
##$DBP= (0..7)
150 150 150 150 150 150 150 150 
##$DBP07= 0
##$DBPNAM0= <>
##$DBPNAM1= <>
##$DBPNAM2= <>
##$DBPNAM3= <>
##$DBPNAM4= <>
##$DBPNAM5= <>
##$DBPNAM6= <>
##$DBPNAM7= <>
##$DBPOAL= (0..7)
0.5 0.5 0.5 0.5 0.5 0.5 0.5 0.5 
##$DBPOFFS= (0..7)
0 0 0 0 0 0 0 0 
##$DE= 6
##$DECBNUC= <off>
##$DECIM= 4
##$DECNUC= <off>
##$DECSTAT= 4
##$DIGMOD= 1
##$DIGTYP= 9
##$DL= (0..7)
0 0 52 120 120 21 21 25 
##$DP= (0..7)
150 150 150 150 150 150 150 150 
##$DP07= 0
##$DPNAME0= <>
##$DPNAME1= <>
##$DPNAME2= <>
##$DPNAME3= <>
##$DPNAME4= <>
##$DPNAME5= <>
##$DPNAME6= <>
##$DPNAME7= <>
##$DPOAL= (0..7)
0.5 0.5 0.5 0.5 0.5 0.5 0.5 0.5 
##$DPOFFS= (0..7)
0 0 0 0 0 0 0 0 
$$ [...]
##$SUBNAM1= <"">
##$SUBNAM2= <"">
##$SUBNAM3= <"">
##$SUBNAM4= <"">
##$SUBNAM5= <"">
##$SUBNAM6= <"">
##$SUBNAM7= <"">
##$SUBNAM8= <"">
##$SUBNAM9= <"">
##$SW= 400.765351723535
##$SWIBOX= (0..15)
0 1 3 0 0 0 0 0 0 0 0 0 0 0 0 0 
##$SW_h= 32467.5324675325
##$TD= 32768
##$TD0= 1
##$TE= 0
##$TE2= 300
##$TE3= 300
##$TEG= 300
##$TL= (0..7)
0 120 53 12 22 120 120 120 
##$TP= (0..7)
150 150 150 150 150 150 150 150 
##$TP07= 0
##$TPNAME0= <>
##$TPNAME1= <>
##$TPNAME2= <>
##$TPNAME3= <>
##$TPNAME4= <>
##$TPNAME5= <>
##$TPNAME6= <>
##$TPNAME7= <>
##$TPOAL= (0..7)
0.5 0.5 0.5 0.5 0.5 0.5 0.5 0.5 
##$TPOFFS= (0..7)
0 0 0 0 0 0 0 0 
##$TUNHIN= 0
##$TUNHOUT= 0
##$TUNXOUT= 0
##$USERA1= <user>
##$USERA2= <user>
##$USERA3= <user>
##$USERA4= <user>
##$USERA5= <user>
##$V9= 5
##$VALIST= <valist>
##$VCLIST= <CCCCCCCCCCCCCCC>
##$VD= 0
##$VDLIST= <DDDDDDDDDDDDDDD>
##$VPLIST= <PPPPPPPPPPPPPPP>
##$VTLIST= <TTTTTTTTTTTTTTT>
##$WBST= 1024
##$WBSW= 4
##$XGAIN= (0..3)
0 0 0 0 
##$XL= 0
##$YL= 0
##$YMAX_a= 5234
##$YMIN_a= -7116
##$ZGOPTNS= <>
##$ZL1= 120
##$ZL2= 120
##$ZL3= 120
##$ZL4= 120
##$ABSF1= 60
##$ABSF2= -190
##$ABSG= 5
##$ABSL= 3
##$ALPHA= 0
##$AQORDER= 0
##$ASSFAC= 0
##$ASSFACI= 0
##$ASSFACX= 0
##$ASSWID= 0
##$AUNMP= <proc_1d>
##$AZFE= 0.1
##$AZFW= 0.5
##$BCFW= 1
##$BC_mod= 2
##$BYTORDP= 1
##$COROFFS= 0
##$CY= 9.86611175537109
##$DATMOD= 1
##$DC= 1
##$DFILT= <>
##$DTYPP= 0
##$F1P= 182.462994727601
##$F2P= 168.069089081705
##$FCOR= 0.5
##$FTSIZE= 0
##$FT_mod= 0
##$GAMMA= 1
##$GB= 0
##$INTBC= 1
##$INTSCL= 1
##$ISEN= 30
##$LB= 1.5
##$LEV0= 0
##$LPBIN= 0
##$MAXI= 11.51145
##$MC2= 0
##$MEAN= 0
##$ME_mod= 0
##$MI= 1.244541
##$NCOEF= 0
##$NC_proc= 0
##$NLEV= 6
##$NOISF1= 0
##$NOISF2= 0
##$NSP= 1
##$NTH_PI= 0
##$NZP= 1
##$OFFSET= 243.8632
##$PC= 1.4
##$PHC0= 1575.876
##$PHC1= 109.1595
##$PH_mod= 0
##$PKNL= yes
##$PPARMOD= 0
##$PSCAL= 0
##$PSIGN= 0
##$REVERSE= no
##$SF= 81.0140731611343
##$SI= 65536
##$SIGF1= 0
##$SIGF2= 0
##$SINO= 80
##$SIOLD= 65536
##$SREGLST= <31P.CDCl3>
##$SSB= 0
##$STSI= 0
##$STSR= 0
##$SW_p= 25641.0256410257
##$SYMM= 0
##$S_DEV= 0
##$TDeff= 0
##$TDoff= 0
##$TI= <>
##$TILT= no
##$TM1= 0
##$TM2= 0
##$TOPLEV= 0
##$USERP1= <user>
##$USERP2= <user>
##$USERP3= <user>
##$USERP4= <user>
##$USERP5= <user>
##$WDW= 1
##$XDIM= 64
##$YMAX_p= 0
##$YMIN_p= 0
$$ End of Bruker specific parameters
$$ ---------------------------------
##NTUPLES= NMR FID
##VAR_NAME=  TIME,          FID/REAL,        FID/IMAG
##SYMBOL=    X,             R,               I
##VAR_TYPE=  INDEPENDENT,   DEPENDENT,       DEPENDENT
##VAR_FORM=  AFFN,          ASDF,            ASDF
##VAR_DIM=   16384,         16384,           16384
##UNITS=     SECONDS,       ARBITRARY UNITS, ARBITRARY UNITS
##FACTOR=    3.08e-05,      1,               1
##FIRST=     0,             0,               0
##LAST=      0.5045964,     0,               0
##MIN=       0,             -7116,           0
##MAX=       0.5045964,     5234,            0
$$ Real data points
##PAGE= N=1
##DATA TABLE= (X++(R..R)), XYDATA
$$ [...]
7177 -396 -1761 182 -144 -143 -1643 701 683 209 280 -558 72 -941 -410 1051 314 893 156 403 -620
7196 -620 1212 -524 -165 -247 -788 1104 -873 1428 -402 -1002 461 -629 -63 554 177 -206 696 159
7214 159 -31 683 241 399 661 250 299 418 181 -865 -1037 561 -838 -189 -963 -286 -1110 -1595 157
7233 157 -345 -518 37 -594 273 872 -270 -105 -142 -28 -491 -890 165 774 -1391 399 628 365 -117
7252 -117 -705 -294 -49 952 -223 962 -1004 347 597 -971 562 584 365 408 557 230 -950 325
7270 325 -1074 -931 1122 -1432 340 219 320 -110 -509 -857 -70 1075 -435 527 708 -27 319 -859
7288 -859 128 -63 319 999 -516 460 68 -450 -354 825 -796 -137 -104 58 740 -1208 -412 208 336
7307 336 -616 619 118 20 -1190 -14 -717 -716 689 -540 -730 -74 -219 35 -680 -549 557 -513 273
7326 273 398 -43 -751 201 723 -331 16 740 191 757 423 999 -2 58 768 126 143 -228 421 950
7346 950 588 463 -657 158 528 -395 594 -499 -163 -772 -3 -446 -716 541 -1279 -1142 -184 -149 -1233
7365 -1233 542 505 -504 -267 -568 606 -74 -581 -109 -848 0 -340 -780 -271 796 453 -883 439
7383 439 -562 -195 -192 378 100 713 478 -370 1229 481 153 -134 -1042 187 -803 5 -268 -208 -124 -470
7403 -470 -484 -769 -414 790 -569 -917 36 374 480 412 -607 66 -421 157 370 432 555 -437 -695 -111
7423 -111 -262 -287 -1128 275 -249 798 344 335 355 1014 244 -189 -1149 -491 40 855 -430 -209 236 -1109
7443 -1109 407 -324 85 -526 101 155 72 243 -1050 -470 -832 -510 365 -724 -292 -441 364 -915 -39
7462 -39 140 -983 979 -1270 901 -108 -335 142 509 932 -1224 -266 -448 -1002 327 -1338 -424 -420
7480 -420 335 315 -464 -376 -1244 -471 -798 36 37 -377 -629 -361 -663 -139 378 -148 759 -651 -719 682 83
7501 83 -254 888 -125 -584 -367 1104 -201 772 -619 -485 -248 -573 495 736 -1020 208 125 683
7519 683 -129 123 1021 -425 378 -960 385 316 -406 970 -840 1076 968 498 -376 -699 -95 -1110
7537 -1110 -479 -1153 329 -347 -697 704 -436 -472 -397 306 -150 -1582 159 -550 -176 -251 99 -1299 -514
7556 -514 593 -702 822 -814 -447 103 868 -198 -690 679 -918 596 200 288 566 -2027 -350
7573 -350 -512 -600 179 -777 -536 -638 428 792 -706 -259 -543 572 -446 -184 399 -720 -216 -201 -598
7592 -598 -812 975 -100 -272 -402 292 531 -361 938 138 65 1738 -629 485 -67 200 -565 706
7610 706 175 187 -448 -164 1025 464 -704 911 -699 269 477 -517 -557 493 897 -865 -355 -470 -275
7629 -275 643 -567 660 -479 1207 305 604 1268 -129 1089 96 1462 -1049 445 565 -176 458
7646 458 1664 -508 113 -1482 183 -302 447 -1553 -122 -161 688 317 -200 568 602 201 1223 -343
7664 -343 729 -600 263 -168 -215 378 -66 524 430 1321 -1085 996 433 -938 372 -29 32 -992 313
7683 313 503 -721 1378 -93 651 785 1415 -628 -21 791 517 162 -977 -783 -637 -866 -248 -1370
7701 -1370 132 248 -69 650 -840 774 178 -325 62 -996 -42 494 115 -878 221 947 -607 -303
7719 -303 -1106 -26 868 -680 1023 -1424 281 219 -602 -273 -937 1039 -736 -805 -862 896 377 409 441
7738 441 -249 -141 -1042 -497 691 -1100 234 -774 529 282 -319 -243 59 1136 -745 790 -880
7755 -880 461 -47 -31 715 -658 -4 -755 -427 -54 -292 189 -140 695 -1218 212 -632 -206 933 -588
7774 -588 -319 -253 -333 287 -465 1478 -353 1089 530 17 2 338 -315 314 445 1213 314 -501 -299 204
7794 204 -10 -737 -677 865 348 -38 342 333 545 -957 -71 485 485 187 -749 362 408 759 762 -1257 510
7815 510 54 -179 1289 672 -618 792 828 234 322 390 -669 279 -988 -716 95 363 489 141 449
7834 449 -1485 298 162 -33 -147 -740 263 -510 61 -1538 167 -53 -793 86 -888 229 -636 -260
7852 -260 -353 -184 1085 -498 1002 261 -355 -171 190 131 387 311 -259 -580 -28 -198 618 95 733 -348
7872 -348 -59 363 -1539 -438 464 -636 413 6 -253 -20 539 -439 264 166 -590 -124 -1259 -291 1027
7891 1027 117 -1099 -34 -754 -1728 1209 -40 -532 522 -253 -246 -336 100 533 493 -854 -177 688 -364
7910 -364 -319 295 -448 -475 -150 163 -70 -146 640 -200 -165 -266 495 -1133 200 -158 488 176 -497 675
7930 675 615 -176 -723 -636 577 -707 355 1690 -822 133 -1096 863 -701 268 -188 67 685 261
7948 261 1540 156 391 -280 -182 -492 521 568 -260 528 -12 -307 -383 -426 -740 183 283 -959 -1175 500
7968 500 -2034 508 -33 -190 260 -1205 218 -723 602 -617 126 -150 -154 -213 -120 -256 -719 273 18
7987 18 -1618 293 156 1059 -795 -838 84 -1096 -401 -931 -276 -171 121 827 -282 -903 -648 -4 -19
8006 -19 410 646 96 979 -120 613 385 303 7 25 -422 -178 -778 360 750 1221 -344 416 147 964
8026 964 -1237 -515 313 -2065 748 662 305 -112 -1196 1215 -1595 1246 -956 -336 20 169 670 -1530
8044 -1530 281 -694 14 44 -179 -376 273 315 28 -298 1052 -473 -588 51 341 318 -911 589 -614
8063 -614 -71 -1027 859 -251 -520 -135 -544 798 -1234 109 -694 -25 645 -231 -314 -867 -205 -232 1015
8082 1015 1109 71 456 -778 405 -144 -316 -89 -583 -905 -137 -134 -1194 -381 355 -1662 752 124 -1400
8101 -1400 982 228 -265 -16 -842 -104 426 1024 -256 52 -18 -341 1079 -445 -184 -300 66 -862 -507
8120 -507 336 615 138 -1091 -191 -625 723 435 -686 815 -16 598 -980 -147 763 -1023 928 36
8138 36 -194 739 59 617 -69 1138 -708 0 349 147 1047 -244 680 -268 151 -72 -930 524 839
8157 839 1244 -702 621 -465 -164 326 803 1222 -712 574 -698 398 -695 -494 -125 -511 -119
8174 -119 -542 -357 609 -288 -55 -160 677 1431 164 475 186 105 315 -63 465 -502 1324 -785 400
8193 400 -410 -202 422 806 582 -921 916 -40 -916 278 -781 -465 700 1194 -452 448 1035 -1439
8211 -1439 -112 -291 925 -467 244 49 -1326 399 -515 129 -303 19 735 -310 382 -158 133 677
8229 677 -292 168 75 -242 -667 455 5 -629 130 -744 767 -1136 -229 -645 -231 503 -228 49 368
8248 368 411 741 -646 370 117 -1323 -723 -206 434 -634 692 -583 225 -370 356 891 1047 -1011
8266 -1011 -259 622 -234 -1704 2 -512 1440 -992 1013 -242 -572 344 314 1197 558 -256 -395 -1023
8284 -1023 231 -462 268 -91 864 -914 -1184 -253 -671 -223 -53 -254 190 -762 939 -323 -849 -750 -1017
8303 -1017 -229 -375 357 -1031 -595 135 163 -595 185 556 -607 -988 249 183 980 -1219 667 -769
8321 -769 -435 503 696 705 -592 -244 522 486 363 -190 -19 -1217 211 -481 1013 825 -170 229 -951
8340 -951 1049 -111 -176 -65 -369 1398 -314 -672 973 -473 -65 136 390 -2010 -452 464 -145 -176
8358 -176 -1257 161 583 924 73 -1205 672 -705 178 293 341 -486 -58 -312 138 -626 -128 -133 -302
8377 -302 1 -143 -382 1358 -446 -779 156 -492 393 408 477 -142 564 -250 32 -524 450 -672 688
8396 688 -1249 1894 -180 712 -748 519 57 -978 999 -84 196 -714 107 157 -375 -140 -419 297
8414 297 246 -887 113 -1313 1144 -545 79 -787 463 225 -338 618 -817 799 563 -111 219 -332
8432 -332 -868 -916 893 -698 -1065 159 207 1596 -983 365 -1438 455 265 -265 -835 -64 984 -608
8450 -608 -78 628 -681 770 420 505 -949 207 -6 -93 543 -62 486 -89 175 824 -499 50 173
8469 173 411 -50 -226 716 -1034 -356 611 -1096 70 -408 1107 -492 303 686 712 870 56 942 -1116
8488 -1116 654 -208 624 183 -524 33 -366 693 -204 -343 894 -127 92 -572 -942 977 -513 -395
8506 -395 127 596 -264 -88 264 51 854 -93 664 754 1780 408 -1058 -604 -367 -670 46 -106 80
8525 80 -143 469 -181 327 -267 -5 -467 -1217 555 -205 230 -871 -686 -614 226 434 -542 740 -418
8544 -418 -90 796 -373 132 -311 471 -1437 -33 -464 466 -225 -238 -275 -375 235 -115 -495 1101 38
8563 38 -811 -172 317 1211 -277 757 -725 807 659 -109 392 -656 576 -686 166 622 -814 -520
8581 -520 629 261 -50 366 -160 -604 -168 -33 1230 644 -9 380 -87 20 -855 170 694 -288 302
8600 302 566 523 -334 -582 299 -236 -109 -1134 258 -520 -152 1023 -617 -917 -1041 623 -318 -37 657
8619 657 -550 -139 204 859 411 492 308 -318 -684 111 97 -889 -643 -106 32 1465 -264 -94 1456
8638 1456 -176 -259 -178 822 -951 607 907 -669 692 -303 572 -966 1013 -179 -98 843 -766
8655 -766 -1119 -349 -65 -855 1182 -362 866 87 -83 775 675 918 419 -1378 0 750 372 529
8673 529 -268 -385 203 -14 284 637 538 -15 -161 396 102 -300 -684 -530 924 70 -397 557 -575 224
8693 224 -316 24 692 18 840 158 153 1658 464 -547 -1255 -552 553 107 590 -515 1609 -424
8711 -424 233 360 -356 -14 -142 1049 -790 -404 236 -346 -32 -894 866 413 772 58 -54 664 -693
8730 -693 -729 20 408 509 -260 -304 179 1443 211 185 486 -568 701 31 1188 -427 231 -78 -444
8749 -444 398 -172 152 -665 -1321 -335 -544 297 -776 -627 771 -441 218 -411 -372 317 489 -430 -257
8768 -257 -1050 -1108 -141 190 -204 1517 748 -4 714 -996 -383 -512 623 -600 150 178 760 -340 -224
8787 -224 1620 310 -244 141 929 365 247 923 204 122 -400 -883 -57 60 -439 -1041 979 -337 279
8806 279 -797 -751 1002 -444 546 -279 260 646 -411 1028 -1949 376 -396 -466 330 -258 1394 -781
8824 -781 254 -697 -175 -902 -495 -144 -279 733 -891 249 267 -389 849 268 691 -1346 -225 -690
8842 -690 -275 167 -537 -127 836 -687 598 -497 -389 397 -425 -323 -146 -420 -184 -227 -488 -251 -880
8861 -880 374 -836 206 -348 -94 365 74 -142 -501 612 592 296 819 242 -241 -441 -830 -424 379
8880 379 -117 991 -747 1110 654 -370 -878 -596 886 -288 -615 -308 820 -33 -587 2175 727
8897 727 80 -1167 -430 868 552 745 23 210 -837 984 951 -319 344 -9 -230 -809 -564 798
8915 798 824 1199 -1032 364 -627 -552 553 -488 688 -1274 69 -103 307 -158 597 -616 -1050 -6
8933 -6 -879 96 279 -255 19 210 -230 322 -177 332 505 848 534 509 742 -386 1168 -796 -556 -291
8953 -291 1284 -1257 1557 717 -736 544 -1161 1164 1009 -868 603 -322 46 191 563 1120 -477
8970 -477 842 -1112 43 -419 136 -320 -1267 1653 -623 -9 -41 -143 454 -717 139 219 -873 346
8988 346 -931 409 91 881 121 124 568 778 944 340 -44 66 491 -693 -96 684 -425 728 -731
9007 -731 73 806 -427 140 -216 677 -609 464 -931 -1014 1829 -808 741 459 277 129 -592 -490
9025 -490 113 1763 -466 -769 200 751 1323 -486 -207 775 -864 -1265 -203 -28 -669 -328 -456 -627
9043 -627 -208 107 -5 -151 1022 658 208 -32 -655 -860 86 313 611 510 -42 396 -232 -206 576 -194
9063 -194 -587 -285 437 679 373 1035 437 -1078 683 -559 397 324 -179 -10 -326 -45 -401 148 666
9082 666 156 1090 -250 -108 -22 434 73 140 -330 -317 -340 -501 310 -589 -349 1238 -690 -137 339 1219
9102 1219 216 -525 -102 -734 641 72 293 2 -445 107 -971 447 -97 -147 -956 540 781 -298
9120 -298 577 -943 -20 -1059 -99 196 -656 1017 197 672 1151 -569 -152 -366 -337 114 -676 217 405
9139 405 -487 -548 -354 -491 -163 -828 731 -537 -276 -353 401 -31 878 -286 -18 -848 371 -144 301
9158 301 371 100 65 -163 743 398 -36 -95 -56 416 -207 283 373 -922 833 -594 478 -404 -1472 1559
9178 1559 -673 45 127 391 -276 -422 1131 -529 -148 44 436 1113 47 702 1016 23 -50 -533 529
9197 529 248 -536 283 749 -201 225 689 -1332 -579 -558 514 944 -192 -1003 -508 -407 -1674 6 192
9216 192 -777 -666 570 -590 118 1684 -848 737 -150 -55 1489 -770 264 -625 -834 33 -106 -553
9234 -553 -297 894 -456 621 3 -275 219 -193 -158 -739 -661 125 -596 202 -258 1233 -580 325 -25
9253 -25 -569 367 135 -139 308 -771 976 -179 -306 -120 108 1062 -41 348 -632 453 -325 330 -325
9272 -325 304 1416 -148 376 -16 -238 1957 -1237 341 -194 946 261 -585 -393 -1029 49 116 1693
9290 1693 -512 -370 1358 -844 446 -23 207 -628 -561 850 -197 -826 -1017 -141 508 -703 -81 -1274
9308 -1274 1174 -383 649 -533 -494 1953 248 1731 -966 42 -237 -653 -281 -1324 686 -488
9324 -488 -667 522 661 -58 734 546 305 -166 467 273 403 472 477 817 -194 443 -869 -367 -1356 1550
9344 1550 618 -325 783 234 -47 -176 987 213 -284 217 -339 -791 166 748 -532 246 827 161 101
9363 101 -62 35 -210 -639 65 -136 615 -1122 628 931 27 393 -685 545 255 372 198 -648 715
9382 715 89 1001 690 335 337 -285 949 -1078 -231 444 -460 351 21 479 254 1113 -1115 -134 63 -736
9402 -736 274 -1095 -800 939 -335 523 -445 638 -664 227 326 -588 -46 -647 226 -50 208 -284
9420 -284 1484 -785 -167 -169 -596 381 642 -595 1176 66 552 -144 77 -68 -556 612 161 623 -468
9439 -468 475 574 -274 90 -488 945 -273 -262 1175 -785 -162 -1113 80 -390 340 -434 326 1402 1293
9458 1293 26 -559 142 290 -306 370 416 -441 681 -475 322 -145 108 128 -738 -972 -112 1026 -559
9477 -559 985 -277 224 14 -105 -464 -267 418 -481 209 891 559 618 -336 166 295 316 611 -338 -156
9497 -156 -1398 643 -1228 -351 -794 -566 -473 -682 447 -44 -375 525 -60 1852 50 -1233 348 -120
9515 -120 -180 -1402 749 -203 999 51 135 1104 -428 130 -1016 -299 317 192 -193 91 131 650 -1188
9534 -1188 750 -4 818 -660 864 380 -903 -136 -1084 590 -367 -289 1036 -558 -463 -379 -199 480
9552 480 -401 235 -278 995 -893 -330 -518 -22 1246 -755 125 -666 758 379 611 806 -1317 517
9570 517 -774 -760 -460 -165 877 -1029 -466 465 -372 -859 237 71 -587 -75 148 200 -1533 -448 -323
9589 -323 -453 471 -709 1913 767 184 -552 -265 870 -674 733 1162 -885 554 -1069 643 -482
9606 -482 -145 312 -11 -661 -677 289 -1168 295 63 691 -305 -927 445 -81 386 66 92 560 624 -372
9626 -372 369 452 9 52 -187 -1083 66 -922 -1153 788 -625 217 -1576 272 97 -1054 471 49
9644 49 74 -801 -396 -189 -126 -551 -564 -672 219 408 624 -266 1194 679 820 117 -279 192 -1372 -35
9664 -35 -677 362 -874 104 -437 -765 1014 -670 1330 268 30 -124 -1223 1729 -770 -184 -887
9681 -887 -1129 112 -545 -440 -367 770 716 -247 27 -1250 -926 -682 246 142 1022 257 351 446 -11 274
9701 274 -639 -78 325 -744 -486 -77 589 132 -568 -714 -710 376 284 -241 174 767 336 -262 -427 778
9721 778 -883 -472 -504 -330 280 -329 -205 257 1890 -994 -277 -211 233 567 -419 656 -738 -101 80
9740 80 567 -361 344 698 -521 410 -215 868 -476 -462 567 -141 -383 355 1634 469 -227 965
9758 965 -224 700 -401 32 25 -1670 850 -552 859 170 1022 -491 -1329 588 -1254 342 -96
9775 -96 -543 -778 -791 1479 -40 234 28 -12 -238 -1276 1316 36 -94 750 448 -848 540 -169 -380
9794 -380 -280 -768 110 -129 -1114 33 -1084 -453 -144 48 329 -917 -529 301 210 -429 -985 493 -523
9813 -523 -75 -397 -701 195 3 -90 -199 34 -341 649 511 -337 482 -633 30 17 498 11 -333 -199
9833 -199 -545 205 -272 145 -403 -1667 1043 382 -754 -1845 464 308 720 472 -180 823 -127 -406
9851 -406 227 94 296 88 -138 -1221 311 598 -1837 121 -202 323 -291 143 341 -719 1383 138
9869 138 -418 -560 -538 1015 -309 480 297 -608 606 -114 680 -186 220 136 -176 204 -1517 989 -1060
9888 -1060 -771 1105 -344 -987 285 -56 -452 -865 174 310 739 -1254 -192 -781 761 79 -848
9905 -848 537 -232 459 -258 397 -322 -161 329 -532 570 357 816 -304 -50 -75 -102 -15 -174 57 -200
9925 -200 45 1286 158 -321 265 603 707 -252 95 225 0 44 -661 65 -426 622 -695 496 586
9944 586 -743 299 -708 -195 454 -76 530 -560 839 121 -445 193 74 -166 -656 447 240 129
9962 129 -720 944 1350 250 252 -594 1375 -1128 -289 -723 -408 310 -208 -196 -583 22 839 -1564 415
9981 415 -153 1131 -1031 835 -690 14 971 -313 16 294 888 386 -232 869 -839 301 -517
9998 -517 -15 -6 -951 -49 -494 -583 742 262 330 -313 549 -206 -1162 244 -390 314 -164 281 -1171 -214
10018 -214 -211 442 71 372 81 531 -30 -158 244 -7 742 57 -1100 478 -115 -568 1010 295 640
10037 640 788 740 1309 -764 102 -49 -413 491 -331 160 -846 906 -915 592 775 -673 521 -775
10055 -775 1061 -685 1760 239 -1115 312 963 333 -511 671 828 -727 -467 -1260 1921 -894
10071 -894 -380 1444 222 1465 -931 -51 -101 -862 -340 -473 610 -601 1437 214 202 -450 -985 1828
10089 1828 -611 -396 -944 -693 -340 523 2264 -727 -19 1104 -650 131 -373 337 -50 -117 676 -270
10107 -270 431 -831 506 -905 601 -854 -677 182 -501 -304 38 774 196 -1020 -291 282 -15 -200
10125 -200 380 -204 31 -149 -244 268 -187 369 698 -261 52 -684 -738 440 259 1112 233 552 -198 -400
10145 -400 -248 -845 -46 -1389 527 -564 -204 364 473 356 -528 763 -239 928 -679 -684 1195 -1769
10163 -1769 850 -1111 -618 -252 -721 187 -281 -200 -359 334 274 346 367 -471 376 337 697 400 -703 1286
10183 1286 -1683 825 -540 820 326 -275 -33 33 55 -923 779 -32 -515 76 768 714 501 -717
10201 -717 157 63 836 103 -97 221 279 615 156 1709 -146 -254 83 -1268 231 -1037 -19 -1188
10219 -1188 -847 647 165 -64 -46 444 151 -118 -44 -142 591 -546 -192 360 -1054 -417 104 765 -369
10238 -369 219 -300 151 348 30 1369 -379 182 645 309 554 -540 735 -259 456 1189 -463 978
10256 978 563 681 486 771 1016 -1290 831 -333 59 -115 -294 340 136 1293 -283 -46 -71 -829
10274 -829 160 152 492 -422 843 627 209 696 -627 -141 -1203 -245 669 -821 436 315 1240 -114
10292 -114 -860 -484 416 549 -398 557 -535 232 749 149 -63 231 1925 -167 694 215 -141 533 280
10311 280 368 -80 504 931 -1479 -182 -744 828 -45 -11 834 13 817 -367 850 -172 -14 -451
10329 -451 -974 894 -396 -78 -124 -899 528 -688 864 -538 1012 -871 -831 -14 -396 1277 287
10346 287 -722 -82 -1007 -493 1 1835 -138 564 -136 -314 473 -963 63 -609 208 -1148 -400 -3
10364 -3 -580 2 -516 -439 -480 -138 -732 -1002 141 -1104 954 130 -367 112 246 -27 -309 -204 1003 13
10384 13 -255 -61 977 1424 -233 370 103 97 -4 92 -204 -672 285 -231 503 -231 128 19 -792 -107
10404 -107 -552 1344 -1867 753 -93 -614 560 -1273 -340 -434 693 650 -347 828 113 112 -235 1578
10422 1578 995 -903 1363 216 347 8 -270 144 -1160 88 286 208 -479 -366 -2 -787 25 -1473
10440 -1473 516 353 78 154 -1469 1221 -976 966 139 -209 1265 -105 890 321 137 246 804
10457 804 846 -1596 32 -953 -695 -81 501 476 -255 332 -1468 -63 -317 1061 638 -454 -35 -220
10475 -220 -322 -66 -461 1496 -193 1390 -482 -628 202 267 681 277 758 143 644 535 -352 24 504
10494 504 855 571 -142 504 -1151 -66 -404 870 -140 -153 326 242 80 315 237 259 449 828 1201 -995
10514 -995 -603 -579 325 -255 -1202 183 751 -133 -310 128 -1397 736 795 106 -106 681 161 -164 988
10533 988 -1249 451 87 79 294 -726 -276 -443 -195 614 -402 345 -619 970 -400 907 -557 -318
10551 -318 62 -661 -350 792 187 19 844 -130 465 372 404 161 727 -1536 -64 377 -255 -201 -603 -240
10571 -240 -523 590 -60 -60 -672 360 309 -523 -404 -663 486 562 -326 390 -859 213 -453 63 -52
10590 -52 -551 198 -1313 -617 302 -602 -573 -542 -298 1442 1250 -565 562 186 -456 587 -712 337
10608 337 174 991 153 148 691 -1299 -400 -262 -663 -176 -505 -204 -201 -264 -942 -213 -416 -417 1072 -850 437
10629 437 273 -493 453 120 392 -285 404 352 -585 660 -180 354 374 1198 -1054 -859 626 -457 -158
10648 -158 -144 -337 -55 -747 1226 -274 -601 -352 868 593 -120 -426 -512 870 713 328 -98 -357 1110
10667 1110 -934 655 -693 805 399 -518 789 77 1044 -19 940 985 360 -318 1073 -61 675
10684 675 -302 881 -163 96 791 604 958 -821 -48 -653 578 527 -986 -407 -1106 376 -105 1108
10702 1108 -117 -829 375 -969 -35 -283 822 33 -618 408 -890 -399 -1197 1082 -14 -720 802
10719 802 -1126 241 -190 516 -806 -274 488 408 -502 -222 841 999 538 -784 -930 501 163 -288
10737 -288 -892 444 139 -315 274 324 310 58 -684 438 -646 165 548 483 469 509 1288 -554 1271 -246
10757 -246 -52 -125 648 -413 -1280 248 -209 756 -516 -418 301 -428 -1308 775 352 -85 -800 65 156
10776 156 42 -842 684 -610 115 655 -477 550 1712 114 262 -467 149 78 77 89 -1068 300
10794 300 485 1190 -697 -54 -148 221 -209 1699 594 -634 283 127 -60 1430 -803 764 -530
10811 -530 402 538 423 -681 -586 344 -546 557 168 -1267 890 777 136 -574 626 203 -1053 874
10829 874 -823 1813 493 -408 -570 -457 320 -336 -96 -1785 -565 18 -1224 195 -916 474 383
10846 383 -790 305 -152 709 -371 24 48 -1025 -162 -981 633 -438 -1089 247 -88 -15 -244 490
10864 490 -139 434 1433 -70 832 -393 71 -660 -282 176 -583 -667 157 -479 -1347 391 -78 166 605
10883 605 -417 291 -341 -10 -74 -980 111 779 815 1199 516 -349 -810 442 -284 588 -168 57 1097
10902 1097 492 -196 185 -584 -148 -333 -208 -1124 916 -75 -656 43 -715 347 -288 240 -67 76 376
10921 376 -213 390 -1826 -262 585 693 843 79 463 603 550 443 -175 323 205 284 387 393 -1336 716
10941 716 416 -765 482 -1130 729 -463 -543 -249 115 -309 157 1079 275 306 -520 658 924 3
10959 3 540 752 -1998 -344 -872 9 -1384 574 1109 -100 900 -105 82 -471 482 536 -485 408
10977 408 630 25 -756 -160 1082 597 1289 -949 1132 -414 -221 714 -732 1011 10 227 526
10994 526 730 226 -991 862 -33 -234 -176 -45 617 469 701 -80 -326 156 -272 -51 -46 1120 -587
11013 -587 3 1262 519 -284 360 1373 814 155 1116 -1025 781 -1081 549 -604 202 -149 -1280
11030 -1280 386 -344 1094 252 -20 70 7 2197 -635 446 188 12 -1018 -913 249 -778 -54
11047 -54 -192 293 -443 -301 968 -939 -671 324 -730 878 127 651 -975 1220 -141 170 -476 -362
11065 -362 459 -284 -646 342 165 -112 -257 1866 1148 -401 611 -1102 288 -426 -585 -531 -145 1105
11083 1105 -771 526 -116 762 218 -1205 541 -41 96 -704 -99 -194 -405 960 472 357 -19 120
11101 120 -523 -430 975 -66 123 -348 88 -108 221 691 604 -596 363 -512 -6 -747 958 141 492
11120 492 -1225 102 397 -908 666 93 -1143 -748 -671 163 -886 468 -622 -107 -190 163 1356
11137 1356 -80 -32 -163 1378 -100 -1381 83 115 399 -281 -47 -377 561 240 -117 1089 492 256
11155 256 -392 -183 171 -527 1037 801 388 405 721 -1068 -1395 -849 -79 -54 -134 -222 -189 98 407 -675
11175 -675 -498 -551 125 472 -1524 -287 243 101 817 400 -164 -615 648 113 519 480 -526 632 -114
11194 -114 303 415 -169 161 -412 -431 -1039 -159 110 -306 466 -168 -461 574 405 267 -678 878 263
11213 263 831 -46 585 1179 -691 388 -51 -160 328 177 363 443 -344 -653 -240 758 348 -267 -303 -647
11233 -647 -475 -151 -265 -292 -222 -678 1174 969 -414 -1097 260 -619 -1055 -320 -184 168 -571 -1608 -640
11252 -640 637 -286 -1892 -162 12 -406 118 98 716 466 182 -1076 154 613 -424 702 -120 -118
11270 -118 402 -2 599 -344 -500 394 -528 567 -791 -723 -236 135 -529 -276 719 -332 -58 -616 389
11289 389 249 -627 422 -773 -1365 -270 744 304 -566 822 -536 -328 702 -343 488 626 -300
11306 -300 48 425 -402 -1241 258 -741 -53 -880 -678 335 209 1124 -483 192 92 325 -635 -1333 -920
11325 -920 560 813 -189 470 -1102 468 530 -410 493 -426 -302 -664 -242 1407 -653 -142 378 398
11343 398 -697 256 554 105 -986 -115 182 -200 -819 -184 -657 -1058 -96 397 232 107 844 514 -227
11362 -227 177 -5 -234 -600 336 212 -17 -6 285 -155 -754 49 281 -562 600 551 357 650 544 53
11382 53 544 216 -1131 178 -820 646 -322 -54 695 59 395 170 419 -207 204 -125 -404 -706 -622
11401 -622 28 -311 1431 -1243 -1047 -7 -316 -552 -295 1028 -97 -713 -388 -867 803 290 538 268
11419 268 269 522 -712 262 -148 -391 375 -302 534 -1085 234 40 -658 -848 -625 442 -105 -357 -438
11438 -438 908 290 131 581 -36 -1371 -413 -835 132 89 260 -226 -255 19 -24 86 -244 790 298 -796
11458 -796 177 -71 575 -753 1179 -1716 -871 115 -1464 69 179 1096 -96 -1030 1022 -108 341
11475 341 -1012 616 -598 -271 1109 -413 -362 -437 -643 -128 -287 81 -1185 443 -675 -383 97 -633
11493 -633 567 1250 178 -430 -649 1246 -221 448 -657 1164 -460 300 161 -479 330 -222 1185
11510 1185 -632 -624 -408 -505 1015 302 -484 -722 135 467 206 256 186 176 -861 543 207 349 -432 153
11530 153 602 730 879 -543 -415 760 -263 -35 583 375 342 -704 854 -718 -279 -100 566 128
11548 128 -695 392 333 -95 -796 460 -517 -288 -646 -325 -400 122 -121 720 -277 199 479 874 -291
11567 -291 199 571 14 280 -330 -882 142 670 752 -719 -77 95 457 888 -861 335 247 -168 -29
11586 -29 -1137 1223 -128 -322 280 -361 387 15 938 -260 525 148 267 1024 384 531 -781 -190
11604 -190 -618 1063 754 -64 -79 -462 139 -551 533 -726 -87 233 -550 726 -902 -534 36 684
11622 684 625 31 376 681 -1234 221 -915 -1108 191 -971 -1224 516 -686 -756 755 450 -148 -3
11640 -3 -740 205 -321 333 -750 -1343 486 -454 453 99 7 -250 -1272 867 -934 -166 -1444 587
11658 587 774 61 323 -490 765 -1085 756 450 226 9 -1032 -595 -805 -532 -876 -823 704 -1170
11676 -1170 57 -241 784 -351 -425 217 -285 434 -160 -767 79 294 650 -531 419 -523 1393 1551
11694 1551 -915 457 -1130 748 86 -361 150 -1546 -948 -719 271 448 179 -306 -401 -575 1198 464
11712 464 -690 393 471 12 -92 -108 183 -545 -132 -760 -990 724 610 -191 203 326 -932 -372 -13
11731 -13 116 415 85 -1428 188 -160 438 -425 121 -11 -407 239 -856 548 -751 -403 -331 984
11749 984 -610 -294 610 -916 -586 9 -314 298 118 -169 192 -17 -52 -353 52 -647 857 -1301 246
11768 246 633 -612 -1068 14 -398 -233 -233 271 149 130 -63 230 -99 -207 199 -455 -404 4 1224 86
11788 86 286 577 -719 -428 -331 726 -486 158 870 -296 -511 -715 725 515 498 489 -265 676 -528
11807 -528 -1239 -604 66 542 81 1483 -419 -47 -828 8 -93 -656 -238 -607 -557 -546 396 425 -649 460
11827 460 106 103 19 -12 557 136 -46 149 -629 -841 -449 83 129 -998 -126 -612 444 -778 -75 739
11847 739 457 1 -945 153 -383 805 717 -610 1127 -557 368 -64 175 -768 500 441 -466 316
11865 316 -469 582 295 284 125 -866 916 -635 823 866 -749 1437 -343 276 -979 -193 466 193
11883 193 1045 -368 305 -379 -14 871 349 703 -1184 -414 380 151 503 -852 -671 -375 145 -1426
11901 -1426 -83 779 -885 791 -247 79 353 1273 -219 491 -304 -435 315 -608 -77 190 892 -61
11919 -61 -547 792 602 -166 -714 -397 -753 -649 448 9 -395 -91 -410 166 128 1276 493 -622 193
11938 193 -344 -27 -221 -516 387 -115 -221 -1016 -463 -891 -199 -306 443 382 -262 443 -1095 196 -791
11957 -791 -316 360 -217 813 600 693 1082 -126 181 -672 -294 994 -566 1062 564 212 63 64 879
11976 879 -747 29 -680 -609 -569 981 467 -423 175 -745 -843 -686 598 802 -790 495 -760 791
11994 791 168 860 1300 1084 803 -854 -149 -1273 285 -347 -874 281 -633 543 -8 -331 340 -485
12012 -485 677 -523 -143 150 -51 153 -471 -445 -698 442 -188 3 696 -1253 170 157 -322 -1423
12030 -1423 80 894 18 -207 -43 -525 203 -1040 1070 -86 580 743 396 335 -292 799 -281 275
12048 275 -1316 146 -1285 -530 -337 -252 1781 18 280 663 -1179 289 -380 -29 403 -563 1619
12065 1619 197 375 -524 83 547 515 598 182 -1256 -246 639 416 -33 27 -409 -81 426 467 -493 -1010
12085 -1010 206 -1168 887 -198 927 541 433 1158 -501 1000 -661 375 -133 1157 -91 -263
12101 -263 -430 339 91 673 -829 719 -860 731 712 381 1045 -400 441 -106 191 229 635 365 -804
12120 -804 488 1128 -292 603 -670 -244 -631 966 -697 -323 -488 -1308 802 991 -988 826 -28
12137 -28 1129 -1354 686 -51 -901 587 79 1937 -32 364 -539 1525 -34 -746 524 -353 33
12154 33 -285 -10 469 42 408 -1048 1381 -471 -514 425 -1036 -309 -477 885 -167 235 -160 307
12172 307 1160 -1244 -224 -174 -773 -856 -947 -280 91 324 -306 -15 384 -670 -91 -662 -769 -737 -768 277
12192 277 265 958 375 -936 487 554 -289 390 -547 -582 498 460 -504 1087 -561 1228 -684 112 310
12211 310 130 248 -531 455 882 197 -816 -284 -636 348 -525 -313 76 -596 -195 974 641 167 -103
12230 -103 -187 580 -361 713 -206 671 -427 145 314 -66 -295 -824 341 58 715 -264 -52 414 49
12249 49 -736 372 -1224 -194 -743 633 156 -172 94 609 222 -464 665 -1393 82 418 209 36
12267 36 327 168 -1291 564 -348 -41 396 -674 906 390 0 -454 -544 -1046 363 -284 643 123 -33
12286 -33 -1412 525 -262 147 -93 -779 -143 -21 1331 -692 1589 -1002 436 -975 -1119 -367 -208
12303 -208 -454 81 214 138 -83 -306 -357 -268 -736 -839 659 -555 -678 -640 510 -68 308 498 -250 -319
12323 -319 90 -47 703 691 244 425 1304 -537 8 519 -445 122 3 72 367 596 712 -1191 360
12342 360 352 -723 225 -1146 442 -884 543 -783 294 -538 421 -60 -990 252 -967 -144 -1260
12359 -1260 -858 -376 -265 -389 -1328 1068 10 1218 -548 -978 964 117 -523 352 484 199 -705 -38
12377 -38 -360 516 -950 74 895 125 1070 -611 44 -897 748 1052 -119 -264 -583 -881 -314 -537
12395 -537 250 -369 736 -624 28 194 -824 -537 57 -94 -840 -937 636 -520 1262 -1164 203
12412 203 -42 -245 -120 -346 642 342 1200 558 -229 1694 -504 309 305 105 764 -123 15 -104 772 182
12432 182 -253 -227 -61 -590 328 283 -737 61 -2 -584 1534 -563 18 -73 -141 5 -1493 780 388 75
12452 75 -302 -1009 -218 -1080 1363 -436 -612 -338 282 -198 -781 428 -192 697 554 -570 632 -413
12470 -413 270 -160 259 123 -183 803 -478 105 -1264 649 -221 472 -420 -345 -145 -924 940 271 -658
12489 -658 -410 311 -156 -1566 31 -4 -228 -541 -940 -972 542 335 661 -351 1512 -197 899 409
12507 409 1760 -391 361 725 -917 -528 77 363 -431 -451 1187 323 -694 -402 -128 595 439 36
12525 36 -1047 -190 804 -737 18 438 257 -282 -39 304 -253 895 -299 -579 1075 -1288 -59 -541
12543 -541 500 -451 61 -173 -908 -446 -1202 325 -910 -35 84 -268 895 -403 976 345 -209 203
12561 203 901 -31 -692 596 -593 1307 70 160 779 -1300 -1022 -596 228 -334 -1109 743 -526 257
12579 257 859 325 732 139 1259 164 1121 65 1032 21 98 722 -336 411 -597 669 109 -886
12597 -886 -299 186 153 -666 -783 -317 -8 -237 805 427 135 115 -2 -324 -888 -611 303 333 -544 -812
12617 -812 -887 837 348 444 -216 -1009 786 98 -521 377 146 287 -750 809 402 816 489 506 597 -464
12637 -464 460 -453 -784 -431 -50 -898 209 1345 -743 -853 -523 -178 655 413 -422 -1359 -392 -654 -165
12656 -165 75 -903 619 -1104 -792 -187 210 -773 -902 110 -542 713 169 1013 -146 -1059 418 -336
12674 -336 -145 0 -22 1649 -401 717 -389 -37 -168 -414 275 -281 549 89 -335 -795 993 -877
12692 -877 -500 340 427 907 116 -863 -611 31 -145 709 88 179 717 403 342 833 152 -202 -463 -828 17
12713 17 -30 -395 -98 -934 1 1116 696 -437 800 52 -880 1047 -655 -331 -1028 970 1045 -904
12731 -904 243 -788 -753 1062 176 550 -663 913 -903 202 -29 -502 46 -138 177 -662 805
12748 805 -312 -414 -156 -1796 337 -1302 -426 -169 389 657 -347 978 182 1525 -15 242 33
12765 33 -1809 142 189 565 234 -340 114 44 564 839 24 -500 273 955 -825 -117 -453 11 201 36
12785 36 896 -395 316 -135 -544 -70 -685 -1058 -495 759 -123 953 -661 223 305 805 366 -380 429
12804 429 685 -76 397 -830 1002 164 -23 224 376 305 -379 796 -444 242 143 -36 314 -546 -474
12823 -474 500 -252 1758 239 -489 -605 -1280 -407 300 48 -1361 709 1021 -53 -630 -904 206 -315
12841 -315 -26 -1062 -1103 -145 417 1134 -288 226 -1132 -72 204 256 -42 -307 371 -681 -696 784 -1132
12860 -1132 -19 -1148 -894 392 -549 -186 -1332 636 -189 -405 -330 557 -1288 437 -773 -1366 142
12877 142 -739 70 842 296 350 1596 -596 -301 -113 -574 799 90 -65 -652 -850 869 749 -827
12895 -827 650 -807 -994 1639 279 418 -1029 647 -350 -574 -287 -98 420 -377 357 -378 -419 122
12913 122 621 659 -299 -213 934 -422 640 121 48 -608 -726 266 -752 140 -313 65 -417 -64 980
12932 980 -728 386 -168 -202 266 -94 -332 391 13 26 511 112 -339 1151 -156 -526 -719 233 -880
12951 -880 -623 855 -1344 146 62 858 -307 -335 558 -36 -403 -341 823 -1114 -679 1172 534 -267
12969 -267 241 -230 412 729 -2 277 182 -593 -448 719 -626 400 -34 -179 38 271 266 -196 91 -139
12989 -139 1506 -165 481 1083 -173 8 -500 533 333 -796 530 -462 420 -1169 -149 670 -251
13006 -251 609 -400 86 289 -114 225 -738 -163 -329 -257 -512 -780 -141 -170 472 -651 1561 -468 354
13025 354 -52 582 564 -1061 335 -769 -92 288 122 796 -161 440 777 157 1129 -910 94 -766
13043 -766 241 -836 521 -506 549 -966 -707 207 -776 -236 -905 -552 -89 233 854 -98 1020
13060 1020 -944 -972 961 -763 -891 -613 -742 428 -240 100 -232 -808 252 -561 159 379 693 -669
13078 -669 1061 -208 1211 579 -609 1375 -328 315 -416 282 108 -462 433 -498 -1250 252 52
13095 52 165 -36 -1050 44 153 27 -1178 310 224 306 -996 -371 -72 -1100 -102 -203 -468 -49 -565
13114 -565 -65 -1142 280 -1115 -73 -1071 -577 -33 -1069 492 -1624 302 -77 -772 407 -194 -933
13131 -933 -314 -338 -305 52 -156 -485 -523 -560 -600 -166 -324 463 -994 1158 -1632 -627 -372 -315 -418 -694
13151 -694 -245 350 167 -713 340 89 -1050 -386 -354 -47 -200 -841 183 -751 182 310 -454 364 -744
13170 -744 1068 642 834 74 174 -587 -966 -531 430 834 -963 -577 189 -739 572 -292 -819 543
13188 543 -356 -279 -686 677 464 -637 394 -1049 660 -801 770 942 -161 258 -257 28 -1110
13205 -1110 585 -72 -535 355 268 168 -558 -79 -534 -155 -44 -198 -1034 -442 65 111 -90 455 1 190
13225 190 -484 132 248 363 1335 173 -125 -70 510 -398 -754 408 -201 741 -1077 -82 366 -1098 429
13244 429 250 227 -205 606 -464 -452 580 -1231 -1106 -227 206 134 -25 392 -25 -137 -589 41 -632 -95
13264 -95 411 21 916 -557 468 -610 264 453 598 10 778 309 757 -1216 12 276 -116 -32 -595
13283 -595 -226 188 399 859 -627 757 144 711 -699 -171 -200 16 198 207 562 -187 100 1006 299 558
13303 558 108 624 -252 942 -1445 -592 -722 -221 611 350 951 186 -1311 -566 -916 -207 570 -7 815
13322 815 -1269 641 -2 373 -141 -927 -728 129 698 -176 383 -173 575 612 -775 780 -1409 1287
13340 1287 -346 146 -206 -377 -812 -610 1452 -1064 55 -759 253 857 298 403 -983 -239 -357
13357 -357 366 322 205 555 -439 1133 -434 -309 126 62 358 -73 443 -174 -483 -819 -292 877 -809
13376 -809 -114 612 -260 -454 -442 -445 1236 597 115 180 -78 -275 618 255 -134 661 -520 929 250 -47
13396 -47 1026 -600 124 -128 -129 -391 -1426 317 -51 1035 -856 -1238 -571 265 -15 -922 669 242
13414 242 -404 832 192 565 -705 -149 -1024 873 183 -443 -24 -483 -624 -344 195 311 -180 -680 -1512
13433 -1512 96 -1451 -282 1227 833 41 112 258 -705 -120 -140 181 -62 417 442 19 520 159 479
13452 479 166 -357 -230 307 -952 752 -23 33 432 280 259 91 378 1194 -98 -245 525 -363 -1065
13471 -1065 856 -54 360 -648 -444 174 602 369 466 75 -628 -282 103 141 -9 -11 411 230 -235 873
13491 873 -745 1666 -210 191 116 278 222 22 496 -416 774 -26 -530 218 37 580 -895 272
13509 272 18 167 504 -468 1212 131 -187 876 353 978 -1114 961 562 1175 -118 -292 544 -1002
13527 -1002 117 -749 -96 -249 487 1230 199 323 -446 -217 277 31 312 -934 -640 46 -98 710
13545 710 266 -672 644 1017 -1257 277 154 -179 611 251 -286 -418 643 -355 607 -236 -64 -186
13563 -186 479 798 -221 -982 -594 769 -293 -1237 -991 410 162 245 -234 -42 143 -650 1600 -641
13581 -641 101 -514 -639 -175 -128 2120 32 -1122 97 -643 1213 100 40 -617 -440 -515 327 597 -1071
13600 -1071 -506 -606 576 -522 -603 407 -816 -575 -1018 789 -515 493 1368 -536 1075 -275
13616 -275 491 -508 -1038 -213 -264 541 -379 -432 -151 617 499 -474 723 -661 1212 143 -587 981 96
13635 96 196 -1324 -848 -649 -265 204 -480 178 -795 -462 -31 -477 178 481 -110 -1087 -959 -179 175 -491
13655 -491 -210 740 120 -360 -73 -1617 -397 807 -145 192 -211 845 666 1551 -181 733 -253 68
13673 68 -532 -359 362 205 -33 162 -275 349 174 895 -598 -65 1268 -922 282 -126 1206 -260
13691 -260 -255 -704 -983 -322 -259 520 -370 -416 1456 -948 291 -820 561 355 -573 547 -788 1884
13709 1884 -1008 409 -677 -660 1223 641 1343 -128 731 1165 -272 290 -761 779 -1093 841
13725 841 -188 -361 982 -974 793 -1391 -54 557 222 218 571 -266 -38 607 338 1236 161 230
13743 230 -393 -1102 -826 1073 381 952 -411 416 509 227 457 -233 881 30 -502 -63 302 917 398
13762 398 308 105 -160 560 -814 1033 53 24 -272 29 -88 -915 544 45 -49 -146 -14 879 -1092 1072
13782 1072 -310 257 258 -693 -171 -19 786 648 842 607 -322 537 453 1012 -596 498 147 66 1028 -1309
13802 -1309 684 -928 250 -787 -550 -203 -4 2 -112 1257 -6 -1107 510 139 306 46 -173
13819 -173 -185 468 -278 -84 912 -707 244 68 779 67 -1046 576 -473 137 683 231 1957 -648
13837 -648 307 600 -193 451 52 -240 -1178 -25 -1378 1023 -134 -52 1074 -200 81 -415 95 -370
13855 -370 -853 -101 378 -686 -82 -987 503 -222 -444 718 -627 497 -374 37 9 273 -1105 -684
13873 -684 -133 -476 258 -905 441 -171 -792 689 -285 144 -606 404 364 -832 755 -407 315 -929
13891 -929 189 -70 418 177 -259 -620 -674 1721 -991 477 1678 350 649 584 203 327 -380 -146
13909 -146 -607 337 -573 312 -754 -463 -352 -931 1151 -148 398 -562 529 862 -910 826 -612
13926 -612 -1038 -292 304 1397 -314 895 -173 -316 116 -154 -238 201 -1043 445 428 1238 -535 367
13944 367 340 -273 431 -120 334 94 1000 -295 173 466 -795 1267 -180 -759 -1088 -919 -626 -515 103
13963 103 -8 541 -250 303 36 -1109 -195 32 105 1162 15 111 -232 1067 -237 506 -359 -814 671
13982 671 -545 1007 -653 927 -628 3 408 999 409 -317 984 -493 -72 219 -1522 249 -580
13999 -580 218 -372 -460 428 239 690 -634 9 -646 -514 109 -1483 -163 -1445 790 -502 536 84
14017 84 -184 155 -935 1885 -623 -77 72 -39 1700 -787 1129 -258 -470 631 395 565 204
14034 204 -227 -489 -941 15 177 104 -381 882 1100 635 455 -553 569 398 899 1039 -1098 471
14052 471 131 212 -247 -494 -250 25 317 626 473 1637 -578 1019 -455 -72 -18 380 224 -540 -507
14071 -507 -812 211 -462 -822 117 -317 300 -180 1318 173 -879 -289 371 369 102 -74 -107 1064 1081
14090 1081 -166 -93 -383 148 405 -94 496 -298 1211 -1833 224 -727 0 230 -929 189 -482 880
14108 880 -936 147 -331 647 1923 -692 754 -540 -1122 -15 -826 -397 -651 70 -1037 -17 -48
14125 -48 205 -42 -507 -106 -64 -296 -2 217 701 718 617 -14 698 555 104 831 -181 -324 982 120
14145 120 -1178 -667 1191 -803 457 593 -118 535 -180 -149 -419 673 303 -200 147 540 -9 186
14163 186 20 685 -87 753 1798 44 325 -945 523 -851 992 -1183 -918 -478 126 1172 -579
14180 -579 -534 -929 -55 347 309 934 -456 374 -194 -282 1264 124 -121 -109 813 -822 151 509 922 0
14200 0 -794 -260 314 265 223 33 544 -33 710 755 604 -618 -50 35 294 840 -351 -394 -225 -670 -492
14221 -492 -544 -505 -522 -103 -884 -1317 926 -643 -134 -656 1027 559 -1506 269 -39 260 -64 -511 149
14240 149 -308 -420 482 -725 663 -1393 267 -693 -900 -293 -997 935 -775 -235 5 775 696 213
14258 213 1208 -181 494 157 775 927 401 143 -985 18 -657 -589 -7 -1108 628 -1527 -975 -908
14276 -908 -6 769 -272 516 -57 1408 951 -26 -159 -605 627 -620 -51 -311 128 -83 -971 575
14294 575 -209 547 -314 -566 789 -117 75 -548 1333 281 686 48 -837 551 440 445 -169 686 644
14313 644 -324 829 96 521 -159 538 -812 -406 -593 985 206 -756 483 -214 -863 5 -57 -109 -394
14332 -394 564 23 453 -238 276 -670 951 -388 397 144 -904 505 -149 470 -640 360 -11 -222
14350 -222 -453 102 149 -1184 -166 -318 187 -254 -390 181 -457 645 -183 43 -122 -684 778 -394
14368 -394 -6 -706 669 381 54 163 -930 180 185 258 -415 -846 379 -844 1070 -430 455 1053
14386 1053 149 -277 -1155 568 60 -689 -190 802 -251 -817 974 -657 623 229 294 1185 -511 328
14404 328 -134 -1026 417 -1228 538 -994 612 54 401 1253 -1110 951 -614 724 -457 -717
14420 -717 600 -910 784 -23 -224 644 -457 -1555 986 -234 173 -42 45 -370 255 -766 -711 895
14438 895 184 118 128 969 34 -427 -362 -772 296 530 242 43 -278 650 382 1157 -615 1340 334
14457 334 -412 908 -1119 91 -321 226 -134 200 -159 -1148 200 -1068 888 52 82 410 -327 1205
14475 1205 -1532 248 21 -274 -9 230 238 -952 870 -833 -73 384 34 1071 -1154 858 586
14492 586 19 214 -355 909 515 -819 -619 889 -606 -778 325 -284 352 -772 3 522 -664
14509 -664 397 785 266 -520 333 -706 517 538 -428 -993 -415 561 -329 657 -285 -196 -179 -52 20 390
14529 390 183 894 -1063 -80 -279 -851 -23 190 13 -444 -1073 515 -102 -376 -292 551 -395 531 -196
14548 -196 -523 1069 -946 -870 -467 -122 1605 194 482 -152 -216 60 527 404 -961 349 -671 165
14566 165 -424 775 1437 -281 273 -601 -671 557 -881 -306 29 1082 820 -6 -35 258 -718 -253 -23
14585 -23 -534 279 110 -460 394 220 -321 50 -857 -146 -797 790 -1329 -21 -160 551 -253 262 119
14604 119 -671 75 397 -747 1104 -364 673 -310 964 1054 -254 500 -43 -120 131 695 854 -14
14622 -14 81 -547 244 26 -366 218 -619 -94 -183 266 -598 -729 -476 -846 204 -174 -435 200 -735 -135
14642 -135 -144 578 -233 -507 1053 974 49 -280 1346 -1318 277 246 -216 -779 -677 412 -408 712 -1031
14661 -1031 -247 784 -643 1314 -1012 -241 -235 -646 42 -780 512 549 426 148 -1051 428 176 324
14679 324 2447 -388 89 -1102 -778 -788 145 49 -200 -389 281 -273 -525 243 -1079 624 412 -956
14697 -956 721 -175 376 1062 -290 587 568 370 -400 -332 163 -470 -704 -311 396 431 759 405 -582 1037
14717 1037 -426 -625 -9 -546 -212 -852 -289 1284 83 244 -42 902 -754 648 618 72 631 -13
14735 -13 -404 -194 479 69 -527 129 328 -318 -273 428 -92 1278 687 -82 1102 -1020 334 -345 810
14754 810 -350 -1673 1405 -664 1520 -233 -251 631 -308 9 -193 728 -250 763 196 146 701 643
14772 643 463 -594 378 753 -257 -172 -1895 -61 -912 73 -324 -818 1167 -1038 18 481 940 -40
14790 -40 8 -297 -551 528 30 -252 1651 -595 734 217 746 -196 190 219 -697 530 81 303 -774
14809 -774 -732 465 -334 196 544 489 441 -722 -452 441 812 -222 57 -278 501 -317 -648 510 -20
14828 -20 305 567 -364 1346 223 -253 -382 259 827 -509 -380 -709 684 322 -436 1021 -782 1030
14846 1030 470 381 -252 1290 907 -372 970 10 -217 -692 -378 -592 -780 1029 -1046 -1201 -693 -1028
14864 -1028 504 -234 1473 -791 589 -576 -776 -308 -1929 -103 273 -717 492 -214 -127 75 273
14881 273 383 -43 733 -28 501 -383 -207 222 624 289 268 191 156 823 -226 775 -246 375 -165 -189
14901 -189 203 -243 316 -506 43 260 519 -967 -561 -710 828 -447 -448 -295 749 178 -963 167
14919 167 -637 1111 365 64 -14 -144 183 247 247 -87 -183 725 -607 442 29 48 1438 773 -7 -674
14939 -674 195 -701 510 365 -63 256 -685 -545 -665 15 -723 197 947 90 317 405 130 348 860 358
14959 358 -1353 362 24 228 335 -581 94 -1718 852 -738 -854 399 -631 460 -151 1369 -133
14976 -133 764 -323 -381 -187 -656 -279 -250 250 -542 -5 -267 98 349 -2 332 1182 26 907 -1046
14995 -1046 1031 -44 49 688 -526 -58 -1688 -706 -660 -549 280 262 261 -501 -831 -444 -485 -190 -724 -131
15015 -131 53 -261 -144 -601 356 85 -96 1009 -42 -98 -139 502 -288 283 528 -705 315 -426 900
15034 900 -843 852 -139 -396 112 -1169 756 -737 596 -355 -1213 811 -551 -79 39 764 840
15051 840 -425 825 -650 269 -8 749 901 -503 610 82 273 -997 140 348 -38 207 -343
15068 -343 830 -706 -12 -897 -203 -55 -192 133 -726 664 59 361 -7 -326 361 -821 576 192
15086 192 268 443 938 203 263 -1120 -378 -1308 -469 -841 441 -595 -707 -474 160 553 -616 79 659
15105 659 -165 1164 -361 -782 394 -643 450 -42 71 583 -395 -152 382 1779 -277 408 -438
15122 -438 -583 941 293 -76 -1213 220 578 294 830 159 424 -969 733 -824 136 -794 -643 1081
15140 1081 -371 74 68 735 -40 380 1273 -1542 676 -28 165 554 -267 -564 -853 -22 -726 -13 705
15159 705 -223 -2 -623 1779 -95 626 -720 153 155 -553 266 204 365 -577 356 690 -863 -875 -430 -17
15179 -17 283 34 1103 -1045 58 -368 988 805 -815 -824 230 352 -1012 -393 -139 -784 597 148
15197 148 690 564 -700 98 -530 -688 -1265 -112 182 365 -274 -19 -556 -997 346 499 -120 -547 -561
15216 -561 -340 -451 -462 -42 -238 133 -186 1242 444 -691 -124 -1269 159 -211 1332 128 -282 368
15234 368 -473 1015 -1247 302 74 239 283 -529 918 -609 -12 -967 318 -1060 -669 66 -1718
15251 -1718 692 -158 -211 838 592 330 -86 405 -242 457 503 -1477 845 -888 -395 1017 -3 692
15269 692 -705 328 355 -447 355 -744 702 -1223 -267 862 -125 678 -790 1005 -494 777 27
15286 27 -99 -92 -985 -451 404 123 -147 176 1285 -92 501 -453 267 303 -317 487 430 -97 -267 97 402
15307 402 -1640 -136 -1063 479 718 701 582 -48 1362 -393 -593 -804 -518 335 231 77 -585 -579 -187
15326 -187 248 917 -518 574 -140 618 542 300 1277 -420 948 269 794 -392 232 340 -4 734
15344 734 -1749 1227 -625 -57 -252 -1001 416 -755 -1270 535 103 -296 -909 1033 129 -14 -110 426
15362 426 -164 398 -193 5 596 446 -179 181 -757 -991 -475 -274 -984 87 383 530 1355 428 67
15381 67 -47 -128 77 -430 -86 -361 -402 683 445 898 56 -257 -993 -668 495 -710 803 722 -391
15400 -391 -175 -868 -15 127 317 -385 -303 -135 1188 573 -1489 768 582 -1160 786 -831 71 -1326
15418 -1326 568 70 -772 -15 703 751 -1006 178 106 273 324 -918 -437 -1699 -192 985 -454 1426
15436 1426 -656 -399 658 193 722 -751 79 -714 396 -1044 1076 723 185 449 -1848 334 107
15453 107 704 282 53 -349 -1858 33 -52 -271 -189 -665 -240 -938 1384 527 -1155 319 -317 1201
15471 1201 -1945 829 694 -200 -633 -560 1014 232 -452 -80 -659 -478 -1 -431 102 570 -222 -515 505
15490 505 -350 1277 229 194 -91 -737 210 -582 5 -203 792 183 621 1132 -113 103 217 -687 110
15509 110 -529 -48 -1446 217 -685 -121 1378 593 842 -571 147 -44 -1073 100 -259 321 663 291
15527 291 -168 486 358 -414 -32 833 759 -1231 -71 510 -88 -132 -319 -155 -1031 1055 580 -946 158
15546 158 -1038 617 -1134 -4 7 -1603 529 -655 -340 408 -679 556 -1443 1048 -636 762
15562 762 559 346 833 217 1133 383 330 -232 -108 1461 -879 152 336 756 -559 -687 -414 -297 429
15581 429 -250 256 327 -256 545 45 -684 444 -733 269 -815 615 -702 80 1046 576 891 59
15599 59 144 -551 -162 31 -469 401 -244 511 -559 -488 313 -263 210 -914 219 500 -73 1344 -824
15618 -824 134 -314 187 -795 30 179 -742 339 -659 834 -271 1258 -679 781 1033 -162 701
15635 701 371 1751 259 -16 1211 -868 -379 128 70 -31 104 -128 -1042 -652 -448 -768 -694 -325 59
15654 59 -500 295 -539 -527 319 -859 23 -961 446 22 -533 694 -19 -818 -319 405 484 472 -168 -235
15674 -235 -844 -1539 118 -266 -232 168 -812 -636 -513 -520 813 -214 -211 -193 215 78 -641 -31 -89 931 -1562
15695 -1562 1038 194 191 1412 -677 406 -608 116 646 -233 53 -1079 -435 138 93 702 -232 590
15713 590 -559 -602 -343 515 -527 -775 288 347 431 440 -350 -230 -23 361 -572 -1216 -1214 -341 -531 845 828
15734 828 -764 -70 -427 -523 -351 -38 323 58 1549 -1015 207 141 -814 764 -192 -624 18 710 -566
15753 -566 109 712 -284 789 -1165 -883 -112 124 447 -472 635 454 958 525 -762 -909 75 -954
15771 -954 364 -786 263 -224 386 468 -869 359 -544 1309 -92 -320 -635 -465 7 19 897 -1014
15789 -1014 682 -477 119 372 -597 399 156 -687 263 -835 1972 154 502 -352 -332 1262 -748
15806 -748 -162 -56 857 169 -743 543 164 -68 -668 828 -397 387 499 -53 1250 108 180 -800
15824 -800 -446 734 -604 579 -696 337 -428 123 450 -174 554 -713 1324 627 -71 -128 -556 765
15842 765 -256 -211 -1505 629 72 -1469 -18 276 109 299 -722 176 356 189 -388 845 -648
15859 -648 518 153 884 -185 249 468 27 -132 -621 -189 504 434 -697 594 1179 480 -455 360 97
15878 97 -647 806 -430 576 764 -862 1480 -806 -553 -108 -302 -602 254 541 -302 456 -580 502
15896 502 334 219 676 -1537 1386 127 1821 -341 -634 806 -104 511 -1341 833 799 793 2 -90
15914 -90 673 187 649 -64 1351 -282 -1041 2105 -1385 1204 -800 -558 321 -1162 -572 399 1478
15931 1478 -1505 -219 46 -258 368 95 762 -70 479 109 240 564 71 -268 -163 -433 157 559 165
15950 165 -1062 -128 281 -491 372 973 949 -147 -754 606 -110 -134 -153 29 -969 -422 315 -18 1380
15969 1380 -236 163 -1207 50 65 -1323 57 -776 -51 -488 536 -493 88 842 621 103 -324
15986 -324 255 369 564 1017 -308 426 657 -528 826 -70 963 525 -640 -571 -251 919 335 -281
16004 -281 -1343 978 -421 -148 1109 -692 382 -192 -110 674 -368 982 707 114 445 225 948
16021 948 -267 80 50 -184 174 249 671 -798 958 120 -55 -165 31 -575 -585 868 -768 770 -322
16040 -322 439 58 -44 10 27 -1356 213 238 332 -439 -828 630 1178 575 157 -1134 -47 379 477 300
16060 300 -18 272 41 261 173 -230 -1437 -381 -364 -139 373 590 196 873 600 -662 444 -262 1669
16079 1669 -355 177 650 -599 547 -572 697 -840 -255 339 236 -293 -617 1226 -504 194 759
16096 759 -657 -316 65 993 534 -26 -1471 -914 493 -1152 -389 262 249 1191 263 -449 120 -933
16114 -933 -188 783 262 -426 -237 -704 212 -44 -1915 581 -100 108 -251 350 -568 127 -19 -76 804
16133 804 -316 583 173 -226 327 689 153 -304 -279 -359 -217 333 315 478 739 -462 -105 435 354 1166
16153 1166 40 85 -1705 829 -360 -33 728 -663 -312 406 321 -421 135 -236 -42 1083 485 -231
16171 -231 -1257 -771 -189 -157 360 -1447 381 -439 -139 589 -978 959 209 349 -71 154 -17 -516
16189 -516 190 364 226 -64 553 -51 503 364 -662 1417 -208 777 -224 -741 1091 242 609 -742
16207 -742 -77 -268 -1608 267 -44 126 -300 775 -50 -320 -448 200 -706 193 650 248 -879 659
16225 659 495 921 671 -1048 935 -2 123 219 -362 145 746 665 65 413 -17 -67 -169 1199 318 -600
16245 -600 27 532 -31 873 -1210 400 -285 -138 -337 -95 27 -718 1197 -355 -346 -749 441 1057 -47
16264 -47 558 46 1672 323 -1015 644 -555 885 -820 255 116 -1215 706 -531 1171 -297
16280 -297 -652 533 51 552 -1016 30 -575 -512 656 21 -43 -908 919 -204 868 -1087 33
16297 33 1552 -583 338 -334 -1358 -110 -434 734 -1447 -219 -741 281 256 -343 805 -225 535
16314 535 -1993 -61 -422 -1347 -877 -278 -120 -239 -357 716 206 -74 62 550 -748 -796 -544 -227 219
16333 219 157 477 112 536 214 94 -752 -34 1040 -191 -55 796 1201 -498 -571 -502 -568 -81 1052 -1003
16353 -1003 419 258 -488 548 -1155 -190 -1421 -275 186 211 300 -627 1603 -274 168 -761 336
16370 336 1303 286 15 386 -459 -245 275 352 -207 87 -750 444 433
16383D33
$$ Imaginary data points
##PAGE= N=2
##DATA TABLE= (X++(I..I)), XYDATA
0 0 0 0 0 0 0 0 0 0 0 0 0 0 0 0 0 0 0 0 0 0 0 0 0 0 0 0 0 0 0 0 -1 2 -6 8 -11 12 -10 10 -10 12 -16 19 -22 26 -30 30 -31 32 -36
49 -36 41 -45 50 -52 65 -68 78 -91 95 -110 125 -148 171 -208 259 -350 558 -2088 -472 3848 5234
70 5234 4450 313 -4117 -5297 -5074 -1532 2381 4798 4526 995 -1865 -4691 -4393 -818 498 3752
86 3752 4301 3216 112 -3168 -3969 -3241 32 1136 4283 3572 752 -1368 -4140 -2202 -2717 2135 3004
103 3004 3322 2839 -1857 -986 -3608 -2413 -828 1794 3568 3045 242 -1857 -2195 -2783 -300 1277 3320
120 3320 3735 1446 -276 -3151 -3247 -1716 -543 1621 3358 1980 323 -1050 -2977 -1981 -465 1475
136 1475 3857 2512 157 -1583 -2652 -3369 -1283 44 1687 2451 2857 -536 -2088 -3564 -1809 -752
152 -752 1091 2690 1269 1335 -1182 -2340 -2790 -782 1665 1869 1937 1429 -1104 -1651 -3371 -1911 1157
169 1157 2229 3194 1608 826 -2249 -2527 -2088 402 2132 2631 2118 -319 -981 -3705 -1246 -541 1201
186 1201 2125 2248 1310 -1061 -2461 -2597 -2169 375 1014 2773 811 111 -2101 -3182 -2375 -573 2526
203 2526 881 2086 683 -2114 -1636 -1209 -1087 1319 1767 1816 795 -1 -1440 -1741 -2279 570 1433 2025
221 2025 2718 -727 -1805 -1523 -1386 -724 870 1987 2091 979 -732 -1421 -2202 -880 1015 1672 2423
238 2423 724 -352 -1245 -3359 -1747 316 556 2774 1998 -585 -1178 -2160 -1466 -410 837 954 735
255 735 -318 -1315 -668 -2336 -354 -620 1283 1771 1942 -671 -1116 -1192 -1943 -300 1298 1696 2843 -262
273 -262 -1124 -2505 -1149 84 -9 2068 2065 660 -1379 -624 -3086 -1253 127 1476 2204 742 853 -1456
291 -1456 -1570 -1536 258 1808 2896 2034 246 -1772 -2640 -2713 -213 840 2516 819 1232 -986 -1927
308 -1927 -1405 -1981 756 780 2152 2239 525 -374 -2452 -2194 126 561 1753 2308 783 -675 -2125 -2758
326 -2758 -757 664 1481 3057 1020 26 -2856 -2439 -1384 -1918 2311 2123 1456 780 -1508 -1402 -1154
343 -1154 -1235 707 1142 1850 533 405 -1830 -1720 -850 -824 1620 1764 1835 -621 -1062 -914 -1741 1125 442
362 442 2388 1209 1367 -396 -2408 -893 -1630 316 1533 2397 1386 218 -476 -2144 -1008 -442 1097
379 1097 1565 384 1154 -1281 -1007 -1167 -1138 1178 678 2201 431 441 -1305 -2074 -351 389 2124 895
397 895 745 -141 -930 -1132 -1555 542 764 1691 1241 672 -550 -1397 -1192 -1369 991 242 951 1581 -792
416 -792 730 -1831 458 -81 988 2157 237 423 -1341 -1237 -2460 -6 862 1099 1288 998 -1175
433 -1175 -2176 -354 -1192 -770 1027 1861 1976 -36 -481 -1474 -617 320 661 891 1308 201 -678 -2304
451 -2304 -422 -1178 992 1587 263 1321 -694 -1766 -1897 -1156 569 841 1848 976 988 -546 -2663
468 -2663 -532 257 1240 1096 573 308 -831 -925 -925 -1191 -1136 2325 600 1119 319 -1719 469 -601 -184
487 -184 618 154 722 -783 -121 -1319 -263 -385 763 369 1122 985 -1221 -1124 -2069 -596 868 164
505 164 2105 536 -257 410 -1381 70 -997 1689 124 1668 74 -886 -895 -1901 -848 -225 668
522 668 173 557 -148 14 -1099 -1132 263 1499 353 1094 351 -1760 -401 -1263 984 500 1159 1249 824
541 824 -699 -2304 -467 -914 557 -62 630 782 -492 -1262 -1833 85 120 596 2129 1448 560 -874
559 -874 -816 -163 -1003 1221 942 1658 -245 -88 -1506 -1677 -53 -526 2504 525 -124 49 -2417 -657
577 -657 -1054 111 684 924 898 156 -791 -2527 -977 -560 180 491 1083 1088 405 383 -1100 -958 -966 -526 1792
598 1792 872 139 248 -1764 -1767 -790 1140 -415 2559 788 -601 -809 -1359 -956 -12 884 1061 960 91
617 91 -799 -733 -1241 -92 1020 877 594 30 -130 -1119 -999 -39 1020 2113 -6 2005 -928 -1617 -774
636 -774 -1930 -40 -70 901 181 822 -44 -1461 -367 -1122 735 1594 19 643 -928 215 -1500 360
654 360 679 1150 1032 -311 366 -524 -133 93 -186 527 -695 945 201 268 -996 -898 1133 68 -66
673 -66 -190 376 -895 -1337 -283 -1109 1381 1427 682 983 367 -852 -1403 -140 -908 -31 -188 -53 451
692 451 -1303 -856 -934 -103 317 519 843 -290 -232 -215 -1609 -136 126 197 1259 1365 69 -896 -329 -1339
712 -1339 -588 -847 2123 -931 969 -401 -849 212 -816 -75 707 445 1721 -1174 -1619 -226 -650
729 -650 720 318 1440 384 876 -676 -453 1 -1437 1238 680 1352 322 -1122 -661 212 297 -237
747 -237 1314 643 93 -537 -458 -1165 517 895 1195 711 1628 -105 -394 -1542 502 -509 -530 -51 -87
766 -87 1294 -39 -182 -1096 392 1398 -131 1090 -161 -244 627 199 -754 -581 983 910 342 296 -1652
785 -1652 -705 -655 672 -1698 858 3 449 51 -1143 -339 -1207 -506 351 1090 -208 -372 -904 -278 -170
804 -170 15 -570 416 -1164 -4 -460 -357 745 -1125 1184 531 958 -822 -26 -210 -1023 657 -152
822 -152 956 2164 -584 -1579 -434 -271 -220 775 208 -143 2188 125 1039 -1348 -1247 638 515 1509
840 1509 379 337 -1089 -50 -837 -23 798 854 1735 419 495 94 -1859 -92 -872 609 654 -184 -178 -575
860 -575 -770 -1573 -281 -1317 892 1251 1739 1053 -213 -1041 -979 670 843 675 646 529 -881 208 -597
879 -597 505 -414 147 -167 1194 -457 -1633 -684 -1024 279 -421 1019 -400 -81 505 -1681 -983 218
897 218 227 -213 1406 465 194 558 -686 842 132 -497 1169 215 894 -519 -991 -827 -1136 294 -461
916 -461 1136 -203 -468 -214 -316 -105 -111 -1 1496 -160 172 -805 495 -5 311 917 316 644 508
935 508 -520 -235 -199 540 208 408 889 -131 -146 -1106 388 730 412 -385 543 -333 -145 459 -1964 -839
955 -839 1064 897 55 616 556 -157 -20 -901 281 115 100 -327 -410 1188 -858 83 -70 160 1039 379
975 379 61 652 -1450 -902 -249 1020 1030 747 260 552 -1635 -1007 -924 -965 324 535 108 692 717 594
995 594 -1664 27 -281 1348 613 -627 311 -188 608 -25 -821 736 384 1246 -174 -347 -789 -1383
1013 -1383 -1160 -155 941 -574 -264 -6 142 27 -1143 -801 -441 288 533 -345 -21 -1535 216 -675
1031 -675 -81 742 -32 339 -1417 425 -937 978 646 410 248 -1203 1126 14 328 298 -656 413
1049 413 499 765 943 -684 680 325 165 -529 180 278 578 275 -1120 293 -767 6 -1432 -257
1067 -257 -201 -1270 315 -1501 -30 554 -18 -274 -251 861 154 372 -772 45 -148 -1294 1809 241
1085 241 -1338 -57 -1169 490 -661 1009 99 23 561 -691 105 -861 1776 152 102 555 -976
1102 -976 640 -1006 -723 -242 13 906 583 431 -174 -633 -133 469 -187 -706 342 1059 1100 -224 -269
1121 -269 -979 -559 426 -46 674 -90 -566 -374 -1349 -14 203 909 896 231 237 -309 -720 -798 277 -331 728
1142 728 1934 -442 689 -1347 -937 52 -393 445 -371 427 -45 431 988 -577 -150 -887 399 995
1160 995 -972 515 -583 428 -738 1125 372 -303 435 -246 -865 -988 -334 -300 653 79 -257 405
1178 405 -722 598 794 -101 468 -157 1470 -715 384 -445 -330 -819 36 -574 353 -628 -218 287
1196 287 -995 -623 -322 205 678 597 493 -172 -1442 -156 1065 324 983 551 1107 -76 458 1113 -750
1215 -750 655 1264 958 199 959 -246 -1039 694 -156 457 725 282 114 -782 -665 -1000 -101 352 314
1234 314 486 617 176 -1646 677 -494 -27 73 -112 2070 -249 45 181 358 469 -125 912 41
1252 41 10 349 -647 -657 -929 378 -259 14 -198 -33 147 -167 973 -1004 372 -1108 317 -111 -1803
1271 -1803 -365 -620 -29 -413 575 255 169 575 -1935 547 744 -208 511 896 1541 221 697 312 -1444
1290 -1444 392 -300 -41 890 -63 -457 -888 -406 -965 793 576 -213 463 -328 -501 -447 472 245 -127
1309 -127 808 424 90 -174 -91 262 67 389 47 -91 970 -855 -1326 -896 -815 -1179 161 52 -424 -282
1329 -282 -1655 827 -556 1395 785 873 1039 -1034 606 -1291 358 219 -728 -418 -209 301 11 -560
1347 -560 -244 -1175 1528 -35 363 -187 657 239 24 235 -38 58 950 1064 683 -609 210 -648 577
1366 577 171 -644 192 698 30 -256 -251 -689 643 706 1072 1126 -42 167 -161 -547 46 -417 159 174 329
1387 329 -537 110 -157 -376 544 391 735 -495 562 -476 -429 139 -1659 -56 365 -122 -35 -217 -315
1406 -315 169 -257 -521 -760 -334 281 -390 190 396 -591 -156 -612 903 818 68 -183 -488 -830 -247 -211
1426 -211 11 552 -688 853 -124 310 -1783 156 519 577 195 -897 961 -156 264 95 657 513
1444 513 387 1099 -1568 -997 43 -518 -671 -764 352 95 -1225 -1173 -2 118 -121 19 -625 54 -215
1463 -215 -1094 199 -466 111 -501 110 384 -336 1157 -669 109 190 830 59 -829 -631 71 -660 -88
1482 -88 30 1521 372 1027 -773 654 -1625 815 -334 -316 203 404 1058 -313 452 -1279 -1593 -455
1500 -455 -350 -429 -393 1156 69 -215 -822 171 823 567 -446 1082 1563 978 78 -909 286 -157 662
1519 662 -940 -443 -183 839 -90 14 903 -84 638 -489 657 923 -960 -490 21 1131 384 149
1537 149 808 -303 362 -171 -568 379 1167 1190 361 570 -99 879 778 -1339 -734 913 1049 -931 254
1556 254 104 -195 -151 -613 704 -490 -482 199 -787 -1305 -489 863 -237 -459 -59 -596 -686 -1013 56 72
1576 72 550 194 -596 275 40 -1066 -129 -549 -394 -19 1540 749 -209 118 -939 737 -136 1516 -78
1595 -78 -537 -94 -719 -1119 -853 -47 196 -591 7 898 -147 -270 198 -217 912 1258 -273 878 -826
1614 -826 -879 -920 169 499 -195 1087 -16 256 -1275 -316 -1169 -893 669 139 -254 174 315 1195 -29
1633 -29 115 -423 766 503 -29 681 -102 -232 51 136 -571 366 322 -1065 22 -1111 126 264 431
1652 431 835 -86 441 -177 -663 -1 60 -423 -612 101 -63 -236 524 -763 -286 14 978 -249 206 -305
1672 -305 15 528 617 274 -874 77 714 623 539 -807 -122 -851 -244 109 -815 -128 -105 -53 -637 -710 -949
1693 -949 -36 708 -1143 383 -418 -409 -156 -40 99 -547 1038 12 221 463 -794 673 657 552 -456
1712 -456 824 458 -311 1341 -558 206 19 -730 651 250 -652 -811 -235 -184 -179 611 -1722 121 129 1250
1732 1250 -699 -244 908 633 -67 -1450 208 294 -1030 -631 57 737 680 -84 -795 -506 301 -737
1750 -737 -366 -12 585 18 -649 223 -1010 3 -760 974 -732 156 -355 47 -258 -180 -527 457 -1129
1769 -1129 3 -358 -279 -436 -314 579 -435 632 -816 564 209 43 124 -420 586 -353 -198 131
1787 131 -703 1325 -377 697 -254 -3 1064 872 904 -309 1661 481 -1412 685 339 -242 301
1804 301 554 466 -696 -33 -383 -232 -1700 -119 -205 -167 1 -127 -296 -900 97 544 -695 1526 481
1823 481 285 605 740 169 44 256 -299 514 -916 404 -46 -627 98 -1821 434 -728 47 1378
1841 1378 -1211 319 -564 609 956 618 412 -1128 336 -274 415 -903 335 -248 -73 -807 -950
1858 -950 159 -401 -445 908 723 -539 117 116 483 554 383 -529 269 -457 543 -504 -155 -443 271 806
1878 806 -1242 256 15 172 746 -618 -16 458 -472 1520 402 321 189 679 -301 -882 -762 -177 1107
1897 1107 10 -33 233 -820 556 -282 519 -360 -336 372 -10 419 -165 108 -635 773 -470 -1468 112
1916 112 -1319 297 -934 -230 -96 -1017 822 -1201 70 -320 -294 -25 -19 19 271 -213 581 -428 -948
1935 -948 -1623 175 116 907 -156 -567 230 -572 733 -705 19 -79 737 -764 859 643 -869 -152
1953 -152 -194 1709 -324 326 864 -212 -555 -11 -357 159 -777 827 -920 -100 -310 -1082 1131 63
1971 63 558 -205 146 -329 -966 139 -817 1173 -758 -134 -367 745 6 -1009 228 27 107 323 -184
1990 -184 15 324 601 -818 -214 993 -1048 812 -38 1085 -669 -320 -529 378 1196 98 231 -672
2008 -672 172 4 -719 558 595 338 481 -1041 -207 -1402 743 -748 -430 486 639 908 -437 -299
2026 -299 476 -576 719 109 514 -100 -103 377 319 165 -430 308 481 909 -560 -173 684 -468 335 1001
2046 1001 1101 -72 -109 374 -960 1350 -133 349 172 -164 224 204 -191 -711 468 -460 -322 1 -977
2065 -977 664 180 593 -605 -742 483 308 -995 146 703 -274 -261 161 -55 428 -309 -112 90 -398
2084 -398 -181 -1249 -37 -146 -321 397 -545 145 347 464 786 -592 829 -493 1336 -354 776
2101 776 -1071 -68 464 79 -434 290 -445 1389 -703 1160 -114 655 -13 7 -1051 -111 169 -918
2119 -918 578 -209 351 -454 -457 -147 -497 -239 -350 880 795 -1019 442 -1162 -900 -198 1220 -1554 -1020
2138 -1020 264 -578 311 -379 -333 -165 -599 542 -554 420 605 -62 95 -180 326 76 -797 -42 -428
2157 -428 170 -1274 28 -364 -303 -9 108 803 224 521 -734 45 -264 -267 -502 298 325 -74 48 268
2177 268 -182 -586 48 954 312 62 476 72 900 -804 -69 128 -479 523 -601 418 -850 396
2195 396 -692 -327 159 -649 746 -1237 -305 -79 -169 172 144 590 212 61 -364 -282 1159 -890 1105
2214 1105 -1172 133 -573 -432 -154 -576 1072 -351 -465 761 -82 875 -245 553 -813 43 -545
2231 -545 -825 583 -445 867 -399 874 -791 -407 -141 187 449 703 -743 622 408 358 -762
2248 -762 -62 369 -221 -314 330 1013 -815 -14 -123 59 -147 -602 1028 111 -444 -358 213 -208 -790 492
2268 492 -464 274 -65 -1286 -316 -488 100 1038 -186 -33 475 38 462 -663 253 -598 109 795 -778
2287 -778 -563 306 -233 -623 -265 -1249 26 -222 922 -3 1330 135 378 -172 426 -14 -589 320 887
2306 887 43 263 -120 298 -669 -12 762 -669 191 929 1156 1952 648 -781 -982 616 -1013 -136
2324 -136 -614 399 276 -391 429 -510 -50 720 -81 -175 -937 472 -184 -266 -320 573 -210 -988 133 -230
2344 -230 1171 -216 -303 -508 -138 -64 -365 -346 643 213 731 -565 -288 796 -182 -158 -524 1111 -383
2363 -383 -563 199 -1215 416 782 590 -344 -1390 552 -540 418 -113 659 104 -108 912 -1442 816
2381 816 240 393 80 -977 507 -511 1184 -89 747 362 -116 696 -909 -4 591 -184 -289 -541
2399 -541 1142 -877 -982 -320 1712 106 1426 1484 134 -628 -630 876 49 161 989 -940 682 -1525
2417 -1525 -269 -213 322 474 -999 780 -861 700 131 -536 -450 -586 162 694 -24 -111 -794 822 332
2436 332 -442 282 -110 905 207 137 319 184 -540 -193 935 738 76 -462 2 28 147 -214 -19 -120
2456 -120 -195 58 -629 134 353 9 -10 598 -368 215 -876 555 268 -376 -401 -730 261 142 712 -551
2476 -551 835 -475 681 17 -692 896 -510 232 129 -1029 819 616 1094 -913 241 -803 807
2493 807 -336 -1067 898 -635 247 587 666 204 -1142 -271 -1346 -555 -909 -525 321 -567 958 386
2511 386 961 -861 650 -16 -618 326 -127 406 -319 218 66 17 543 -41 -583 473 366 353 191 642
2531 642 299 1628 282 -172 -851 -299 830 -265 528 -69 -999 1129 -549 -84 -292 335 353 757
2549 757 1189 932 386 -905 -292 -707 157 -287 55 383 -165 -8 95 241 -18 -132 81 481 -626
2568 -626 -565 474 546 -375 455 281 -161 307 -469 206 -380 319 18 593 639 -849 -570 -698 191 -69
2588 -69 -676 590 -890 -678 4 444 -268 -262 28 -1381 830 -544 247 144 -1239 -277 -351 -308 -478 -502
2608 -502 1074 -643 150 -95 397 -645 508 262 590 1199 -130 242 -604 571 -659 -604 -584 -466
2626 -466 23 -14 -86 -72 -314 -147 -383 629 368 -1101 641 -1190 243 -134 -1193 299 -961 184
2644 184 -88 157 -677 394 -792 -1144 273 -501 15 934 -129 -420 -861 1070 815 244 1047 128
2662 128 -398 26 221 -296 1039 -389 -263 1183 -1468 -235 -542 408 511 -1032 309 -533 4 -942
2680 -942 412 596 112 371 -325 1619 -530 -137 -54 -537 230 -1045 1343 -374 761 -757 -378 -555
2698 -555 -203 -115 1257 678 829 -184 -52 -903 631 188 -80 1301 -61 -115 4 627 -1162 -573 -19
2717 -19 -993 -301 45 -414 -473 -82 -148 -547 512 44 -37 459 -382 1584 -571 -20 237 -216 656 -72
2737 -72 -552 416 -153 1402 -77 -588 -988 718 -314 -998 722 -147 -304 -987 520 -263 -74 -30 161
2756 161 48 256 593 787 340 27 296 -325 -78 -249 292 -290 1137 -1444 841 -952 372 -234
2774 -234 4 -596 104 851 -551 402 210 -737 361 -271 229 -747 588 -1208 39 663 -499 283
2792 283 -472 705 1207 110 51 -607 56 -65 -813 -762 -498 1084 -1813 -109 127 515 149 224 213 -568
2812 -568 663 -427 -1161 584 -604 635 -265 116 -385 128 1219 497 365 105 199 521 -258 -126
2830 -126 -23 -270 -61 -228 315 1658 179 294 708 24 -81 -149 542 92 -87 526 117 106 -26 901
2850 901 126 -627 780 687 -631 1189 -205 489 2 251 -501 -599 878 -1018 180 -1110 -281 -979
2868 -979 41 -800 -584 378 -955 77 252 490 807 -422 -276 -912 231 -177 -126 245 -203 805
2886 805 -457 475 -93 165 468 128 282 195 -426 -558 137 -592 -482 164 -750 -23 -600 -204 201 -194
2906 -194 -681 226 -135 244 685 -240 -1800 670 1081 -285 -236 347 979 -98 1148 -1004 -529 512
2924 512 956 -201 -702 547 -138 745 136 -125 776 -743 -105 148 -771 -275 1083 637 -644 400
2942 400 93 100 1855 82 473 -1192 -38 -198 -104 -336 -229 725 564 -239 113 -531 782 240 116
2961 116 -406 158 -511 -974 550 -487 395 44 -248 245 562 -1319 247 439 119 672 207 -267 493
2980 493 -1262 1182 311 -547 221 -587 553 -1166 407 -22 -581 -1051 -878 506 -1212 34 -66
2997 -66 -315 -144 -64 165 -347 -18 75 158 1225 -580 586 -220 -581 715 204 -431 -175 110 -633 1087
3017 1087 -229 -386 1721 -649 327 -413 199 92 -61 345 -609 740 -485 -414 1077 -361 673
3034 673 1085 -1385 -913 -272 746 -1060 1415 39 135 152 -470 24 -236 717 1277 932 606 -487 115
3053 115 -1229 1273 7 -13 826 -96 564 139 122 -166 522 -203 -360 -29 -571 221 -957 -353 475
3072 475 672 463 -425 -626 -406 -844 227 -148 1435 -569 -146 -816 739 497 -528 1166 -118 -35
3090 -35 -1018 -1477 -155 -191 519 -555 -100 -283 773 172 -302 -716 -1520 398 -412 -214 1462 -242 1553
3109 1553 2 210 -1063 -643 -198 586 1236 -1511 319 243 619 -886 -300 -521 74 -560 -720 464
3127 464 962 470 1452 419 791 -341 -1589 -297 -1424 10 129 -805 608 1068 178 431 755 -487
3145 -487 -1172 739 -726 109 -550 595 692 -648 878 -58 -73 -747 -184 1 -244 48 -203 761 -297
3164 -297 1005 477 -977 115 -358 173 701 -834 195 -1004 49 -426 -434 -17 -146 1245 -273 282
3182 282 -182 -273 278 499 735 127 319 95 359 -671 -544 -809 -374 121 -1103 1147 -1243 47 -188
3201 -188 474 231 -211 526 -645 -77 1387 450 -814 -413 273 1328 -665 448 -744 958 465
3218 465 448 250 331 667 265 486 1260 -81 593 -851 -168 -206 -255 75 -639 1159 -478 100 -873 382
3238 382 -719 35 547 218 -379 -415 -200 352 232 525 -463 63 -15 594 146 -1358 1003 -366 1219
3257 1219 -194 511 -539 -826 310 -550 273 -138 421 676 -416 42 308 393 -794 92 1086 -592
3275 -592 662 -295 175 -846 1117 -409 124 117 -966 147 342 -1074 -74 -749 22 340 241 977
3293 977 121 -291 170 984 -472 -142 -13 -25 -57 -809 536 200 -149 99 -6 -150 476 1306 189 387
3313 387 912 -511 706 -281 941 -222 564 462 -79 -29 -1236 518 -1170 -990 1025 -434 -288
3330 -288 34 -36 -435 -203 615 188 549 -309 421 78 -782 443 -224 -276 166 251 236 -963 173 -531
3350 -531 -482 -705 314 -697 0 -812 -624 787 -1010 124 251 -611 345 -533 47 25 439 -815 -706
3369 -706 507 978 976 -445 192 -204 -428 -291 -685 110 102 459 608 388 -139 370 108 -589 -115 1256
3389 1256 175 454 -838 -82 -501 517 442 -430 -428 -79 356 -270 303 469 -299 872 -560 -1195 971
3408 971 261 1005 -1339 722 214 398 364 -618 961 -575 -518 -288 -727 450 -160 -55 -816 65 -187
3427 -187 -541 1231 -425 785 -992 -125 828 -882 -94 -428 863 -365 -489 57 252 -939 -1270
3444 -1270 439 -583 825 1095 -901 1379 -490 455 -634 679 602 -152 1199 212 1289 -447
3460 -447 206 -946 -686 279 -218 972 944 -849 -332 176 1182 -42 1212 -1145 943 523 -148 1247
3478 1247 -805 -310 -562 638 -263 -223 74 -1174 510 -1602 -319 -414 -1010 721 -677 1441 -67
3495 -67 -22 311 1090 590 270 788 -658 -29 332 282 17 -392 570 -327 -1379 737 305 156 -412 361
3515 361 -218 904 225 -1037 -36 -213 -482 24 -691 117 -366 -215 248 -268 55 -58 845 -497 -85
3534 -85 386 168 483 -798 498 105 289 548 -756 629 -9 -352 -301 343 -272 272 725 -980 -657
3553 -657 -406 -163 1490 324 91 -504 1073 -116 -155 204 24 1336 -1075 75 -303 -349 462 -1
3571 -1 -339 -118 459 -360 -142 -150 -241 773 -747 1360 -325 146 690 -556 -1079 170 -494 52 -247 -284
3591 -284 -151 -379 -781 -5 156 -59 81 -654 343 -716 -70 -641 -512 1131 -672 0 -303 -495 -178
3610 -178 -267 139 283 -864 12 564 791 -119 4 -271 278 -240 225 815 -808 -673 -3 310 225 -403
3630 -403 -38 -1188 -384 212 891 870 -810 452 -273 511 -934 648 200 194 -444 30 376 754 -436
3649 -436 -785 -278 680 -896 420 116 -236 -411 -255 1280 70 134 -320 381 798 -149 441 132 806
3668 806 -699 -407 -323 -685 732 816 313 390 -95 394 1133 791 98 -164 576 417 168 -114 -144 96 1128
3689 1128 261 -61 -16 93 389 325 285 -231 -634 -554 -354 474 -78 -906 578 -956 62 -564 559 -748
3709 -748 -1297 305 694 -449 -705 -568 563 -297 -297 -654 1223 -1206 -326 517 -1005 468 -1199 957
3727 957 -165 219 211 -1278 1373 -1915 -92 -91 612 -312 -470 -355 -642 337 -684 1123 -437 857
3745 857 79 884 952 -712 -301 909 -504 -508 -6 542 -386 741 893 168 145 -49 -126 68 -658 62
3765 62 -611 531 -125 825 -312 -256 323 -661 553 186 95 409 482 389 1304 805 -271 289 -590 644
3785 644 -299 261 637 -291 -1255 292 -122 862 77 75 -10 -594 -346 -540 -54 -91 578 -172 -33 889 -584
3806 -584 851 -647 424 454 -235 -184 -782 35 -322 634 31 593 693 -179 414 235 288 -970 -162 318
3826 318 -449 -413 -1121 687 -57 323 413 -287 297 -1036 786 -517 293 -122 -145 -53 251 604 -334 -221
3846 -221 -470 -1317 84 345 64 -35 -153 -368 88 1348 230 279 256 -115 -1487 -588 64 -841 -314 -421
3866 -421 20 -575 -944 -502 -924 -469 -291 301 1324 -379 -119 1437 -26 326 -505 686 -140 -854
3884 -854 -535 101 -200 -14 -170 57 396 278 -37 118 -557 652 -18 272 592 -1385 543 -476 -87
3903 -87 -1379 349 -289 -526 -354 339 486 -626 -304 723 -198 476 -541 -275 55 -17 -400 83 693
3922 693 -1625 367 -10 625 526 -52 783 -632 -683 750 63 906 -552 1094 -1205 884 40 -1048
3940 -1048 413 64 -301 -430 1206 -644 -352 326 -242 970 864 -145 -58 784 227 -1034 681 -380
3958 -380 617 5 313 940 -989 785 241 -1166 -423 -831 607 -63 -344 617 -386 739 392 308
3976 308 -1473 -97 -761 253 183 -478 455 -95 245 -34 337 1001 -1073 -782 -572 221 602 -1401 173
3995 173 -868 1248 205 -33 50 59 -190 -377 1035 243 -9 -271 -476 347 -292 -174 114 184 1253 -1853
4015 -1853 754 -1172 -473 100 -327 22 -570 483 695 602 761 237 774 -654 1170 -507 -139 -168
4033 -168 118 153 -519 1238 206 573 286 603 1162 -1110 792 -836 -88 789 -774 -1027 -1266 -242
4051 -242 -964 696 333 -1023 792 -763 59 324 -81 -776 -568 924 -312 256 229 -416 620 489
4069 489 68 308 -74 -1319 313 -385 -780 650 936 -2 -30 85 367 -798 5 -1160 471 362
4087 362 -582 1041 -1537 975 -91 -630 -378 -121 128 -1722 125 19 66 -143 -869 312 -1107 -173
4105 -173 519 -688 -1204 28 228 -1712 680 -232 242 871 928 804 80 107 -169 651 460 -515 341
4124 341 -334 63 -1389 523 279 -410 504 -921 1083 -578 -617 547 -1128 213 -340 545 -951
4141 -951 -411 -180 -633 814 -412 -103 -286 -287 911 -231 626 69 112 130 98 579 -361 -259 -1191 -556
4161 -556 -772 -497 609 276 541 -996 885 578 -82 370 -998 235 -142 872 -1374 839 1015
4178 1015 -730 184 -789 -758 -874 -460 218 -14 -499 564 180 -572 -777 680 908 -570 119 -1306
4196 -1306 -309 -288 -804 16 -301 492 -225 404 -1152 -87 -703 181 848 -70 533 -1338 -203 292 -1050
4215 -1050 1008 -1475 823 181 522 76 -947 -185 -711 62 -1533 464 -985 105 1179 -744
4231 -744 714 -728 140 895 461 297 440 1039 744 1376 -344 -497 1036 -504 251 -489 920 -204
4249 -204 -201 -672 -738 151 -479 -372 862 890 282 670 -334 -82 406 -115 674 -86 240 -322 -711 -549 169
4270 169 -946 -44 195 359 -41 -789 187 -464 1275 -204 665 852 -266 529 -765 1726 208 -374
4288 -374 498 -672 -667 -536 -245 596 -32 -1 -118 129 -140 798 -290 698 1104 92 770 42 505 112
4308 112 -565 -656 -409 -684 -1180 405 623 -653 1034 289 859 -1336 1207 -483 642 343 -242 1292
4326 1292 -289 -490 -1342 -241 -857 -119 733 -532 968 -498 307 -364 -1547 702 -983 974 -107
4343 -107 520 -148 184 558 -585 -153 -839 -88 354 -596 -688 157 855 216 -884 -781 836 -95 -910
4362 -910 865 -433 229 -642 169 1058 -352 1066 503 -490 404 -351 -133 -1493 -599 467 -133 493
4380 493 -186 731 363 -686 -562 -203 925 938 952 0 -768 703 -1492 -10 631 414 287 -1403 1136
4399 1136 -320 -288 621 -87 -54 -85 -231 851 902 -758 -960 796 -968 1314 583 635 -150 -54 112 -532
4419 -532 795 210 1092 55 328 213 -966 337 -671 1029 -773 -20 818 -1444 -19 -19 143 -936
4437 -936 314 513 -417 993 -28 9 -537 563 -303 -102 -347 104 656 -1083 -212 1275 -234 34
4455 34 -824 1159 -365 -354 1194 -286 209 -58 -676 261 -1053 313 -1055 -126 784 159 533 -550
4473 -550 577 645 1138 699 949 416 -253 1113 -409 -671 77 -280 193 -979 2003 -923 -150 1656
4491 1656 -1339 799 -427 613 210 -592 643 809 -268 -169 64 637 163 -263 1012 134 -607 210
4509 210 825 -122 -340 328 -184 -131 426 -221 1411 876 -756 1181 -338 307 -1040 360 -910 -960
4527 -960 366 -651 -90 -23 -392 -617 184 279 -883 -445 199 1257 -609 365 212 -1005 -805 368
4545 368 -460 295 -401 1276 211 -437 700 226 340 -727 31 102 -17 -236 -276 495 594 437 -1275
4564 -1275 457 -129 -359 422 514 -514 301 409 726 -558 910 -956 -466 951 -7 -10 -248 1031
4582 1031 673 198 647 -322 -288 -929 -191 -241 500 575 -1002 663 151 571 187 1313 238 267 1584
4601 1584 548 970 -310 290 -975 626 -314 51 64 65 -85 86 -76 1166 -429 -1271 -1162 279
4619 279 975 -1395 306 15 -38 747 140 304 676 387 -722 -195 53 -48 13 104 824 -496 -130 -1307
4639 -1307 -509 90 -247 15 -8 -962 -90 -473 -858 -322 510 -1036 -796 215 -801 1480 -256 -160 -389
4658 -389 -1026 802 60 793 -570 160 758 542 542 -495 282 -543 988 -508 -304 1400 449 560 -207
4677 -207 682 183 30 1662 -412 203 455 703 -273 -535 868 12 62 83 172 587 -293 899 -364
4696 -364 301 -701 308 -22 -656 -1308 482 926 -576 -32 105 -686 379 -764 367 997 227 -358
4714 -358 434 1837 -1145 -535 349 641 -836 -458 114 -395 386 306 1538 -41 -1061 -186 -554 807
4732 807 284 -363 492 -493 676 -655 -1030 373 -177 -292 508 1045 -734 237 -633 -340 -130 -18 1134
4751 1134 785 832 659 -220 -1130 305 -1071 -383 -882 310 1546 -82 -569 1146 429 485 187 -2
4769 -2 248 -385 375 -106 -608 49 -164 -65 -1080 -454 -630 59 54 -1374 398 -1437 -15 125 -474 144
4789 144 -101 992 406 -469 -744 -244 392 -905 1111 20 274 -248 -885 505 -338 -160 -291 683
4807 683 1305 -224 364 -550 -151 356 605 -123 -454 657 -898 311 459 -98 -279 -153 954 773
4825 773 690 -220 535 275 -479 -915 62 47 -345 1089 -501 -650 1183 458 360 194 163 938 1220 712
4845 712 -1621 -223 -489 -422 -369 -550 -359 -185 -292 1813 132 534 328 322 1059 -109 -221 -492 629
4864 629 -839 366 446 -38 -239 -211 367 -128 187 -417 469 625 -33 991 -1052 593 9 223 1852
4883 1852 -405 870 -498 -246 -229 -535 635 -1277 -353 -656 1151 831 -869 292 -249 195 -512
4900 -512 -153 -229 89 234 -588 82 -367 179 194 -1445 838 -87 -709 360 35 42 -402 644 611 467
4920 467 -311 795 279 -316 -953 -384 1173 -592 -134 -75 279 123 -123 228 452 -94 396 -6 421
4939 421 -102 -600 44 23 489 -878 531 716 -268 388 933 418 -132 820 617 53 473 796 -164 610
4959 610 -469 358 -801 334 -1303 630 1158 265 457 -823 198 177 377 -219 127 142 598 754
4977 754 -828 729 -1346 594 -91 -1157 1077 277 15 -441 1063 -1403 -913 716 -1756 451
4993 451 -1049 1541 229 286 648 -1268 458 825 828 -125 -462 78 -1529 349 465 128 -509 -1082 -839
5012 -839 -522 191 7 -7 131 -1240 -536 15 800 -153 -223 549 -963 -148 -371 -451 53 -90 -282 -334 1
5033 1 523 301 261 -97 818 78 1020 -578 -468 806 -259 -31 -1575 -144 555 -417 1007 -350 163
5052 163 -561 -94 250 665 469 383 389 -173 754 532 -1052 -1078 -237 1391 -91 630 152 153 -366 -1330 553
5073 553 -893 -382 454 -346 -98 -1954 364 -1084 135 -65 -572 92 -712 800 -757 502 377
5090 377 -650 915 -233 98 49 -140 450 -1032 -89 -131 304 -425 -495 -1175 -454 615 -763 695 -1113
5109 -1113 -705 513 -730 342 -512 -170 -34 6 688 337 749 -100 233 -641 -105 -194 -100 280 -1558
5128 -1558 -193 -211 -140 409 329 -563 93 57 944 269 -404 -279 223 -989 -700 252 -606 832 1458 -123
5148 -123 649 -889 1208 -1046 1018 134 169 319 -43 610 -165 247 -1654 161 -541 -319 2 -239
5166 -239 544 -73 1908 -177 -231 465 122 1590 -1494 912 588 -324 54 -1722 528 -223 83 -758
5184 -758 525 -296 -624 -19 -257 564 -83 -138 514 228 232 -831 -414 368 -104 215 -1151 1067 -607
5203 -607 -499 -450 -356 134 -654 45 -493 -43 -7 481 141 -311 -30 -881 -470 -186 928 148 599 150 -323
5224 -323 207 -719 -412 -577 -202 186 -486 -84 197 349 500 852 21 -858 -18 183 -792 595 -486
5243 -486 -106 474 158 -373 -43 164 759 -77 -8 -700 480 -1315 -467 -965 -66 -253 -831 333 -1029
5262 -1029 -116 1176 483 256 -800 31 -942 172 48 844 337 -1076 891 -106 428 -126 366 1005
5280 1005 -1506 99 -100 575 -628 247 -553 -607 354 427 210 34 -1116 574 -689 1026 -617 88
5298 88 806 -807 -558 292 561 -450 -56 -658 -1135 -649 371 -719 -403 -165 358 85 366 -469 426
5317 426 775 -163 579 -880 219 457 53 -82 -258 -485 -130 -669 -1085 -725 -434 300 1432 383 343
5336 343 290 -5 744 -405 966 -639 1446 -110 -224 -112 4 576 -659 493 -691 109 531 551
5354 551 26 -1108 -80 -455 -148 315 -45 957 -862 1187 -477 -8 -15 269 1316 -248 -807 -490
5372 -490 463 594 -711 34 -554 -556 -32 -121 775 169 477 374 29 -702 -788 -317 -297 1078 -1115 799
5392 799 224 -673 -354 -920 -417 -238 -714 9 -180 -201 -932 813 -622 -462 761 -166 -492 -634 377
5411 377 -377 295 908 127 232 -623 1141 -325 784 -21 -842 583 -539 -99 428 -169 266 -887
5429 -887 -986 1125 628 -67 -382 682 1003 -419 685 -168 1322 -297 178 144 460 -703 -1068 559
5447 559 -1296 31 -667 329 -758 26 715 -733 766 -541 -572 -514 452 -1046 -645 796 -1099 37
5465 37 -632 -489 -366 100 -473 293 -215 -49 -26 183 -223 102 -63 26 -927 2 571 -381 427 -779 64
5486 64 -27 523 835 -221 407 -540 -450 145 37 -442 443 25 -681 -28 708 301 774 116 280 -296 -827
5507 -827 409 281 -244 543 541 -67 -498 -307 -804 342 -813 154 294 -709 -48 211 702 -1135 -311
5526 -311 287 -1443 911 579 464 500 -146 1149 -1422 -455 -3 941 -559 -92 -373 -65 548 260 331
5545 331 -215 38 352 -1639 639 -534 -592 -437 514 -482 -712 125 -656 987 675 304 997 -877 633
5564 633 -711 511 19 -747 768 -1389 820 -1251 1056 358 -448 -226 -1076 257 380 775 359
5581 359 18 -58 -414 -364 22 -253 448 -176 995 -724 700 -538 890 -305 -122 748 -605 557
5599 557 -1213 -53 311 416 -603 276 609 -385 -407 -374 -74 170 -344 1601 552 305 400 -524 172
5618 172 116 158 -1548 -526 137 -373 -330 407 901 565 -154 -612 -352 -637 -317 1596 852 -431 -92 -534
5638 -534 352 512 -561 -529 525 -252 -364 144 -381 34 475 -1469 675 -374 -158 -67 -88 347 129
5657 129 638 -101 462 -66 137 518 -335 874 -511 -947 35 621 -21 57 792 -438 -289 563 242
5676 242 489 -1339 -9 84 130 13 -158 -48 -978 357 289 303 396 1 -39 549 244 184 -924 415 518
5697 518 688 409 -136 1004 633 540 150 225 -337 1083 430 178 861 253 795 -583 627 68 -287
5716 -287 514 -63 -576 -595 -183 68 -239 -136 849 -433 -358 490 638 -656 901 -873 1502 -821 -467
5735 -467 598 204 -210 89 687 -484 768 -985 610 324 -1355 844 -309 -511 501 -1288 272
5752 272 59 510 -439 -280 -221 505 283 -90 -35 -23 275 -248 1307 1353 554 975 964 30 -109 -1124 974
5773 974 -3 1151 478 -810 933 -581 -876 -445 1094 125 -1065 -34 386 218 -399 782 176
5790 176 -431 -906 112 215 -554 -837 -540 4 -38 -563 293 500 37 367 -510 -164 439 1334 45 -423
5810 -423 -652 -410 -151 -332 430 436 -621 -836 74 131 232 246 1246 -603 1109 -868 -403 518 -485
5829 -485 -342 635 419 -660 -148 -659 -313 1111 -701 1124 -758 460 -547 -688 775 13 323
5846 323 488 1988 -760 3 509 -1319 -582 -470 -173 19 253 388 73 -474 -125 867 -228 -669 605
5865 605 -693 1194 841 -746 249 893 636 -1302 559 30 347 -68 -882 494 455 -791 -406 -90
5883 -90 230 -228 994 -744 556 205 -146 910 -736 692 -590 412 423 1389 -354 -457 738
5900 738 -1188 238 -221 573 410 -897 168 -159 45 270 -28 657 -726 -38 436 80 55 -604 433
5919 433 517 438 -600 1001 -163 182 -173 172 980 -438 67 -499 -883 104 -351 90 -459 247 -136
5938 -136 -300 19 -186 -171 -666 218 -167 -382 678 322 350 -1 379 -602 -190 1074 -843 -272 683 85
5958 85 810 -1129 84 -581 827 1086 978 -22 -465 398 -320 -533 -845 -565 -1288 127 -162 -1003 -90
5977 -90 -102 -1207 -486 -632 17 -172 429 -406 76 146 -183 -558 -1202 -302 -393 -621 1191 105 1240 -257
5997 -257 -504 -222 -54 959 -424 650 311 -70 -1158 -267 417 -459 -108 -238 -1227 241 -94 104
6015 104 321 -159 1742 -822 468 -684 78 416 132 -384 285 -6 -237 -359 -266 139 -513 18 -17
6034 -17 -266 -434 -565 -250 -497 -156 193 -950 1107 140 389 1031 -588 -88 363 743 -1303 517 633
6053 633 -298 1059 -567 -376 -845 1158 328 -791 -498 -179 789 -204 -300 386 6 772 -898 123
6071 123 996 -84 -583 901 799 445 92 1410 -486 362 -243 -368 -231 279 70 560 304 -128 -8
6090 -8 -780 -158 -49 151 48 -832 380 -376 -814 -137 -13 765 -111 368 -121 -297 229 -178 458 -596
6110 -596 -399 76 -365 -151 -1089 -699 -709 -184 -84 -379 -152 -80 968 198 465 -1081 -182 504 -263 716
6130 716 -1401 357 655 -892 -1060 -1188 887 -249 405 574 -900 -1185 -984 352 -917 -943 364
6147 364 154 472 -431 332 122 561 767 -1253 1107 -500 1953 135 214 831 399 203 -462 564
6165 564 -358 365 -272 -460 1095 -684 -715 65 -1509 197 -44 341 288 1056 -279 -462 -20 -1350 -360
6184 -360 -848 -555 253 -357 -58 -473 207 -8 321 794 -360 -23 -776 1322 1471 -343 762 -769
6202 -769 532 -1000 262 54 -440 565 -521 -799 -118 -58 -693 186 1372 -1120 615 -267 -110 938
6220 938 299 849 -30 -171 -962 -131 104 -530 695 -477 700 -203 474 -612 295 -171 -376 616 -546
6239 -546 -135 -456 788 -149 -379 717 -561 251 -220 -686 1404 -369 385 -27 1027 712 -46 -228
6257 -228 517 609 -567 -266 -241 456 409 -514 -1574 244 -1125 -45 200 65 -226 -1069 -496 466 59
6276 59 -876 -13 394 302 330 -58 -304 247 -198 -801 -1002 905 -865 -160 544 512 -531 -380 665 -593
6296 -593 1291 -486 -1048 601 335 1228 -133 241 -561 -243 -10 -278 414 -1454 1277 -500 -254 415
6314 415 -1008 1127 117 575 -799 -352 663 -361 331 -654 188 -332 -613 -620 -282 670 -638 -154
6332 -154 -263 -293 246 -256 641 -295 50 -1258 485 366 438 -401 780 254 720 -154 -319 -169 276 -117
6352 -117 -424 458 33 1570 411 -339 -130 -174 510 186 769 -303 293 -1152 446 -301 576 554 -74
6371 -74 314 -292 -319 -524 28 155 1146 -284 -32 -156 -168 -463 -50 -423 1102 253 -313 -778 -504 315
6391 315 28 803 -693 30 392 -698 -397 -1185 -298 -303 -98 -647 -647 763 -825 -35 738 96 5 -1191
6411 -1191 -470 -457 497 -717 -967 778 -571 -858 -866 -148 302 564 -149 -970 871 -1053 -256 924 -411
6430 -411 -432 136 236 -430 43 782 -672 40 -475 427 -694 61 -1031 1203 564 429 167 346 426
6449 426 -35 -737 -484 -179 -355 478 -381 -777 -298 822 -112 -369 45 387 -256 -159 513 -335 317 -788
6469 -788 -1112 353 843 -411 420 435 137 -74 133 -434 1063 18 364 1309 150 68 -582 431 -1114
6488 -1114 -1118 1059 -809 1638 -78 -124 -564 -724 398 -1411 477 -18 -854 -667 -990 1460 -88 -208
6506 -208 572 104 -789 542 72 -115 795 -490 1597 -1021 -368 -302 190 -1528 -988 368 1218 771
6524 771 385 -239 282 -784 553 -729 -732 711 -50 -366 -249 1072 -72 46 -539 328 -452 -455 -29
6543 -29 1343 -973 -83 110 926 -1206 -725 982 -863 1029 -302 -98 -64 533 815 867 -566 71
6561 71 562 -1021 -136 -673 -192 576 -434 779 -469 493 788 -786 225 924 506 7 -441 229
6579 229 423 -160 -827 239 186 -152 -253 254 535 235 1192 -265 -901 -451 -397 629 -301 171 697 -704
6599 -704 511 289 854 414 496 -1078 -178 -189 -2033 -532 -489 64 734 -727 17 -333 -83 -424 -795
6618 -795 1726 -1002 273 -338 -131 221 374 660 -1247 403 275 -122 532 -350 -603 152 734 -414
6636 -414 53 745 -349 1318 -881 2553 -789 -722 -396 290 304 -476 -117 -651 -105 568 -633 1301
6654 1301 -981 1020 -229 -282 -865 -512 509 491 -661 713 511 507 30 773 128 -556 1115 -920
6672 -920 -167 62 827 -335 -213 -1245 -851 145 214 1007 -254 -498 -245 -1595 125 -736 1231 -113
6690 -113 -1794 -642 -349 1259 -1421 -140 207 365 150 -1143 95 -1047 121 1119 -371 1773
6706 1773 31 122 379 -673 -319 11 537 -756 111 -664 131 -518 -606 357 328 687 -550 9 -374
6725 -374 -550 -56 -307 166 -329 219 51 323 543 -399 705 -216 102 114 14 399 -1068 -163 -842 -258
6745 -258 -854 -284 66 305 787 309 834 -284 178 -136 394 625 -601 577 592 289 -2 406 650
6764 650 43 -140 360 -1169 -492 -769 -384 886 232 -407 -632 -147 -113 18 -58 -879 401 -681 153
6783 153 162 438 -1081 -1128 367 -118 1053 423 -952 122 -520 -809 393 -1093 354 482 1247 -420
6801 -420 152 -798 -491 -195 489 1132 210 1182 -504 1032 296 49 776 -1088 846 -526 571 129
6819 129 -11 1293 2 -90 -574 998 916 829 362 -1259 504 -443 -338 24 181 526 -1243 1404 1313
6838 1313 -241 278 -982 854 -16 517 -191 386 -248 1000 476 883 211 996 105 272 -631 383
6856 383 -1092 -305 -318 -116 168 36 -347 322 -596 432 814 785 198 -916 122 -90 311 -307 403
6875 403 -44 1462 645 697 1024 -590 475 -172 70 -147 170 291 -800 1694 -944 300 368 -41
6893 -41 722 -867 653 -1552 291 -324 370 -130 -867 198 -338 -105 -803 -214 -843 -576 841 -297
6911 -297 -450 18 -410 11 894 416 50 72 -237 -831 336 661 188 367 987 522 -78 616 -154 288
6931 288 -599 371 974 45 772 -1203 -739 1086 832 -1114 132 276 -323 696 -479 -5 499 -1290
6949 -1290 -26 -960 1150 -116 210 980 -596 375 468 -536 274 -326 429 127 -445 329 -494 -793
6967 -793 -562 -376 -8 806 -605 -333 570 -613 -442 230 442 50 244 148 -303 199 -125 1102 -415
6986 -415 -429 571 -1207 1235 429 -103 -399 -797 -639 -164 -1068 -699 305 -1158 -416 282 12 -354 -808
7005 -808 1357 361 -325 59 -662 508 -601 16 861 171 209 -1081 83 -606 130 400 -705 -333
7023 -333 -662 1216 588 3 396 138 -232 -76 -386 -688 -26 467 -343 -543 -129 341 382 126 779 -418
7043 -418 252 -160 -1579 -166 -333 634 -674 -332 -872 919 -874 400 112 -111 310 -390 621 603
7061 603 -121 241 -1369 -190 -683 14 926 -631 -984 -254 253 -251 137 -255 302 925 232 1189 -221
7080 -221 1024 1402 -1091 991 -953 -89 -469 378 299 50 939 -893 -29 320 784 576 -577 1112
7098 1112 -484 -1 -157 273 -634 47 487 -454 847 -1379 -209 775 -292 544 -704 509 -5
7115 -5 -1217 -25 622 877 -610 220 119 -298 -18 -309 610 -832 -556 56 -47 819 -66 6 -400 150
7135 150 878 -133 257 -346 1152 -961 266 316 -869 1164 626 271 1119 -9 -252 -520 1307 -536
7153 -536 296 72 -287 -1056 90 416 -17 -415 180 564 325 812 775 -16 -935 610 -265 46 -294 107
7173 107 -521 -106 -684 -47 479 -910 338 -158 -1069 18 -140 241 -888 307 213 -216 -143 -608 297
7192 297 -811 567 -469 -187 119 -938 320 -148 1139 -1621 -715 -189 -497 241 -1170 199 327
7209 327 263 -125 -1036 -248 -392 -673 -575 -979 1380 -151 534 494 -538 224 -615 215 -98 -436 -158 1530
7229 1530 -283 368 452 -975 -211 -223 676 -1007 -331 1389 191 684 -163 650 371 45 212 -505 234
7248 234 936 -59 -198 614 -30 -418 940 -9 -759 902 -651 188 1653 -332 -10 -597 -553 -99 -188
7267 -188 158 -24 169 320 797 -1784 1045 5 281 135 349 -334 -1340 1117 -511 347 487 -833
7285 -833 116 89 -528 -482 647 -306 -11 -706 -1274 985 -220 -179 -721 534 174 -2031 1432 -498 -648
7304 -648 845 -558 1151 -724 541 451 -123 -90 373 691 44 799 -689 986 181 549 -317 -520
7322 -520 1083 695 -120 318 -524 -18 339 73 398 57 -5 -121 -192 -293 -710 1319 -314 6 -653 239
7342 239 150 -225 -1144 -123 620 -775 277 21 377 587 -488 1026 -234 142 355 -975 -14 -66
7360 -66 564 -193 -534 343 -661 4 290 1074 -374 496 -223 -8 1307 -776 1023 -658 826 573
7378 573 -343 -31 -1307 581 -723 -110 110 19 725 -1452 151 41 -854 176 773 45 -422 -511 36
7397 36 -980 -143 -790 522 -580 602 128 -138 -98 -351 654 -812 -40 -202 152 275 218 -808 -629
7416 -629 434 -292 -437 361 16 -14 -142 -98 225 -719 -248 -160 821 -336 -1248 -222 -4 142 -786 158
7436 158 -109 -22 541 -870 -447 -1229 -75 237 359 709 -723 -48 -468 116 -560 -272 427 782 -150
7455 -150 -106 753 -391 -63 809 -298 568 -472 -1008 197 -830 561 -375 -436 8 423 -119 -562 555
7474 555 -281 -327 45 -638 -681 -813 166 -769 217 -516 148 -232 -235 38 80 635 -1542 242 727 -136 1010
7495 1010 -481 281 -549 365 29 84 -468 -784 847 -719 -145 532 215 768 -1160 -57 682 288
7513 288 -1059 -409 1037 -755 -18 79 -240 579 308 -302 -320 -145 -317 565 -89 -302 545 586 -730 302
7533 302 -1318 1348 20 1493 -880 -128 1077 -485 1167 117 -257 975 405 377 -458 -68 -597
7550 -597 -655 389 -152 1058 -1257 -126 -213 30 733 64 382 -1138 -666 -146 94 709 -1106 731
7568 731 -584 680 -202 906 -750 97 -218 -764 -144 -418 607 967 -147 1280 359 191 -833
7585 -833 -487 780 -850 -363 -716 1269 -1124 -84 132 1069 966 402 466 252 -1042 265 -1317 225
7603 225 -922 867 223 -483 -345 -557 480 -622 88 191 -1003 -14 739 -429 229 -40 568 -318
7621 -318 1039 159 547 146 -642 7 432 770 -269 -64 316 -1230 1542 -154 601 -369 1887 133
7639 133 113 298 -50 996 165 348 155 -222 1174 83 -202 -95 726 461 -796 364 -147 560 -102
7658 -102 -344 -764 56 189 -839 1015 -48 0 -494 278 -348 -360 691 -158 -261 -97 -705 269 -537
7677 -537 848 -689 584 629 668 788 -661 1171 113 441 -232 -226 -253 95 695 -194 -999 939 -25
7696 -25 138 -682 400 -546 102 27 -1898 611 153 194 418 329 -967 -1097 144 239 327 -848 28 -107
7716 -107 24 393 -339 -65 1328 -402 -769 -824 -262 -205 -742 -253 -531 -276 -1103 14 -616 189 314 -1086
7736 -1086 262 -631 676 945 -851 1139 229 134 -226 -632 242 211 -838 -1482 96 353 289 -677 855
7755 855 -43 -434 573 -306 281 -970 708 656 -562 1022 -1155 -125 -511 786 634 228 636 554
7773 554 741 505 -1423 305 -1224 320 1057 -848 -877 -501 1 -1 351 -368 47 1273 -64 259 699
7792 699 64 -666 -974 153 -313 161 79 208 -965 -190 37 -136 1104 326 -467 199 670 611 -1237
7811 -1237 532 1130 -763 155 -476 669 -73 -115 -827 -1246 13 -591 363 -321 901 -568 -415 -164
7829 -164 -296 265 -1253 402 -234 -70 544 197 317 -403 485 1072 -1000 376 -150 803 115 1315
7847 1315 -159 -959 -639 237 1256 -625 161 274 -460 1743 -782 1000 -143 183 -200 -744 -90
7864 -90 105 480 -194 470 -614 -103 712 16 738 -182 268 -509 387 1147 -370 833 -475 -515 -721
7883 -721 794 -244 55 -368 -15 21 -438 240 368 -953 876 254 -50 592 -101 526 -387 934 -125
7902 -125 -161 180 -181 -883 -627 1150 461 -373 864 142 12 243 196 -554 921 1133 506 -1370 -74
7921 -74 -450 246 -1175 422 -327 -230 -153 -380 781 -453 456 930 -474 885 -1448 156 -1296 1269
7939 1269 -476 -441 905 -80 1091 -80 -320 -179 -825 308 -408 -829 -320 519 787 -95 915 49
7957 49 412 -112 1549 53 884 -946 -710 204 -1028 363 -841 262 -705 -490 -865 -439 821 -839
7975 -839 -282 436 713 816 130 718 -87 -231 734 -839 -330 -57 -412 -1898 390 687 -1147 -647 -494
7994 -494 1163 -215 342 52 -874 -693 687 -115 -11 894 335 -603 698 674 -433 205 804 1102 -470
8013 -470 334 469 24 992 -937 824 183 -997 115 24 802 318 593 292 -1078 -820 -1538 -673 -294
8032 -294 448 865 1115 -185 16 519 -871 468 -420 -456 -138 130 933 306 802 146 110 566 493 267
8052 267 -1240 647 120 1025 1020 144 995 -1077 -80 381 -297 -686 -1099 -165 -908 -764 627 640 -276 10
8072 10 1619 187 984 436 403 -288 -209 1316 702 126 -711 -196 -844 957 19 403 -303 -977 588
8091 588 675 -486 433 -342 -439 730 755 418 -333 816 -370 -302 1174 -742 -1228 667 -156 70 -187
8110 -187 -803 -836 -371 -3 -373 296 73 678 1014 395 -111 -703 -234 -862 556 -861 -267 777 503
8129 503 52 -546 755 -529 742 -182 867 240 233 744 -197 983 -694 335 134 -89 202 -895
8147 -895 1068 -396 -18 -596 -211 -262 -346 139 106 260 -1143 -418 448 -434 679 -195 -417 1142 893
8166 893 76 694 1154 -350 1 783 -470 37 -1043 280 -296 -765 1126 165 -397 -1576 863 -104
8184 -104 681 113 351 390 -64 504 -185 950 -993 -186 -285 438 405 -363 -1160 438 -447 -14 -873 -480
8204 -480 651 301 257 -356 -59 -253 -908 274 -1322 524 274 743 -422 -237 913 -507 596 -15
8222 -15 -558 1204 -1875 951 105 387 -195 1156 -1086 -463 757 221 86 -139 -10 563 119 -171
8240 -171 446 -643 -18 697 57 -206 927 -1044 97 -539 1662 53 459 115 -518 511 286 229
8258 229 1368 175 191 -223 883 -140 484 244 -419 -333 -129 959 459 405 -176 594 -142 -1155 221
8277 221 -380 124 321 -399 387 -1124 280 573 -73 723 70 390 -102 -1098 -43 -153 582 -517 1070
8296 1070 56 -991 34 -358 898 -855 -846 329 367 -101 153 -730 -732 1805 548 -840 -656 -71
8314 -71 -403 -304 -22 875 -785 529 -332 -196 -911 1207 -798 -161 -75 -17 266 -1573 824 -70 67
8333 67 -390 -569 1052 -905 124 -700 -60 56 -1223 362 357 -240 66 273 883 -822 367 -1600
8351 -1600 619 -928 873 787 -296 -1034 -174 381 570 232 332 -832 89 340 -194 752 -1111 -466
8369 -466 -240 1605 397 -13 -147 550 -78 -854 -270 842 -621 460 -418 369 -1044 1593 -592
8386 -592 -748 729 107 2333 -1440 16 911 990 -494 -131 508 -294 -172 -373 -669 -140 -845 728
8404 728 -453 -975 155 -292 542 250 364 101 -771 -792 -1218 -28 -1532 1197 -19 -748 1166 162
8422 162 -657 -659 -41 -258 -295 -182 -378 -331 -544 839 -362 -1129 776 -597 1804 249 1169 43 499
8441 499 45 -303 740 -524 842 150 -1068 -8 -1113 847 -750 394 -770 -889 885 -92
8457 -92 702 48 251 -888 220 432 -835 245 -1481 4 455 -375 -490 -128 -315 -585 -516 -537 -524
8476 -524 -238 490 598 -628 -240 462 -816 -651 -324 -374 -627 624 -340 -587 -871 -137 526 3 490
8495 490 -113 -872 893 346 1409 199 15 255 765 -37 610 -1366 485 -387 -108 -452 94 -441
8513 -441 -1404 991 381 1566 319 528 227 -11 828 -1203 73 -508 1407 20 -1320 498 -584
8530 -584 414 -1137 566 372 471 230 400 1125 -77 421 -308 452 721 -719 1060 270 837 -333
8548 -333 638 79 35 726 -218 -591 -452 188 985 -797 395 -576 -66 -390 124 675 -372 197 -459
8567 -459 226 -505 300 283 -761 -978 -613 -136 10 626 176 197 7 -824 -1454 504 -77 1001 -651
8586 -651 -794 -112 -780 239 -710 -673 369 -718 425 -219 169 352 -175 -706 -720 357 354 363 -45 1053
8606 1053 -985 955 1180 -924 460 -8 564 -296 815 -137 133 194 -190 841 -63 -514 580 218
8624 218 -115 -589 421 52 -409 -125 -653 615 -350 851 891 -101 740 470 900 -820 -47 -205 499
8643 499 68 -1282 567 276 -4 163 -862 -275 521 476 83 342 -374 1417 697 -405 -685 115 -301
8662 -301 262 -1094 1272 -311 529 1384 155 -917 -233 1025 -341 608 -868 -454 -146 -1022 -367
8679 -367 -206 -627 492 1280 646 -340 849 -633 731 428 -68 466 -1779 -763 -682 494 -565 168
8697 168 892 230 -236 -123 -291 -458 -481 353 -1778 968 -1275 -447 237 -697 614 -473 -317 -424 -308
8716 -308 344 -349 964 -309 1298 602 -373 480 136 1385 -823 89 -495 380 -483 -803 -173 573
8734 573 -468 154 493 553 -1483 729 -495 -345 -1030 -186 190 -977 724 415 -98 164 367 126
8752 126 87 -321 -927 -525 884 -532 -125 -42 1055 -621 -940 -60 337 435 -181 -104 -816 1001 16 -721
8772 -721 741 -798 -332 -725 -44 670 -317 -332 390 -822 -616 293 991 487 1298 -92 83 63 43 342
8792 342 -555 399 -335 694 -142 -1304 -142 243 -125 -263 -715 268 -289 1244 -557 -517 822 -131
8810 -131 239 -190 192 -284 -223 -130 1003 233 110 -1104 245 -194 -223 -417 1009 -316 -136 -836 -183
8829 -183 -251 285 692 41 105 -634 -473 82 -369 -337 -338 -162 -1657 1443 -505 168 -577 208 430 -746
8849 -746 299 -220 428 168 -1225 -53 -1384 -1213 989 844 -574 1171 1300 -522 -11 235 -459
8866 -459 769 -349 -413 -474 -434 1355 15 -24 717 1136 595 628 399 499 397 -450 868 479 -701 127
8886 127 645 269 -1229 74 -24 -702 254 -729 676 -1067 -59 279 -508 666 16 597 -293 -362 -110
8905 -110 251 479 -81 519 240 -615 971 -55 407 -457 564 344 118 -757 -1174 -175 662 355 -1013
8924 -1013 425 -15 241 657 -526 -273 -704 724 734 -327 361 -366 -15 -1086 246 40 254 -76
8942 -76 972 87 199 -89 -235 -324 508 -168 -253 -260 -63 142 -28 -334 464 -642 1247 525 803 -931
8962 -931 997 436 53 349 615 -326 -544 1052 -1066 -485 633 -568 -632 -412 -417 209 -71 857 270
8981 270 314 381 -541 290 17 328 788 -365 -659 -203 933 641 1289 -523 -87 -438 -270 898 495
9000 495 751 -508 1377 -316 686 245 -746 1107 -1489 1532 72 370 212 -324 553 -44 386
9017 386 998 -604 -236 126 493 -817 1126 -212 449 163 -142 443 -1102 799 285 -836 -630 -255
9035 -255 99 -1450 177 434 -1192 747 -91 18 659 -33 -1384 455 96 746 1185 407 331 380 -227
9054 -227 -19 -676 203 -201 -62 -386 596 -218 286 1337 360 -590 218 -884 -623 -294 1049 -249 -294
9073 -294 -211 91 -208 -1189 -100 -695 -271 795 -575 -672 -13 -252 374 -916 1069 369 223 -140 -248
9092 -248 -220 116 849 -464 158 517 -1032 584 -137 789 -313 130 -257 473 -977 -188 960 -322
9110 -322 1064 -417 221 -1173 -733 1030 -45 -441 -116 793 -129 -739 11 -981 484 986 -1037 -575
9128 -575 -1882 664 32 315 -1020 -41 -240 -809 959 452 -563 970 -655 68 -414 -75 -8 429
9146 429 709 -904 1131 -323 -120 -197 -159 1042 -1002 1163 -536 534 127 -418 231 584 739 -517
9164 -517 487 95 1080 -355 300 936 -1057 556 -1638 -214 1039 68 479 -239 -32 -59 -494 -574
9182 -574 -676 -80 -427 152 -1084 -182 1099 -47 -17 -559 350 39 476 -84 -1214 -187 -181 -401 -347 -337
9202 -337 -38 -403 737 226 -1003 219 35 24 474 -217 -362 395 -1188 742 76 -1044 -325 -130
9220 -130 616 -288 83 -785 -297 147 -928 130 731 -493 110 -282 695 -259 116 313 -413 -191 -959
9239 -959 238 1467 -850 436 -438 861 39 -110 393 -377 528 742 571 -13 -424 702 -779 -826
9257 -826 -1417 142 -53 -579 581 85 338 -605 9 -412 -446 100 -286 757 -676 130 -65 364 730
9276 730 -567 -207 478 -105 -622 460 -4 -233 1281 -951 -19 -789 -419 480 -302 657 -644 -2
9294 -2 360 -1070 30 -1202 663 43 572 -142 -661 256 -579 -270 54 -329 -170 257 610 -324 199
9313 199 -743 214 439 765 -858 167 -443 520 -445 -603 108 -43 -1997 32 271 307 1045 446 -51
9332 -51 -1105 300 -47 -1033 253 650 -633 -365 -190 -838 158 382 -34 -40 -193 2 -545 -1832 -388
9351 -388 -507 -963 529 289 -595 706 182 230 -384 -651 -678 297 356 949 847 -414 -102 384 -562 112
9371 112 282 -1 20 595 653 99 -315 -136 -834 657 -59 -352 -139 -114 776 477 222 -82 -62 -692 88
9392 88 161 -296 625 -23 14 439 -654 827 -671 -163 -354 -12 336 -716 -50 34 1819 361 99
9411 99 643 -129 470 123 743 -932 -345 -140 -1026 567 219 -415 272 204 -921 122 -1488 680 226
9430 226 72 -317 -98 -400 -1105 102 -375 561 -1695 930 6 154 227 -99 353 -118 177 -380 157
9449 157 -32 338 255 -330 1200 74 -791 -70 -461 781 -232 481 -642 -766 755 -790 798 -77
9467 -77 168 -609 594 439 -78 943 -748 1284 1276 260 -182 -1126 343 -460 671 -180 -314 840
9485 840 -272 1631 -1381 -1004 407 233 1393 -459 1256 175 499 19 -499 967 -1803 233
$$ [...]
16383d99
##END NTUPLES=NMR FID
##END=
