##TITLE=31P_DE-80H_X3
 64 sc D2O
 26.2.2025
##JCAMPDX= 6.0         $$ Bruker NMR JCAMP-DX V2.0
##DATA TYPE= NMR FID
##DATA CLASS= NTUPLES
##ORIGIN= UXNMR, Bruker Analytische Messtechnik GmbH
##OWNER= root
$$ XWIN-NMR		Version 3.5
$$ Tue Mar 24 14:04:14 2026 Russian Standard Time (UT+4h)  Yarkov@DPX200
##.OBSERVE FREQUENCY= 81.013821
##.OBSERVE NUCLEUS= ^31P
##.DELAY= (6, 6)
##.ACQUISITION MODE= SIMULTANEOUS
##.ACQUISITION SCHEME= undefined
##.AVERAGES= 64
##.DIGITISER RES= 17
##SPECTROMETER/DATA SYSTEM= spect
##.PULSE SEQUENCE= zgpg30
##.SOLVENT NAME= CDCl3
##.SHIFT REFERENCE= (INTERNAL, CDCl3, 0, 243.863)
##AUDIT TRAIL= $$ (NUMBER, WHEN, WHO, WHERE, WHAT)
$$ ##TITLE= Audit trail, XWIN-NMR		Version 3.5
$$ ##JCAMPDX= 5.01
$$ ##ORIGIN= Bruker BioSpin GmbH
$$ ##OWNER= Yarkov
$$ C:/Bruker/XWIN-NMR/data/yarkov2/nmr/P31/2/audita.txt
$$ ##AUDIT TRAIL=  $$ (NUMBER, WHEN, WHO, WHERE, WHAT)
(   1,<2026-03-24 14:03:03.59 +0400>,<Yarkov>,<DPX200>,
      <created by zg, POWCHK disabled, PULCHK disabled
       configuration hash MD5:
       00 E9 B6 7A A2 85 ED C7 34 08 36 98 17 FE 4E 26
       data hash MD5: 32K
       0B 73 B5 C2 F5 5C B6 43 2C 47 30 E5 2E E2 B4 B4>)
$$ ##END=
$$ 
$$ hash MD5
$$ E1 6A 02 12 CE 3C 89 47 2D 37 57 6B DD 00 31 63
##$RELAX= 
##$RELAX= 
##$RELAX= 
##$RELAX= 
##$RELAX= 
##$RELAX= 
##$RELAX= 
##$RELAX= 
$$ Bruker specific parameters
$$ --------------------------
##$DU= <C:/Bruker/XWIN-NMR>
##$EXPNO= 2
##$NAME= <P31>
##$PROCNO= 1
##$TYPE= <nmr>
##$USER= <yarkov2>
##$AMP= (0..31)
100 100 100 100 100 100 100 100 100 100 100 100 100 100 100 100 100 100 
100 100 100 100 100 100 100 100 100 100 100 100 100 100 
##$AQSEQ= 0
##$AQ_mod= 1
##$AUNM= <au_zg>
##$AUTOPOS= <>
##$BF1= 81.014009
##$BF2= 200.13
##$BF3= 200.13
##$BF4= 200.13
##$BF5= 200.13
##$BF6= 200.13
##$BF7= 200.13
##$BF8= 200.13
##$BYTORDA= 1
##$CFDGTYP= 0
##$CFRGTYP= 5
##$CHEMSTR= <none>
##$CNST= (0..31)
1 1 145 1 1 1 1 1 1 1 1 1 1 1 1 1 1 1 1 1 1 1 1 1 1 1 1 1 1 1 1 1 
##$CPDPRG= <waltz16>
##$CPDPRG1= <>
##$CPDPRG2= <waltz16>
##$CPDPRG3= <>
##$CPDPRG4= <mlev>
##$CPDPRG5= <mlev>
##$CPDPRG6= <mlev>
##$CPDPRG7= <mlev>
##$CPDPRG8= <mlev>
##$CPDPRGB= <>
##$CPDPRGT= <>
##$D= (0..31)
0 1 0 0 0 0 0 0 0 0.06 0 0.03 2e-05 3e-06 0 0 0.0002 0 0 0 0 0 0 0 0 0 
0 0 0 0 0 0 
##$DATE= 1774346583
##$DBL= (0..7)
120 120 120 11 120 120 24 19 
##$DBP= (0..7)
150 150 150 150 150 150 150 150 
##$DBP07= 0
##$DBPNAM0= <>
##$DBPNAM1= <>
##$DBPNAM2= <>
##$DBPNAM3= <>
##$DBPNAM4= <>
##$DBPNAM5= <>
##$DBPNAM6= <>
##$DBPNAM7= <>
##$DBPOAL= (0..7)
0.5 0.5 0.5 0.5 0.5 0.5 0.5 0.5 
##$DBPOFFS= (0..7)
0 0 0 0 0 0 0 0 
##$DE= 6
##$DECBNUC= <off>
##$DECIM= 4
##$DECNUC= <off>
##$DECSTAT= 4
##$DIGMOD= 1
##$DIGTYP= 9
##$DL= (0..7)
0 0 52 120 120 21 21 25 
##$DP= (0..7)
150 150 150 150 150 150 150 150 
##$DP07= 0
##$DPNAME0= <>
##$DPNAME1= <>
##$DPNAME2= <>
##$DPNAME3= <>
##$DPNAME4= <>
##$DPNAME5= <>
##$DPNAME6= <>
##$DPNAME7= <>
##$DPOAL= (0..7)
0.5 0.5 0.5 0.5 0.5 0.5 0.5 0.5 
##$DPOFFS= (0..7)
0 0 0 0 0 0 0 0 
$$ [...]
##$SUBNAM1= <"">
##$SUBNAM2= <"">
##$SUBNAM3= <"">
##$SUBNAM4= <"">
##$SUBNAM5= <"">
##$SUBNAM6= <"">
##$SUBNAM7= <"">
##$SUBNAM8= <"">
##$SUBNAM9= <"">
##$SW= 400.765351723535
##$SWIBOX= (0..15)
0 1 3 0 0 0 0 0 0 0 0 0 0 0 0 0 
##$SW_h= 32467.5324675325
##$TD= 32768
##$TD0= 1
##$TE= 0
##$TE2= 300
##$TE3= 300
##$TEG= 300
##$TL= (0..7)
0 120 53 12 22 120 120 120 
##$TP= (0..7)
150 150 150 150 150 150 150 150 
##$TP07= 0
##$TPNAME0= <>
##$TPNAME1= <>
##$TPNAME2= <>
##$TPNAME3= <>
##$TPNAME4= <>
##$TPNAME5= <>
##$TPNAME6= <>
##$TPNAME7= <>
##$TPOAL= (0..7)
0.5 0.5 0.5 0.5 0.5 0.5 0.5 0.5 
##$TPOFFS= (0..7)
0 0 0 0 0 0 0 0 
##$TUNHIN= 0
##$TUNHOUT= 0
##$TUNXOUT= 0
##$USERA1= <user>
##$USERA2= <user>
##$USERA3= <user>
##$USERA4= <user>
##$USERA5= <user>
##$V9= 5
##$VALIST= <valist>
##$VCLIST= <CCCCCCCCCCCCCCC>
##$VD= 0
##$VDLIST= <DDDDDDDDDDDDDDD>
##$VPLIST= <PPPPPPPPPPPPPPP>
##$VTLIST= <TTTTTTTTTTTTTTT>
##$WBST= 1024
##$WBSW= 4
##$XGAIN= (0..3)
0 0 0 0 
##$XL= 0
##$YL= 0
##$YMAX_a= 61687
##$YMIN_a= -70533
##$ZGOPTNS= <>
##$ZL1= 120
##$ZL2= 120
##$ZL3= 120
##$ZL4= 120
##$ABSF1= 60
##$ABSF2= -190
##$ABSG= 5
##$ABSL= 3
##$ALPHA= 0
##$AQORDER= 0
##$ASSFAC= 0
##$ASSFACI= 0
##$ASSFACX= 0
##$ASSWID= 0
##$AUNMP= <proc_1d>
##$AZFE= 0.1
##$AZFW= 0.5
##$BCFW= 1
##$BC_mod= 2
##$BYTORDP= 1
##$COROFFS= 0
##$CY= 9.86611175537109
##$DATMOD= 1
##$DC= 1
##$DFILT= <>
##$DTYPP= 0
##$F1P= 182.462994727601
##$F2P= 168.069089081705
##$FCOR= 0.5
##$FTSIZE= 0
##$FT_mod= 0
##$GAMMA= 1
##$GB= 0
##$INTBC= 1
##$INTSCL= 1
##$ISEN= 30
##$LB= 1.5
##$LEV0= 0
##$LPBIN= 0
##$MAXI= 11.51145
##$MC2= 0
##$MEAN= 0
##$ME_mod= 0
##$MI= 1.244541
##$NCOEF= 0
##$NC_proc= 0
##$NLEV= 6
##$NOISF1= 0
##$NOISF2= 0
##$NSP= 1
##$NTH_PI= 0
##$NZP= 1
##$OFFSET= 243.8632
##$PC= 1.4
##$PHC0= 1741.401
##$PHC1= 73.15952
##$PH_mod= 0
##$PKNL= yes
##$PPARMOD= 0
##$PSCAL= 0
##$PSIGN= 0
##$REVERSE= no
##$SF= 81.0140731611343
##$SI= 65536
##$SIGF1= 0
##$SIGF2= 0
##$SINO= 80
##$SIOLD= 65536
##$SREGLST= <31P.CDCl3>
##$SSB= 0
##$STSI= 0
##$STSR= 0
##$SW_p= 25641.0256410257
##$SYMM= 0
##$S_DEV= 0
##$TDeff= 0
##$TDoff= 0
##$TI= <>
##$TILT= no
##$TM1= 0
##$TM2= 0
##$TOPLEV= 0
##$USERP1= <user>
##$USERP2= <user>
##$USERP3= <user>
##$USERP4= <user>
##$USERP5= <user>
##$WDW= 1
##$XDIM= 64
##$YMAX_p= 0
##$YMIN_p= 0
$$ End of Bruker specific parameters
$$ ---------------------------------
##NTUPLES= NMR FID
##VAR_NAME=  TIME,          FID/REAL,        FID/IMAG
##SYMBOL=    X,             R,               I
##VAR_TYPE=  INDEPENDENT,   DEPENDENT,       DEPENDENT
##VAR_FORM=  AFFN,          ASDF,            ASDF
##VAR_DIM=   16384,         16384,           16384
##UNITS=     SECONDS,       ARBITRARY UNITS, ARBITRARY UNITS
##FACTOR=    3.08e-05,      1,               1
##FIRST=     0,             0,               0
##LAST=      0.5045964,     0,               0
##MIN=       0,             -70533,          0
##MAX=       0.5045964,     61687,           0
$$ Real data points
##PAGE= N=1
##DATA TABLE= (X++(R..R)), XYDATA
$$ [...]
11131a127K227k103J122L5M54o93q15P82o1q5P63p55P41r5j23N48l06j49j503
$$ -1127 1100 -1003 119 154 608 -85 -900 -118 -179 -264 499 -256 485 390 267 815 509 360 -1143
11150a143J672q39O09n76M75K41q70M7L60j122J281p90M40P35p48j81M65j432
$$ -1143 529 -310 299 -277 198 439 -431 -384 -24 -1146 135 -655 -215 520 -228 -409 56 -1376
11168a376P50J104j189J036n16k35pQ85o10N1L18m99J33K32o69K840k343J143
$$ -1376 -626 478 -711 325 -191 -426 -433 452 -158 -107 211 -288 -155 77 -592 2248 -95 1048
11186A048j175J12l06K30K72k15R52k300J557j71n33J651j649J363j395k6o10
$$ 1048 -127 -15 -321 -91 181 -34 918 -1382 175 4 -529 1122 -527 836 -559 -585 -1195
11203a195J152Q07j043J205q96m25J9l74J290k84l5p00J30n58P87l59P98J2kl4
$$ -1195 -43 764 -279 926 30 -395 -376 -750 540 256 221 -479 -349 -907 -120 -479 319 331 329 295
11223B95n0k36m43R74l74L86q24N33j301J639m84R7J046k56j282o84J468n63L08
$$ 295 245 9 -434 540 166 552 -272 261 -1040 599 115 212 1258 1002 -280 -964 504 -59 249
11242B49n15p33j17M18J077N2M02q4p44j061NJ035P4K20Q13j108m83j007M83K181
$$ 249 -266 -999 -1116 -698 379 431 833 749 5 -1056 -1051 -16 58 278 1091 -17 -500 -1507 -1024 1157
11262A157o01p18q93J470j458J762M30j962K234o92K61r56N60o72R54j219j38
$$ 1157 556 -162 -1055 415 -1043 719 1149 -813 1421 729 990 34 594 -78 876 -343 -481
11279d81P05j380K043j031J19l50r90K046j575J273k363J217K52m35Q21l99L50
$$ -481 224 -1156 887 -144 -25 -375 -1365 681 -894 379 -1984 -767 -515 -950 -129 -528 -178
11296a78L67O51o13N4M58j774J293k1l64l05N62K44j875J748J03q06lM19l2j313
$$ -178 189 840 227 281 739 -1035 258 237 -127 -432 130 374 -1501 247 350 -456 -459 -40 -72 -1385
11316a385R55k12J964j607O80J02j270q90J519JR78j641N73J42J52J25j706J697
$$ -1385 -430 -642 1322 -285 395 497 -773 -1663 -144 -143 835 -806 -233 -91 61 186 -1520 177
11334A77O14k56q88N84j096J67R03O70j119o1n63J431o22o28J080o78J30N7n13
$$ 177 791 535 -353 231 -865 -698 205 875 -244 -305 -868 563 -59 -687 393 -285 -155 -98 -611
11353f11K29L54K39J61M97p13R94k125J735p49n36J481j180M94m82R19j475J239
$$ -611 -382 -28 211 372 869 156 1150 -975 760 11 -525 956 -224 270 -212 707 -768 471
11371D71K61j872J437r71J637p56j39J21L0J37l48k48K41J162p11r79L11K26J161
$$ 471 732 -1140 297 -674 963 207 68 189 219 356 8 -240 1 1163 452 -527 -216 10 1171
11390A171k663J517J14k16N03r53Q24r19K032j563m1j93o84J209p34P60M94j095
$$ 1171 -1492 25 139 -77 426 -527 297 -622 1410 -153 -194 -387 -1071 138 -596 164 658 -437
11408d37j48L74J255j564J778j184l34J58Q30n21l78n55J245q82O28n36o6M22
$$ -437 -585 -211 1044 -520 1258 74 -260 -102 728 207 -171 -726 519 -363 265 -271 -337 85
11426H5j143J463j198J447q49o93N47P03r2o92L19K0j353R45K5N89L91j335J082
$$ 85 -1058 405 -793 654 -195 -888 -341 362 270 -422 -103 -83 -1436 -491 -466 123 514 -821 261
11445B61j219J659j028K41k34J109p36j059K514l217K252l08K53p31p35J943j904
$$ 261 -958 701 -327 -86 -320 789 53 -1006 1508 -1709 543 235 488 -243 -978 965 -939
11462i39K301j788m07N52j403J078j449K515j182J835k56n38j24p44O58J40j66
$$ -939 1362 -426 -833 -281 -1684 -606 -2055 460 -722 1113 857 319 195 -549 109 249 83
11479H3m5q12J463k092J072P26q3j027J31M7l82Q76j234K271r60P61n67r28K28
$$ 83 38 -774 689 -1403 -331 395 312 -715 -584 -537 -919 -43 -1277 994 34 795 228 -700 -472
11498d72L39J231r49j33q85K92o29J327O17r02J05m4O2N86j20L5p61p99Q45O73
$$ -472 -133 1098 149 16 -869 -577 -1206 121 738 -164 -59 -103 -41 545 425 460 -301 -1100 -255 418
11518D18j409O87M76O53l23k93r38R33R37j885J995k012P45J169k426K280p29
$$ 418 -991 -304 172 825 502 209 -729 204 1141 -744 1251 -761 -16 1153 -1273 1007 278
11535B78M99m82j59n38K4J077j526J336l65m83O15l20L82r92J185o92J526m00
$$ 278 777 295 136 -402 -378 699 -827 509 144 -339 276 -44 338 -654 531 -161 1365 965
11553I65j702J722j520J557j839J178k72Ql81M04q85J026l78K16j33M42j375J454
$$ 965 -737 985 -535 1022 -817 361 89 97 -284 120 -765 261 -117 99 -34 408 -967 487
11571D87k15L46k30j350M63P8j35M71o24O54j65k96j00O51j038P60J64Q40j123
$$ 487 272 618 388 -962 -499 -421 -556 -85 -709 -55 -220 -516 -616 35 -1003 -243 -79 761 -362
11590c62J89L28J92r41Q67k75P04m33k89P22o80N97j606J621q96M12K9Qn41K41
$$ -362 -173 155 347 -594 273 -2 702 269 -20 702 22 619 -987 634 -262 150 179 187 -354 -113
11610a13k55j07J76J495j580J559j291n28P30O67j32o00j54n79J295K19j368J483
$$ -113 -368 -475 -299 1196 -384 1175 -116 -644 86 753 621 21 -133 -712 583 802 -566 917
11628I17j355O1K26J05P60j057J200j25O16k035J684j368m91K51K32J209q26K10
$$ 917 -438 -377 -151 -46 714 -343 857 732 1348 -687 997 -371 -862 -611 -379 830 4 214
11646B14n58k96J236r06J95N76j23q18K31j05K93Q69m85J39j117O24k84j72P01
$$ 214 -344 -640 596 -310 -115 461 338 -480 -249 -354 -61 808 323 462 -655 -31 -315 -487 214
11665B14n91J60P89j7p09L66K68j117R52n34k09m3l90K67j534R64q5J762K7k60
$$ 214 -377 -217 572 555 -154 212 480 -637 315 -219 -428 -471 -861 -594 -2128 -1164 -1249 513 540 280
11685B80K43r28Q42j122K62l80N02j83L73l26Q53p2n22R25j478J189m35o17K23
$$ 280 523 -405 437 -685 -423 -803 -301 -484 -111 -437 416 344 -178 747 -731 458 23 -594 -371
11704c71J0M1L98M82JJ061j093o60J019j252M79k86R76o80J42j63j709K034j157
$$ -371 -361 -320 78 560 561 1622 529 -131 888 -364 115 -171 805 125 267 104 -1605 429 -728
11723g28M81j60Q74O35j722Q82q90J481l39k79L74j626R52p91P71M6M24j469J77
$$ -728 -247 -407 467 1102 -620 262 -628 853 514 235 609 -1017 -65 -856 -85 -39 385 -1084 -907
11742i07J61n12R60p77J306j52R9J426k674R51m18N55r1o71J723k050J297j67
$$ -907 -746 -1258 -298 -1075 231 79 178 1604 -1070 -119 -537 18 -73 -744 979 -1071 226 59
11760E9M33n58j93o73N75J272m09l6j003Q51j464L77N16p0K92j51J488j343J0
$$ 59 492 -66 -259 -932 -357 915 506 470 -533 318 -1146 -769 -253 -323 -31 -182 1306 -37 -27
11779b7l23j52l36N35J096p25L79K54k179J602L7J34k15o30N58O1m24Q72k25l79
$$ -27 -350 -502 -838 -303 793 68 447 701 -1478 124 161 295 80 -550 8 69 -355 517 292 -87
11799h7R77j258N62N0l37L71R00j096l45J72k83j95R42j236K9R36M6p77J001j525
$$ -87 890 -368 194 244 -93 278 1178 82 -263 -91 -374 -569 373 -863 -834 102 148 -629 372 -1153
11819a153P93Q72r00M00l95O25p92J509k42j280J637j867J037l30O02O03o63o01
$$ -1153 -360 512 -388 12 -383 242 -550 959 717 -563 1074 -793 244 -86 516 1119 456 -145
11837a45m64J69j091K146j282N95K23k64J287j984J066n97R06q73J09N55q96J379
$$ -145 -609 -440 -1531 615 -667 -72 151 -113 1174 -810 256 -341 565 -308 -199 356 -540 839
11855H39q80N40R1m60p57q11J984k85m18N19n38J30l72J122j053M16L03q63P93
$$ 839 -41 499 590 130 -627 -1438 546 261 -157 362 -176 -46 -418 704 -349 67 370 -493 300
11874C00l45n22N86k75O09o69N58m54l78Q54K38j004m90J341l94K71L56K94n89
$$ 300 -45 -567 19 -256 353 -316 242 -212 -590 264 502 -502 -992 349 -45 226 582 876 287
11893B87o35r09K510j954J851q41j447Q58j86N49j042J012%L74n93j69R0L86N14
$$ 287 -348 -1257 1253 -701 1150 309 -1138 -280 -466 83 -959 53 53 427 -166 -335 -245 141 655
11912F55j082J715j435L11j30q04K725j544Q69q74n98K08m69P93j378R10j199
$$ 655 -427 1288 -147 164 34 -770 1955 411 1280 406 -192 16 -453 340 -1038 -128 -1327
11929a327J356p73k51n1P64j86j201Q92K51l09R64r45J849o29j470J355n77j67
$$ -1327 29 -744 -995 -1046 -282 -468 -1669 -777 -526 -835 129 -816 1033 404 -1066 289 -288 -455
11947d55Q15k91n21J290j720N22K60n64K16R26K85l80r99O04k93M78l99m20R29
$$ -455 360 69 -452 838 -882 -360 -100 -664 -448 478 763 383 -616 -12 -305 173 -226 -646 283
11966B83n71k66K18J308p06q6m8k161J660Q10p85Q56j95l8n10j05m5QP46j320
$$ 283 -288 -554 -336 972 266 180 132 -2029 -369 441 -344 512 317 279 -231 -336 -381 -373 373 -947
11986i47J210k86l0L94j212J539j427J508n78r96O69r3J791r52l22j72J05m08
$$ -947 263 -23 -53 341 -871 668 -759 749 171 -825 -156 -249 1542 590 268 96 201 -207
12004b07J08k82m54Q16j87p0J668k050J229j023J264j562Q78r3p58K025j938R06
$$ -207 -99 -381 -835 -19 -206 -276 1392 -658 571 -452 812 -750 128 35 -723 1302 -636 270
12022B70j169J355O45k419J606l96J367p91O54n60m81N29j004N70r15N68o96R82
$$ 270 -899 456 1101 -1318 288 -108 1259 468 1122 562 81 610 -394 176 -739 -171 -867 115
12040A15m86M27P25Q1j176K13N8m02J42R92j577J299k77j73R04q75J0jj115J458
$$ 115 -371 56 781 862 -314 -101 -43 -445 -303 689 -888 411 134 -39 865 -10 0 -1 -1116 342
12060C42j058K70J263j075M54n57P37R25j885J174j172J850j016j023k96K124
$$ 342 -716 -446 817 -258 196 -361 376 1301 -584 590 -582 1268 252 -771 -1067 1057
12076A057j291r26J204k25K76MJ58M25q70J301k054L9k18J336l88n9m2n16J805
$$ 1057 -234 -1160 44 -181 95 99 257 682 -188 1113 -941 -902 -1120 216 -172 -231 -273 -789 1016
12095A016j752J364q66q27J840j375J531p84l35K44Q29n42j5J592k880M59J174
$$ 1016 -736 628 -238 -1065 775 -600 931 147 -188 56 885 343 328 1920 -960 -501 673
12112F73j477R04o92J430j369j7k9P74P98j18l63j110L14m19R9J720j156O6J08
$$ 673 -804 100 -592 838 -531 -548 -577 197 995 877 514 -596 -282 -701 -602 1118 -38 28 136
12131A36l6o61J84P78j0P5j146M76J33m1K54J98m87R83l50l46k62P4K80O06n82
$$ 136 100 -561 -377 401 391 466 -680 -204 -71 -112 142 340 -147 836 486 140 -122 -48 232 838 256
12152B56n59L11k6j178K332j393Q36n1q35l99L58R34R1%j441J739q38J38j90M20
$$ 256 -303 8 -18 -1196 1136 -257 579 528 -307 -706 -348 586 677 677 -764 975 137 275 85 505
12172E05m12k09l52N12O66r23n42P40L01L13j317J475r54M34P82j177N16j516
$$ 505 93 -116 -468 44 710 -213 -755 -15 286 599 -718 757 -197 237 1019 -158 358 -1158
12190a158K026n57q26O89n08J601k291J153N72j534J906j304R19k3j26j48q84
$$ -1158 868 311 -515 174 -334 1267 -1024 129 701 -833 1073 -231 688 665 539 391 -493
12207d93J011j092O03m17R37o15J13J181o57m10j091J589m11j17M07n71Q79o30
$$ -493 518 -574 29 -388 549 -66 47 1228 571 161 -930 659 248 131 538 -33 846 216
12225B16k89N9p8N04Q5n86P67r40n20J278j839J737m79n02J452p31n3o98J101
$$ 216 -73 -14 -92 412 497 -89 678 -262 -782 496 -1343 394 -85 -587 865 134 81 -617 484
12244D84J97q97Q44m34j080J765m06R6m62K04J223j688R68Kj155Q58p23O09q45
$$ 484 681 -216 628 194 -886 879 473 569 107 311 1534 -154 814 816 -339 519 -204 405 -440
12263d40k74J125q05J240j030M34l84n89O40J63J239r07j23r73J466o81j78J37
$$ -440 -714 411 -394 846 -184 250 -134 -723 -83 80 1319 412 289 -684 782 101 -77 60
12281F0r43K077j342O72J5j578Q48k97R71n75N60j099R56l82m87J809l72p46j270
$$ 60 -883 1194 -148 524 539 -1039 -191 -488 483 -92 468 -631 325 -57 -544 1265 893 147 -1123
12300a123L4J778j376J068j077J293j305N49J181j223L33l76j69M71L20p06l89
$$ -1123 -1089 689 -687 381 -696 597 -708 -159 1022 -201 132 -244 -413 58 378 -328 -717
12317g17J777q56r93R66m12l31Q42j045N59O5m33O10K9L71M8n92J55o96Q19m01
$$ -717 1060 204 -789 177 -235 -566 276 -769 -210 -145 -578 32 61 432 480 -112 43 -653 166 -235
12337b35R12j070j38L87R67r19q45P04J30j77N61l03r18J76K27k09M63M01R88
$$ -235 677 -393 -531 -144 823 -96 -941 -237 -107 -284 277 -26 -944 -768 -541 -750 -287 114 1102
12356A102j505K90o09J70J320j152K42n8p2J518j258L10J72M77j977J659p19M2
$$ 1102 -403 -113 -722 -552 768 -384 -142 -200 -272 1246 -12 298 470 947 -1030 629 -90 -48
12374d8j102J15J843j823K007p33l39J50n36J602j762K85M98j021J091p79J616
$$ -48 -1150 -1035 808 -1015 992 259 -80 70 -466 1136 -626 -341 157 -864 227 -552 1064
12391A064j218O47l8l71j362O94N78M10j020P99L60M5o61k63O62L41R7j730J621
$$ 1064 -154 493 455 84 -1278 -584 -6 404 -616 183 543 588 -73 -336 326 667 764 -966 655
12410F55q14N51j625J488K3m79Q7l15J68j67J31l89N76P5K57n17j069J307M87
$$ 655 -159 392 -1233 255 278 -201 -114 -429 -261 -428 -297 -686 -110 -35 222 -295 -1364 -57 430
12429D30n03M60n89r54J215k94N11q43N96j175O94J190n91J26r05K008n14m63
$$ 430 -73 387 -202 -1156 59 -235 276 -567 29 -1146 -452 738 147 273 -632 1376 862 399
12447C99j82j087N42O15L05j088P64n34Kk78P24K06j474J371J21J7M56j980J232
$$ 399 217 -870 -328 287 592 -496 268 -266 -264 -542 182 388 -1086 285 406 423 879 -1101 131
12466A31L7M2n6n78K87l2J105j045o9J025k52j453M43L63J00P19n30j083Q51J61
$$ 131 168 210 154 -424 -137 -169 936 -109 -178 847 595 -858 -415 -52 48 767 237 -846 5 166
12486A66o98l01Q03L7l51P78m96N99L90J25j532J290O16j002L15l44J60j80p79
$$ 166 -532 -833 -30 7 -344 434 -62 537 927 1052 -480 810 1426 424 739 395 555 375 -404
12505d04K77K10j135M31P4M3N34n69N71K61J19j166L33K77j01J794k575K231o24
$$ -404 -127 83 -1052 -621 -547 -504 30 -539 32 293 412 -754 -421 -144 -245 1549 -1026 1205 581
12524E81j156k10N82J498k372J705j287Q57j398R29j141P96K315j577Q13o11j413
$$ 581 -575 -785 -203 1295 -1077 628 -659 198 -1200 -271 -1412 -616 1699 122 935 324 -1089
12541a089M88j32J811j392j8K80P03l93j227J700j712N99j40N35J49J39M04j480
$$ -1089 -601 -733 1078 -314 -332 -52 651 258 -969 731 -981 -382 -522 13 162 301 705 -775
12559g75M84K65o87N54N19K54j375J081j007j79N1J477n65o75R12r73N4J45Q38
$$ -775 -291 -26 -713 -159 360 614 -761 320 -687 -866 -815 662 97 -578 334 -639 -585 -440 398
12578C98Q55j695K330j211m87J11j061J388j379k2K16R20J86l72J021j555l72
$$ 398 1253 -442 1888 677 190 301 -760 628 -751 -773 -557 363 549 177 1198 -357 -729
12595g29J09N45o8Q27j64n12o33K71j087K396j514J036j1n69J377k167K51Q39
$$ -729 -620 -75 -143 684 520 8 -625 -354 -1441 955 -559 477 466 -103 1274 -893 -642 197
12613A97m02L8k4L92k49l10O64m15M80k60k46K08q0m18j15R35j005K75j52J298
$$ 197 -205 -167 -191 201 -48 -358 306 -109 371 111 -135 73 -7 -425 -540 395 -610 -335 -487 811
12633H11j243N50M60j491R28n28J341r0k34k45K40j80j539J043j15Q29J81j236
$$ 811 -432 118 578 -913 15 -513 828 738 504 259 499 319 -1220 -177 -292 537 718 -518
12651e18J741j376J014q05N34r54m27O20n13n81o4Q19M7k68J013q37J075j084
$$ -518 1223 -153 861 56 590 -364 -791 -171 -684 -1265 -1329 -510 -463 -731 282 -555 520 -564
12669e64J324n04M30j015KR01n65O53p80O02Oo00N90j893J758N20j838L80L69
$$ -564 760 256 686 -329 -327 574 9 662 -118 484 490 -110 480 -1413 345 865 -973 -593 -224
12688b24J3M28j98q4L79m60J670j424l55L22J140j154P7o21Q70n4q74P29L47m59
$$ -224 -211 217 19 -65 314 -146 1524 100 -255 67 1207 53 130 -491 379 325 -549 180 527 68
12708F8m49k33p49J950p18N56l70M07p90o28O75Q63j659j37K154j73r91j6J213
$$ 68 -381 -614 -1363 587 -131 425 55 462 -328 -956 -281 582 -1077 -1214 940 767 -224 -240 973
12727I73q65Q9r50J164j44O77j209m96O41L13j119J910j023J300j48k004J198
$$ 973 108 197 -753 411 267 944 -265 -761 -120 193 -926 984 -39 1261 1113 -891 307
12744C07j149J553j784J452j33m77o56j04J817q7l28p97P01k68om91JP65j151
$$ 307 -842 711 -1073 379 246 -231 -887 -991 826 739 411 -386 315 47 41 -450 -449 316 -835
12763h35J338j157k0O21J05R36j239K34N86n58L85m71Q9o23R88M15J08l43j003
$$ -835 503 -654 -674 -53 52 988 -251 -17 569 11 396 -75 14 -609 379 794 902 559 -444
12782d44J47r2M30m95J18j57Q08P88q61q44J116j94l72L33n35K64m23J037J42
$$ -444 -297 -389 41 -454 -336 -493 315 1103 242 -602 514 320 -52 281 -254 10 -413 624 766
12801G66o29N4M66l98K32Q41j116K50o22o84K219k425J852j303K81L77j235K219
$$ 766 137 191 657 259 491 1332 216 466 -156 -840 1379 -1046 806 -497 -216 161 -1074 1145
12819A145j702J549q95M86k76j333J397j106J079o59K0J40l15P90l79j18J006
$$ 1145 -557 992 97 583 307 -1026 371 -735 344 -315 -295 -155 -470 320 -59 -177 829
12836H29j042p24L62j37L11Q70l71J93n33r2P03j050K512k131O92k2n72J22p32
$$ 829 -213 -937 -575 -712 -401 469 98 291 -242 -334 369 -681 1831 -300 392 370 -202 -80 -812
12855h12P51l87J549j020K2N54p37O02j5k91K03r0j055O16L40J82n87J483r76
$$ -812 -61 -448 1101 81 103 657 -80 522 507 216 419 329 -726 -110 230 412 -175 1308 332
12874C32l10q88r9J811r36J284p42n56j50j19L18n00P94o52Q3J343j227K45o84
$$ 332 22 -866 -965 846 -90 1194 452 -104 -254 -373 -55 -555 239 -413 -330 1013 -214 31 -653
12893f53P41k49R08j583N60O47k50J103j143p13P8r70J632j330K093j366J336
$$ -653 88 -161 747 -836 -276 371 121 1224 81 -632 -554 -1524 108 -1222 871 -495 841
12910H41r55m44O87q2J201k564Q38n7r7J028j1j073L82N99o81n03J074r15J971
$$ 841 -114 -558 129 47 1248 -1316 -478 -535 -632 396 385 -688 -306 293 -388 -891 183 -732 1239
12929A239j355P89j87j105K27j06J428j186J529l73j796J431j363P08l71O07K58
$$ 1239 -116 673 486 -619 -392 -498 930 -256 1273 900 -896 535 -828 -120 -491 116 374
12946C74k54N23j999J407J199o08k8q63O45k80J457k618P09m2M94K09r55J623
$$ 374 120 643 -1356 51 1250 642 614 -249 396 116 1573 -1045 -336 -378 116 325 -630 993
12964I93r23r96J417k67n11k51K63O61q5k35p99j58Q59n23N29o58P66r30J238
$$ 993 70 -926 491 224 -287 -538 -275 386 301 66 -733 -891 -32 -555 -26 -684 82 -848 390
12983C90nq73j61R40j08j458J799p13l3O88p76Q19j321N98p2R61p2r04k61J86
$$ 390 385 -488 -649 291 183 -1275 524 -189 -222 466 -310 509 -812 -214 -286 675 603 -301 -562 -376
13003c76J069j135o60K68j29K517j627Q45o48l85n6K16R68j917K51p03Q06J020
$$ -376 693 -442 -1102 -834 -963 1554 -73 772 124 -261 -317 -101 867 -1050 -799 -1502 -696 324
13021C24l11K04J80Nn3j70r47R79J018j297P83r27L71J77r74J533J37q27Q89n33
$$ 324 13 217 397 402 349 179 -768 211 1229 -68 715 -212 159 336 -638 895 1032 205 1094 561
13041E61m52J33q9L25K26J11j050N41o92k62L79K91m1r9j66N55JJ41J90p16K05
$$ 561 109 242 153 478 704 815 -235 306 -386 -648 -269 22 -19 -118 -284 271 272 413 603 -113 92
13062I2J25p8J57Q98k106J627j607O95n99R44J32n13J157k209J116o76N27J000
$$ 92 217 139 296 1194 -912 715 -892 -197 -796 148 280 -233 924 -1285 -169 -845 -318 682
13080F82j260M6q64K072r95l45K62K58O45j247J934j379o97R80K11o48M48m8o2
$$ 682 -578 -532 -1396 676 -319 -664 -402 -144 501 -746 1188 -191 -888 92 303 -345 103 55 -7
13099gr44J359p90J605j928J223p93O31o92p47J565l58J01q22N86j47K59L87M92
$$ -7 -951 408 -382 1223 -705 518 -275 356 -336 -1083 482 124 225 -597 -11 -158 101 488 980
13118I80q05J27k92O33m85L03l39O20j10j653J791m53L26r94J533k771O94P46
$$ 980 175 302 10 643 158 461 122 742 632 -1021 770 317 643 -351 1182 -1589 -895 -149
13136a49j91J634q14o43j07L82l51l84Q99j85m86j34J163j161J484n91n59M99
$$ -149 -340 1294 480 -163 -270 112 -239 -623 276 91 -395 -529 634 -527 957 366 -193 306
13154C06q01N92M23k95j55R0l16J145j037M0m73k92N74O18M3n67j3N69r77j6n9
$$ 306 -495 97 520 225 70 160 -156 989 -48 -8 -481 -773 -199 419 462 -105 -118 451 -526 -542 -601
13175f01L80j313J352m05J69K84qN92j815J911p53n51J416j153J869j377J138
$$ -601 -221 -1534 -182 -587 -418 -134 -142 450 -1365 546 -207 -758 658 -495 1374 -3 1135
13192A135j443L95J565j060r09M87J173k106P50n06L7Q00p66J050q85Q21r98M15
$$ 1135 -308 87 1652 592 -317 170 1343 -763 -13 -519 -482 318 -448 602 -283 538 -460 -45
13210d5J016p07Q20r14m86m3O30o15M10n45O79J77l31k0J209j628l30M88j71R2
$$ -45 971 264 1084 170 -316 -359 271 -344 66 -479 200 377 46 26 1235 -393 -723 -235 -406 -314
13230c14K44m44N84p80R35K7n04P51p79k69O99M96j166J706j335n4M10r7J228
$$ -314 -70 -514 70 -710 225 252 -252 499 -280 -549 150 646 -520 1186 -149 -203 207 110 1338
13249A338k009L01M48M55j16j041Q94J94m4r18o26K107m20l00j403J723j129j92
$$ 1338 -671 -370 78 533 417 -624 270 464 420 -498 -1124 983 563 263 -1140 583 -546 -738
13267g38R87p97J739j397n33j124J809j093R06R99j405J232p17K64mM58L92k247
$$ -738 249 -548 1191 -206 -739 -1863 -54 -1147 -241 758 -647 585 -132 132 128 586 978 -1269
13285a269J837j398O94L94p7oj04j24l69K53L87J54N00j574J259j965J736K91
$$ -1269 568 -830 -136 258 181 175 71 -53 -422 -169 218 372 872 -702 557 -1408 328 619
13303F19k34m5j273J545Oo96o66M9n87L86J007N9P8M1q53M13o8J163j222L8P84
$$ 619 385 340 -933 612 618 -78 -744 -695 -1282 -896 111 170 248 289 -564 -151 -219 944 -278 -240 544
13324E44m47k29R01j120J254n75l10m04J257q03J78q37J240j45q68j036O36M55
$$ 544 97 -132 769 -351 903 328 18 -386 871 68 246 -591 649 504 -364 -1400 -764 -309
13342c09P37J14m30j513K397n92j18M54j264N11N80N39k06p60L2P0R64n46l97
$$ -309 428 542 112 -1401 996 404 286 740 -524 -13 567 1106 900 140 172 242 1206 660 263
13361B63j89K48R22k553J829j652J069P90j775Q45p6n14P00Q87k025J252m7o82
$$ 263 74 322 1244 -1309 520 -1132 -63 727 -1048 -203 -279 -793 -93 794 -1231 21 -26 -708
13379g08J336o03L58J57J86j159k3P59n4P38q48o51J658k488J539k07M37m6k07
$$ -708 628 25 383 540 726 -433 -456 303 249 987 139 -512 1146 -1342 197 -10 427 381 174
13398A74p72o40J761q62Q1J47L22J23p05j24J58l4J57P66j518R27P00j247P3J456
$$ 174 -598 -1238 523 -339 -258 -111 211 334 -371 -495 -337 -371 -214 552 -966 -39 661 -586 -513 943
13418I43o37K38q12M57j88o0J09j46k49l31L84j88N36P08o81Q0M32j176k07M88
$$ 943 306 544 -268 189 1 -59 50 -96 -345 -676 -292 -480 56 764 83 163 595 -581 -788 -300
13438c00J525p69M48r29K73M63j986J792k48j68j172J64R54J64K36p62J201l6
$$ -300 1225 456 904 -25 248 711 -1275 517 269 101 -1071 -907 47 211 447 -315 886 850
13456H50j757N11R33o91j137J370O47j93R2m00J267l190L071j210P1R80k182J474
$$ 850 -907 -396 537 -154 -1291 79 726 533 625 225 1492 -1698 1373 163 234 1214 -968 506
13474E06l23O41k37j409J398j300j08R69N32K86j318N5O83J282j032r89N01k65
$$ 506 183 824 587 -822 576 -724 -832 137 669 955 -363 -308 375 1657 625 -364 137 -128
13492a28R16o01j609R61P51q25K41Q16j653J392o67o08J002k80R73j074O92p77
$$ -128 788 187 -1422 -461 290 -535 -294 522 -1131 261 -406 -1014 -12 -292 681 -393 299 -478
13510d78R00J24j444R11p39L96K56M5P02j5l57J45m74m06J053m97p47N60n41Q47
$$ -478 422 546 -898 13 -726 -330 -74 -29 673 658 301 446 -28 -434 619 122 -625 -65 -606 241
13530B41l50r23J248o89J452n74k86N58j038m94J64M97K79O47p11j024Q79L71
$$ 241 -109 -1032 216 -473 979 405 119 677 -361 -855 -691 -194 85 732 21 -1003 -124 247
13548B47o16Q14k37P21j202O08L76l52k09j74L7p2J116j367M84r27O79J388j579
$$ 247 -369 445 208 929 -273 335 711 359 150 -24 13 -59 1057 -310 174 -753 -74 1314 -265
13567b65R94j109K31M82M33M48j629J638r2p90o67R99N68j728P62m28N80r50Q52
$$ -265 729 -380 -149 333 766 1214 -415 1223 1131 341 -326 673 1241 -487 275 -153 427 -523 329
13586C29m20J84L88j233J145O3j034J508m92L59j124j42M78J35k0p53J401j061
$$ 329 -91 93 481 -752 393 456 -578 930 438 797 -327 -469 9 144 124 -629 772 -289
13604b89j09J054j323J10M96L09o3l17R60j568N59O60j96l78J97L96o07Q10m77
$$ -289 -398 656 -667 -557 -61 248 185 -132 828 -740 -181 479 283 -95 102 498 -109 701 224
13623B24k41r8r23K334j631j56K76N96m45j441J548l64O80j6j263J213j068J417
$$ 224 -17 -115 -1038 1296 -335 -491 -215 381 -64 -1505 43 -321 359 343 -920 293 -775 642
13641F42j327Q30j06K63m78j209K150n85q8m97J122p57r12J241J8N15j154jn46
$$ 642 -685 145 39 302 -176 -1385 765 180 92 -405 717 -40 -952 289 307 822 -332 -333 -879
13660h79J512p6j792K447r56l87O34l34N30r14J328j172J23q6j66L33l95J768
$$ -879 633 557 -1235 1212 256 -131 503 169 699 -215 1113 -59 64 -22 -188 145 -250 1518
13678A518j189l34l90LR60j025J024j527K189j157q08J015p01j90Q46m19l9J630
$$ 1518 329 -5 -395 -392 568 -457 567 -960 1229 72 -736 279 -422 -612 234 -185 -224 1406
13696A406j531R57l70m30j135J068j0j87j59k65P25k77m67n08J036m80l75M33
$$ 1406 -125 832 462 32 -1103 -35 -45 -232 -391 -656 69 -208 -675 -1183 -147 -627 -1002 -569
13714e69l63J488j320M5P58p48J210n4q33J014j524R14L42Q41j768J060j094N43
$$ -569 -932 556 -764 -719 39 -709 501 447 -386 628 -896 18 360 1201 -567 493 -601 -58
13732e8K64p55N76j053N31K45N76p76o04R59l04R90j356l75J110n95J035j083
$$ -58 206 -549 27 -1026 -495 -250 326 -450 -1054 -95 -399 591 -765 -1140 -30 -625 410 -673
13750f73M14P03r98LK73J282r97j0l0n8O83L34p01j254J754j109J021j388O79
$$ -673 -259 444 -554 -551 -278 1004 7 -3 -33 -91 592 926 225 -1029 725 -384 637 -751 -72
13769g2P27j398N78J68o38P10M57k74j000P08o26j97Q61M55k87o22J541j515O45
$$ -72 655 -743 -165 3 -635 75 532 258 -742 -34 -660 -857 4 459 172 -450 1091 -424 221
13788B21m29K29o35R86K64j28m73j2q67R39l60M92p2N33j05j47j308J238J52m08
$$ 221 -208 21 -614 372 636 508 35 23 -844 95 -265 227 155 688 583 436 -872 366 518 110
13808A10l57J287j584R61j021J64Q65j277P70l64Q90o29K03J170j442R46p76J200
$$ 110 -247 1040 -544 417 -604 -440 425 -852 -82 -446 444 -185 18 1188 -254 692 -84 1116
13826A116m12k128J399j427J773l78m1O49j785Q99R91q54Q52j132J48r09J236
$$ 1116 704 -1424 -25 -1452 321 -57 -98 551 -1234 -335 656 -198 654 -478 -330 -1239 -3
13843ck407L499j637L90P49L44r94N46O57j475M95o00r18J218j38P37p18N34n07
$$ -3 -2410 1089 -548 -158 591 935 -59 487 1144 -331 164 -436 -1354 -136 -274 463 -255 279 -228
13862b28P29L15O21j596J029n26q7J59q48J094j771J032R83r35o53k02Q64n60
$$ -228 501 816 1437 -159 870 344 257 416 -432 662 -1109 -77 906 -29 -682 -884 -20 -580
13880e80P48Q43j004o4l42R27n42J091k23J10k90j774Q06Q89N18j273J057j339
$$ -580 168 1011 7 -57 -399 528 -14 1077 854 964 674 -1100 -294 595 1113 -160 897 -442
13898d42n60N79j40J651q47N20o38N54m37q46M05p95Q39j111J506n6m8N19j746
$$ -442 -1002 -423 -563 1088 241 761 123 677 240 -606 -201 -996 -157 -1268 238 182 134 653 -1093
13917a093J834j842J418Q21j693P52K85J65q24L80k49r63J475j383J482j274O99
$$ -1093 741 -1101 317 1138 -555 197 482 647 -177 203 -46 -1009 466 -917 565 -709 -10
13934a0m63p26P65n90J140j74K89m78K9J003j75K14j332J83m56J269o27j49Q00
$$ -10 -473 -1199 -434 -1024 116 -58 231 -247 -218 785 610 824 -508 -325 -781 488 -139 -288 512
13953E12j179p0L54R65q89J319j856P75l28R71m20K65j130J879j271k75M39J85
$$ 512 -667 -737 -383 582 -307 1012 -844 -69 -397 574 154 419 -711 1168 -103 -378 61 246
13971B46o48k39L5R37o24J081j653L81O17P83q9q68N42j303l34J774m53J007o73
$$ 246 -402 -641 -606 331 -293 788 -865 -484 133 916 827 -41 501 -802 -1136 638 185 1192 519
13990E19n99R67m53Kl84R48j225O01q99J337j544J207J688k211n72Q08j19n75
$$ 519 -80 887 434 436 52 1000 -225 376 -523 814 -730 477 2165 -46 -618 190 71 -504
14008e04l13R81j910J585j209J230p41N9J138l24J144k330J537j128N95P60o97
$$ -504 -817 164 -1746 -161 -1370 -140 -881 -822 316 -8 1136 -1194 343 -785 -190 570 -127
14025a27J522n51j653L64k57J767p14K31m94J96m73oP45jj05r4r8r17N80M37P29
$$ -127 1395 844 -809 -445 -702 1065 351 582 88 284 -189 -195 550 549 444 350 252 -665 -85 352 1081
14046A081p41M01k88l97j006J557j003r3R29p67j49p44J223q28J390N69o24j054
$$ 1081 340 741 453 56 -950 607 -396 -489 440 -327 -476 -1220 3 -825 565 1134 510 -544
14064e44J268j090m74K40K8N55M82j194J484L48j698J046n79P50j128m04J010
$$ -544 724 -366 -840 -600 -572 -17 465 -729 755 1103 -595 451 -128 622 -506 -910 100
14081A00P8J932k438J011k219R24J014p15P36J66q42j297J855J18j436J051K00
$$ 100 178 2110 -328 683 -1536 -612 402 -313 423 589 -253 -1550 305 423 -1013 38 238
14098B38O1k118J980J73p34J060r61O99j375Q75p0N6J138n02o03L89N73j251j88
$$ 238 299 -1819 161 334 -400 660 -301 398 -977 -102 -172 -116 1022 520 -83 306 879 -372 -560
14117e60J970j382M98J97L94j271k28j14r30J708N57q02p45O82N2j57P92r67N66
$$ -560 1410 28 526 723 1117 -154 -382 -496 -1426 282 839 37 -708 -26 26 -131 661 -306 260
14136B60j69M76j280J109P4j139n35J452o09R2r8n14Q73N45K89l87l57L16j24
$$ 260 91 567 -713 396 470 -669 -1204 248 -361 -269 -367 -881 -8 537 826 439 82 398 274
14155B74j579J161j52R96p41j16M58o36k10J555j413O73m0j5L33Q89q93j880R11
$$ 274 -1305 -144 -296 700 -41 -157 301 -335 -545 1010 -403 270 230 215 548 1437 544 -1336 -425
14174d25L52j11Q61j733O40j256J090M74J27M55j886L312j785j35o03P43j32j426
$$ -425 -73 -184 677 -1056 -416 -1672 -582 -108 19 474 -1412 1900 115 -20 -623 120 -12 -1438
14192a438K069r42P56o25j516K300j490P08l4J001j537Q03n1j031K019k190K442
$$ -1438 631 -311 445 -180 -1696 604 -886 -178 -212 789 -748 55 4 -1027 992 -1198 1244
14209A244j472M88j33q9O9L45M10m04j82o45p3O26o72j09l03J844j046J92n30
$$ 1244 -228 260 127 38 107 452 862 458 276 -369 -442 184 -488 -597 -900 944 -102 90 -440
14228d40K42J08P13k142J025Q18o85l44L93L50Q6K81j95l45J356j319k66M69q98
$$ -440 -198 -90 623 -1519 -494 324 -361 -705 -312 38 124 405 210 -135 1221 -98 -364 105 -793
14247g93J797p35K96r2p05l23Q55q44L4N01o11J721j006l44K6O5P92P86j024n47
$$ -793 1004 269 565 473 -232 -555 300 -544 -510 -9 -620 1101 95 -249 -223 -158 634 1420 396 -151
14267a51k70j82J420q58J61J015j751J564l21j762J915j931J521j306J255o25
$$ -151 -421 -603 817 -41 120 1135 -616 948 627 -1135 780 -1151 370 -936 319 -306
14283c06J028m45r47J098j39k04l31O06J97n49J42k86j28J10p69L96l34J248l53
$$ -306 722 277 -670 428 289 85 -246 360 557 8 150 -136 -264 -154 -923 -527 -861 387 34
14302C4J13r83R80N14J74j494o47J693o28N30j40L77n41l72j14O77j085R42J03
$$ 34 147 -836 144 658 832 -662 -1309 384 -244 286 146 523 -18 -390 -504 173 -912 30 133
14321A33R4L4p18l13J084J199j235J80o31k18J94l92l5P68M62m13j094J814j027
$$ 133 227 261 -457 -770 314 1513 278 458 -173 -391 -197 -589 -624 144 606 193 -901 913 -114
14340a14J99L08l25N6o39N99l48l03o03M40J785k99r5j577J154p68R39j157M85
$$ -114 85 393 68 124 -515 84 -264 -567 -1170 -730 1055 756 661 -916 238 -530 409 -748 -263
14359b63Q11j349J544j383O37j91J169l60j215M12r12L77j60M95M42K09J026j574
$$ -263 548 -801 743 -640 -3 -194 975 615 -600 -188 -1100 -723 -883 -388 54 263 1289 -285
14377b85K086k820K29J716k064K250k204J036o5M63J14m40R17j303N49p95O07
$$ -285 1801 -1019 -790 926 -1138 1112 -1092 -56 -121 342 456 16 933 -370 179 -616 -9
14394ij23k42J170o24o18j47K06P28Pl29P67o15k26R01j71O35k043l45J619n11
$$ -9 -132 -374 796 172 -446 -593 -387 341 348 19 786 171 -55 846 675 1310 -733 -1078 541 30
14414C0K61q68J00Q79j216j3Q59L45j37K69o47j47P4J64m60J08K3O2K74j185Q12
$$ 30 291 -577 -477 402 -814 -827 32 377 240 509 -138 -285 -211 -47 -507 -399 -376 -314 -40 -1225 -413
14435d13P03K30L84j217J60m45J249j023P64J99k094J504r6P30p19R61n53j233
$$ -413 290 520 904 -313 -153 -598 651 -372 392 591 -1503 1 -95 635 -84 877 324 -909
14453i09J652j456k80P96n56K22P0P10l70K44k31J153j358j79J077j714L55n10
$$ -909 743 -713 -993 -197 -753 -531 -461 249 -121 123 -108 1045 -313 -492 585 -1129 -774 -1284
14471a284R03L32j556K612j508R06p33m10J270j5j83o60O79n78O51J80q42M97
$$ -1284 -381 -49 -1605 1007 -501 405 -328 -738 532 517 334 -326 353 -225 426 606 -236 261
14489B61O12n48n78M24n49M26m15P25l58n97O5J967j215J80N5M49p30k49M86j54
$$ 261 873 325 -253 171 -378 48 -367 358 0 -597 -532 1435 220 400 455 904 174 -75 411 257
14509B57K09j343JN09K14O08MK49n00L68r49K37r02Q81p5j92N21P00j519N99J45
$$ 257 466 -877 -876 -367 -153 455 459 708 208 576 -373 -136 -1038 -157 -232 -424 97 797 -722 -123 22
14530B2j008J761l08K77j521n50O0J990o00L62R04l169J719p81J751j285j82J273
$$ 22 -986 775 467 744 -777 -1327 -1267 723 123 485 1389 -1780 -61 -842 909 -376 -558 715
14548G15k000J317r3L35m37K32k2m12K822l194P66L83M80k08l72j55r74J727q77
$$ 715 -1285 32 -61 274 -163 69 47 -365 2457 -737 29 412 892 684 312 157 -817 910 33
14567C3j028J689q67O98j190J067j61j82L06j464J111j085J355J35j086J063r8
$$ 33 -995 694 -173 525 -665 402 241 59 365 -1099 12 -1073 282 417 -669 394 296
14584B96K57j944J837M90r14O68k342K012q0q31L34m56R66J3r30O95m19O02o37
$$ 296 553 -1391 446 936 22 690 -1652 360 280 -551 -217 -673 293 306 -624 71 -348 254 -383
14603c83J232o47J102j345j37J461j494k8O33j412J837j024J203n88j318P45m4
$$ -383 849 202 1304 -41 -178 1283 -211 -239 394 -1018 819 -205 998 410 -908 -163 -207
14620b07K45k59R51j141R72j79k39j01o31M27K17q73M47K83K43j077J883K08l26
$$ -207 38 -221 730 -411 561 382 143 42 -589 -162 55 -818 -371 -88 155 -922 961 1169 843
14639H43j756J159q10o70J198j126J526n74M33j38j235J271m50J033j499P31P6
$$ 843 -913 246 -564 -1234 -36 -1162 364 -210 223 85 -1150 121 -329 704 -795 -64 12
14656A2m0L60j433J906j005j71p58n53K746j670J699j209M06L69j243N56j3J84
$$ 12 -28 332 -1101 805 -200 -371 -1129 -1682 1064 -606 1093 -116 290 659 -584 -28 -41 143
14674A43O54o90k04R46j699M83J111j098o8MR46J28j072J117j316J57R15L22J
$$ 143 797 107 -97 849 -850 -367 744 -354 -422 -418 528 656 -416 701 -615 -458 457 779 780
14693G80k0j18n45r61J761M04j378m76o2J112n97O3R00l54j020O13J55n57J071
$$ 780 760 642 97 -864 897 1301 -77 -553 -615 497 -100 -37 863 509 -511 102 257 -300 771
14712G71j924J516n21l49Q29r29J887j719l53P54n27O03j659K432j428J024R65
$$ 771 -1153 363 -158 -507 322 -607 1280 -439 -792 -38 -565 38 -1621 811 -617 407 1372
14729A372k527J475m42J038j505J020l23J00M82o07n23M85q7Q92r40N2p83J269
$$ 1372 -1155 320 -122 916 -589 431 108 208 690 83 -440 45 -42 850 -90 -38 -821 448
14747D48n0K65K31j412k38m8Q65m36N37l92M16N55j995J087p5J26J270k844J103
$$ 448 398 663 894 -518 -756 -804 61 -375 162 -230 186 741 -1254 -167 -242 -116 1154 -1690 -587
14766e87K60R68O91p12k16l68q9m18J095J62r66J10r25J02q9J754j010n28J009
$$ -587 -327 641 1332 620 404 36 -53 -471 624 786 -180 -70 -995 -893 -982 772 -238 -766 243
14785B43j93L73l23l48J060j379Q90l64M68l23l43N84k6L58p53J125j711N70J403
$$ 243 50 423 100 -248 812 -567 323 -41 427 104 -239 345 319 677 -76 1049 -662 -92 1311
14804A311j877J257o97n36O47p02R78j369J567j021j17P53p26J184o42l49k96
$$ 1311 -566 691 -6 -542 105 -597 381 -988 579 -442 -559 194 -532 652 10 -339 -635
14821f35R23j61j448J181p11M26j31O60K72j043J530j478J057o87L27K39j618
$$ -635 288 127 -1321 -140 -851 -425 -556 104 376 -667 863 -615 442 -245 82 321 -1297
14838a297J022n54J474j271M12J041r07q39K36J269o11Oj241L73R12j23Q53j300
$$ -1297 -275 -829 645 -626 -214 827 -80 -919 -683 586 -25 -19 -1260 -887 25 -98 755 -545
14856e45J352j055m37R71k27j186K138n76j279K050j536m34R36k03K76q21J320
$$ -545 807 -248 -685 286 59 -1127 1011 435 -844 1206 -330 -764 172 -31 245 -576 744
14873G44r20M52m04O66j10n38K61q46k47J168L87q20J322j929K21N54l16m61R25
$$ 744 -176 276 -128 538 428 -110 151 -695 -942 226 613 -207 1115 -814 -593 -39 -355 -816 109
14892A09J086j084l28J118q24k42l3J686j339m26l04L24J060o23R80k074K38M68
$$ 109 1195 111 -217 901 77 -165 -198 1488 149 -277 -581 -257 803 180 1160 -914 -676 -208
14910b08j232K149r79m23L57J30r8n56R62r92k42M19J217j727J679q18m23J690
$$ -208 -1440 709 -270 -693 -336 -206 -304 -860 102 -890 -1132 -713 504 -1223 456 -362 -785 905
14928I05k530J223M83l10K10o63Q95O85M16o16l57L53p03O67o89r29J205O14j111
$$ 905 -1625 -402 81 -229 -19 -682 213 898 1314 698 341 694 -9 658 -31 -960 245 859 -252
14947b52j47O02l40J77Q8n34m25Q92M90j484J067P78q19J71m47n03o31J694o20
$$ -252 -399 203 -137 40 128 -406 -831 61 551 -933 134 912 93 264 -183 -686 -1317 377 -243
14966b43j8m71K83K29O70m73j05q1J26l27J58J55j135R15K8n69K013j322J169
$$ -243 -261 -732 -449 -220 450 -23 -128 -209 -83 -410 -252 -97 -1232 -317 -289 -858 1155 -167 1002
14985A002j541L45L3p34J326k41l87m3O70J09j347J039r74R93j32j05j18L69J454
$$ 1002 -539 -194 -161 -895 431 190 -197 -240 430 539 -808 231 -743 250 118 13 -105 264 1718
15004A718k075R12j740K112k344K101M74j475P26j839J449o23m5N18N17M47j033
$$ 1718 -357 555 -1185 927 -1417 684 1158 -317 409 -1430 19 -604 -649 -131 386 833 -200
15021b00L91k27o55K94k35M44M08J53l75J56r1k84l48Q26O83j822O89N85K25l81
$$ -200 191 -36 -691 -397 -632 -188 220 373 -2 154 63 -221 -569 257 940 -882 -193 392 617 236
15041B36j65K76j167J818l40o70l89M88q2m07N52l75K57j26Q2j11Q46j150N53
$$ 236 71 347 -820 998 658 -12 -401 87 5 -402 150 -225 32 -94 -12 -123 723 -427 126
15060A26j06K35M54j601J676j016P18P94j395Q45j183R02j035J748o00m50N5j33
$$ 126 20 255 709 -892 784 -232 486 1280 -115 730 -453 449 -586 1162 562 112 167 34
15078C4K10L4M48j016L32P81n73K81n61J03r11N71j146J539Q80k869K159k87J29
$$ 34 244 278 726 -290 42 823 250 531 -30 73 -838 -267 -1413 126 1006 -1863 296 9 138
15097A38P48J1L67k571J025n83J231r55K15K330l756J313o93K158n88j762J822
$$ 138 886 897 1264 -1307 -282 -865 366 -589 -374 1956 -1800 -487 -1180 978 390 -1372 450
15114D50o6R5o75K81k91Q76n16n18R55n37q4J00Q80n18j224j97mJ183q09J769
$$ 450 384 479 -196 85 -206 670 154 -364 591 54 -30 70 950 432 -792 -989 -993 190 -619 1150
15134A150j149M74k27o79K85p81Q05K4K9m34O98j070J095J21j95j092O24P99l94
$$ 1150 1 475 248 -431 -146 -927 -122 -98 -69 -503 195 -875 220 341 146 -946 -322 477 83
15153H3p61M75O38j233K31J655j868Q44j000J504n41q91R69M39n14J07L08p02
$$ 83 -678 -203 435 -798 -567 1088 -780 64 -936 568 27 -864 105 544 30 137 445 -257
15171b57N46o2k209J582m16P22Q26j981K037j505J376p16R58m54j789J833j138
$$ -257 289 227 -1982 -400 -816 -94 732 -1249 788 -717 659 -57 901 447 -1342 491 -647
15188f47J106k50L9J46r25J182k403K201j210J017L77q2k40j245J594j971J384
$$ -647 459 209 248 394 -531 651 -1752 449 -761 256 633 551 311 -934 660 -1311 73
15205G3m44L5J08k58n60j1J505q87Q27k43oO99j096P43P25j171l39K94J056j629
$$ 73 -371 -336 -228 -486 -1046 -1057 448 -439 388 145 139 838 -258 485 1210 39 -300 -6 1050 -579
15225e79k7J092p34R32j932P56j23J434O6j208q9j48Q61k31P69j111N31M13j041
$$ -579 -606 486 -248 684 -1248 -492 -615 819 885 -323 -412 -560 301 70 839 -272 259 672 -369
15244c69l85J504o12j23K13N54j57j237Q47j032J329r54p35J553L11o39k8j46
$$ -369 -754 750 138 15 228 782 625 -612 235 -797 532 -422 -1157 396 707 68 40 -106
15262a06j367K467o21q9L07m49K90n67J020n75p69J559n63q46L67J53j139J503
$$ -106 -1473 994 373 284 591 142 432 -135 885 310 -459 1100 537 -309 58 211 -928 575
15280E75N49j613R18l64M48j257p6R51j43K81K08p14rR80p17l85Q87m84l30R93
$$ 575 1124 -489 429 65 513 -744 -820 131 -12 269 477 -237 -246 734 17 -368 519 35 -295 698
15300F98l89M05j548P46j16Q26k89K39r1n56J528o95p12O73j051P75m84J75m61
$$ 698 309 714 -834 -88 -204 622 333 572 481 -75 1453 758 46 719 -332 443 -41 134 -327
15319c27J25O37j180P06K79j11o03m59J071J057J03p78j000J173j009J64M79l27
$$ -327 -202 435 -745 -39 240 129 -474 -933 138 1195 1298 520 -480 693 -316 -152 327 0
15337@J044j142o69L35M24j399P83J660r63l26q53O64J20Q47j93q48O50r27J809
$$ 0 1044 -98 -767 -432 -8 -1407 -624 1036 73 -253 -1106 -442 -322 525 332 -516 134 -793 1016
15356A016j764J259j235R6J284j202J148q55J371J90m17j932k00J670n10Q68p38
$$ 1016 -748 511 -724 -628 656 -546 602 -253 1118 1308 891 -1041 -1241 429 -81 787 49
15373D9l95N68j521K383q54N81P6q41kn80J616k142J313l49N03j073o00K300j092
$$ 49 -346 222 -1299 1084 230 811 887 46 44 -536 1080 -1062 251 -98 405 -668 -1268 1032 -60
15392f0P85o52P76o41j005J824r42J677k062N91Q7q10J480j633J146n93j30Q7
$$ -60 725 73 849 208 -797 1027 85 1762 -300 291 378 -432 1048 -585 561 -32 -162 -75
15410g5J112l18j438Q78j034N66L79k84Q85o17O69j929Q11k2O88m63K73l54N00
$$ -75 1037 719 -719 159 -875 -309 70 -214 671 54 723 -1206 -395 -417 271 -192 81 -273 227
15429B27q95M40r26J839o91j79R93o12q70J98J25j3o08J345j052J158q69O45L32
$$ 227 -668 -228 -1154 685 -6 -185 808 196 -674 -476 -351 -364 -972 373 -679 479 -390 255 587
15448E87n97O02r50P11j599J329M63n96Q23j207O36l89j39k20O26J271j594J83
$$ 587 -10 592 -358 353 -1246 83 546 -50 773 -434 202 -187 -326 -546 80 1351 -243 -60
15466f0q46J431p42k66J555j363J789k317K90J196q45R86j029Q49j443J516j924
$$ -60 -906 525 -217 -483 1072 -291 1498 -819 -529 667 -178 808 -221 628 -815 701 -1223
15483a223K181j237j96J771k425J830q5r29J666j009p34P5J089K68j001K03r53
$$ -1223 958 -279 -475 1296 -1129 701 616 -313 1353 344 -390 -315 774 1042 41 244 -709
15500g09J395j291K6J185j828J386K09p02K44J048j439L83k72P88n55k66J28R
$$ -709 686 -605 -579 606 -1222 164 373 -329 -85 963 -476 -93 -365 423 -132 -398 -270 -261
15518b61Q54j199L78p17J036L66n32m33J37P61L50o89n14Q65n8o38J064j65q79
$$ -261 593 -606 -228 -945 91 457 -75 -508 -371 390 740 51 -463 402 344 -294 770 605 -274
15537b74j059K115j277R95k40k20oO5k81k93K048j134j196J173J71k6j795J337
$$ -274 -1333 782 -495 500 260 40 34 99 -182 -475 1573 439 -757 416 587 561 -1234 103
15555A03q11n33J809j378J472j359J239m81j154J265n44L05J11r3N39m91k0k26
$$ 103 -708 -1241 568 -810 662 -697 542 61 -1093 172 -372 -67 44 -49 490 -1 -21 -247
15573b47J135o36m88P91o55J315j567K10M37K80n02r68J135n47p03M37J087j283
$$ -247 888 252 -236 555 -100 1215 -352 -142 295 575 73 -895 240 -307 -1010 -573 514 -769
15591g69Q84q9M6M60j087J09J331j209L04J399j734J166o60o29M52r5p25J85N75
$$ -769 115 26 72 532 -555 -446 885 -324 -20 1379 -355 811 151 -478 -26 -121 -846 -661 -86
15610h6l46J269j115L13Q0p30J76o8J249p31O00Q7j013k68J1J60k23J87L02M82
$$ -86 -432 837 -278 35 115 -615 -439 -507 742 11 611 698 -315 -583 -572 -412 -635 -448 -146 336
15630C36q91O16J15r18J775j154J500j304k23L74j96R95j863J189L53j228O84
$$ 336 -555 61 176 -742 1033 -121 1379 75 -148 226 30 1025 -838 351 704 -524 160
15647A60j046J357l9r04J381j954K654l227K102R9j008J040m26M5j408K266r39
$$ 160 -886 471 432 -472 909 -1045 1609 -1618 484 583 -425 615 189 234 -1174 1092 153
15664A53j26m50P94J498k454j08P13L0Ql78M59K86r95J11P40R5p49O65q32K119
$$ 153 27 -423 371 1869 -585 -693 20 50 58 -320 139 425 -570 -459 281 376 -373 292 -540 1579
15684A579j583j688K114l83j3N08k80p2j09J04p32K31J40m59J747j570J096N0
$$ 1579 -4 -1692 422 39 26 534 254 182 73 177 -555 -324 -184 -643 1104 -466 630 680
15702F80n17Q4J32j943J899M36k59n09l23n20N76J117j710M16L76O33j412N30
$$ 680 163 247 379 -1564 335 771 512 3 -320 -840 -264 853 -857 -441 -65 568 -844 -314
15720c14p84K249j751o87J806r63J403q76Q67n27n26J230k408K264j468M32M95
$$ -314 -1098 1151 -600 -1287 519 -444 959 83 950 423 -103 1127 -1281 983 -485 -53 442
15737D42q52R04p28O00j30P47j092n1J17j348J459m75J115j123N92N2o06K77j387
$$ 442 -410 494 -234 366 236 983 -109 -160 -43 -1391 68 -407 708 -415 177 229 -377 -100 -1487
15756a487J550n24M90J25p69J568j309J274j134r7P88L18J59j18N48j669N69J2
$$ -1487 63 -461 29 154 -615 953 -356 918 -216 -313 475 793 952 834 1382 -287 282 294
15774B94j103J943q13n21l5R91j470k54L80l98P92J19L56N20r80o74J840j645
$$ 294 -809 1134 321 -200 -235 756 -714 -968 -588 -986 -194 -75 281 801 -179 -853 987 -658
15792f58K045j934J903k893N4K173q96N86m21k27J18o56K93k02K031r79q30J381
$$ -658 1387 -547 1356 -1537 -1483 690 -206 380 -41 -268 -150 -806 -513 -715 1316 337 -493 888
15810H88k73q17n4R00j32J15l73r7QO03p6j338P19q30N35O83j500K034j754N39
$$ 888 615 -202 -256 644 512 627 254 157 165 768 692 -646 73 -757 -222 461 -1039 995 -759 -220
15830b20p3K03q56O94J058p23o8J9K10j092O1K005j430Q04O1j268J88r6P07q23
$$ -220 -293 -90 -946 -252 806 83 15 34 244 -848 -787 1218 -212 592 653 -615 -427 -523 184 -639
15850f39J468j913N84k44M11Q75j474J093N97n20O1r3N04j302J134N70l43J78
$$ -639 829 -1084 -500 -744 -333 542 -932 161 758 238 299 206 710 -592 542 1112 769 947
15868I47j605k5k01L99M99p13J240k73p05M16Rk93K79P66j115k54L87Q47m58Q65
$$ 947 -658 -683 -884 -485 14 -699 541 268 -437 -21 -12 -305 -26 740 -375 -629 -242 605 147 1012
15888A012j037P7n6L87m88M92n94j10j085J606K27o38r2q40J660k09p65J014j607
$$ 1012 -25 52 -4 383 -105 387 -207 -317 -1402 204 431 -207 -299 -1139 521 312 -453 561 -1046
15907a046J663n40O31O44l12j436K15m07o40K003p96J58j050j096K500o89L70
$$ -1046 617 77 708 1352 1040 -396 -181 -588 -1228 775 -21 137 -913 -2009 491 -198 172
15924A72p31J80O94l46J415k267J034j180M35Q9j44O67o39J325j100p89J831j811
$$ 172 -559 -379 315 -31 1384 -883 151 -1029 -594 -505 -649 18 -621 704 -396 -1185 646 -1165
15942a165J879j043L35p74L63J88R05j247l48K431k393L45P10L17k41p72J804
$$ -1165 714 -329 6 -768 -405 -217 688 -559 -907 1524 -869 -524 186 503 262 -510 1294
15959A294j601O85m97j101K263q21J0j01K08m37k82J30Q39k80l55J63j307O42
$$ 1294 -307 378 -119 -1220 1043 222 232 131 339 -98 -380 -250 589 309 -46 117 -1190 -548
15977e48P98P7k23Ko47J281p67p27n42K047k78j804K072n75j31m5k21J83M10q6
$$ -548 250 327 104 106 -541 740 -27 -754 -1296 751 473 -1331 741 166 35 -10 -231 -48 362 276
15997B76l24O5Q28o56R38j876K148j227J81j28J89L78q51O28m70k07K2l68O34
$$ 276 -48 17 845 189 1127 -749 1399 172 353 225 414 792 -59 569 99 -108 -86 -454 180
16016A80m66P67n55l0m11N29R68j546J280k660K738j39m05Q52j717J520j607J737
$$ 180 -286 481 -74 -104 -515 14 982 -564 716 -1944 794 655 250 1102 -615 905 -702 1035
16034A035k298N23J323j115J474k140J580j163P00R12q89k42j51Q05O31n42j78
$$ 1035 -1263 -740 583 -532 942 -1198 382 -781 -81 831 -58 -300 -451 354 985 443 265
16051B65j344J24L89O10q6M30L67j094M38m06n93J121J121k686J343P46Q1q33
$$ 265 -1079 -955 -566 44 -42 388 755 -339 99 -307 -900 221 1342 -1344 -1 745 826 -7
16069gL69L78m11j4m82J137j889J017k44j1J441j603L28M53k37LK14k60j336K756
$$ -7 362 740 329 315 -167 970 -919 98 -146 -157 1284 -319 9 462 225 228 442 182 -1154 1602
16089A602j861P11r30O26J91p08O29r03N81j87P32j429Q3J411p53O93j892J964
$$ 1602 -259 452 -478 148 339 -369 260 -643 -62 -249 483 -946 -863 548 -205 488 -1404 560
16107E60Q58k162N18p37J907j740K10R16j12K12m75P86j460P26R2Q2M47j549J458
$$ 560 1418 -744 -226 -963 944 -796 -586 330 218 430 -45 741 -719 7 99 181 628 -921 537
16126E37j072J396j167o96J265N16r53j190J540j293M98J012o82M22L23m42l45
$$ 537 -535 861 -306 -1002 263 779 -174 -1364 176 -1117 -619 393 -289 133 456 14 -331
16143c31j37n6l96J826p32p65k48qK74J186k052K31J048O6O4l58N10J100j085
$$ -331 -468 -524 -920 906 174 -591 -839 -847 -573 613 -1439 -1208 -160 -94 -30 -388 122 1222 137
16162A37k92J026j403J309n40p10N57j412M24J268j013K100l509L298j598J086
$$ 137 -155 871 -532 777 237 -473 84 -1328 -904 364 -649 1451 -2058 1240 -358 728
16178G28J49k321J280L04M77r64O79j62L57r26M67J0j244K875k110k73k28Q78
$$ 728 877 -1444 -164 140 617 -347 332 170 527 -399 68 78 -1166 1709 -401 -674 -902 -24
16196b4P61j230J688j580P84p51j17Q29j283R75r49L94P33Q8l13J27L71q59K27
$$ -24 737 -493 1195 -385 399 -352 -469 360 -923 52 -897 -503 230 318 5 132 503 -356 -129
16215a29l36R51k85j205R45K62m55P4K29j93mN47j015N06M66j327K014j501J220
$$ -129 -465 486 201 -1004 -59 203 -252 -178 51 -142 -146 401 -614 -108 358 -969 1045 -456 764
16234G64M1l16k26j32q70K16l15O92J94P30j189k43J843j368M36o23k51P60n60
$$ 764 805 489 263 131 -739 -523 -838 -146 48 778 -411 -654 1189 -179 257 -366 -617 143 -417
16253d17L62k49J801q78o54m7N37j63N4m24o62J078L00k48J6m13J000j139L95
$$ -417 -55 -304 1497 619 -35 -82 455 292 346 -78 -740 338 638 390 406 -7 993 -146 249
16272B49n43M20L30n45R76j478J694j807LO81k3l18J061m41o64J283m32j27J67
$$ 249 -294 126 456 -89 887 -591 1103 -704 -701 -20 -43 -361 700 259 -405 878 446 319 486
16291D86j295R01N5l91J245j647J507j517L81J26L59P32j604l85lJ544p45M21
$$ 486 -809 92 147 -244 1001 -646 861 -656 -275 -149 210 942 -662 -1047 -1050 494 -251 170
16309A70q25R40n24n75M96L47J194k930J313Q62j568J033j1P36l34m07k69J651
$$ 170 -655 285 -239 -814 -318 29 1223 -1707 -394 468 -1100 -67 -78 658 324 -83 -352 1299
16327A299j330o34N86O4m21j69o46J237N87j57%j278P24J80m02O07O64N05q96
$$ 1299 -31 -665 -79 -15 -436 -605 -1251 -14 573 416 416 -862 -138 42 -360 247 911 1416 520
16346E20m65N15n62P57k084J319j44J428m79r93P67r14Q5n93R64p71M12O56l11
$$ 520 55 570 8 765 -1319 0 -144 1284 805 -188 579 -335 -250 -843 121 -650 -238 418 107
16365A07Q48q67O26j103L46K84r64J415j109J85P41k79K96j715J205j497K673
$$ 107 955 88 714 -389 -43 241 -723 692 -417 -232 509 230 526 -1189 16 -1481 1192
16382A192j723
$$ 1192 -531
16383e31
$$ Imaginary data points
##PAGE= N=2
##DATA TABLE= (X++(I..I)), XYDATA
0@%%%%%%%%%%%%%%%%%%%%%%%%%oJ9m3P1q6R6j07J12j17J27j42J64j90K13k29K54
$$ 0 0 0 0 0 0 0 0 0 0 0 0 0 0 0 0 0 0 0 0 0 0 0 0 0 0 -6 13 -30 41 -45 51 -56 56 -61 66 -76 88 -102 111 -118 136
41A36k85L11l37L73m10M58n08N51o10O73p41Q21r13J012j128J271j438J637j886
$$ 136 -149 162 -175 198 -212 246 -262 289 -321 352 -389 432 -481 531 -597 674 -764 873 -1013
60a013K212k643L256m202N852r584L2324R654p3946k8568J4558N9805L8612N625
$$ -1013 1199 -1444 1812 -2390 3462 -6122 26202 35856 -38090 -66658 -52100 7705 46317 51942
74E1942m1490m0125j2933K3670L6430J9265j2710l1654k1238M872K2876K3212
$$ 51942 10452 -29673 -42606 -18936 17494 36759 24049 -7605 -28843 -23971 -1095 22117
86B2117N54j6329k1543n471J2638J8408P098q329j3752q437N261R338O249l295
$$ 22117 22671 6342 -15201 -20672 -8034 10374 17472 9143 -4609 -13046 -7785 1553 7802 4507
100D507p372l018M383R698l0o655q854k218O978Q779L887p742j0197m820N833
$$ 4507 -2865 -5883 -1500 8198 8168 1513 -7341 -9559 -2581 6198 10085 2343 -7854 -12674 -6841
115f841J4987P532l923j4216j0904j268J0296J5079K909q631j1550o001P011J1918
$$ -6841 8146 15678 11755 -2461 -13365 -14633 -4337 10742 13651 5020 -6530 -12531 -5520 6398
129F398Q585m443j2952j0838j294R688J4127M705p876r185n102L206O629N151
$$ 6398 14983 10540 -2412 -13250 -14544 -4856 9271 13976 6100 -3085 -8187 -4981 1648 6799
143F799m038k831o093J958N162L006j835n777n88J149P118L320l068o845o424
$$ 6799 2761 -70 -6163 -4205 957 3963 2128 -3649 -4237 -3088 4030 7350 4282 -2563 -8987
158h987J773P621P679n86n335q282k988M458R574N980k468p050q819k629N296
$$ -8987 -7214 407 8086 7500 2165 -6117 -9105 -4647 4927 10907 8439 1389 -7430 -10059 -4763
173d763O189O604l885l183l532q65L046K874j21k115P02l737K53J351m08L082
$$ -4763 1426 8030 4145 962 -2570 -3435 -389 2485 2364 249 951 -2786 -2533 -1182 -1590 1492
189A492K008J629k648k086m006k443M497M667M055l319o107l919j790P112O646
$$ 1492 3500 5129 2481 395 -3611 -6054 -1557 3110 7165 3846 -2261 -6180 -7970 -858 5788
204E788L942m758q088n685P89O337O605L246l505q049n114L653P302M936J866
$$ 5788 9730 4972 -3116 -8801 -8012 -1675 4930 8176 4671 -3378 -8492 -4839 2463 7399 9265
219I265n036q945n803K919N921Q924K714m945p903m286N38Q041P127J659p521
$$ 9265 4229 -4716 -10519 -7600 -1679 7245 9959 5014 -2889 -7175 -6637 1404 8531 10190 2669
234B669r511o376R8J1667J3316N229o942j4803q714L01J0085J3297M159p038j5351
$$ 2669 -6842 -13218 -13120 -1453 11863 17092 10150 -4653 -13367 -13066 -2981 10316 14475 7437 -7914
249g914p292L314J4102J4067j071j1044j4308n648Q464J3628P221n305j2080j1090
$$ -7914 -15206 -11892 2210 16277 15206 4162 -10146 -15794 -7330 6298 13519 8214 -3866 -14956
263a4956M282J1734J2064J634j1018j1812o714O346J2689P603k805j1426p333
$$ -14956 -10674 1060 13124 14758 3740 -8072 -14786 -8440 4249 11852 9047 -2379 -9712
276i712L52J1983R865J37r351j3497m341O739J2899N575j778j0307p719K805P963
$$ -9712 -9360 2623 12488 12625 3274 -10223 -14564 -7825 5074 10649 8871 -1436 -9155 -6350 1613
291A613R206k648r598r706P91Q907R727M092q665r699o965O482J3116O360k284
$$ 1613 10819 8171 -1427 -11133 -10342 -1435 8292 12384 3719 -5980 -12945 -6463 6653 13013 10729
306A0729j3112j0807J364R657J1179K182p422j1006l682O024J0779O934m200j2585
$$ 10729 -2383 -13190 -11826 -2169 9010 11192 3770 -7236 -10918 -4894 5885 12819 8619 -3966
320c966p728R31R537Q500K411o353r065j53M968P560o18o744o935p14P955Q036
$$ -3966 -11694 -10763 -1226 7274 9685 3332 -5733 -5886 -918 6642 6024 -720 -7655 -8369 -414 7622
336G622m4o980r527j315Q934J1645K738o456j4833q342O659J2809J3774l612j1829
$$ 7622 7578 598 -8929 -10244 -1310 10335 13073 6617 -8216 -16558 -9899 2910 16684 13072 1243
351A243j4421p56J1778J2606N929j1386j4362p447O597J4438J0437p01j4627j2631
$$ 1243 -13178 -13934 -2156 10450 16379 4993 -9369 -16816 -10219 4219 14656 13955 -672 -13303
365a3303K448Q923J2786K549p812j4840m284L867J1725O657p31q000o027K860
$$ -13303 -10855 -1932 10854 13403 5591 -9249 -13533 -9666 2059 8716 7985 -15 -6042 -3182
379c182N414L317k886o693l121K497P951L400l251o351m241M783P513N897o160
$$ -3182 2232 5549 2663 -4030 -7151 -4654 3297 6697 3446 -2905 -7146 -2363 5150 11047 4887
394D887j0171p834J415J3240J1654m49j1523j2386l225J0261J4144P199r804j6119
$$ 4887 -5284 -13118 -11703 1537 13191 12742 1219 -11167 -14392 -4131 10013 17212 7408 -8711
408h711j1314P444J7212J4033j258j6278j6670m319J4838J9502O617j0539k0241
$$ -8711 -20025 -12581 4631 18664 17406 1128 -15542 -19861 -5023 14479 21096 10557 -9684
421i684j2562L955J9922J6933J250j4991j9375l718J1923J6917P394r209j7608
$$ -9684 -22246 -18291 1631 18564 19814 4823 -14552 -18270 -6347 10570 17964 8755 -8853
434h853j2032O228J8591J4109N42j5532j4415n769J1961J3783P663j0283j4349
$$ -8853 -20885 -14657 3934 18043 18585 3053 -11362 -17131 -5170 8613 16276 5993 -8356
447h356p840N050J4241J1189J098j1848j2679m071O119J2096L045k477j0608m036
$$ -8356 -16196 -11146 3095 14284 15382 3534 -9145 -13216 -7097 4999 8044 5567 -5041 -9077
461i077K757Q371O676j626n476q386j920N250O826J648k594m531j722L539J374
$$ -9077 -6320 2051 8727 7101 1625 -6761 -8681 -3431 3395 5043 2449 -2082 -3804 -265 1109
476A109J746o3k685p77j88K363j599j956l88o71M130K653P54k060k936j215K37
$$ 1109 2855 2792 107 -670 -858 1505 -94 -2050 -2438 -3109 1021 3674 4428 2368 -568 -1783 -1546
493a546K458N34o49k540n97J231L106J803j685k619j068l82K889R74j239p93j669
$$ -1546 912 1446 797 -1743 -2340 -1109 1997 3800 2115 -504 -1572 -1954 935 1909 670 -123 -1792
510a792k69K740K239K06k189j134j649O21m05k38O63R49K818p3j716l134j431
$$ -1792 -2061 679 2918 3124 935 -199 -1848 -1227 -1632 -1870 -1207 -258 2560 2487 771 -2363 -3794
527c794L527L136K769k242n244n707Q47M234Q684K487l139p379o550J807P709
$$ -3794 -267 2869 5638 3396 -1848 -7555 -6708 -2474 6210 8697 5558 -1821 -8371 -6564 1145
542A145O380J807p914p146o972O516Q128O686P52q673o145k753O012P769K156
$$ 1145 7525 9332 1418 -5728 -12700 -6184 1944 8630 9382 709 -5436 -8189 -2177 5592 7748
557G748l417p842n503J367Q131O137J540l472q541J0q75L501M154p60j409l108
$$ 7748 4331 -3511 -9014 -7647 484 6621 8161 4689 -3852 -3842 -4717 -1216 2938 2178 769 -2339
573b339l11J569J879L235m81k124k278j721q55O29K645L040K727l250m849k077
$$ -2339 -2650 -1081 798 4033 3552 1428 -850 -2571 -3426 -2797 -152 2888 5615 2365 -2484 -4561
589d561J690M948M675J125o403p125n872L872R516Q405K73o811j0476l396N600
$$ -4561 -2871 2077 6752 7877 1474 -5651 -11523 -7651 1865 10270 10543 3732 -6744 -10140 -4540
604d540J0035N790m568j0813q646L367J0282J1278l39j0546r382k845Q990R263
$$ -4540 5495 11285 6717 -4096 -12742 -9375 907 12185 11846 1300 -8082 -10927 -1937 7326
618G326N283p647j4488o474L210J6893J3155k18j5144j4768k974Q714J6178O473
$$ 7326 12609 4962 -9526 -16000 -12790 4103 17258 17040 1896 -12872 -15846 -7132 9046 15519
632A5519o436j7921q361M422J5404J4530J31j3746j7352k918Q545J5747O905p724
$$ 15519 9083 -8838 -17199 -12777 2627 17157 17288 3542 -13810 -16728 -8183 7564 14469 6745
646F745j1290j0931O043J1806J2072j509j1586j0898l358Q109R877M354n495r095
$$ 6745 -4545 -15476 -9433 2373 14445 12936 1350 -9548 -12906 -4797 5080 9434 3939 -5156
660e156j940L032R731L891m929q116n733M713O066M950k477o552n861K848R009
$$ -5156 -7096 -4064 5667 9558 4629 -3487 -9220 -4507 1559 6509 4032 -2520 -8381 -5533 3476
675C476P077k862r900p876J240R521Q998J169j0215j0622k778R799J3685M690
$$ 3476 10553 7691 -2209 -10085 -8845 676 9674 10843 628 -9994 -12772 -2973 10712 15402
689A5402o047j6702q361M145J2325J2886j50j2149j3559l023R938J4431Q141o362
$$ 15402 9355 -7347 -15708 -11563 762 13648 13498 1349 -12210 -15233 -5295 9136 17277 10915
703A0915j3932j3273J378J2393J2483M181q856r848p319P189P776M905p25r177
$$ 10915 -3017 -16290 -14912 -2519 9964 14145 5289 -4559 -11878 -4689 3087 7992 7267 -1910
717a910m879R93P807L937j125m892n031L5M736N073k92m014m078K80K842J148
$$ -1910 -6789 -5796 2011 5948 4823 -69 -5100 -5065 -329 4744 4452 438 -3640 -3360 -518 630
733F30K459n692j006j092O837M725l458l831n706N71M188O799O32m063p662k970
$$ 630 3089 -2603 -3609 -4701 2136 6861 3403 -428 -6134 -5563 -1375 5424 6056 1993 -5669 -8639
749h639O220Q261M297l965j0033n892J508R235O649L01p986p930j002P359R587
$$ -8639 -2419 5842 10139 6174 -3859 -9751 -8243 992 7641 7942 -44 -7974 -8976 -1617 7970
764G970L523o745r829o699K742J1476Q312k700r222q363L91R137R053J498q646
$$ 7970 11493 4748 -5081 -11780 -9038 2438 10750 8050 -1172 -9535 -9144 -7 9046 10544 1898
779A898j0947r23P557P918N235o604r310p420O127J1718P443p92j1865j0859m074
$$ 1898 -9049 -9972 -2415 5503 10738 4134 -5176 -12596 -6469 5249 12692 11900 35 -10824 -14898
794a4898R297J2163O168l701j3086o441K08J2132Q356J419p531j0604n891L465
$$ -14898 -5601 6562 12730 9029 -4057 -10498 -10290 1842 10198 11617 4086 -6518 -12409 -8944
808h944J1011O407P18o767o806n44J969N350L026q04m639o391L237mP510J047
$$ -8944 2067 8474 9192 2425 -4381 -4925 -2956 2394 5420 4616 -23 -6414 -3177 -3181 4329 5376
824E376j01l519l637k617p29N805J586J988l725l586j303J537M828K978N72l810
$$ 5376 5275 1756 -1881 -4498 -5227 578 2164 4152 427 -3159 -4462 -2925 1903 4881 5453 1643
840A643o393j522N37O671M360k72l520m513n61J314M823J667l43l603k863o78
$$ 1643 -4750 -6272 -5735 936 5296 5024 1504 -3009 -3570 -2256 2567 4234 3891 288 -2575 -3253
856c253J910K158n93Q8P33L04M96k47k543K8j523K785J175P66k251m790l64K866
$$ -3253 -1343 815 222 310 1043 1347 1843 1596 -947 -919 -2442 343 1518 2284 33 -4757 -5121 -2255
874b255P210M276l815p798p128L43P466J0403M80o871o695m956L653R160O103
$$ -2255 4955 9231 5416 -2382 -9510 -9167 -1701 8702 9182 2311 -4384 -9340 -5687 3473 9576
889I576k001p189j0008j864R627R425K965o774q994n087M022J1290N748j009r782
$$ 9576 7575 386 -9622 -11486 -1859 7566 10531 3757 -5237 -10324 -6302 4988 10736 9727 -55
904e5r794j082O711J2897K341m573j0726n831L703P920P880k228o557p946j225
$$ -55 -9849 -10931 -4220 8677 11018 6445 -4281 -10112 -6409 1511 9391 7163 606 -7340 -8565
919h565P370M991J877m096n975j080L700P266J041l332o246m608K170N172M329
$$ -8565 -1195 3796 5673 1577 -4398 -5478 -1778 5488 6529 3197 -3049 -7657 -5487 -315 4014
934D014l20l854m106J411M610L933k683m107l882p78M454M498n54k200m045J333
$$ 4014 3694 -160 -4266 -2855 1755 5688 3005 -1102 -4984 -5762 -1308 3190 2636 436 -3609 -2276
950b276M712K032j96n230l818n05K947O033J340l433m785m61L176N740M98o256
$$ -2276 2436 4468 4272 -958 -4776 -5281 -2334 3699 5039 1606 -3179 -3640 -464 5276 5774 -482
966d82n880k955P502O213M715n880q988n171M324J2448P565k063j1809j3684j585
$$ -482 -6362 -9317 -1815 4398 9113 3233 -5755 -10926 -6602 5846 13411 11348 -461 -14145 -15730
981a5730R684J5997O442q539j3470j0367N231J3430J4918j512j4371j6090m605
$$ -15730 -6046 9951 16393 7854 -5616 -15983 -10752 2678 17596 16084 1713 -14377 -18982
994a8982J0771J6854J0299o308j6191j2288K178J3597J2730M126j3370j3102q208
$$ -18982 -8211 8643 18942 12634 -3557 -15845 -13667 -70 12660 16786 3416 -9686 -17894
1007a7894N910J6635J0425l00j1792j1701l431P351R334L463l620q310l387K035
$$ -17894 -11984 4651 15076 14776 2984 -8717 -12148 -4797 4537 8000 4380 -3930 -7317 -5282
1021e282O268N211j775l336m082J177K245J910j785m763M99L726N206l24m107
$$ -5282 986 6197 4422 1086 -2996 -1819 426 2336 551 -4212 -3713 13 5219 4895 788
1036G88n457k045O610O293K770m954j0464o470M405J0228J0522J143j0173j1949
$$ 788 -4669 -6714 -104 6189 8959 4005 -6459 -12929 -8524 1704 12226 13369 3196 -8753
1050h753l699N484J2609P501m010j1610j0180p14J0003J1622N189o099j1022n880
$$ -8753 -12452 -6968 5641 13142 9132 -2478 -12658 -13372 -3369 8253 13442 7343 -3679 -9559
1064i559P74Q687O736O38p372n229j761N788O049J446j698o302n86M18K097J150
$$ -9559 -8785 -98 6638 7276 -96 -5325 -7086 -1298 4751 6197 4499 -1803 -2389 -1971 126 1276
1080A276k184j158Q3L708O71j82l232j898j11L409L780P4l759o182n44N256M780
$$ 1276 -908 -2066 -1983 1725 2396 2214 -1018 -2916 -3027 382 4162 4236 477 -5705 -6249 -993 3787
1097C787K924k234o891l227J145O510J947J619n623n969j335P043M345J581k925
$$ 3787 6711 4477 -2414 -5641 -4496 2014 3961 5580 -43 -6012 -7347 -304 4041 5622 2697
1112B697n140j213K815K982K254k926n588j553J773M954M546k179l945l512R39
$$ 2697 -2443 -3656 -841 2141 4395 1469 -4119 -5672 -3899 1055 5601 3422 -523 -4035 -3096
1127c096K456L961n26m473m683J834N025N263K873p131o370l600M196O274M965
$$ -3096 -640 3321 2795 -1678 -6361 -4527 498 5761 8634 1503 -4867 -8467 -4271 2003 6968
1142F968j361n869p037j915N761Q540M672l547o952o171j177N606N705L246j614
$$ 6968 5607 -262 -7299 -9214 -3453 5087 9759 6212 -740 -6911 -8088 -2482 3223 6469 4855
1157D855p747k444j044M512O850K976j314o444m319j992K002N495J814K124m652
$$ 4855 -2892 -5336 -6380 -1868 4982 7958 6644 200 -4119 -6111 -4109 1386 3200 5324 672
1172F72l814k139L701O886J662j173p126n684k320N310R091L279j422o734m893
$$ 672 -3142 -5281 -1580 5306 6968 5795 -1331 -7015 -9335 -4025 5066 8345 6923 189 -4704
1187d704k79L939O120Q98l972p101k665K620P520N279r43m643o055j632L424M190
$$ -4704 -4983 -1044 5076 5974 2002 -5099 -7764 -5144 2376 7655 6712 2069 -3986 -5618 -2194 1996
1203A996K633j600n641k209K918M013K021j240m049J50j399L586L30k834l459
$$ 1996 4629 3029 -2612 -4821 -1903 2110 4131 2891 -1158 -1008 -2407 1179 1509 -1325 -4784
1218d784j20N029M597K407m611o873m778M262Q883O500j893r244j0380j417P392
$$ -4784 -4904 125 4722 7129 2518 -4355 -9133 -4871 4012 10512 8619 -625 -11005 -12422 -5030
1233e030J2753O394n577j0851j0383J940R726J0687J476r208j1254k627P048J1498
$$ -5030 7723 14117 8540 -2311 -12694 -10754 -1028 9659 11135 1927 -9327 -11954 -4906 6592
1247F592N475k046j2565q502N32Q958J0867N35p188j0567j545O288Q676L334l385
$$ 6592 12067 10021 -2544 -11046 -10514 -1556 9311 9846 2658 -7909 -9454 -3166 5510 8844 5459
1262E459q522p107N495N268O065j883p421m395m46J0121L801M10o395p338q40
$$ 5459 -3063 -10170 -4675 593 6658 4775 -2646 -7041 -7487 2634 6435 6845 450 -6888 -7728
1277g728N471R339L15n092o960l507M428P342O243m997o397o461J080P212O170
$$ -7728 -2257 7082 7397 2305 -4655 -8162 -3734 3608 9851 4854 -1543 -8004 -6924 288 6458
1292F458J030o622p897k760Q182P919K835k461p885n655J33M146O088K156k477
$$ 6458 7488 866 -7031 -9791 -1609 6310 9145 6684 -1201 -6856 -6723 -2577 3511 5667 3190
1307C190n970n92J259M254O12J02k032o00o3j37j84l075o56K496N366K045j343
$$ 3190 -2780 -3372 -2113 2141 2753 2855 823 223 160 23 -161 -3236 -3892 -1396 3970 6015 4672
1324D672p365m888J439O365P998M69o966r767l899O267J1114Q203k514j0311j3008
$$ 4672 -2693 -7581 -6142 223 8221 8690 1724 -8043 -11942 -5675 5439 13642 11128 817 -12191
1339a2191j667R429J1656N118n239j2278q646L516J2730J1568J287j1926j1835
$$ -12191 -13858 -4429 7227 12345 7106 -5172 -13818 -10302 2428 13996 15283 3357 -8478
1352h478o092P640J2015O425j803j3300p214R73R557J1456K06p785j0510l673
$$ -8478 -14570 -6930 5085 11510 9707 -3593 -10807 -9834 -277 11179 11385 3600 -6910 -10583
1366a0583L682J0890L495j334o586o499K401N834N919k174n595m812k699O205
$$ -10583 -6901 3989 7484 6150 -436 -6935 -4534 1300 7219 5045 -550 -5362 -8061 -1856
1380a856N322K437n622l695p75M265M885q59k092p503j331L671N977L873l778
$$ -1856 3466 5903 281 -3414 -4189 76 4961 4102 2010 -5493 -6824 -3153 2824 6697 2919
1395B919n480k766K716M811M971k272n119n736j085L482O008M207k757m628k688
$$ 2919 -2561 -5327 -2611 2200 7171 4899 -220 -5956 -7041 -3559 2449 6656 3899 -729 -3417
1410c417O63L749K321o84l928k700J90M227L085r41k060k178j362L482M378o23
$$ -3417 -2754 995 3316 2632 -1296 -3996 -3806 421 3506 2565 505 -1673 -3035 447 4825 4202
1426D202k998n143j878L465L426M784j470k779l683j988M405K969J933l652k925
$$ 4202 1204 -3939 -5817 -2352 1074 5858 4388 1609 -2074 -4062 343 3312 5245 1593 -1332
1441a332l683R59L890K331K749k916k123j522n46J117J566L31N40j848j588q28
$$ -1332 -5015 -4056 -166 2165 4914 1998 -125 -1647 -2193 -1076 490 821 1361 -487 -2075 -2903
1457b903K718J392K822K97l043m038k109K247L179M183J383m811n229j782J342
$$ -2903 -185 1207 4029 4326 1283 -2755 -4864 -2617 562 4745 6128 1317 -3912 -5694 -4352
1472d352O306N253j344n072p496j398M211P483L627l321o224n423J331O855P179
$$ -4352 1954 7207 5863 791 -6705 -8103 -3892 3591 7218 3897 -2327 -7750 -6419 436 7615
1487G615K910o650p759m797J291O823O141K085k725p395l105J453N737M141l78
$$ 7615 10525 3875 -3884 -8681 -7390 -567 5574 7659 4934 -2461 -5566 -4113 1624 5765 5387
1502E387l512m788k892J378M005K995K173q26k853l505j819K049K646K024J704
$$ 5387 1875 -2913 -5805 -4427 -422 2573 4746 3920 1067 -2438 -4257 -2208 438 2462 4166
1517D166l094l111l079K986M956M714k267m363m641l595L527P319L610r15p868
$$ 4166 1072 -2039 -5118 -2132 2824 7538 5271 908 -3733 -7328 -3801 3518 7128 6213 -1655
1532a655m403k799R026O838K520m066j0240l375K68R560M625n65n268o053q28
$$ -1655 -6058 -8857 169 7007 9527 5461 -4779 -8154 -7886 1674 6299 5734 466 -5587 -6415
1547f415O861O740J892o832q030m385M895P410M463l253n242n041L448P172M515
$$ -6415 446 7186 9078 2246 -5784 -10169 -5274 2136 6599 3346 -1896 -6937 -3489 3683 8198
1562H198j741p205q241p01O152R708K430n341p337k313M556N254L640l281p480
$$ 8198 6457 -748 -8989 -9690 -3538 6170 8600 3259 -4078 -6391 -1835 3419 7059 3778 -3702
1577c702o120K762R514N520M28p226p390q06N483P729K426n722q449j851M107
$$ -3702 -9822 -7060 2454 7974 8402 1176 -6214 -7020 -1537 6192 8618 2896 -5553 -7404 -3297
1592c297N975L852k998o486l119K725O471M182k804r103m545M095P292P412j663
$$ -3297 2678 6530 3532 -2954 -6073 -3348 3123 7305 4501 -4602 -9147 -5052 2240 9652 7989
1607G989q114r147J93Q299J0251L685r220j2200o938N180J3758J0652n29j2438
$$ 7989 -125 -9272 -9079 -780 9471 13156 3936 -8264 -15202 -10022 3736 14388 13859 1421
1621A421j2551j896Q230J3654N054o224j3793p630J481J3269J0356J244r173j1542
$$ 1421 -11130 -13026 -4796 8858 13912 7688 -6105 -13735 -12254 1015 11371 12615 3442 -8100
1635h100m152N067J0260P057l606q713o746J026P106P088o43m639l650k424L895
$$ -8100 -12252 -7185 3075 10132 6526 -2187 -8933 -7907 -801 6287 5644 1005 -2645 -5069 -1174
1650a174N756M10m216l033k873K422N166q39J27k293p25K638J528J49n775k157
$$ -1174 4582 4992 776 -2257 -5130 -2708 2458 1619 1746 -547 -1272 1366 2894 3043 -2732 -4889
1666d889j38N527N147L45l484o139k921L523O019M491k077q060o088N62P383P566
$$ -4889 -5027 500 5647 5992 2508 -3631 -6552 -3029 2990 7481 5404 -2656 -8744 -8182 -799 6767
1682F767J960m698p361l533J750R511N78j405m512n535J238M446N682l85l933
$$ 6767 8727 4029 -3332 -6865 -5115 4396 4974 3569 -943 -6478 -5240 -794 4888 4503 570
1697E70l438m98L093K775J94l537l839o03L892O977L2k704o010k300L425M493
$$ 570 -2868 -3366 -273 2502 2696 -841 -4680 -5283 -1391 5586 5618 2914 -3096 -5396 -1971 2522
1713B522M424l921m929m805k59N676P002K588m978n535n763J822P443M728l0p855
$$ 2522 6946 3025 -1904 -6709 -6968 -1292 5710 8298 3320 -2215 -7978 -6156 1287 6015 5985 -1870
1729a870m059k583M546Q161M360J98q264n176l604N117M131M015j36m964k508
$$ -1870 -5929 -8512 -3966 4195 8555 8753 489 -4687 -8291 -3174 957 4972 4836 -128 -2636
1744b636j382L267L317J944J54m663l782j390K367K820K319J315j869k560j712
$$ -2636 -4018 -751 2566 4510 4664 1 -3781 -5171 -2804 16 2335 3650 1781 -779 -2491
1759b491J896J879J294k60k148l627l94J183K648K662J635r25k334j784k874K154
$$ -2491 -595 1284 2578 2318 170 -3457 -3851 -2668 -20 2642 4277 3352 1018 -766 -3640 -1486
1775a486P27K665k17q73j588J4n62N03K976K320j939l619m627R32K010L976M035
$$ -1486 -759 1906 1689 816 -772 -758 -1320 -817 2159 4479 2540 -1079 -5706 -4774 -2764 1212 5247
1792E247j928j644n105j545P86O764L729r25n306p559r18M245P545M700m53o342
$$ 5247 3319 1675 -3430 -4975 -4189 2575 6304 5379 73 -7486 -8404 -4159 3386 8086 7633 1291
1808A291r377J9M299R873L387m664o874q574K787O489Q870J656m602q765o053
$$ 1291 -8086 -8067 -3768 6105 9492 4828 -2046 -10620 -7833 -1344 7526 9182 4580 -4185 -10238
1823a0238M611P100O092j038p201o191j167O541P369K935m192p576m069P10Q234
$$ -10238 -5627 1473 7565 6527 -674 -6865 -8032 -1491 5878 8813 4621 -2955 -7024 -6314 1920
1838A920L114J050n726n163j376M733L951K321j724m639j799J491K892J431j782
$$ 1920 5034 6084 358 -4805 -6181 -1448 2503 4824 3100 -1539 -3338 -1847 1045 2476 694
1853F94k626j295K485L273L61j290l622r47J655L665J260r89m901l041O64N345
$$ 694 -1932 -3227 -742 2531 2892 1602 -2020 -2967 -1312 2353 3613 2624 -2277 -5318 -4654 691
1869F91M730j33k297n613n42J599K511q51j58k094L54K377K055J247l973l374
$$ 691 5421 5288 2991 -2622 -3164 -1565 946 95 -63 -2157 -1803 574 2629 3876 -97 -3471
1885c471q56L919L645M29k437o416j081L129N212N315j031o463p567Q45N553P626
$$ -3471 -4327 -408 3237 3666 1229 -5187 -6268 -3139 2073 7388 6357 -106 -7673 -6828 -1275 6351
1901F351L095p666p545o351O021R791P288r55j0951q328k178Q475R563M868p222
$$ 6351 9446 1780 -5765 -12116 -6095 3696 10984 10029 -922 -9250 -11428 -2953 6610 11478 4256
1916D256j1462m810M965J0682P103M55r344r744l078N757R954M853n873p428n617
$$ 4256 -7206 -12016 -7051 3631 10734 11189 1845 -7899 -10977 -5220 4734 9587 3714 -3714 -9331
1931i331L477Q880P262k016p563p261j954M522O719K460l258l563j338L385L577
$$ -9331 -5854 3026 10288 8272 709 -6552 -8506 -3984 2735 5195 1937 -1626 -2964 421 3998
1946C998J2l828l364j673N035M624p58m346m246j545N727P722J105m463q717n008
$$ 3998 4010 182 -3182 -4855 180 4804 4046 -300 -4546 -6091 -364 7358 8463 4000 -4717 -9725
1962i725K333R133Q590j788q576q908j558P375J1575M048o290j1481o726J348
$$ -9725 -7392 1741 10331 8543 -33 -8941 -10499 -3124 8451 12499 6209 -5272 -11998 -10650
1976a0650J1593Q636P33p883j0334j466N380R315M951k086j1537o411J506N809
$$ -10650 943 9579 10312 2429 -7905 -9371 -3991 5324 10275 8189 -3348 -9759 -8253 -2444
1990b444R397R18m249p567k278K644M599N483k827l902m798J001J568M831K701
$$ -2444 6953 7871 3622 -3945 -6223 -3579 1020 6503 3676 -226 -5024 -4023 -2455 2376 5077
2005E077k418j511k370j744K226J302J429k506J367k237Q71p0l59J43N56M560
$$ 5077 2659 1148 -1222 -2966 -740 562 1991 -515 852 -1385 -514 -584 -943 -800 -244 4316
2021D316k184j273l543r65K423L432J879l294k138j779l22L994K740J112l187
$$ 4316 2132 859 -2684 -3649 -1226 2206 4085 791 -1347 -3126 -3448 546 3286 4398 1211
2036A211m033j801K092K589K350m29k802j545O25L497J027n09m066K85k48J417
$$ 1211 -2822 -4623 -2531 58 2408 1979 -823 -2368 -1743 1754 2781 2272 -1794 -1509 -1757 -340
2052c40K152p45o65k841J363L58L129M28r65l661j792J033J194L196L5j138j430
$$ -340 1812 1067 402 -2439 -1076 -718 2411 2839 1874 -1787 -3579 -2546 -1352 1844 1879 741 -689
2069f89j028J095J215J370j122j907l20l57J670j46J300j081J338j49p90J21j800
$$ -689 -1717 -622 593 1963 841 -1066 -1386 -1743 -73 -219 1081 0 1338 1189 399 520 -1280
2086a280J262J296j498N0j397J129o61K954N29l73j913j908n69m29L908P97j961
$$ -1280 -18 1278 -220 -170 -1567 -438 -1099 1855 2384 2011 98 -1810 -2379 -2808 1100 1897 -64
2103f4j414k031J607K754M069j392j419m749l678L320K729L881j877j481l764
$$ -64 -1478 -3509 -1902 852 4921 3529 2110 -2639 -6317 -2997 -268 3613 1736 255 -3509
2118c509J04L961K403K872m126k962l276j21L904L305J74k588L11o62P3J546j396
$$ -3509 -3405 556 2959 5831 1705 -1257 -4533 -4654 -750 2555 2729 141 452 -210 -137 1409 13
2135A3p59j030Q32K766q33p87j151j073K854J593J154k102l491k802J899K935
$$ 13 -746 -1776 -944 1822 989 202 -949 -2022 832 2425 3579 1477 -2014 -4816 -2917 18
2151A8M451M41m545m128k18L164O272J209m239o708l835K396O122O473J27o183
$$ 18 4469 4910 365 -3763 -3981 -817 5455 6664 2425 -4283 -8118 -5722 400 6873 7000 817
2167H17o437j682M983P677N580p135q517n154K375Q219O380K715r529n812k416
$$ 817 -5620 -7302 -2319 5358 10938 3803 -4714 -9868 -7493 726 7106 9821 292 -5520 -7936
2182g936M281R038L833k554r891n355n02Q724P000J943m596q240k308J819O419
$$ -7936 -3655 5383 9216 6662 -3229 -8584 -9086 -362 6638 8581 3985 -4255 -6563 -4744 1675
2197A675M696k125m532n810N87N092M529R52l589k401k922K982L140J063k573
$$ 1675 6371 4246 -286 -6096 -5509 -417 4112 5064 1475 -926 -3848 -866 2274 3337 764
2212G64k979j826K023L984Q55j314l140j618K490K252J411n8m657j274P03L425
$$ 764 -2215 -4041 -2018 1966 2821 1507 -1633 -3251 -761 1491 2902 2844 -1813 -3087 -2384 1041
2228A041J491j298k218j392J084L066J730n10m487l000o04M089L130K875l188
$$ 1041 2532 1234 -984 -2376 -1292 1774 3504 2994 -1493 -4493 -5097 -1008 2122 4997 1809
2243A809l103j991J798L844P29k017l639l115K372M313N986k750l270n301P34
$$ 1809 -1294 -3285 -1487 2357 3086 1069 -2570 -5685 -3313 1000 6986 4236 966 -4335 -3601
2258c601M049K993J675o680l674r64M042N960M055l738p428l549K124O619N888
$$ -3601 448 3441 5116 -1564 -5238 -6202 -2160 3800 7855 4117 -3311 -6860 -4736 1883 7771
2273G771j663o878p134j59M559Q329L551l955n334o737L124N241O051j049o726
$$ 7771 6108 -770 -7904 -8063 -3504 4825 8376 4421 -913 -7650 -4526 715 6766 5717 -1009
2288a009n796k429N661P540M555j800p856k698j957M854L211j013k617k549J196
$$ -1009 -6805 -9234 -3573 3967 8522 6722 -1134 -3832 -5789 -935 2276 1263 -1354 -3903 -2707
2303b707L311K888L02k383k611q92K145K009j834j940k778K515K387M696J32l398
$$ -2707 604 3492 3794 1411 -1200 -2092 53 2062 228 -1712 -4490 -1975 412 5108 5240 1842
2319A842l693l244J433N102L201k099n127k533k39N834N461P07k575p431k116
$$ 1842 -1851 -5095 -3662 1440 4641 2542 -2585 -5118 -5357 477 5938 6645 4070 -3361 -5477
2334e477J414M642N049k333k797n200n73M895M779K023k162n565m340J106M351
$$ -5477 -4063 579 5628 3295 498 -4702 -5275 -380 4399 6422 4260 -1305 -5645 -4539 -188
2349a88M326M65l444k335l689K160M140K933Q9l881l070k559K663J707L605r08
$$ -188 4138 4603 1159 -1176 -4865 -2705 1435 4368 4457 576 -2494 -5053 -2390 -683 2922 2014
2365B014Q12k996l404K419J691J651j96j373k186k168Q95J892K050K537j855r40
$$ 2014 2826 -170 -3574 -1155 536 2187 1991 618 -1568 -3736 -2841 -949 1101 3638 1783 843
2381H43l044J42J95K779J94Mj879j887L042K220k42k052j485j543K080L054M34
$$ 843 -2201 -2059 -1864 915 1109 1113 -766 -2653 389 2609 2367 315 -1170 -2713 -633 2421 2855
2398B855m39k955k899j366K797M181J200L14m082l252J458J467L643n72k400j848
$$ 2855 2416 -539 -3438 -4804 -2007 2174 3374 3688 -394 -3646 -2188 -721 2922 2350 -50 -1898
2414a898j508L029J731J143k97k010j433j193K031Q76p33Pj603J324P97J017K65
$$ -1898 -3406 -377 1354 2497 2200 190 -1243 -2436 -405 471 -262 -255 -1858 -534 263 1280 1545
2431A545j183M9j213J053K16j677n66o89K469K283J092l853q70j182K293L034
$$ 1545 362 411 -802 251 467 -1210 -1776 -2465 4 2287 3379 -474 -1344 -2526 -233 2801
2447B801K18k148m675o23N11N050M228J72l487n648r06L583M452K739m100l898
$$ 2801 3019 871 -3804 -4427 -3916 1134 5362 5534 2047 -3601 -4507 -924 3528 6267 2167 -1731
2463a731l645K062M356N161P2n383k817m830L698N324K955j689n527j884q99N214
$$ -1731 -5376 -3314 1042 6203 6275 892 -1925 -6755 -3057 2267 5222 3533 -1994 -3878 -4777 437
2479D37M097J371n134l098j429O59M263J354j777k685k81K885K464R01k569k561
$$ 437 4534 5905 771 -2327 -3756 -3097 1166 2520 743 -1942 -2223 662 3126 4027 1458 -1103
2495a103j719Q27L229R8j460l917N43J731N209J303j86o776l037K53M016M286
$$ -1103 -2822 -1995 1234 1332 -128 -4045 -3502 -1771 3438 4741 4555 -2221 -5258 -5005 -989 3297
2511C297N99m161n531N87M277O462K867m689o868l971L119N037N751j167o803
$$ 3297 3896 -265 -5796 -5209 -932 5530 8397 3708 -3160 -7131 -4012 1025 6776 5609 -1194
2526a194n816j140P973N940L851n829r940k405K726Q230M846m57o989p347M45
$$ -1194 -7010 -8150 -177 5763 9614 3785 -6155 -8560 -5834 2396 7242 6785 -204 -7551 -7106
2541g106N392P926K629l870r062m412K136P434O112j763m122o043j652N655L626
$$ -7106 -1714 6212 8841 4971 -4091 -8503 -6367 1067 7179 5416 1294 -4749 -6401 -746 2880
2556B880L975n260m223l898L498M996K957p17o074k321P86L476N698m42m351n696
$$ 2880 6855 1595 -2628 -6526 -3028 1968 4925 4208 -1866 -4187 -3401 75 5773 5331 980 -4716
2572d716k84J854L770L446k036j810j221O50o38J619r59n35j033J550K241p88
$$ -4716 -5000 -3146 624 4070 2034 224 -997 -347 -985 634 -325 -860 -1893 -343 1898 1110
2588A110m84k696m61K978K815M87k031m282j598M45N466K439j037k931m448K11
$$ 1110 626 -2070 -2531 447 3262 3749 1718 -2564 -4162 -3717 1749 4188 3151 220 -4228 -4017
2604d017L291N565M34k242m892k976J746L471L167O84n174j480j166M166P02K521
$$ -4017 -726 4839 5273 3031 -1861 -4837 -3091 380 3547 4231 -943 -2423 -3589 577 1279 3800
2620C800k740k870j838J1L283J566P84j041o47j15n79J993j208j107j144J500
$$ 3800 1060 -1810 -3648 -3637 -354 1212 1996 955 308 193 -386 1607 399 -708 -1852 -352
2636c52J579j602M74j743J213K80J894K441l436j708k463J551J341L287J39l197
$$ -352 1227 -375 99 -1644 -431 -151 1743 4184 748 -960 -3423 -1872 -531 2756 2895 -302
2652c02k635j509M000M530Q15K7p447l031p00L491N578K213j391o275o91N34K819
$$ -302 -2937 -4446 -446 4084 4899 4926 -2521 -5552 -6252 -2761 2817 5030 3639 -2636 -3327 -2793 26
2669B6K291J726l041m103k051J970L465K925k97j828l695J866mN9R42n10j645
$$ 26 2317 4043 1002 -3101 -5152 -3182 283 3208 2911 1083 -2612 -746 -750 -691 251 -259 -1904
2686a904R5j7K348J854l50n42p84k58l38O53j718L83L11O58P61k73Q30k019Q5
$$ -1904 -1809 -1826 522 2376 2026 1484 700 442 104 757 -961 -578 -267 391 1152 879 1709 -310 -225
2705b25n50N4N20J01K67j985N97j402K429J216J354O30l021J32l723J529K581
$$ -225 -775 -721 -201 -100 167 -1818 -1221 -2623 -194 1022 2376 3006 -15 117 -3606 -2077 504
2722E04J943j74k056k448j412J865L410L646l26m630l482k581L549M296Q75J354
$$ 504 2447 2273 217 -2231 -3643 -1778 1632 5278 4952 322 -3160 -5741 -2192 2104 2979 4333
2738D333n647l709J410N278M403l11l625o822k186J764Q057K608O43n015o576
$$ 4333 -1314 -5023 -3613 1665 6068 5757 2132 -4690 -6876 -5112 2945 5553 6196 1181 -5395
2753e395j202L933O616K905m332m295m192M18M399N476Q43l118m912j181K496
$$ -5395 -6597 -2664 3952 6857 2525 -1770 -5962 -5544 -1145 4331 5174 2056 -2856 -4037 -1541
2768a541K645J371q17k378k115P28J116K225l45p85j569J069J023M53j349j997
$$ -1541 1104 2475 1658 -720 -2835 -2107 -991 1234 889 104 -1465 -396 627 1080 -269 -2266
2784b266j62J510J784J374j891j756j896L325J798J706l95m904k335j47M013J742
$$ -2266 -2428 -918 866 2240 349 -1407 -3303 22 1820 3526 3131 -1773 -4108 -4255 -242 1500
2800A500K031j705m355p69K484L690N75j282m797j399J191L544M568k702k170
$$ 1500 3531 1826 -2529 -3298 -814 2876 3451 2169 -2628 -4027 -2836 708 5276 2574 404
2815D04m354Q81L482J781L885m984l701l166K521N240J452L8m472q94k25K657
$$ 404 -3950 -3069 413 2194 6079 1095 -2606 -5772 -3251 1989 3441 3479 -993 -1887 -2112 545
2831E45M785k122k383n652N80L768M224K264l909m424j387K252M852J397j946
$$ 545 5330 3208 825 -4827 -4247 -479 3745 6009 2100 -2324 -3711 -1459 3393 4790 2844
2846B844n799j963o62L858O728J491m049l152l182K180M546J250l056k039m190
$$ 2844 -2955 -4918 -5580 -1722 5006 6497 2448 -704 -3886 -1706 2840 4090 1034 -1005 -5195
2861e195K305K561L931m6k267k225j536J756J916Q11k700k783K161J453K128J701
$$ -5195 -2890 -329 3602 3556 1289 -936 -2472 -716 1200 2011 -689 -3472 -1311 142 2270 3971
2877C971l754k058j283L838K376r96j846n923k37K231P226L415l164m789n246
$$ 3971 217 -1841 -3124 714 3090 2094 248 -5675 -5912 -3681 3545 6960 3796 -993 -6239
2892f239K80M606O585J740n505p056n382N732P900N514l40o283p057l913O262
$$ -6239 -5959 -1353 5232 6972 1467 -5589 -10971 -5239 2661 8175 7835 1552 -5505 -9418 -3156
2907c156N836N980k326r525m411r82Q767N461K857n510o530m294J361P545M208
$$ -3156 2680 8660 6334 -3191 -7602 -8584 183 5644 8501 2991 -3539 -7833 -6472 1073 5281
2922E281K77m804l891j604N55N954L595m09l911l542k476J547K789J523J350k271
$$ 5281 5558 754 -3137 -4741 -4186 1768 5363 4954 1043 -2499 -4975 -3428 -639 884 2234 -37
2938c7K01o05j746P17P59K215J280j713j147l479Q52J674L217J637j098k381l011
$$ -37 164 -441 -2187 -1470 -711 1504 2784 1071 -76 -3555 -2703 -1029 2188 3825 2727 346 -2665
2955b665j222K228L146K620j670l473l890M83M507K413J791j863l178l043J06
$$ -2665 -3887 -1659 1487 4107 2437 -1036 -4926 -4443 64 2477 4268 2405 -773 -3816 -3710
2970c710L579K661o0k507r59k220J855K498J568k81l007Q03p79m17J056q88J538
$$ -3710 -131 2530 2470 -37 -996 -3216 -1361 1137 2705 2424 -583 220 -559 -976 80 -808 730
2987G30m42L71l19k5M25K28l9p05J74O24k929j15j87M045L16P75k526j512o74
$$ 730 288 659 340 315 740 968 929 224 398 1022 -1907 -2022 -2209 1836 2152 2927 401 -1111 -1785
3006a785k53L719l2M71k763r91m70R04L862k21m46j730k813J113j351L216m25
$$ -1785 -2038 1681 1649 2120 -643 -1634 -2104 -1200 2662 2441 1995 265 -2548 -1435 -2786 430 5
3023EJ78Lj51Q31q62m34K89J125m54N68j259j510o01n70L242J084J698k072j237
$$ 5 183 186 35 866 4 -430 -141 984 530 1098 -161 -1671 -2272 -2842 400 1484 3182 1110 -127
3042a27j368j85J500J746m76j789n07k092L902J23K344j346j251o03k925K616
$$ -127 -1495 -1680 -180 1566 1090 -699 -1206 -3298 604 727 3071 1725 474 -129 -3054 -438
3058d38n41L18O20N34J020j619K7q63P00k20J693R5j815j474j701L189K344K865
$$ -438 -979 -661 -41 493 1513 -106 -79 -942 -242 -462 1231 1326 -489 -1963 -3664 -475 1869 4734
3076D734q85l672l161k883N383K166L429l234m393k459J267O331L017L47o395
$$ 4734 3849 177 -2984 -5867 -484 1682 5111 1877 -2516 -4975 -3708 2623 5640 5987 -408
3091d08o466J012L579O234K258j512q329m092J609O019O973j17m164o759k474
$$ -408 -6874 -5862 -2283 3951 6209 4697 -3632 -7724 -6115 -96 6877 6760 2596 -4163 -6637
3106f637K688N387M430j850n558l969K17O784L207P78m915l301j991K411N133
$$ -6637 -3949 1438 5868 4018 -1540 -5509 -5292 1492 4699 5477 562 -2739 -4730 -2319 2814
3121B814R26r15o140j371K674M333L593j693n642m934J409N149L777J30l790l724
$$ 2814 3740 2825 -3315 -4686 -2012 2321 5914 4221 -1421 -6355 -4946 203 3980 4110 320 -3404
3137c404j606M530L777J892j802m643k349Q47L259K752l70l015l157Q61K048L110
$$ -3404 -5010 -480 3297 5189 3387 -1256 -3605 -2758 501 3253 2883 -132 -3289 -2428 -380 2730
3153B730J569l777j479j526P69K867N69r37k633m29K159L660M00k481k257k873
$$ 2730 4299 522 -957 -2483 -1714 1153 1722 785 -1848 -2277 -118 3542 3942 1461 -796 -3669
3169c669K803J526K395j404k929m42o11L437J562L11k490n683L089L35M344p18
$$ -3669 -866 660 3055 1651 -1278 -1720 -2331 1106 2668 2979 489 -5194 -2105 -1770 2574 1856
3185A856o80l145k515L817K937L784l564l606m430J624L848L171J04l160k328
$$ 1856 1176 -1969 -4484 -667 2270 6054 2490 -1116 -5546 -3922 -74 3097 3201 41 -2287
3200b287j474L573L154J268o62n290k990J784J399L238k51o20k949R17J260J864
$$ -2287 -3761 -188 2966 4234 3572 -1718 -4708 -2924 -1525 1713 1462 842 -2107 -1190 70 1934
3216A934M0k087k081p03J031K456J708m36k980j059N70K537L272j486l623k566
$$ 1934 1974 -113 -2194 -2897 -1866 590 2298 1862 -1118 -2177 -1607 930 4202 2716 -907 -3473
3232c473O59J548K251J390k638j563J468J354K137q09j600k733j648J114K162
$$ -3473 -2814 -1266 985 2375 -263 -1826 -358 996 3133 2324 724 -2009 -3657 -2543 -381
3247c81K787j078o94k957J102K227J371J532m965k639o83J104O123L4p6l271k155
$$ -381 2406 1328 634 -2323 -1221 1006 2377 3909 -1056 -3695 -4378 -3274 2849 2883 2807 -464 -2619
3264b619J93M090J114j5l087k951P6p64N293K592N32k785m654N28n84M832P65
$$ -2619 -2426 1664 2778 2763 -324 -3275 -3199 -3963 1330 3922 4454 1669 -2985 -2457 -3041 1791 2556
3281B556j274j169k830n18J416M107J366k212j53k589n81N12J887J472j575l82
$$ 2556 1282 113 -2717 -3235 -1819 2288 3654 1442 1289 -1300 -1881 -1369 518 1990 415 33
3297C3k568J357N50K948L7j986p4l239J361l53L896j77j66p71k557Q42m32K859
$$ 33 -2535 -1178 -628 2320 2357 371 297 -2942 -1581 -1934 1962 1785 1619 848 -1709 -867 -1299 1560
3315A560M05l70j636k732o17K260J590J637p32p16o51j560J787N92O55n71j630
$$ 1560 1965 1595 -41 -2773 -3390 -1130 460 2097 1365 649 -2 -1562 225 817 1472 901 -729
3332g29j88r98J271J495R45j489J96K43j869O8k2K156l69J264j946j134j198J2
$$ -729 -917 -1915 -644 851 1796 307 503 746 -1123 -1055 -1077 1079 710 1974 28 -1106 -2304 -2292
3350b292K546K456q78M11m491l70K8K443Q2K051k050q48P6m14K217K132j236j772
$$ -2292 254 2710 1832 2243 -2248 -2618 -2590 -147 -65 1986 -64 -912 -836 -1250 967 3099 1863 91
3368I1l240J7J225M964M11p00l294l153L578M79L388j837k735j865P83K173J100
$$ 91 -3149 -3132 -1907 3057 3468 2768 -526 -3679 -101 378 3766 1929 -806 -2671 -1888 285 1385
3385A385R16j263j927m78O92J624N62O36l790m87P55J013K638j266o85j616M35
$$ 1385 2301 1038 -889 -1367 -675 949 1511 2147 -1643 -2130 -1375 -362 2276 1010 325 -1291 -856
3402h56J380K044j243j501p86k204J466K598J468q34j005q66O03J607O21k257
$$ -856 524 2568 1325 -176 -962 -3166 -1700 898 2366 1532 527 -339 264 1871 2492 235
3418B35k064k84N92K008R22O81k168r08J655n33K839j574k731p01n57K091K664
$$ 235 -1829 -2113 -1521 487 1409 2090 -78 -986 669 136 2975 1401 -1330 -2031 -2588 -497 2167
3435B167R61k800k088K62J336K436Q44k053n573m45K626N902K131j504n072n167
$$ 2167 3128 328 -1760 -1498 -162 2274 3118 1065 -4508 -4953 -2327 3575 5706 4202 -870 -6037
3451f037J476M888O276N06n051o637l550L546P419M585r94o575n508o4M150O249
$$ -6037 -4561 327 6603 7109 2058 -4579 -8129 -4583 2836 7421 6427 -148 -5656 -5720 -1570 4679
3467D679K589n188o194l076K257P054M341l49o741m134j49K257N510J395q85n308
$$ 4679 7268 2080 -4114 -7190 -4933 2121 6462 6113 -628 -4762 -4911 -2654 2856 4251 3366 -1942
3483a942k432K323K758M158j506k969l508p8K253K303R6j269j897K06J290K741
$$ -1942 -4374 -2051 707 4865 3359 390 -3118 -3196 -943 1360 1456 187 -1710 -1504 -214 2527
3499B527j642k07l671J454L046L64K18k856k454Q92K570K847o33j253l069k314
$$ 2527 885 678 -2993 -1539 1507 1871 2089 -767 -3221 -2329 241 3088 2455 1202 -1867 -4181
3515d181K798L512K675j712l569m443O6M572K741K787l629l659k198J809L142
$$ -4181 -1383 2129 4804 3092 -477 -4920 -4854 -282 2459 5246 1617 -2042 -4240 -2431 711
3530G11J133J689m729j150p07J978M007r60l10k844j071J076J016J724r83j199
$$ 711 1844 3533 -1196 -2346 -3053 -1075 2932 1972 1662 -1182 -2253 -1177 -161 1563 580 -619
3546f19k539K175J825J524J010m474M9o71Q63M93J430j23j278O57k372L014O07
$$ -619 -3158 -983 842 2366 3376 -1098 -1049 -1720 -857 -364 1066 943 -335 322 -2050 964 1571
3563A571j55j234j377R10k8R38k363j02J752O14J048K20j070j675j014K057k20
$$ 1571 1416 182 -1195 -285 -313 625 -1738 -1840 -88 526 1574 1794 724 -951 -1965 92 -128
3580a28R88j381j697j44J929J239Q71J299k208k737m91J793Q38M65j6j213r84
$$ -128 860 -521 -2218 -2362 -433 806 1677 2976 768 -1969 -2460 -667 171 636 620 -593 -1577
3597a577Q90R37J786j78j872j898k45K436N35l61n7j824l7R7L240Q79m38k300
$$ -1577 -687 250 2036 1858 -14 -1912 -2157 279 814 453 396 -1428 -1465 -1368 1872 2751 2313 13
3615A3k425M66J968R63j94N99k491k74l13Q76K933O49M29k705m521j84J445L772
$$ 13 -2412 -1946 22 985 791 1390 -1101 -1375 -1688 -812 2121 2770 3199 494 -4027 -4211 -2766 1006
3633A006Q60J624k677k186m61n33L689j23J303k480j791j545K038L294K61l60
$$ 1006 1866 3490 813 -1373 -1834 -2367 1322 1199 2502 22 -1769 -3314 -1276 2018 2279 1919
3649A919l316j451N00K801L199j821j182m979rL754K942R61o8m021l697K131K717
$$ 1919 -1397 -2848 -2348 453 3652 1831 649 -4330 -4339 -585 2357 3318 3250 -771 -4468 -2337 380
3666C80K848J485m527k550k784J172N301K940l8l791l790L82L58M046P25j0k781
$$ 380 3228 4713 186 -2364 -5148 -3976 1325 4265 4227 436 -3354 -2972 -2614 1432 2157 2147 -634
3683f34k587J127K621K889l59l258j589n91J163K305M11j252j179J15l3J890J79
$$ -634 -3221 -2094 527 3416 3057 -201 -1790 -2381 -1218 1087 1498 246 -933 -818 -851 1039 1218
3700A218j631j408J46M71J605J798j803n17j884Q43K264L37N53l007J60K19O40
$$ 1218 -413 -1821 -1675 -1204 401 2199 396 -121 -2005 -1162 1102 1439 1992 -1015 -855 -636 4
3717Dn7J77n48l200L974O87Q67m6k149k960o02M201K242P41j590n379n07j61M658
$$ 4 -53 124 -424 -3624 350 1037 1904 1858 -291 -3251 -3853 348 2590 3331 1741 -3638 -4145 -4306 352
3736C52L887M13l270m778o20J358M945L98M6l554k697J285K569L761K81k950l614
$$ 352 4239 4652 1382 -3396 -4016 -2658 2287 2685 2731 -823 -3520 -2235 334 4095 4376 1426 -2188
3753b188j511J654L712K107j918k387k779l27L150L884J220l265l029o75l65K510
$$ -2188 -3699 -2045 1667 3774 1856 -531 -3310 -3637 -487 3397 4617 1352 -1677 -2352 -2717 -207
3769b07J832K62j857j321M83J000J703l79j650o7r07Q42jk49l36O2K494q9R52
$$ -207 1625 1887 30 -1291 -808 192 1895 1516 -134 -201 -1108 -266 -267 -516 -852 -790 1704 1615 2567
3788B567k510l33k201J167K917K53p03k561j940J305K473L772q45r50m915k627
$$ 2567 57 -276 -2477 -1310 1607 1860 1157 -1404 -3344 -2039 434 4206 3361 2411 -2504 -5131
3804e131J952L184L630j326j064m832KM169J640J833m836k179k130K772M566R90
$$ -5131 -3179 5 3635 2309 1245 -3587 -3585 584 2224 4057 -779 -2958 -5088 -2316 2250 3240
3820C240J84n108j702J077L474L118j822k428m008j194K554N916N33j817l148
$$ 3240 3424 -1684 -3386 -2309 1165 4283 2461 33 -3975 -5169 -2615 3301 3834 2017 -1131
3835a131k892J719K881K337K209m655m399j420L500L190K294l94l308k273n15
$$ -1131 -4023 -2304 577 2914 5123 468 -3931 -5351 -1851 1339 3633 3239 -69 -2342 -2857
3850b857L782K259n26l223k495L56K373J434K037j075q59k531L38L92Q11M3p02
$$ -2857 925 3184 2658 -565 -3060 -2704 -331 1103 3140 2065 1206 -1325 -987 -595 216 259 -443
3867d43Q57Q02k027N97O9q08O68K058q35Lj896j299J066Q34J805N47j378j821
$$ -443 414 1216 -811 -214 -145 -953 -285 1773 938 941 -955 -2254 -1188 -354 1451 1998 620 -1201
3885a201j679J295K934K198k76l101l391q33K838K656K760j923k834k622m17L622
$$ -1201 -2880 -1585 1349 3547 3271 170 -3221 -4054 -1216 1440 4200 2277 -557 -3179 -3596 26
3901B6K371J186k219j609l156L27K098R22L470j157j117l357l57J681k61L831
$$ 26 2397 3583 1364 -245 -3401 -3074 -976 -54 3416 2259 1142 -2215 -2572 -891 -1152 2679
3917B679q62j576j393o77l01P86L240J445r01k086l404K56J17M618j18M60k097
$$ 2679 1817 241 -1152 -1829 -2130 -1344 1896 3341 2440 354 -3050 -2794 -2677 1941 1823 2283 186
3934A86k320m43J899L681l0p84l594k382J665K365J384J537j304k036j877J396
$$ 186 -2134 -2577 -678 3003 2973 2189 -1405 -3787 -2122 243 1627 3164 1860 -176 -2053 -657
3950f57J391P49N05j059k387n58q57K801n07K802l03j480j56n21L2n52P72k72
$$ -657 734 1483 1988 929 -1458 -2016 -2873 -72 -579 2223 1920 440 284 -237 -205 -757 15 -257
3968b57Q88o74j18J044m20J377r79P32l040l35j59R38K879q92J289k420j035J11
$$ -257 631 -43 -161 883 463 1840 861 1593 -1447 -1782 -1941 -1003 1876 984 2273 -147 -1182 -1071
3986a071R53J899j815p81p14q43J534K00J315j745J907j068K326j560l82O0k551
$$ -1071 -118 1781 -34 -815 -1529 -2372 -838 -638 677 -1068 839 -229 2097 537 155 215 -2336
4003b336J025j18K717J251j693k059l87J459J833J935k427k112l282q00N756J284
$$ -2336 -1311 -1429 1288 2539 846 -1213 -1600 -141 1692 3627 1200 -912 -4194 -4994 762 2046
4019B046J921k535k709k534J783L952K138o0m139l938p97K330N074K421j098m698
$$ 2046 3967 1432 -1277 -3811 -2028 1924 4062 4002 -137 -4075 -4872 -2542 2532 4953 3855 -843
4035h43k858M76L553K444J295l122m216q27K012J797L844o7k475k610o74K458
$$ -843 -3701 -3225 328 2772 4067 945 -3271 -4098 -2086 -289 3555 3488 1013 -1597 -2271 187
4051A87P64J695j403k735k60K483P38J03j310j460K51J992k70Q77j968k331P17
$$ 187 951 2646 1243 -1492 -1752 731 1469 1572 262 -1198 -947 1045 775 1652 -316 -2647 -1930
4068a930O92L258ll48k589k673K463K450L595k508k175n099M59N088J589J284
$$ -1930 -1238 2020 2017 1669 -920 -3593 -1130 1320 4915 2407 232 -4867 -4408 680 2269 3553
4084C553j526l096m320K074N389P12O40m463j528j280K328L323J503j015l540
$$ 3553 2027 -1069 -5389 -3315 2074 2786 3426 -1037 -2565 -3845 -1517 1806 3309 2294 -1246
4099a246M36j778J888K333k74j768j734J06J352K208j182M09j787J027N87P72
$$ -1246 -810 -2588 -700 1633 1359 -409 -2143 -2037 -685 1523 341 750 -1037 -10 577 1349
4115A349p83j902k214J956K847J634j140j606k092P3J688M92J442j400k804l64
$$ 1349 566 -1336 -3550 -1594 1253 2887 1747 141 -1951 -1878 -190 302 1744 344 -2460 -2824
4131b824M27K439L706o13k889j883j422K123K313Q63j797k295j885J860M484Q96
$$ -2824 -2397 42 3748 3135 246 -1637 -3059 -936 1377 2240 443 -1852 -3737 -1877 2607 3503
4147C503P3l782k432P95J198K164R26k097k952J50J530K383Q71r3l451l47J779
$$ 3503 3576 -206 -2638 -1843 -645 1519 2445 348 -2604 -2454 -924 1459 2330 2237 -1214 -1561 218
4164B18m71J691k182j466N22P35L756n62R3k170k957J017N99L500j409q0k488
$$ 218 -253 1438 -744 -2210 -1688 -953 2803 2241 2334 164 -2793 -1776 -1177 2323 914 834 -1654
4181a654n67K049J887K347j468k092m108L97K523J562L363l109q71k765N97K241
$$ -1654 -2221 -172 1715 4062 2594 502 -3606 -3209 -686 876 4239 1130 259 -2506 -1909 332
4197C32J807K364m101j883j725J283K359O46P99k625O16rm72K232o15R41k258
$$ 332 2139 4503 402 -1481 -3206 -1923 436 1082 1881 -744 -128 -137 -609 1623 1008 1949 -309
4214c09n40j554J510J018r78K218q90P55j163k96N7M44J864j735j297L2j58J277
$$ -309 -849 -2403 -893 125 -853 1365 475 1230 67 -229 -172 272 2136 401 -896 -864 -1022 255
4232B55P92R09N21j924j509m59Q66J549k25J090k615m05KJ592R30J045j137k014
$$ 255 1047 1956 2477 553 -956 -1415 -549 1000 775 1865 -750 -1155 -1153 439 1369 2414 1277 -737
4250g37l27j068J012j47J852N19l77J7k131J250JJ479N09j263p3l262J300Q27
$$ -737 -1064 -2132 -1120 -1267 585 1104 727 744 -1387 -137 -136 1343 1852 589 516 -2746 -1446 -619
4268f19K386J573j330j626k661k06J146L280J705k207l182j770J335J667L754
$$ -619 1767 3340 2010 384 -2277 -2483 -1337 1943 3648 1441 -1741 -3511 -2176 -509 3245
4283C245L31k191l052j992L205K335J608j377l613k185l14L906L590J86k064k126
$$ 3245 3576 1385 -1667 -3659 -454 1881 3489 2112 -1501 -3686 -4000 -94 3496 3682 1618 -508
4299e08k601J63K940K220M34k714n55j044O15K249J189j355j285k228Q27J313
$$ -508 -3109 -2946 -6 2214 2648 -66 -621 -1665 -1050 1199 2388 1033 -252 -2480 -1653 -340
4315c40K550j071r90r39q01N4L038r41P6L40o97n30k54K30j033o95J271K395k14
$$ -340 2210 1139 149 -790 -1591 -1537 1501 560 636 976 279 -251 -505 -275 -1308 -2003 -732 1663 1449
4334A449J82j632k242N93J156J104m29m93j285r41K280K127j50j490j458M4k91
$$ 1449 1631 -1 -2243 -1650 -494 610 181 -312 -1597 -2538 -258 1869 1719 229 -1229 -1185 -1476
4351a476J607M21k1j726m85K92J395M130k401k8m631p22J419M047J152j841k208
$$ -1476 131 552 531 -1195 -1680 -1388 7 4137 1736 1708 -2923 -3645 -2226 1821 2973 1132 -1076
4368a076j794N00K796K570O03k702k346k628K456L194J414j428k988p76M00K452
$$ -1076 -2870 -2370 426 2996 3599 897 -1449 -4077 -1621 1573 2987 1559 -1429 -2205 -1805 647
4384F47K631K8l007l704Q78R6L620K652k494r38m167J302K891L384k306j775k742
$$ 647 3278 3306 299 -3405 -2527 -2431 1189 3841 1347 409 -3758 -2456 435 3819 1513 -262 -3004
4401c004j556L926J658J815k579q22j780J171K552L66p19j502j344P00J492k42
$$ -3004 -4560 -634 1024 2839 260 -562 -2342 -1171 1381 1747 1028 -474 -1818 -1118 374 132
4417A32M17j689o15O52J997J150r83j425k150k33K000J461J928k766j242j091
$$ 132 549 -1140 -1755 -1103 894 2044 1061 -364 -2514 -2747 -747 714 2642 -124 -1366 -2457
4433b457K406J565N00m06k257k065o8L360J044P92j497l070J083M6L002M80r99
$$ -2457 -51 1514 2014 1608 -649 -2714 -2782 578 1622 2414 917 -2153 -1070 -1024 1978 2458 1459
4450A459k348k980Q28K254M587j631k962M37l602L684J618K058j353k834j292
$$ 1459 -889 -3869 -3041 -787 3800 2169 -793 -356 -3958 -274 1344 3402 2049 -785 -2077
4465b077o19K182P95J990j297q69j113J69K115q50J104k540K48Q44l73P09j341
$$ -2077 -2696 -514 281 2271 974 105 -1008 -839 1276 426 1530 -1010 -762 82 -291 418 -923
4482i23J585j617K834k655J178r50k756K210N66K329k44j235j528J186j89J767
$$ -923 662 -955 1879 -776 402 -548 -3304 -1094 -528 1801 1557 322 -1206 -20 -209 1558
4498A558O56j510j525j285M35R56K338J65q21j778r94K004L17J457j489j456k11
$$ 1558 2214 704 -821 -2106 -1671 -715 1623 1788 967 -811 -1805 199 516 1973 484 -972 -1183
4515a183j579K756Q33J634k676P95j986J939N98j021Q60k754O35K57J860o33N74
$$ -1183 -2762 -6 827 2461 -215 580 -1406 533 1131 110 970 -1784 -1149 -892 968 335 909
4532I09P2k652K592q59N49Jk618J380j177J865R88O71o98p38k89j526K544q59
$$ 909 981 -1671 921 62 611 612 -2006 -626 -1803 62 1050 1721 1023 285 -4 -1530 1014 155
4550A55K78j574p48J075p4L484j010K95k471J551k617P70M35J032O87j082q24
$$ 155 433 -1141 -1889 -814 -888 2596 1586 1881 -590 961 -1656 -886 -451 581 1268 186 -638
4567f38R34q64J980m85J361j594k511P82j019K306J152P70j705j769k21Q57J556
$$ -638 296 -568 1412 927 2288 694 -1817 -1035 -2054 252 1404 2174 469 -1300 -1521 -664 892
4584H92J749j493P3l183q77K032J832J923j236k691j268o06K817J282Q07k828
$$ 892 2641 1148 1221 -1962 -2839 -807 1025 2948 1712 -979 -2247 -2853 -36 1246 2053 -775
4600g75l33k116Q64K468J593O33k457J57n10N76J242p1j300j863O20P15J962j35
$$ -775 -1108 -3224 -2360 108 1701 2334 -123 34 -476 100 1342 1271 -29 -1892 -1272 -557 1405 1270
4618A270j681L67m92Q67q64K133j808n52Q25o45J989j338N93m30j302K313l95
$$ 1270 -411 -44 -536 331 -533 1600 -208 -760 65 -580 1409 71 664 234 -1068 1245 850
4635H50J303k839p79q62P44K830J484R51l564k217J191O49L000j12p80l706l80
$$ 850 2153 -686 -1465 -2327 -1583 1247 2731 3682 118 -2099 -908 -259 2741 2629 1849 -1857 -2237
4652b237j57L645J635j052j307l104K434O86J976J429k925k279k517K512J988
$$ -2237 -2394 1251 2886 1834 527 -2577 -143 543 2519 3948 1023 -1256 -3773 -1261 727
4667G27L053j283l442j96J23J731J263k11k433q90l71J321R87K102j365n51k335
$$ 727 3780 2497 -945 -1141 -1018 713 1976 1765 -668 -1558 -1929 -608 379 2481 1116 565 -1770
4684a770K26L106J359k016k824r11J487J345J354k1j604P5r34O39J704M59j461
$$ -1770 -1544 1562 2921 905 -1919 -2830 -1343 2 1356 1335 -269 -194 -1128 -489 1215 1674 213
$$ [...]
16383d16
##END NTUPLES=NMR FID
##END=
