##TITLE=31P_DE-80H_X3
 64 sc D2O
 26.2.2025
##JCAMPDX= 6.0         $$ Bruker NMR JCAMP-DX V2.0
##DATA TYPE= NMR FID
##DATA CLASS= NTUPLES
##ORIGIN= UXNMR, Bruker Analytische Messtechnik GmbH
##OWNER= root
$$ XWIN-NMR		Version 3.5
$$ Tue Mar 24 14:12:56 2026 Russian Standard Time (UT+4h)  Yarkov@DPX200
##.OBSERVE FREQUENCY= 81.013821
##.OBSERVE NUCLEUS= ^31P
##.DELAY= (6, 6)
##.ACQUISITION MODE= SIMULTANEOUS
##.ACQUISITION SCHEME= undefined
##.AVERAGES= 64
##.DIGITISER RES= 17
##SPECTROMETER/DATA SYSTEM= spect
##.PULSE SEQUENCE= zgpg30
##.SOLVENT NAME= CDCl3
##.SHIFT REFERENCE= (INTERNAL, CDCl3, 0, 243.863)
##AUDIT TRAIL= $$ (NUMBER, WHEN, WHO, WHERE, WHAT)
$$ ##TITLE= Audit trail, XWIN-NMR		Version 3.5
$$ ##JCAMPDX= 5.01
$$ ##ORIGIN= Bruker BioSpin GmbH
$$ ##OWNER= Yarkov
$$ C:/Bruker/XWIN-NMR/data/yarkov2/nmr/P31/2/audita.txt
$$ ##AUDIT TRAIL=  $$ (NUMBER, WHEN, WHO, WHERE, WHAT)
(   1,<2026-03-24 14:11:56.64 +0400>,<Yarkov>,<DPX200>,
      <created by zg, POWCHK disabled, PULCHK disabled
       configuration hash MD5:
       00 E9 B6 7A A2 85 ED C7 34 08 36 98 17 FE 4E 26
       data hash MD5: 32K
       A8 69 D2 7C DA A5 4F 60 42 46 28 5A 9D AE BA 88>)
$$ ##END=
$$ 
$$ hash MD5
$$ 98 51 C8 68 A0 BF 41 65 75 7B C6 4C 1D C1 F0 73
##$RELAX= 
##$RELAX= 
##$RELAX= 
##$RELAX= 
##$RELAX= 
##$RELAX= 
##$RELAX= 
##$RELAX= 
$$ Bruker specific parameters
$$ --------------------------
##$DU= <C:/Bruker/XWIN-NMR>
##$EXPNO= 2
##$NAME= <P31>
##$PROCNO= 1
##$TYPE= <nmr>
##$USER= <yarkov2>
##$AMP= (0..31)
100 100 100 100 100 100 100 100 100 100 100 100 100 100 100 100 100 100 
100 100 100 100 100 100 100 100 100 100 100 100 100 100 
##$AQSEQ= 0
##$AQ_mod= 1
##$AUNM= <au_zg>
##$AUTOPOS= <>
##$BF1= 81.014009
##$BF2= 200.13
##$BF3= 200.13
##$BF4= 200.13
##$BF5= 200.13
##$BF6= 200.13
##$BF7= 200.13
##$BF8= 200.13
##$BYTORDA= 1
##$CFDGTYP= 0
##$CFRGTYP= 5
##$CHEMSTR= <none>
##$CNST= (0..31)
1 1 145 1 1 1 1 1 1 1 1 1 1 1 1 1 1 1 1 1 1 1 1 1 1 1 1 1 1 1 1 1 
##$CPDPRG= <waltz16>
##$CPDPRG1= <>
##$CPDPRG2= <waltz16>
##$CPDPRG3= <>
##$CPDPRG4= <mlev>
##$CPDPRG5= <mlev>
##$CPDPRG6= <mlev>
##$CPDPRG7= <mlev>
##$CPDPRG8= <mlev>
##$CPDPRGB= <>
##$CPDPRGT= <>
##$D= (0..31)
0 1 0 0 0 0 0 0 0 0.06 0 0.03 2e-05 3e-06 0 0 0.0002 0 0 0 0 0 0 0 0 0 
0 0 0 0 0 0 
##$DATE= 1774347116
##$DBL= (0..7)
120 120 120 11 120 120 24 19 
##$DBP= (0..7)
150 150 150 150 150 150 150 150 
##$DBP07= 0
##$DBPNAM0= <>
##$DBPNAM1= <>
##$DBPNAM2= <>
##$DBPNAM3= <>
##$DBPNAM4= <>
##$DBPNAM5= <>
##$DBPNAM6= <>
##$DBPNAM7= <>
##$DBPOAL= (0..7)
0.5 0.5 0.5 0.5 0.5 0.5 0.5 0.5 
##$DBPOFFS= (0..7)
0 0 0 0 0 0 0 0 
##$DE= 6
##$DECBNUC= <off>
##$DECIM= 4
##$DECNUC= <off>
##$DECSTAT= 4
##$DIGMOD= 1
##$DIGTYP= 9
##$DL= (0..7)
0 0 52 120 120 21 21 25 
##$DP= (0..7)
150 150 150 150 150 150 150 150 
##$DP07= 0
##$DPNAME0= <>
##$DPNAME1= <>
##$DPNAME2= <>
##$DPNAME3= <>
##$DPNAME4= <>
##$DPNAME5= <>
##$DPNAME6= <>
##$DPNAME7= <>
##$DPOAL= (0..7)
0.5 0.5 0.5 0.5 0.5 0.5 0.5 0.5 
##$DPOFFS= (0..7)
0 0 0 0 0 0 0 0 
$$ [...]
##$SUBNAM1= <"">
##$SUBNAM2= <"">
##$SUBNAM3= <"">
##$SUBNAM4= <"">
##$SUBNAM5= <"">
##$SUBNAM6= <"">
##$SUBNAM7= <"">
##$SUBNAM8= <"">
##$SUBNAM9= <"">
##$SW= 400.765351723535
##$SWIBOX= (0..15)
0 1 3 0 0 0 0 0 0 0 0 0 0 0 0 0 
##$SW_h= 32467.5324675325
##$TD= 32768
##$TD0= 1
##$TE= 0
##$TE2= 300
##$TE3= 300
##$TEG= 300
##$TL= (0..7)
0 120 53 12 22 120 120 120 
##$TP= (0..7)
150 150 150 150 150 150 150 150 
##$TP07= 0
##$TPNAME0= <>
##$TPNAME1= <>
##$TPNAME2= <>
##$TPNAME3= <>
##$TPNAME4= <>
##$TPNAME5= <>
##$TPNAME6= <>
##$TPNAME7= <>
##$TPOAL= (0..7)
0.5 0.5 0.5 0.5 0.5 0.5 0.5 0.5 
##$TPOFFS= (0..7)
0 0 0 0 0 0 0 0 
##$TUNHIN= 0
##$TUNHOUT= 0
##$TUNXOUT= 0
##$USERA1= <user>
##$USERA2= <user>
##$USERA3= <user>
##$USERA4= <user>
##$USERA5= <user>
##$V9= 5
##$VALIST= <valist>
##$VCLIST= <CCCCCCCCCCCCCCC>
##$VD= 0
##$VDLIST= <DDDDDDDDDDDDDDD>
##$VPLIST= <PPPPPPPPPPPPPPP>
##$VTLIST= <TTTTTTTTTTTTTTT>
##$WBST= 1024
##$WBSW= 4
##$XGAIN= (0..3)
0 0 0 0 
##$XL= 0
##$YL= 0
##$YMAX_a= 23405
##$YMIN_a= -18172
##$ZGOPTNS= <>
##$ZL1= 120
##$ZL2= 120
##$ZL3= 120
##$ZL4= 120
##$ABSF1= 60
##$ABSF2= -190
##$ABSG= 5
##$ABSL= 3
##$ALPHA= 0
##$AQORDER= 0
##$ASSFAC= 0
##$ASSFACI= 0
##$ASSFACX= 0
##$ASSWID= 0
##$AUNMP= <proc_1d>
##$AZFE= 0.1
##$AZFW= 0.5
##$BCFW= 1
##$BC_mod= 2
##$BYTORDP= 1
##$COROFFS= 0
##$CY= 9.86611175537109
##$DATMOD= 1
##$DC= 1
##$DFILT= <>
##$DTYPP= 0
##$F1P= 182.462994727601
##$F2P= 168.069089081705
##$FCOR= 0.5
##$FTSIZE= 0
##$FT_mod= 0
##$GAMMA= 1
##$GB= 0
##$INTBC= 1
##$INTSCL= 1
##$ISEN= 30
##$LB= 1.5
##$LEV0= 0
##$LPBIN= 0
##$MAXI= 11.51145
##$MC2= 0
##$MEAN= 0
##$ME_mod= 0
##$MI= 1.244541
##$NCOEF= 0
##$NC_proc= 0
##$NLEV= 6
##$NOISF1= 0
##$NOISF2= 0
##$NSP= 1
##$NTH_PI= 0
##$NZP= 1
##$OFFSET= 243.8632
##$PC= 1.4
##$PHC0= 1765.001
##$PHC1= 73.15952
##$PH_mod= 0
##$PKNL= yes
##$PPARMOD= 0
##$PSCAL= 0
##$PSIGN= 0
##$REVERSE= no
##$SF= 81.0140731611343
##$SI= 65536
##$SIGF1= 0
##$SIGF2= 0
##$SINO= 80
##$SIOLD= 65536
##$SREGLST= <31P.CDCl3>
##$SSB= 0
##$STSI= 0
##$STSR= 0
##$SW_p= 25641.0256410257
##$SYMM= 0
##$S_DEV= 0
##$TDeff= 0
##$TDoff= 0
##$TI= <>
##$TILT= no
##$TM1= 0
##$TM2= 0
##$TOPLEV= 0
##$USERP1= <user>
##$USERP2= <user>
##$USERP3= <user>
##$USERP4= <user>
##$USERP5= <user>
##$WDW= 1
##$XDIM= 64
##$YMAX_p= 0
##$YMIN_p= 0
$$ End of Bruker specific parameters
$$ ---------------------------------
##NTUPLES= NMR FID
##VAR_NAME=  TIME,          FID/REAL,        FID/IMAG
##SYMBOL=    X,             R,               I
##VAR_TYPE=  INDEPENDENT,   DEPENDENT,       DEPENDENT
##VAR_FORM=  AFFN,          ASDF,            ASDF
##VAR_DIM=   16384,         16384,           16384
##UNITS=     SECONDS,       ARBITRARY UNITS, ARBITRARY UNITS
##FACTOR=    3.08e-05,      1,               1
##FIRST=     0,             0,               0
##LAST=      0.5045964,     0,               0
##MIN=       0,             -18172,          0
##MAX=       0.5045964,     23405,           0
$$ Real data points
##PAGE= N=1
##DATA TABLE= (X++(R..R)), XYDATA
0@%%%%%%%%%%%%%%%%%%%%%%%%%%%%%%%%kMlLlKoJ1j3J6k1K3k4K4k4L0l4L8m4M5
$$ 0 0 0 0 0 0 0 0 0 0 0 0 0 0 0 0 0 0 0 0 0 0 0 0 0 0 0 0 0 0 0 0 0 -2 2 -1 2 -1 1 -5 6 -7 9 -12 11 -13 11 -13 17 -17 21 -23 22
52B2n0N9o5O7p0Q4r7J07j36J76k22L01m61Q80J411k0178K573J1120J2342Q869
$$ 22 -28 31 -34 33 -37 47 -50 57 -79 97 -125 176 -285 595 2006 -18172 -15599 -4479 7863 16732
72A6732k557j1422j2691n747M020J1026J2124K676l909j0502r440m933M064J1396
$$ 16732 14175 2753 -9938 -15685 -11665 -639 11485 14161 10252 -250 -9690 -14623 -10559 837
86H37Q978N450n989j0400q224k901L502Q661Q141J742l064p425o953j647L474
$$ 837 9815 15265 9276 -1124 -9348 -12249 -8747 -86 8055 9797 6733 -692 -7645 -9292 -5818
101e818O299O612J295l169p302m835k451L468Q221N044K046l773n775o777j339
$$ -5818 481 7093 8388 5219 -2083 -6918 -9369 -5901 2320 7364 9410 5637 -138 -6915 -8254
116h254K336P727M178J807k253o601m817j236L101O214K760K763m142n085n916
$$ -8254 -5918 1809 5987 7794 5541 -1060 -5877 -7113 -4012 2202 4962 7725 3583 -1502 -7418
131g418o45N074M705M937J14l780n042m848J285K064O236K509o51k065n804j685
$$ -7418 -8063 -2989 1716 6653 6767 2987 -2055 -6903 -5618 -3554 2682 5191 4540 2475 -3329 -5014
147e014l03L089O270K398r18m846l651l265J167M705L894K833j896l273o143j516
$$ -5014 -5317 -2228 4042 6440 5522 676 -2975 -6240 -5073 -368 3526 6359 4463 1190 -4953 -6469
163f469K430L814L712J920j250n303l674j383L082M610L575P62k790m733k856
$$ -6469 -4039 -225 3487 5407 4157 -1146 -4820 -6203 -3121 1489 5064 5826 3036 -1697 -4553
178d553k012L714N839K683j703k216m193m391J998L690N066J459j556l548l881
$$ -4553 -6565 -2851 2988 5671 3968 1752 -2441 -6832 -4834 -1144 3922 5381 3825 277 -3604
193c604k869J595N452L526K347k473n215k266j642K760L404L037J36k664l519
$$ -3604 -6473 -4878 574 4100 6447 3974 -1241 -3507 -5149 -2389 1015 4052 4188 1524 -1995
208a995k795j86M153K516L264j638k983l942j137K267K077L302P94j190k447k446
$$ -1995 -4790 -4976 -823 1693 4957 3319 336 -3606 -4743 -2476 -399 2903 3697 2507 60 -2386
224b386k165J489M359J752L50p04l294k476j401J955K739L007Q57p39l019l416
$$ -2386 -4551 -3062 1297 3049 3399 2695 -599 -3075 -4476 -2521 218 3225 4082 3343 324 -3092
240c092n9P62K890J816R97k02m119j403o11J784K054K705O14k547k259j924j077
$$ -3092 -3151 -2389 501 2317 3314 3112 -1007 -2410 -3021 -1237 817 3522 4136 1589 -670 -2594 -3671
257c671J222L537K841Q3j447l013l703R85Q65L584J743j94j238k932l74k510L372
$$ -3671 -2449 1088 3929 4012 2565 -448 -4151 -3166 -2301 1283 3026 2832 1594 -1338 -1712 -4222 -850
274h50J688L014M9k271k971l098O38K739K884J301O26k411k853k288L12K053K994
$$ -850 838 3852 3901 1630 -1341 -4439 -3801 -1062 1822 3123 3749 1338 -1515 -3803 -3491 -1438 1556
291A556K013p83k694j724k330J120K292K990J340l31k541l266k319R30K511N695
$$ 1556 3569 2786 92 -1632 -3962 -2842 -550 2440 3780 3449 908 -2358 -4677 -3747 -1236 4459
307D459Jp59l586k885k032J801M028J486J161j633k506k518j601K489K044M004
$$ 4459 4460 3701 115 -2770 -4802 -3001 1027 2513 3674 2041 -465 -2983 -4584 -2095 -51 3953
323C953m5j221k623l559q20J802L913J214L10n91l765q35j077Q03L119J542M48
$$ 3953 3908 2687 64 -3495 -4315 -2513 1400 2614 2924 2333 -1432 -2267 -3344 -2541 578 2120 2568
340B568k006p93j932o49J839J488L280r94l26l522l67j734K17J389L270p8J68
$$ 2568 562 -231 -2163 -2812 -973 515 3795 2801 2475 -1047 -1414 -3148 -2931 -1542 1728 1650 1818
357A818p97k776j232J341J165K518L81p15j908k016n74q08L955K859M34O9m660
$$ 1818 1021 -1755 -2987 -1646 -481 2037 2418 1703 -205 -2221 -2795 -3603 352 3211 3645 3714 -946
374i46j329j082K110J079L249J89k469l64k735j25P21K849J267O92r51k678k089
$$ -946 -2275 -3357 -1247 -168 3081 3270 801 437 -2298 -2423 -1702 1147 2414 3106 2155 -523 -2612
391b612p31K095J873J589J296j058l300k296l57J728L047L71J181j606j292j673
$$ -2612 -3343 -1248 625 2214 3510 2452 -848 -3144 -3501 -1773 1274 1645 2826 1220 -72 -1745
407a745L36O64P72J528P25j495k130j231q0J718K230J182o83j259R57m006P35
$$ -1745 -1409 -745 27 1555 2280 785 -1345 -2576 -2656 -938 1292 2474 1791 532 1489 -2517 -1782
424a782J348Q76P29J57J39j616o55Q71j673K228L81Q54n75j819q76j63N65J41
$$ -1782 -434 442 1171 1328 1467 -149 -804 67 -1606 622 1003 1857 1282 -537 -1413 -1576 -1011 -870
442h70J432J542j052j48j276r65n47J104N08J026Q72j479m4p40N65k48R76Q30
$$ -870 562 2104 1052 904 -372 -1337 -1884 -780 -272 754 1626 147 103 -637 -72 -320 656 1486
460A486J40j010j471m10k44Q95K883j272J349k366n91m97O88L35L38R19J16m11
$$ 1486 1626 616 -855 -1265 -1509 -614 2269 997 2346 -20 -611 -1108 -420 -85 253 1172 1288 877
478H77j801L66j70J11K681p68k13j015j253j134J649J671q41J152k394J049r84
$$ 877 -924 -558 -728 -617 2064 1296 1083 68 -1185 -2319 -670 1001 160 1312 -1082 -33 -1017
495a017N95N42J94L21k45n86j183N84J25M63Q4J243j473o9n79n9J297n60P22j360
$$ -1017 -422 120 314 635 390 -196 -1379 -795 -670 -207 -123 1120 -353 -422 -1001 -1060 237 -323 399 -961
515i61J584j672N2R29p09P54m97R52l11N0K34R2o70MJ32q23Q64J022m55n23r98
$$ -961 623 -1049 -997 -68 -777 -23 -520 432 121 171 405 497 -173 -169 -37 -860 4 1026 571 48 -950
536i50J063j325J524N61K22k87j867J89r14K786O9K00l62m65j390n70P43P71J485
$$ -950 113 -1212 312 873 1095 808 -1059 -870 -1784 1002 1071 1271 909 444 -946 -1516 -773 -2 1483
555A483J47j308p67l02m56l51J454K58M74J20j897L02j29N28M53K062k6k096j327
$$ 1483 1630 322 -445 -747 -1203 -1554 -100 158 632 752 -1145 -843 -972 -444 9 2071 2045 -51 -1378
574a378j152Q37J849J441J607k399j250j680J138k82J830J799q46j164j032j459
$$ -1378 -2530 -1693 156 1597 3204 805 -445 -2125 -987 -1269 561 2360 1514 350 -682 -2141
590b141J009P5K362N39J2n93k406n70j110J935K700m18N91j804p37k599J380K133
$$ -2141 -1132 -1057 1305 1844 1856 1263 -1143 -1713 -2823 -888 1812 1394 1985 181 -556 -3155 -1775 358
608C58j30J392l12j618j881K02K56J827J990L51j371r53k004J26L54J484J156
$$ 358 228 1620 1308 -310 -2191 -1989 -1733 94 2084 2435 1064 111 -1893 -1767 -1413 71 1227
625A227N81q80q56j431k57K032j173K467j05q20j327o34n95L07K478j168K251
$$ 1227 1808 928 72 -1359 -1616 416 -757 1710 1605 785 -542 -1176 -1771 -1464 1014 -154 2097
642B097Q93l027N3k833K165p41L203l83O70j804k461K17Q45N66J702J035j103
$$ 2097 2990 -37 16 -2817 -652 -1393 1810 1427 2097 293 -2168 -1951 -1106 -540 1162 2197 1094
659A094j524q61j002M35J324K540R58j656j753j016j102J960J313J035O54j720
$$ 1094 -430 -1291 -2293 -1858 -534 2006 2964 1308 -445 -1461 -2563 -603 710 1745 2399 679
675F79j043j613k40J479J486J963j090j992k041O99n20J992J225K025j263j851
$$ 679 -364 -1977 -2217 -738 748 2711 1621 -371 -2412 -1713 -2233 -241 984 3009 1746 -105
691a05j434k70O8K559K98R57p77j998j632M44K95J927K235l48J79m252j458m22
$$ -105 -1539 -1809 -1741 818 1116 2073 1296 -702 -2334 -1890 -1595 332 2567 2219 2398 -1854 -3312 -3734
709c734K212K912J070J597k954k304k106R10K866Q28K064j980r03k687j411J481
$$ -3734 -1522 1390 2460 4057 1103 -1201 -3307 -2397 469 1297 3361 1381 478 -2209 -3620 -2139
725b139J597L920j232J45k299k885O08O3K370K041K090j397k603k317j793K444
$$ -2139 -542 3378 2146 2291 -8 -2893 -2285 -2222 148 2189 4279 2882 279 -2038 -3831 -1387
741a387J882J821K04p07k355k103M43Q2K200L065j06j025l367j005m5N31L204
$$ -1387 495 2316 2520 1813 -542 -2645 -2202 -2120 80 3145 3039 2014 -1353 -2358 -2403 -1872 1332
758A332K44J228r97k163k886J409k59K264K315K15k068j73l689m20K046L267K31
$$ 1332 1576 2804 1807 -356 -3242 -1833 -2092 172 2487 2702 634 461 -3228 -3648 -1602 1665 1896
775A896J192j735k834n00L4L06J437J772K40j44k057k759j23K900K147J780j074
$$ 1896 3088 1353 -1481 -1981 -1947 -1641 -204 1568 1808 1664 -393 -3152 -3275 -375 1772 3552 2478
792B478k678j947o75Q41P58L095K953j458l273j200j259k33J913K154J506j133
$$ 2478 -200 -2147 -2822 -1981 -1223 1872 4825 3367 94 -1106 -2365 -2598 -685 1469 2975 1842
808A842j482k353r24K90L002K750K4q82k803k897k9J424K602K144K33j384k413
$$ 1842 360 -1993 -2917 -2627 375 3125 3149 2267 -536 -3433 -3462 -2038 564 2708 2941 1557 -856
825h56j127q22J472K097J628J08j071j823k429M80Q77K722J776N77k088l945k65
$$ -856 -1983 -2805 -1333 764 2392 2500 1429 -394 -2823 -2343 -1466 1256 3032 3609 1521 -2424 -2689
842b689L30J083L158K82O8j569j399k676J606J003K274J653j069j983j287j374
$$ -2689 -2359 -1276 1882 2164 2232 663 -736 -3412 -1806 -803 1471 3124 2055 72 -1215 -2589
858b589J171K059P58J616j064k580q70L52j318K045K414L20j167j982o46j938
$$ -2589 -1418 641 1399 3015 1951 -629 -1499 -1147 -2465 -420 1994 2314 1147 -835 -1481 -3419
874c419K179J255J778M14j290r10l270N93J582J171K726P72r12k172k547j109
$$ -3419 -1240 15 1793 2207 917 7 -3263 -2670 -1088 83 2809 3581 2669 497 -2050 -3159
890c159M92L320J746N11j954j080j602j651J550K480L022j462p50k846o35n80
$$ -3159 -2667 653 2399 2910 956 -124 -1726 -3377 -1827 653 3675 2213 1463 -1383 -2018 -2598
906b598J208J788L110J75k332j902j660r05J705J621K676Q18k872k370j033q69
$$ -2598 -1390 398 3508 3683 1351 -551 -2211 -3116 -1411 210 2886 3704 832 -1538 -2571 -3440
922c440L325K179J117j31k052k884j495J336K271K130R10l60k420l010q65M36
$$ -3440 -115 2064 3181 3050 998 -1886 -3381 -2045 226 2356 3266 2906 486 -2524 -3389 -2953
938b953K832J902J184j191l132j071l93K027J413K787j330L38m138p20K34P03
$$ -2953 -121 1781 2965 1774 -1358 -2429 -2822 -795 618 3405 2075 2413 -1725 -2445 -2211 -1508
954a508K763P08R09j740k008j395m18J593K030l6J421n54j939j019n56J393K473
$$ -1508 1255 1963 2872 1132 -876 -2271 -2689 -1096 934 898 2319 1765 -174 -1193 -1749 -356 2117
971B117J71L74j447j721r35K44L77K475j531K514k148j241k032k67K232J924O78
$$ 2117 2288 2662 1215 -506 -1441 -1197 -820 1655 124 2638 490 -751 -2783 -3050 -818 1106 1784
988A784j127m75q91j292N62J460K025p66M01j489j692n17j189M098L85J009j345
$$ 1784 657 182 -709 -2001 -1439 21 2046 1280 1681 192 -1500 -2017 -3206 892 1277 2286 941
1005I41o46j923j073J165J320K496o1j571j303k635Q5J057L920P44K10j792k133
$$ 941 295 -1628 -2701 -1536 -216 2280 2219 648 -655 -3290 -3205 -2148 1772 2516 2726 934 -1199
1022a199k599N20K379R43L539j338l408m74j389r61M189J881J141j272j554j986
$$ -1199 -3798 -3278 -899 44 3583 2245 -1163 -1637 -3026 -3987 202 2083 3224 1952 398 -1588
1038a588q95J322J718J409O36r33k151k648M65R15K743J570P23j464l085j070
$$ -1588 -2483 -1161 557 1966 2602 1669 -482 -3130 -2665 -1750 993 2563 3286 1822 -1263 -2333
1054b333j330J569J990K935N17k896j133k267M5J376K705J601K14j792k939p06
$$ -2333 -3663 -2094 -104 2831 3348 452 -681 -2948 -2903 -1527 1178 2779 2993 1201 -1738 -2444
1070b444p06K378J920J539L56k682k002m82j163L101J289J338k44p00l629q12
$$ -2444 -3150 -772 1148 2687 3043 361 -1641 -2123 -3286 -185 1104 2442 2198 1498 -2131 -2943
1086b943M81J648J722K259M35j726k795k172O13K018J412K179J80l141j258k344
$$ -2943 -2462 -814 908 3167 3602 1876 -919 -3091 -2478 -460 952 3131 3311 170 -1088 -3432
1102c432J250J009L517M29k98k134j859m99k87J512L396m46j01j908k222l92L32
$$ -3432 -2182 -1173 2344 2773 2475 341 -1518 -2017 -2304 -792 2604 2158 2057 149 -2073 -2465 -2133
1119b133J682K064J529j441j044l468K65J941J241O08L09R25k079k966P59R0J939
$$ -2133 -451 1613 3142 1701 657 -2811 -2546 -605 636 1244 1553 2478 399 -2567 -1808 -1718 221
1136B21K304n2j267j573j375j030Q42L350J029M71j348l149j492Q50J953K506
$$ 221 2525 2473 1206 -367 -1742 -2772 -1930 1420 2449 2920 1572 -1577 -3069 -2219 -266 2240
1152B240J271r56k535j554o55k24K883J937j407P54k041j160n61L56K417K050
$$ 2240 3511 2555 20 -1534 -2189 -2413 470 2407 1000 1754 -287 -1447 -2008 -1652 765 2815
1168B815O4l034K6k266M17J111J591N85P35j805j609j307L25J363L063P72j169
$$ 2815 2879 -155 -129 -2395 -1978 -867 724 1309 2044 239 -1370 -2677 -2352 -989 2074 2846 1677
1185A677k474l97p59P69J018N62O65L75k275o45j047J385P06L104j269J53j123
$$ 1677 -797 -1194 -1953 -1184 -166 396 1061 1436 -839 -1484 -2531 -1146 -440 2664 1395 1548 425
1202D25j867N69M01N78K146n18K73j749k374R50O26J043L10J332k143P3p67j22
$$ 425 -1442 -873 -472 106 2252 1734 2007 258 -2116 -1166 -540 503 813 2145 2 75 -692 -814
1220h14m23J256R04J523q74j249j340j50j10Q16M03J633j205l86j035j593J570
$$ -814 -1237 19 923 2446 1572 323 -1017 -1167 -1277 -461 -58 1575 370 -16 -1051 -2644 -1074
1237a074O68K406r48l95q95j946m7P00J992R89Q8k65j884j108p06J485K521J17
$$ -1074 -406 2000 1052 657 -238 -2184 -2231 -1531 461 1450 1538 1273 -611 -1719 -2425 -940 1581 1698
1255A698L40k346n98j699m61K473K064r6R59k265j952n40R08O85L560j57n40k735
$$ 1698 2038 -308 -906 -2605 -3066 -593 1471 1375 2334 69 -1883 -2423 -1515 -830 2730 2573 2033 -702
1273g02j501O30K90K688l30J40j534j67o12j178L013M32J500r22j661r15j144
$$ -702 -2203 -1573 -1283 1405 1075 1215 -319 -486 -1098 -2276 737 1169 2669 1747 86 -829 -1973
1290a973Q41J63O20K156m62o73j266K03r27J585P85l57j087n59q92P15N36J841
$$ -1973 -1132 -969 -349 1807 1345 672 -594 -391 -1318 267 1052 695 -392 -951 -1843 -1128 -592 1249
1308A249j042O34j078P8k5m73J088l44L32L29j524L51K204k548M85Q55j072J525
$$ 1249 207 841 -237 -159 -184 -657 431 87 419 748 -776 -425 1779 -769 -284 571 -501 1024
1326A024j236k10O95p60O01m73m96N96L72J45p60l1M29m26Q25K9L08j482J660
$$ 1024 -212 -422 273 -487 114 -359 -855 -259 113 258 -502 -533 -104 -530 295 324 632 -850 810
1345H10j199j52L87k56Q30l48O45o95k33K19j502K510m18q0r69K22n74p31K085
$$ 810 -389 -541 -154 -410 420 72 717 22 -211 8 -1494 1016 598 518 -451 -229 -803 -1534 551
1364E51l20L20l70j7K90j008O69O09r03J038j99j002n4K61r41L25J034o05M38
$$ 551 231 551 181 164 454 -554 115 724 -179 859 660 -342 -396 -135 -1076 -751 283 -322 116
1383A16j822K641j454J135K50j311J075k199Q68J035K74j87R4r01jK33q30Q38
$$ 116 -1706 935 -519 616 866 -445 630 -1569 -701 334 608 421 515 -386 -387 -154 -984 -146
1401a46N14m25J52p11J309j479J473k55K87r38o06l82J282p29Q03M0J942k738
$$ -146 368 -57 95 -616 693 -786 687 432 719 -219 -825 -1207 75 -654 149 189 2131 -607
1419f07J401j592L05J028l78J907j993K26k28j100P84P3K064o74r38o55l14O03
$$ -607 794 -798 -493 535 157 2064 71 297 69 -1031 -247 -174 1890 1216 278 -377 -691 -88
1437h8j310K024O64J83j046q70Kq11J713K12J769j955q30p9r99J306l01Q40k2
$$ -88 -1398 626 1290 1473 427 -443 -441 -1252 461 673 2442 487 -343 -422 -1421 -115 -416 424 402
1456D02L47j580m13K40K95J136J158j519Q46j729jq76J220K631j907L24n04n71
$$ 402 749 -831 -1244 -1004 -709 427 1585 66 912 -817 -818 -1694 -474 2157 250 574 70 -501
1474e01o26R80L7p78K678j379j365k96M50M73Q77K35K4m38q70M72o83J775q57
$$ -501 -1127 -147 -110 -888 1790 411 -954 -1250 -800 -327 550 785 809 371 -499 -27 -710 1065 208
1493B08L17N22o58n87L76r30O16J55K63K34j31j836J086o01M52R51L73o40L42
$$ 208 525 1047 389 -198 178 -752 -136 19 282 516 385 -1451 -365 -966 -514 437 810 170 512
1512E12j393L34J072j123M14K88J059j377R45j525Q71P77j451J500r82J210k079
$$ 512 -881 -547 525 -598 -184 104 1163 -214 731 -794 77 854 -597 903 -79 1131 -948
1529i48KJ91l18K889j100m49N14k286j96k52J460J434M90j04j539m5k021J025
$$ -948 -946 -755 -1073 1816 716 267 781 -1505 -1701 -1953 -493 941 1431 1327 -212 -257 -2278 -1253
1547a253Q82J968m14o94J96k417J056p35J733J934L52j033k769M06n37M21K470
$$ -1253 -371 1597 1183 489 685 -1732 -676 -1411 322 2256 2608 1575 -1194 -788 -1325 -904 1566
1564A566K05J02k604j366M79n66K271N71Q53r9k288j176o06J271K405J305q94
$$ 1566 1771 1873 -731 -2097 -1618 -2184 87 658 1511 1412 -876 -2052 -2658 -1387 1018 2323 1429
1581A429O69k075k118J137r98J491J574J318m88k129p63j285J33L816j62N20j421
$$ 1429 2098 23 -2095 -958 -1956 -465 1109 2427 1939 -190 -953 -2238 -2105 1711 1549 2069 648
1598F48j445N93j031M46J156J300p23j19j658r96J87P26J596RQ80j436q57p01
$$ 648 -797 -204 -1235 -789 367 1667 944 825 -833 -1829 -1642 -916 680 689 1569 133 -724 -1425
1616a425p18K350n24K083L87q92j481k421J019j21L336p03J173r67k325M70n07
$$ -1425 -2143 207 -317 1766 2153 1261 -220 -2641 -1622 -1743 1593 890 2063 1096 -1229 -759 -1266
1633a266J127M64R17K51k48j966k303J767P74J207R02J61l60k544p43m43J912
$$ -1266 -139 325 1242 1493 1245 -721 -3024 -1257 -483 724 1626 1787 1427 -1117 -1860 -2303 -391
1650c91J500J510Q4k650j464j802K254J908L51J237q46j649k394k7O70J223K337
$$ -391 1109 2619 2703 53 -1411 -3213 -959 949 1300 2537 1691 42 -2352 -2379 -1709 -486 1851
1667A851K016k538k095j202j280J623K171J032J143j898k076r46j432K739J989
$$ 1851 3867 1329 -766 -1968 -3248 -1625 546 1578 2721 823 -1253 -2199 -3631 -892 1097
1682A097J146O8j371j462k315J536Q85J854nM98m51m249J603o96J788K221r63
$$ 1097 2243 2311 940 -522 -2837 -1301 -416 1438 1433 1931 1480 -2769 -1166 -1862 -74 2147 1184
1699A184J078l086j085M53L28J470J281J352k114L60m081R58J151j1K620L34r30
$$ 1184 2262 -824 -1909 -1456 -1128 342 1623 2975 861 1221 -2860 -1902 -751 -762 1858 2192 1262
1716A262j817o41j63L73J796j43J900j376j602m92j410K619q92K085o51P3o55
$$ 1262 -555 -1196 -1359 -986 810 667 2567 1191 -411 -903 -2313 306 -586 1499 848 921 266
1733B66k017M03l37J873J057Q71r95k436J93j298K500l66J722J400j597j015k396
$$ 266 -1751 -1348 -1685 188 1245 2116 1121 -1315 -1122 -2420 80 -286 1436 2836 1239 224 -2172
1750b172j044K026J966Q68O36r15k810m49p10J750J565J504L67k186p76j544j759
$$ -2172 -3216 -1190 776 1644 2280 1365 -1445 -1894 -2604 -854 711 2215 2582 396 -380 -1924 -3683
1767c683L205K304O84j244q39j529j649P83J07L572k48L18j356j378j067K14K282
$$ -3683 -478 1826 2510 1266 427 -1102 -2751 -1968 -1861 1711 1463 1781 425 -953 -2020 -1806 476
1784D76J481o4L85k839l25j140P34J712J240K112k187j347j478j085K416k36J475
$$ 476 1957 1893 2278 -561 -886 -2026 -1292 420 1660 3772 1585 238 -1240 -2325 91 -145 1330
1801A330M14p24j877m97l35J375J566M85J234l105r36j535M52K646M98O83k4j244
$$ 1330 1744 1020 -857 -1354 -1689 -314 1252 1737 2971 -134 -1070 -2605 -2153 493 991 1674 1650 406
1819D06k372q64K092l18L148p51j561j23j592M96P09J480M70n68Q99k704M79m65
$$ 406 -1966 -2830 -738 -1056 2092 1341 -220 -343 -1935 -1439 -730 750 1220 652 1551 -1153 -674 -1139
1837a139N36L48L19J159O4m81k311J055k13J327k93J74R68k967K66P66m24J094
$$ -1139 -603 -255 64 1223 1287 806 -1505 -450 -663 664 371 545 1513 -1454 -1188 -422 -846 248
1855B48J022j189O00k076q94O52O08J139J876j029n53L6k902J627q22K315M85
$$ 248 1270 81 681 -1395 -2289 -1637 -1029 110 1986 957 404 440 -2462 -835 -1657 658 1143
1872A143J045j042j887M71j385J057J459M14P76k034j212j424J365J251J455J301
$$ 1143 2188 1146 -741 -270 -1655 -598 861 1275 2051 17 -1195 -2619 -1254 -3 1452 2753
1888B753k258K13k290j061K362L47K140m3l62j426k288j26P74K584M0O92j713
$$ 2753 495 708 -1582 -2643 -281 66 2206 2163 1801 375 -1913 -2039 -1265 1319 1359 2051 338
1905C38j228j72k56J434M86J768n91j136j027k197J503J064J949Q03j392o78k983
$$ 338 -890 -1062 -1318 116 602 2370 1779 643 -384 -2581 -1078 -14 1935 2738 1346 668 -2315
1922b315m50J642P58J044O84j12k709J80m77K226m92P28J650k516j135N62j759
$$ -2315 -2765 -1123 -365 679 1363 1251 -1458 -1278 -1755 471 -21 707 2357 -159 -1294 -732 -2491
1939b491K233Q83O99r17J25K8k708J036L53Q26J074Q82j783n27n19M0K23J958
$$ -2491 -258 625 1324 407 532 560 -2148 -1112 -759 67 1141 2023 240 -287 -806 -766 -543 1415
1957A415l50k69q76j357m34N99N07K254m46J34j034j082J127j675N30J090J297
$$ 1415 1065 796 -80 -1437 -1871 -1272 -765 1489 1043 1177 143 -939 188 -1487 -957 133 1430
1974A430q55o94L62j477O04m57J411N74K82n98q51j374N72J76J355P63l87J00
$$ 1430 575 -119 243 -1234 -630 -1087 324 898 1180 582 -269 -1643 -1071 -895 460 1223 836 936
1992I36p10r02j002R49N84K348j546O16j093k254J313m25K208P80n83n96k034
$$ 936 226 -676 -1678 -729 -145 2203 657 1273 180 -2074 -761 -1186 1022 1802 1219 623 -1411
2009a411J23M0J88J095R61k51p19J47j854J199j40J063P13l09r31l74M47j147
$$ -1411 -1288 -1248 -1060 35 996 745 26 173 -1681 -482 -622 441 1154 845 -86 -460 -13 -1160
2027a160N30J282J072j276q25m50M03j182K390j72Q45n29k415J211r35n19J040
$$ -1160 -630 652 1724 448 -377 -827 -424 -1606 784 612 1457 928 -1487 -276 -1211 -1730 -690
2044f90J561l60q38O56j261O72k80J30O13l92J435j548J219j360j28R10j88L90
$$ -690 871 511 -327 329 -932 -260 -540 -410 203 -189 1246 -302 917 -443 -571 339 151 541
2062E41m35O12J36j201M75j580J349P12L17j472R18o3j487J426q13K205q39J07
$$ 541 106 718 854 -347 128 -1452 -103 609 926 -546 372 309 -1178 248 -565 1640 801 908
2080I08l74o99Q09j713J606l06J403j440k97N24k069J923k84K65M83J64q56p83
$$ 908 534 -165 644 -1069 537 231 1634 194 -103 421 -1648 275 -9 256 739 903 47 -736
2098g36L1J114j260J957j24k00l62o36n80m75J949m68o73M40j203R49J99n14J109
$$ -736 -705 409 -851 1106 982 782 420 -216 -796 -1271 678 210 -463 -23 -1226 -277 -78 -592 517
2117E17j53p8o09P0j03o88J346J151Mj791k81L7N12j103J686o31J474r77L32j360
$$ 517 364 286 -323 -253 -356 -1044 302 1453 1457 -334 -615 -578 -66 -1169 517 -114 1360 383 715 -645
2137f45O41O93j751J237P17n14q05J62O32l62m70k43J005k52M88m75o4k03O62
$$ -645 -4 689 -1062 175 892 378 -427 -265 367 5 -465 -708 297 45 533 58 -6 -209 453
2156D53r90J092p45J002N08j713K40o09Q43P29n83R7q1j586N58K242m72p37m83
$$ 453 -537 555 -190 812 1320 -393 -153 -762 81 810 227 324 243 -1343 -785 1457 985 248 -235
2175b35K25lr6P57r23J952j351o34q5n43J009m96J719q33l92j11o74p15L19P92
$$ -235 -10 -13 -109 648 -275 1677 326 -308 -393 -936 73 -423 1296 463 71 -40 -714 -1429 -1110 -318
2195c18o0J243l74j470L36k99J397j47R03j0j192j65Lm84R38J47k90r1L23l79
$$ -318 -378 865 491 -979 -643 -942 455 308 1211 1201 9 -156 -153 -637 301 448 158 67 390 11
2215A1K6l21Q71N84q51j48j304J59K87J6J861j14p82n02m2r70J043J782j422J80
$$ 11 37 -284 587 1171 320 172 -1132 -973 -686 -670 1191 1077 295 -207 -249 -1219 -176 1606 184 364
2235C64K88l80j333M67Q19m5n2L34M01m53j404K27L0Q78O50N01k97j081k02k33
$$ 364 652 272 -1061 -594 225 180 128 462 863 410 -994 -767 -737 141 791 1292 995 -86 -288 -521
2255e21O00p28O30P81j133J36m85j37M43L81P35L05j137L36J91N02j031J50n01
$$ -521 79 -649 -19 762 -371 -235 -720 -857 -414 -33 702 1007 -130 206 397 899 -132 18 -483
2274d83J696r04j23N85j877J408k92P19L94m08l54l63J73j078L81J115l9P41k180
$$ -483 1213 309 186 771 -1106 302 10 729 1123 715 361 -2 171 -907 -526 589 550 1291 -889
2293h89J126j35Q7k64M49r39J245p19j566n39J205J312J128j156j85o6r47R16
$$ -889 237 102 189 -75 374 -565 680 -39 -1605 -2144 -939 373 1501 345 160 94 -853 63
2311F3o71J908n48k02q43o95n57O98J49Q77P71q99j57Jq83J64j11K98R65n38Q53
$$ 63 -608 1300 752 550 -293 -988 -1545 -847 -698 179 950 51 -106 -105 -988 -824 -935 -637 328 -210 643
2332F43j096j350P51Q03N40Q20nj309Q13j393J219j107K145p3p68J75p10k7j90
$$ 643 -453 -1803 -1052 -249 291 1111 1106 -203 610 -783 436 -671 1474 1401 633 808 98 71 -119
2351a19j91O34L45r9m61q52L68l29J66M78P50j88M09p15n04M19q34J56K64J780
$$ -119 -310 324 669 570 109 -743 -375 -704 -538 -60 690 502 911 196 -308 111 -723 -567 -303 1477
2371A477n84k10r44R3j58Q86m69P45l74n63p70J63k11J63P35P07k29n55n87O5
$$ 1477 893 683 -261 -168 -326 560 91 836 462 -101 -871 -708 -919 -756 -21 686 457 -98 -685 -620
2391f20L4k77J671N14L39j647j144r16J177L03Q66R45l74n10j008P0j2l86J735
$$ -620 -586 -863 808 1322 1661 14 -1130 -2046 -869 -566 300 1245 871 361 -647 -577 -589 -975 760
2410G60R83j724J43j127n45J355K94K47J550k120K50k312J004L30O92K640j853
$$ 760 1743 19 162 -965 -1510 -155 139 386 1936 -184 66 -2246 -1242 -912 -220 2420 567
2427E67M30j633n85m02J267J022m43J577j371m43j547M17J94O82J624m91r57L4
$$ 567 997 -636 -1221 -1623 -356 666 223 1800 429 -14 -1561 -1144 -950 -268 1356 865 -92 -58
2445e8j459Q34J74J503l88QO46k603R51j89P98k39O29J46k042N13l41J059L5O55
$$ -58 -1517 -683 -509 994 606 614 1260 -1343 -392 -581 217 -22 607 753 -1289 -776 -1117 -58 -23 632
2465F32O76j638P60j659J427L93m24P97r20L60j395J225l04J88K01o96J887j731
$$ 632 1308 -330 430 -1229 198 591 167 964 44 404 -991 234 -70 118 319 -377 1510 -221
2483b21r03N23K66L30k94K043j848k0k19m66Q14m09P74j10K76n82j105N57o11
$$ -221 -1124 -601 -335 -5 -299 1744 -104 -124 -343 -809 5 -404 370 260 536 -46 -1151 -594 -1205
2502a205J040P64K61N74j237j081L49j59J92K025N3j375R32j556K14p54R2K420
$$ -1205 -165 599 860 1434 197 -884 -535 -694 -502 1523 1576 201 1133 -423 -209 -963 -871 1549
2520A549o76O4j705p49M13J79K494n34J263k766R77j722K82J143Q82K40O4j046
$$ 1549 873 937 -768 -1517 -1104 -925 1569 1035 2298 -468 509 -1213 -931 212 1094 1334 1398 352
2538C52j160q70M17N94K809j095l08O9k407R6j45K285L24kK48r85j534L4P02O80
$$ 352 -808 -1678 -1261 -667 2142 1047 739 808 -1599 -1503 -1648 637 961 959 1207 222 -1312 -1278 -576 104
2558A04R94J43m71K16j586K1Q25k46J692j08q99j138j248N6l03K656j20Q78p18
$$ 104 1098 1241 770 986 -600 -579 246 0 1692 1584 685 -453 -1701 -1645 -1948 708 588 1466 748
2577G48n83j440J15J406j01R99j92n5j873p12J566Q9P50l73N29n77j520J733k796
$$ 748 165 -1275 -1160 246 145 1144 952 897 -976 -1688 -122 -33 717 344 873 296 -1224 509 -2287
2596b287J228J544L44o67m74l15L95l77Q02Q8J551j785j001O99k13j049J507L50
$$ -2287 -1059 485 829 162 -312 -627 -232 -609 193 281 1832 47 -954 -255 -468 -1517 -10 340
2614C40R62k80l38n61j851M60P80R31N1L37O75k729l91J129J58J316o46L22L47
$$ 340 1302 1022 684 123 -1728 -1268 -488 443 494 831 1506 -1223 -1614 -485 -327 989 343 665 1012
2633A012k589N95j243K678K5J306j580Q2j448L55N20q3J131P97j460l22r82L3
$$ 1012 -1577 -982 -2225 453 478 1784 204 286 -1162 -807 -287 -370 761 1558 98 -224 -1206 -1173
2651a173J77J161L63O52L33k917N61L31P85p1R27n37j124r87J331m09M6R69J13
$$ -1173 -996 165 528 1180 1513 -1404 -843 -512 273 202 1129 592 -532 -1519 -188 -597 -551 418 531
2670E31n73J73o57O58q72L33J196K98n08l59r66L83L03L51M50p76J297j549L46
$$ 531 -42 131 -526 132 -740 -407 789 1087 579 220 -746 -363 -60 291 741 -35 1262 -287 59
2689E9o31K9L06J17K097k337k54m75M68q3K19J264l12J031k485j64J66N28J269
$$ 59 -572 -543 -237 -120 1977 -360 -614 -1089 -621 -704 -485 779 467 1498 -987 -1151 -985 -457 812
2708H12k68P41j117J316j991j193J234R11J732j053o49p04m26q40L18K26K014
$$ 812 544 1285 168 1484 -507 -1700 -466 445 2177 1124 475 -229 -655 -1495 -1177 -951 1063
2725A063P48j278n03p72k3J097J1N61k04j257N08p28M11Q83j66P23P79j143j280
$$ 1063 1811 533 30 -742 -765 332 343 904 700 -557 -49 -777 -366 517 351 1074 1853 710 -570
2744e70p42J49M94J341P46p45j623K35q37O08M1J216P72j281O8j717L12R95M97
$$ -570 -1312 -1163 -669 672 1418 673 -950 -715 -1552 -944 -903 313 1085 -196 -128 -1845 -1533 -538 -41
2763d1J131N03n15j819p52K78Q28R17O75p96R4j470J08j018J611N85M82n62l24
$$ -41 1090 1593 1078 -741 -1493 -1215 -387 530 1205 409 503 -967 -859 -1877 -266 319 801 239 -85
2782h5q2j664J81J526N23M79R16j482j282N36n60P78Q98j4P54j689m88m27J157
$$ -85 -167 -1831 -1650 -124 399 878 1794 312 -970 -434 -994 -216 682 668 1422 -267 -755 -1182 -25
2801b5p56O82J216r23N74o47j652J006K64P52N32n32j89j447Q10N28m08N9Q00
$$ -25 -781 -99 1117 194 768 121 -1531 -525 -261 491 1023 491 302 -1145 -335 193 -215 -156 644
2820F44m42J01n91j02j96k9J699n1O31p77j547P86k230K353P53j729J714j317
$$ 644 202 303 -288 -390 -586 -615 1084 1033 1664 887 -660 126 -2104 249 1002 -727 987 -330
2838c30p04o18Q38P15N97L66M1o76j13k092K046j78J268l18o50l43j139J719n62
$$ -330 -1034 -1652 -814 -99 498 864 905 229 116 -1976 70 -108 1160 842 192 -151 -1290 429 -133
2857a33R77p36R99p57j094k75N60P35O38K45o03r13l52n13M38J222k3P19l44N69
$$ -133 844 108 1107 350 -744 -1019 -459 276 914 1159 556 -357 -709 -1222 -784 438 415 1134 790 1359
2877A359k251J308j765J445Q85j84n09j306P99K94J87N94n20M48q46P66j609P73
$$ 1359 -892 416 -1349 96 981 797 288 -1018 -219 75 262 856 336 784 -62 704 -905 -132
2895a32J218j446J790j468L54j036J34J065k84P58j264Q89j680J169k42J55J142
$$ -132 1086 -360 1430 -38 316 -720 -586 479 195 953 -311 578 -1102 67 -175 -20 1122
2912A122m29M33k160P33j35n83P02J99R3n55K30N72n84N85l83q31P63L12L55n92
$$ 1122 693 1126 -1034 -301 -436 -1019 -317 -118 -25 -580 -350 222 -362 223 -160 -991 -228 84 439 -153
2932a53L70j215k57J993j128M86q90K97J45o57J337j072J622K55j960m22J510
$$ -153 217 -998 -1255 738 -390 96 -794 -497 -352 -1009 328 -744 878 1133 -827 -1249 261
2949B61j004J051Q13o28l27L80m45l29l60N40J26J65m58L12l08n53R02o43N29
$$ 261 -743 308 1121 493 166 546 101 -228 -588 -48 78 243 -215 97 -211 -764 138 -505 24
2968B4R1j39l59R0Q87o24R18J44K04q72j007N74L94r97P9J161J162k062N72j237
$$ 24 115 -24 -383 -293 594 -30 888 1032 1236 364 -643 -69 325 -672 -593 568 1730 -332 240 -997
2988i97l69P82o00J747m70J072k086J98M44j47J642k54o04r26j44l74J0J410L97
$$ -997 -1366 -584 -1184 563 93 1165 -921 -723 -279 -426 1216 962 358 -568 -712 -1086 -1076 334 731
3007G31j45o00O2j109P70L94l7N63L17n47o21n81J274l84M65p62m84L70R9L81
$$ 731 586 -14 48 -1061 -291 103 66 629 946 399 -222 -803 471 87 552 -210 -694 -324 -225 156
3027A56m37K34K94n86N62q28J087l09R56q50m75J3K86mK2j77j039K42Q53J172
$$ 156 -281 -47 247 -339 223 -605 482 173 1129 279 -196 -183 103 99 121 -56 -1095 -853 0 1172
3047A172j193M13l30K76P7j41j03n5M47r08N76j70J076k014J12k95J057R96j991
$$ 1172 -21 392 62 338 415 274 171 116 563 -345 231 61 1137 -877 -765 -1060 -3 993 -998
3066i98Q20n69J09pP30L79K19Q99j545K2j180K83O60j75J460o28k88p50R9J107
$$ -998 -178 -747 -638 -645 85 464 683 1582 37 59 -1121 -838 -178 -353 1107 479 191 -559 -460 647
3086F47j291J081K64j81j8r71l47l24J951l07N11j25k27l73q42L48M12m33K66
$$ 647 -644 437 701 520 502 -469 -816 -1140 811 504 1015 890 663 290 -552 -204 208 -225 41
3105D1kP4J08o38K74q63P83J168n30j126J040J38j636J788q32J429q69r90M67
$$ 41 39 113 221 -417 -143 -1006 -223 945 415 -711 329 467 -1169 619 -213 1216 347 -643 -176
3124a76n43J546j035N14n48O83m37j62j218R64p6L77R22j087K23N31l79o69l08
$$ -176 -719 827 -208 306 -242 441 4 -158 -1376 -412 -488 -111 811 -276 -53 478 99 -570 -878
3143h78L86R38J90N35j694J119k096R71J148m57P3N62r32O07j551N98j19Q19Q89
$$ -878 -492 446 636 1171 -523 596 -1500 -529 619 162 235 797 -135 472 -1079 -481 -600 219 1108
3162A108j106j51N89j731J684P17J76m42m61j593J623r54O52l0M3J003j117M26
$$ 1108 2 -149 440 -1291 393 1110 1286 844 383 -1210 413 -541 111 81 124 1127 10 436
3180D36j183J401j105Q26J01m65o85o48j56J993O91l50m77o5q64n72Q60L77R08
$$ 436 -747 654 -451 375 476 11 -674 -1322 -1478 515 1206 856 379 314 -550 -1122 -262 115 1023
3199A023q01P01r69q08M88J9K80r8q4Q13j25p80L85L80k79K34j10o87j45q42L52
$$ 1023 222 923 -46 -854 -366 -347 -67 -165 -249 564 439 -341 44 424 145 379 269 -418 -563 -1405 -1053
3220a053O91O27J397j167j018n78K184k487J240J096m63J136k052J366j955O71
$$ -1053 -362 265 1662 495 -523 -1101 1083 -1404 -164 932 469 1605 -447 919 -1036 -365
3236c65m22P20M84n12k54o32J137j037R62o9m53O08L47k77j136L21m11J472M8
$$ -365 -787 -67 417 -95 -349 -981 156 -881 81 12 -441 167 514 237 -899 -578 -989 483 531
3255E31n15O88J93m76j42j461J490o75L03k61M10K95r32R96r17L07K21L18p99
$$ 531 16 704 897 421 279 -1182 308 -367 -64 -325 85 380 -552 444 -473 -166 55 373 -426
3274d26m08N35n79J270n40N60n77p30R05j336J029J90L85N44r18L43k054K101
$$ -426 -834 -299 -878 392 -148 412 -165 -895 10 -1326 -297 -107 278 822 -96 247 -1807 294
3292B94j01J047j672J57J072j805j11O65J164R70j206k77k018J724M92j48N21
$$ 294 193 1240 -432 -275 797 -1008 -1119 -454 710 1680 474 197 -1821 -97 395 247 768
3309G68l86J187j363o01l93J73J293j196K050j423q47m72J94J226m04L23M38q60
$$ 768 382 1569 206 -395 -788 -615 678 -518 1532 109 -738 -1210 -1016 210 -194 129 567 -293
3327b93L26r51J140n65O72N83p1R95k552L49k90N21r6L23J076k38n17M97k242
$$ -293 33 -918 222 -343 329 912 841 1836 -716 -367 -657 -136 -232 91 1167 929 412 909 -1333
3346a333J130n69P15K90m84N60q58K63q04J153n55K425q94j766Q93q14K23p53
$$ -1333 -203 -772 -57 233 -251 309 -549 -286 -1090 63 -492 1933 1039 -727 166 -648 -425 -1178
3364a178J606O4l01j76j608J472j44J011L27j197J009j912K12M94r1J533j861
$$ -1178 428 492 191 15 -1593 -121 -265 746 1073 -124 885 -1027 -815 -321 -412 1121 -740
3381g40K414k502P86o10K74J14L41O88j158Q58j409J284p57p58J173N81L40p96
$$ -740 1674 -828 -42 -652 -378 -264 77 765 -393 465 -944 340 -417 -1175 -2 579 919 123
3399A23l44m71m88M24J92R17k83M98o17m00J176j18q15J209j32j438J75K3j61
$$ 123 -221 -692 -1180 -756 -564 353 70 568 -49 -449 727 609 -206 1003 871 -567 -392 -369 -530
3418e30j77J336O50j228J5K54p12m98J193K54K02o67m08l72j015K381j595P95
$$ -530 -707 629 1279 51 66 320 -392 -890 303 557 759 92 -316 -688 -1703 678 -917 -122
3436a22O12P81j327m75P22q87J937q38N16o52m79k88K72L85n62k81O40M80J33
$$ -122 490 1271 -56 -531 191 -696 1241 403 919 267 -212 -500 -228 157 -405 -686 -46 434 567
3455E67j271J153j113R32j343K201l38k116J059j187J184M50J078r50o31P51m15
$$ 567 -704 449 -664 268 -1075 1126 788 -1328 -269 -1456 -272 178 1256 306 -325 426 11
3472A1j63o7J552m06j282J53J90o36P96j128L55K70k40n5L51j75P29P56J86o1
$$ 11 -152 -219 1333 927 -355 -202 -12 -648 148 -980 -625 -355 -595 -650 -299 -474 255 1011 1197 1136
3492A136q60r07l54k24N40J597p54N52Mj145m99M78N13k28Q22r42l14j25m41O00
$$ 1136 276 -631 -985 -1209 -669 928 174 726 730 -415 -914 -436 77 -151 671 -271 -585 -710 -1151 -551
3512e51J422O53j033K47q88J102j757R13J235j450R78j670k21l40R77K30K71Q1
$$ -551 871 1524 491 738 -150 952 -805 108 1343 -107 871 -799 -1020 -1360 -383 -153 118 199
3530A99j464J902j985N13J260p40l48Q46O09K03j12r65j355J852k55J068o97K8
$$ 199 -1265 637 -1348 -835 425 -315 -663 183 792 995 883 -82 -1437 415 160 1228 531 559
3548E59q76M75m78m5J847j808J424q99j234J042j037J934m72J83O79j351P24k224
$$ 559 -317 158 -320 -365 1482 -326 1098 199 -1035 7 -1030 904 432 615 1294 -57 667 -1557
3566a557J779J88K20p59M90p42J84J49p76R96L27K37j14L1p79O83q32j96Q50P12
$$ -1557 222 410 630 -129 361 -381 -197 -48 -824 172 499 736 622 653 -126 557 -275 -471 379 1091
3586A091o40o47Om39j123R62J387l89j26J396k659J164j212Q51o9J248k28n48
$$ 1091 451 -196 -190 -629 -1752 -790 597 208 82 1478 -1181 -17 -1229 -378 -447 801 573 25
3604B5J43o54j20O50O09K93r49J75o94N53q1o72J816r41N69r35P6q94K60J83N83
$$ 25 168 -486 -606 44 653 946 -3 172 -522 31 -50 -722 1094 153 722 -213 -137 -1031 -771 -588 -5
3625eJ027r80j14k64m1O84J33j279M18M57k48n1J57K5O43n28J11l37p40J119j366
$$ -5 1022 42 -72 -336 -377 307 440 -839 -421 36 -212 -263 -106 -81 562 34 145 -192 -932 187 -1179
3646a179J619l6o10L24o23R85O7n66N50k8k64K99O9j006J526j537q17J779J53
$$ -1179 440 404 -206 118 -505 480 547 -19 531 503 239 538 607 -399 1127 -410 -1227 552 705
3665G05q2j521L00P77j104Q48N07o17J341r47j714K015n21J87J293j214J07o68
$$ 705 623 -898 -598 179 -925 -77 430 -187 1154 207 -1507 508 -13 174 1467 253 360 -308
3683c08k77Q87p38J34M14N09m77m79O58o57N77m54p17K652r97j238L24J170j301
$$ -308 -585 302 -436 -302 112 621 144 -335 323 -334 243 -211 -928 1724 727 -511 -187 983 -318
3702c18K31M80M47j31j125p6n05J057Q80j253O40n04n42o03P78J307j317K176
$$ -318 -87 393 840 709 -416 -492 -997 60 940 -313 327 -177 -719 -1322 -544 763 -554 1622
3720A622l190K160m14j640K116j078J609j342L27O5o16Q44r76R54K51j33r43k50
$$ 1622 -1568 592 178 -1462 654 -424 1185 -157 170 235 -381 463 -513 441 692 559 -384 -634
3738f34N30r02J573j088Q41k50J70m89J321r02q93P65M06J42j477J86P1M12Q03
$$ -634 -104 -1006 567 -521 320 70 240 -249 1072 170 -723 42 448 590 -887 -701 -630 -218 585
3757E85L82j035J478j095k56j44o96J375o20O34n59R04J3j432j55N50M93o17L29
$$ 585 967 -68 1410 315 59 -85 -781 594 -26 608 49 953 966 -466 -621 -71 422 -195 134
3776A34r08P23k04O23M71j195L77q6k13J11k88L46l65K36J41M46j138m90J221
$$ 134 -774 -51 -255 368 839 -356 21 -65 -278 -167 -455 -109 -474 -238 -97 349 -789 -1279 -58
3795e8l06q55N33j59K545j834R42j577N19P96L0P45j994J112j113M02K80k44R88
$$ -58 -364 -1219 -686 -845 1700 -134 808 -769 -250 546 576 1321 -673 439 -674 -272 8 -236 752
3814G52j343O97j031m21J455M98q60Q14r65L03p06Q79r52Q11O80Q53j453M29j022
$$ 752 -591 106 -925 -1346 109 607 -253 561 -404 -101 -807 72 -880 -69 611 1464 11 440 -582
3833e82j06J643n02k93O5K87j96k08O13j669J363J35n67M92j596n10O33J152O00
$$ -582 -688 955 453 160 225 512 316 108 721 -948 415 550 -17 475 -1121 -1631 -998 154 754
3852G54n16N2N12q13n47Q44k75k05R19q67J020j209j76R85N35j16n2j58K24m7
$$ 754 238 290 802 -11 -558 286 11 -194 725 -142 878 -331 -507 478 1013 897 845 687 911 864
3872H64k81r90j27N93P55l22j23J60j297M93P6O06J034j643K51o41O72j631J504
$$ 864 583 -407 -534 59 814 492 369 529 -768 -275 -199 407 1441 -202 49 -592 80 -1551 -47
3891d7o23j98K214j981J152l07n37Q16j148R97L04K92j097l80K21j31O72l74R03
$$ -47 -670 -868 1346 -635 517 210 -327 489 -659 338 642 934 -163 -543 -322 -453 219 -155 748
3910G48J44k438J488l1n73J764k97l45j6l4j032K96n55J883l98m54P53j587n22
$$ 748 892 -1546 -58 -89 -662 1102 805 460 444 410 -622 -326 -881 1002 604 150 903 -684 -1206
3929a206P22J86k54j8Q38L13K04o17j343r8mJ204m48K3M25L4r93Q40K42Q37p39
$$ -1206 -484 -298 -552 -570 268 581 785 168 -1175 -1273 -1277 -73 -521 -498 -73 -39 -1032 -192 50 887 148
3950A48k89M36P58j601J356p35j39R1N0m4J21l31j64N88j08K99J08j723J217k34
$$ 148 -141 295 1053 -548 808 73 -66 25 75 31 152 -179 -343 245 137 436 544 -1179 38 -196
3970a96n56R07j68O42n29j21jj001J807q99K87j211J415O5l19m57J56K96p24N79
$$ -196 -752 155 -13 629 100 -21 -22 -1023 784 -115 172 -1039 376 441 122 -335 -179 117 -607 -28
3990b8j8q1J42r18J072J85P14q40k4K16q60Q07o32N96q79J78J01K56K33j016J44
$$ -28 -46 -127 15 -903 169 354 1068 228 204 420 -440 367 -265 331 -548 -370 -269 -13 220 -796 -652
4011f52O95l92O94n75O18n49K04l25J306m17q82M94p46l39k01J549j302O01Q42
$$ -652 43 -349 345 -230 388 -161 43 -282 1024 607 -275 219 -527 -866 -1067 482 -820 -219 623
4030F23j566Q28n6j007J157N02N31p31p18K24j11J886j234Q90j407o29J395j313
$$ 623 -943 -115 -171 -1178 -21 481 1012 281 -437 -213 -324 1562 328 1218 -189 -818 577 -736
4048g36o90O78J612q49l19k09n07J352n89J254q62L99L07p38K09j195J708j233
$$ -736 -1426 -748 864 15 -304 -513 -1020 332 -257 997 135 534 841 103 312 -883 825 -408
4066d08j41M21q6r78J341q36R19J4L56r86Q51j041K39M92j490J800n08M24r33
$$ -408 -549 -128 -214 -1192 149 -687 232 246 602 -384 467 -574 -335 157 -1333 467 -41 383 -550
4085e50J070k86J29k05p5p08Q67p83N24n03Q05k41k04M7M10L06M0L79j527l81
$$ -550 520 234 363 158 83 -625 242 -541 -17 -520 285 44 -160 -113 297 603 643 1022 -505 -886
4105h86j007J204J15J400j62k95k07o75K36p5P90K86n84l43l84O70m35M6P91j279
$$ -886 -1893 -689 -574 826 664 369 162 -513 -277 -352 438 724 140 -203 -587 83 -352 -306 485 -794
4125g94Q11J061m61j928N48N76k8P86l87r95O63K53q3j17P98K05j440J008l46
$$ -794 17 1078 617 -1311 -763 -187 -215 571 184 -811 -148 105 22 -95 703 908 -532 476 130
4144A30k75qM63q51r5P82p11N37L68r97J690m03o97J69J58L83m30R5L16M95k522
$$ 130 -145 -153 310 -541 -636 146 -565 -28 340 -657 1033 630 -67 102 260 643 213 308 624 1119 -1403
4165a403O49O23o6J405j768R48N66p99l90q64K456j698J43J079m29o63J11m74
$$ -1403 -754 -131 -197 1208 -560 388 954 155 -235 -1099 1357 -341 -198 881 452 -211 -100 -574
4183e74P82p30O10R97j253p28N06o04K345j161j53J65k59M43j582J239j232J385
$$ -574 208 -522 88 1085 -168 -896 -390 -994 1351 190 37 202 -57 386 -1196 43 -1189 196
4201A96l31M04o73J248J57j124p64J810k07j046M97L24j651K67o5O69L54N4K33
$$ 196 -135 269 -404 844 1001 -123 -887 923 716 -330 167 491 -1160 -893 -958 -289 65 119 352
4220C52l88j246J172k32Q55J68r87J35K55k85n09N58N89Ml79p44Q13o04L60Q18
$$ 352 -36 -1282 -110 -342 513 681 -306 -171 84 -201 -710 -152 437 441 62 -682 131 -473 -113 705
4240G05K44j438M42R92j451N94j76L70K19o88M56o30K74kj185O45N69J254j836
$$ 705 949 -489 -47 945 -506 88 -88 282 501 -187 269 -361 -87 -89 -1274 -629 -60 1194 -642
4259f42J010k005J246P34j919J895o78J447j732j21J699j676J565k63O2l65j840
$$ -642 368 -1637 -391 343 -1576 319 -359 1088 -644 -765 934 -742 823 560 622 257 -1583
4276a583J283m67O29n81Q35o20M38o48O69n89J10R80L48j205L18j130O47O90k05
$$ -1583 -300 -767 -138 -719 116 -504 -66 -714 -45 -634 -524 456 804 -401 -83 -1213 -566 124 -81
4295h1K62K29J078j377O60j883M79J036k30k59J207o2j137L79j408R06J272o49
$$ -81 181 410 1488 111 771 -1112 -633 403 173 -86 1121 1059 -78 301 -1107 -201 1071 422
4313D22m75N3m61R73n45k05J042j35M14j199J21j049M63K23J340O0q62p02o62
$$ 422 -53 0 -461 512 -33 -238 804 669 1083 -116 5 -1044 -581 -358 982 1042 180 -522 -1184
4332a184J410n09N98j94r73K286j106q99N72O28J869k700K359j182q07M0j61L74
$$ -1184 226 -283 315 121 -852 1434 328 -571 1 629 2498 -202 2157 975 168 208 47 421
4350D21r3K60M9o41l38q04K269j418J194k7M04o71j946J950j347J049n67R01r00
$$ 421 328 588 637 -4 -342 -1146 1123 -295 899 872 1276 605 -1341 609 -738 311 -256 645 -255
4369b55m45m54Q51l13N21N00P82r58j81n98k40m60J391L21j26n43M53r84J89N72
$$ -255 -700 -1154 -303 -616 -95 405 1187 229 48 -550 -790 -1250 141 462 336 -207 246 -738 -549 23
4389B3o56J527j15J69p04q09r82M52J578L53j555R20r69O72p27J996j161K9k12
$$ 23 -633 894 779 948 244 -565 -1547 -1095 483 836 -719 201 -768 -96 -823 1173 12 41 -171
4408a71P42o54k88M8k4M96q3P63j291Kl19J405j20j634J171n9M55j109N4O14M26
$$ -171 571 -83 -371 -323 -347 149 66 829 -462 -460 -779 626 506 -1128 43 -16 439 -670 -616 -2 424
4429D24M18m34Q21q31k90n12r3Q70n30L44l48P06J33j268O78j90J172j783N35
$$ 424 842 408 1229 398 108 -404 -497 373 -157 187 -161 545 678 -590 88 -102 1070 -713 -178
4448a78N90kj081LJ10N9K009r28M18j192M1K60K01j32O63j42K4j401M00j87k72
$$ -178 412 410 -671 -668 -558 -499 1510 582 1000 -192 -151 109 310 178 841 699 723 -678 -278 -465 -737
4469g37J755n82m31j39O65k297J602n55J770j101k56J78M50j030J215k08Q01q76
$$ -737 1018 436 5 -134 531 -1766 -164 -719 1051 -50 -306 -128 322 -708 507 299 1100 224
4487B24M44j271r29Q51K42M85K25%m58J20j24K31Q7l48P71j287k38J004n73J447
$$ 224 668 -603 -1532 -681 -439 46 271 271 -187 -67 -191 40 127 -221 550 -737 -975 29 -544 903
4507I03j503P42r77M26J05K6J366j659P26j124J108R63j621j86l7N17kM1J301
$$ 903 -600 142 -835 -409 -304 -278 1088 -571 155 -969 139 1102 -519 -705 -742 -225 -227 -186 1115
4526A115k518J396M73K00m03n97J180j969P17R3J100j275M94Q06j524J489m74
$$ 1115 -1403 -7 466 666 263 -334 846 -1123 -406 -313 787 -488 6 812 -712 777 303
4543C03j560J891j281J443j419Q96l02Q11j154L2J414k144J659r41J294j727n81
$$ 303 -1257 634 -647 796 -623 273 -29 782 -372 -340 1074 -1070 589 -352 942 -785 -1366
4560a366J568j122P26J497j402N75k15n86p82J162j658J369P35k6M14l15m22j151
$$ -1366 202 -920 -194 1303 -99 476 261 -325 -1107 55 -1603 -234 501 475 889 574 152 -999
4578i99J294M18K35q3j269l35Q73k77N04o42J256j19j735K75j61L44l19P66J012
$$ -999 295 713 948 865 -404 -739 134 -143 361 -281 975 856 -879 -604 -765 -421 -740 26 1038
4597A038l99p15r74J295j26J333o57j420O66n24K7J339l17l26k3R93j343m1n59
$$ 1038 639 -76 -1050 245 119 1452 795 -625 41 -483 -456 883 566 240 217 1210 -133 -174 -733
4616g33M76L74o89P11m47Q02l14L11r67Q56j92p69O10K31K28j4j136P75K55r2
$$ -733 -257 117 -572 139 -308 494 180 491 -476 380 188 -581 29 260 488 474 -662 113 368 276
4636B76o47N38j61k22M92n71J037m58L3m34q3k11J122l1j49p66j40j29k4l04R52
$$ 276 -371 167 6 -216 276 -295 742 284 317 -117 -200 -411 711 680 531 -235 -375 -504 -528 -832 120
4657A20K5L30L53j087O75r84o19O08M23J066j428P56q31P52q40N33q39J189O9
$$ 120 145 475 828 -259 416 -568 -1187 -579 -156 910 -518 238 -593 159 -681 -148 -987 202 271
4676B71K90j339P29j419J148J433r85Q7l59L3n13R01o28M35O97m39j00m76q70
$$ 271 561 -778 -49 -1468 -320 1113 128 215 -144 -111 -624 277 -351 84 781 342 242 -234 -1104
4695a104J605p41O31M04m64l42l5J86n97J073k60k01l92M39j174M32J183n64n32
$$ -1104 501 -240 391 795 331 -11 -46 140 -457 616 356 155 -237 202 -972 -540 643 79 -453
4714d53m28K015k09q01o82o5K290k286R47k70k53M31q03O36q35J335n49L46j008
$$ -453 -881 1134 925 124 -558 -623 1667 -619 328 58 -195 236 -567 69 -766 569 20 366 -642
4733f42j99Q31k18O28l01j75L36m33n46M66J927j619J43Qj070N43P3J168j245
$$ -642 -841 -10 -228 400 99 -76 260 -173 -719 -253 1674 55 198 206 -864 -321 -248 920 -325
4752c25n7J171j153K25J924j836q1N89J2q15P92j37n14k56N87o48J344j229L05
$$ -325 -382 789 -364 -139 1785 -51 -132 457 469 -346 446 309 -205 -461 126 -522 822 -407 -102
4771a02l8J019j06n61j02o49L95j79O23l69L48k14N60k72k39L59j354R78j62m67
$$ -102 -140 879 773 212 110 -539 -144 -323 300 -69 279 65 625 353 114 473 -881 97 -65 -532
4791e32N57j079R16p11L76m5J319j223M84l9j02J310j098k3P35j357K73k14J042
$$ -532 25 -1054 -138 -849 -473 -518 801 -422 62 23 -79 1231 133 110 845 -512 -239 -453 589
4810E89k68l09p34J168m89p2R8k82N83k6Q5R41k211J240j51j242Q90p51J815j138
$$ 589 321 12 -722 446 -43 -115 -17 -299 284 258 343 1284 -927 313 162 -1080 -190 -941 874 -264
4830b64K42L69p81Q62j708J884j509P07N51n50J327m46M39n84m99O37r69R30j502
$$ -264 -22 347 -434 428 -1280 604 -905 -198 353 -197 1130 684 1123 539 40 677 -292 638 -864
4849h64N75m76J349k56O28m60j82L69q29J48j57J83L20o04L89j40P1K57N1L91
$$ -864 -289 -765 584 328 956 496 314 683 -146 2 -155 28 348 -256 133 -7 64 321 372 763
4869G63k286J794q11M72m42k36J370j653J251r82k71L31J64J342j570J302k09
$$ 763 -1523 271 -540 -68 -510 -746 624 -1029 222 -760 -1031 -700 -536 806 -764 538 329
4886C29r91J056m80K25m44N09l64O49L15j208J295j446J174r20k79M67j72J218
$$ 329 -662 394 -86 139 -305 204 -160 489 804 -404 891 -555 619 -301 -580 -113 -285 933
4904I33m85K21k27l65m70n8J352j406J941j923l78J236j277J600j180P07l80J146
$$ 933 448 669 442 77 -393 -451 901 -505 1436 -487 -865 371 -906 694 -486 221 -159 987
4922I87j162j05j04L35o36K13K34L23O33j26o26l60k31M57L81o55K6k45P69k10
$$ 987 -175 -280 -384 -49 -685 -472 -238 85 718 592 -34 -394 -625 -168 213 -442 -416 -661 108 -102
4942a02O86m86k39P1q5n37P8R84K92L6p45j2o22O43K59l85o56J475q58O94j074
$$ -102 584 98 -141 -70 -155 -692 -614 370 662 698 -47 -59 -681 -38 221 -164 -820 655 -203 491 -583
4963e83r3J442k603J386L34k36%j14P43j113L68R04n52J173p67l32q39M32J215
$$ -583 -676 766 -1837 -451 -117 -353 -353 -467 276 -837 -469 435 -117 1056 289 -43 -882 -450 765
4982G65j357J287j43m91l75L27J300j855L84M36J134j862J19j409R88J332L9J19
$$ 765 -592 695 552 61 -314 13 1313 -542 -158 278 1412 -450 -331 -1740 -752 580 619 738
5000G38o54o61Q45o3K2j154K032m37j938N99Q93M78r58N05L83o72nl38K73n23
$$ 738 84 -577 268 205 227 -927 1105 668 -1270 -671 222 700 -258 247 630 -42 -47 -385 -112 -635
5020f35J353L81o62m87j38l03J24R39o42M51q96N51J057j623Q45q55N73n18n0
$$ -635 718 1099 437 -50 -188 -491 -367 572 -70 381 -515 36 1093 -530 315 -540 33 -485 -535
5039e35J037o08K18J2n02R26M11j098J473j283L88j020N12K17K32q4r31K39M17
$$ -535 502 -106 112 124 -378 548 959 -139 1334 51 439 -581 -69 148 380 296 -635 -396 21
5058B1o5o51J44P28k80J021q64N74n42l32l42n89J389J65K35q89l35Q34n32K163
$$ 21 -44 -695 -551 177 -103 918 54 628 86 -246 -588 -1177 212 377 612 -277 -612 222 -310 1853
5078A853k001O43k7r06J267j131M97n98Q09n32l25P05j835J828k28K21R5k07J25
$$ 1853 -148 495 468 -438 829 -302 195 -403 406 -126 -451 254 -1581 247 19 240 335 128 253
5097B53r7j44Q5R14o42r50P57M0j65p58q2P51L70n63j029K172j176P56J50j90
$$ 253 156 12 97 1011 369 -581 176 216 51 -707 -789 -38 332 -231 -1260 912 -264 492 642 452
5117D52j188k0N12k31M80p20J110j010l70Q13J329p97L38n90r5K74N93o60M6j26
$$ 452 -736 -756 -244 -475 5 -715 395 -615 -985 -172 1157 360 698 108 13 287 880 220 266 140
5137A40J497m15j933J252m50K45o44K55K43o21O14j82R1k95l26J227m58l7K05
$$ 140 1637 1222 -711 541 91 336 -308 -53 190 -431 183 1 92 -203 -529 698 240 203 408
5156D08l94l57p18K816j517q02N47n38J58K46K96L27j92q84J12M93l05J145j389
$$ 408 14 -343 -1061 1755 238 -564 -17 -555 -397 -151 145 472 280 -604 -492 1 -304 841 -548
5175e48J456o33n09J04j112J630r55P9K42O69j041J87M53q91J322p70O95l37j136
$$ -548 908 275 -234 -130 -1242 388 -567 -488 -246 423 -618 -431 22 -869 453 -317 378 41 -1095
5194a095J118K11r56L52j129J980k37j000R02m15j51j39J258j124J25k41L62l51
$$ -1095 23 234 -722 -370 -1499 481 244 -756 146 -269 -420 -559 699 -425 -300 -541 -179 -530
5212e30k3R67Qj17j94r56J295q82J034jO59o64j090O97j516J258K78l41q7m80
$$ -530 -553 414 422 305 111 -845 450 -432 602 601 1260 596 -494 203 -1313 -55 223 -118 -205 -685
5232f85Q36L64p7M85n25r70O88p6kM24r42n16J741j012J114o63l06q02Q78J107
$$ -685 151 515 438 923 398 -572 116 40 38 462 -480 -996 745 -267 847 184 -122 -924 -46 1061
5252A061m68j69L06j86m03r34J951j847J531j090Q15l46p29J319j742J974n03
$$ 1061 593 424 730 544 141 -793 1158 -689 842 -248 567 221 -508 811 -931 1043 540
5269E40n67J87m64M60k18n7n47K36Q80n11K32j458P70q7P65j39O9P85j817J508
$$ 540 -27 160 -304 156 -62 -119 -666 -430 450 -61 171 -1287 -517 -604 161 22 91 876 -941 567
5289E67n41N11l23k71M15r24k61J00P35P35k03j80j668J023j13O2j8k08Q03o0
$$ 567 26 537 214 -57 358 -566 -827 -727 8 743 540 360 -1308 -285 -398 -336 -354 -562 241 181
5309A81l24O63r29N21K12o65M41l06n82L37J3K28Q99o77M65K31o37N3n21K37m31
$$ 181 -143 520 -409 112 324 -341 100 -206 -788 -451 -438 -210 689 12 477 708 71 124 -397 -160 -591
5330e91J093J99j011J342k074J251R71j208P08k47L73j329m6J090p45J22Q63q45
$$ -591 502 701 -310 1032 -1042 209 1180 -28 680 433 806 -523 -569 521 -224 -102 761 -84
5348h4j639J258K22k6O72j308J461n85K68j23r79J537j754K023r90k61j76P41
$$ -84 -1723 -465 -243 -269 403 -905 556 -29 239 116 -863 674 -1080 943 -47 -308 -484 257
5366B57r67L12J258k241J309J372j112N02r16J12R8n52N22p99O97m01N89m91J657
$$ 257 -710 -398 860 -1381 -72 1300 188 690 -226 -114 -16 -568 -46 -845 -148 -549 40 -451 1206
5385A206j962J368j94k61n44M98j65J67m84M07k71j187J319k51k17N64n71P08
$$ 1206 -756 612 418 157 -387 111 -54 113 -371 36 -235 -1422 -103 -354 -571 -7 -578 130
5403A30M05K45j279l38J267O60k38k8q36p88R40p04N21r4K60n46M97r77Q80o55
$$ 130 535 780 -499 -837 430 1090 852 824 -12 -800 140 -564 -43 -137 123 -423 74 -903 -23 -678
5423f78Q79m12k28L93m9N22j301O41M0J202j189N12m38P77p86N14M80q55l28k32
$$ -678 201 -211 -439 -46 -95 427 -874 -233 -193 1009 -180 332 -106 671 -115 399 879 24 -304 -536
5443e36R65j400R12P77j764J951l94p60M86M5p47N22J5J1J81J35k1m68o99J317
$$ -536 429 -971 -59 718 -1046 905 511 -249 237 282 -465 57 72 83 264 399 378 -90 -789 528
5463E28q35R0o4l49K39p89J880j102k71J965j105n56j118J501m31j33N8k31J941
$$ 528 -307 -217 -281 -630 -391 -1180 700 -402 -673 1292 187 -369 -1487 14 -417 -550 -492 -723 1218
5482A218j781L4N98m4P3r32J466n53n61Q19j071R9j38L14O49l5m0p02J667r94
$$ 1218 -563 -529 69 25 98 -834 632 79 -482 337 -734 -635 -773 -459 190 155 115 -587 1080 86
5502H6l51K61k50J008l30p50K85n11P46o29J193j019M01p68J60K54k1J266j011
$$ 86 -265 -4 -254 754 424 -326 -41 -552 194 -435 758 -261 140 -628 -468 -214 -235 1031 20
5521B0P02q09M84l74N21q49J49N19N9K32p33l75O19r96O93K83J12q3n28J250j413
$$ 20 722 -87 397 23 544 -305 -156 363 422 654 -79 -454 165 -831 -138 145 257 174 -354 896 -517
5542e17Q55n41O88k69j091J626N1n11j69R3K1j424J554j203J015j020P08P07r66
$$ -517 338 -203 485 216 -875 751 802 291 122 215 236 -1188 366 -837 178 -842 -134 573 -393
5561c93J220j254J023n14J01p66J140M59j409R94j783R04p69R89o8n81L61l24
$$ -393 827 -427 596 82 183 -583 557 1016 -393 601 -1182 -278 -1047 -58 -126 -707 -346 -670
5579f70K56P68p52j50L34M05J80l29K82j162P28O35j051N06p10J86J553r0j386
$$ -670 -414 354 -398 -548 -214 191 371 42 324 -838 -110 525 -526 -20 -730 -544 1009 919 -467
5598d67N58O57j413J961j744J151n43q55J140j114P30j3j11k08M58q5m13J385
$$ -467 91 748 -665 1296 -448 703 160 -695 445 -669 61 48 -63 -271 187 102 -311 1074
5616A074o68M62j635M74J084L86j119k37M18rj52R8j65J44o97r2J78j46J815j162
$$ 1074 406 868 -767 -293 791 1177 58 -179 239 230 78 176 11 155 -542 -634 -456 -602 1213 51
5636E1K60n67M10n74J120m02j988K329k68k06o87k75J057J03k24l61J365j203
$$ 51 311 -256 154 -420 700 298 -1690 639 371 165 -522 -797 260 363 139 -222 1143 -60
5654f0M46m95j71j47n6J375j410L13J758j893K18J055j486O42J4j65M49o63Q98
$$ -60 386 -109 -280 -427 -483 892 -518 -205 1553 -340 -122 933 -553 89 103 -62 387 -276 622
5673F22l16L90j068J689pp82j457N85J307n37r19Q97K60j611L79k52M3J41P53
$$ 622 306 696 -372 1317 1310 528 -929 -344 963 426 -493 404 664 -947 -568 -820 -777 -636 117
5692A17j47J29n8L57j608J048M82P97j205L8J48q51J120k24K53j95m14P61j323
$$ 117 -30 99 41 398 -1210 -162 320 1117 -88 -50 98 -753 367 143 396 201 -213 548 -775
5711g75O87M58p73J738j827O29o66M48Q01l73j74K22j79q64Q54L53q31K87nP73
$$ -775 -88 370 -403 1335 -492 137 -529 -81 720 347 173 395 216 -648 206 559 -272 15 10 783
5731G83r71q25J704j42r95O95j91j10m44M36l02J238m32J73j285J249p37n42J289
$$ 783 -188 -1013 691 549 -446 249 58 -52 -496 -60 -362 876 444 617 -668 581 -156 -698 591
5750E91j616J733j440P20l85q95K77N27J767j951J73j77N00N17p0n33l23L56k36
$$ 591 -1025 708 -732 -12 -397 -1292 -1015 -488 1279 -672 -499 -676 -176 341 271 -262 -585 -229 -465
5769d65K91J27M56j07n96O03j105l66j32P73O43m7J38l63Q50q00p9Q52m78l72
$$ -465 -174 -47 409 302 -294 309 -796 -1162 -1294 -521 122 75 213 -150 700 -100 -179 673 195 -177
5789a77J170j725N41J63M13J268k006J428l28L98j572j74Q54L6n24j64M24K96
$$ -177 993 -732 -191 -28 385 1653 -353 1075 747 1145 -427 -601 253 289 -235 -399 25 321
5807C21j001m89Q53M58L54o18N38N00l53ro9j805J721l25R66o88j483J119K41
$$ 321 -680 -1169 -316 142 496 -122 416 916 563 554 485 -1320 401 76 1042 354 -1129 -10 231
5826B31j058J56J312n01j55N48n77K30n3N1l88J134K38k344R58m83P60K40p52
$$ 231 -827 -671 641 140 -15 533 -44 186 133 184 -204 930 1168 -1176 -218 -701 59 299 -453
5845d53P35K8j54K68m3J044j692O30k78M37n90r0J84j72j210J741L47l71Pj042
$$ -453 282 310 156 424 381 1425 -267 363 85 522 -68 -158 26 -146 -1356 385 732 361 368 -674
5865f74O38j184N38N93J589j897J349o08l97k84K30Q48n73K82q84O30m63K86O8
$$ -674 -36 -1220 -682 -89 1500 -397 952 344 -53 -337 -107 741 168 450 -434 196 -267 19 87
5884H7j39L34j361O85N76K78L75j901J918j344P02k24p93J024o09J399o02p22
$$ 87 -52 282 -1079 -394 182 460 835 -1066 852 -492 210 -14 -807 217 -392 1007 405 -317
5902c17r1j88J022j343J677q46N71o54M30n76l12j43O21K48j63O44J187k612P61
$$ -317 -408 -596 426 -917 760 -86 485 -169 261 -315 -627 -770 -149 99 -64 580 1767 -845 -84
5921h4n05K30R33k88N29p53K64m85n5m62Q88q14O27J010j130J089K32j792Q92
$$ -84 -589 -359 574 286 815 62 326 -159 -214 -676 212 -602 25 1035 -95 994 1226 -566 326
5940C26n69l43k92R47l39R70r31j86L78l02O37K05p06O36j21J48M09k96M92j240
$$ 326 -243 -586 -878 69 -270 700 -231 -417 -39 -341 296 501 -205 431 310 458 867 571 1063 -177
5960a77L57p9n39P16o27J69K77o31Q03K02p94L31N99r21Q02j186N24q4Q8P30j105
$$ -177 180 101 -438 278 -349 -180 97 -534 269 471 -323 8 607 -314 488 -698 -174 -258 -170 560 -545
5981e45P32n89l59J219l59R0m58O12M21m17j008J391L22k250K234L25j153p69
$$ -545 187 -402 -761 458 99 189 -269 343 764 347 -661 730 1052 -1198 1036 1361 208 -561
5999e61O37m30k91P24L5j040J206k4l78j026J303n69M46l45Q1J26J65M28J067
$$ -561 76 -354 -645 79 114 -926 280 256 -122 -1148 155 -414 32 -313 -232 -106 59 487 1554
6018A554j764M90r79J807j902L66l53J013O5j203O00n48J542o0m25Q07k039J695
$$ 1554 -210 280 -699 1108 -794 -428 -781 232 297 -906 -306 -854 688 628 203 1010 -1029 666
6036F66K02l15P54k46j092m35Q27n34m59R02L36r72J65J207p53m03j85l84Q69
$$ 666 868 553 1307 1061 -31 -466 361 -173 -632 270 606 -366 -201 1006 253 -150 -335 -719 150
6055A50K47j0n10Q0K46j3L56p69M98j312O51J210j481Q37j105O66J837j644R71
$$ 150 397 387 -123 -43 203 190 546 -223 275 -1037 -386 824 -657 180 -925 -259 1578 -66 905
6074I05l81K28q70PP88q95j30k47L62n55L22M66j245J136j06N87k61n28P37j434
$$ 905 524 752 -118 -111 677 -218 -348 -595 -233 -788 -466 0 -1245 -109 -215 372 111 -417 320 -1114
6094a114K057j155J47P38q02K21r19J067l51J442l03r27k86M31k22j465J430m38
$$ -1114 943 -212 -65 673 -129 92 -827 240 -111 1331 1028 101 -185 246 24 -1441 -11 -449
6112d49K2P97k31M80j036M05J74L14j21q15L95n3J27j82J27j46M5O35J52n07l98
$$ -449 -427 370 139 619 -417 -12 162 476 355 -460 -65 -118 9 -173 -46 -192 -147 488 640 133 -265
6133b65R8q87J410m7q35J229k22j028K84P7M53J070k130J180o83o47N31N37p28
$$ -265 -167 -1054 356 309 -526 703 481 -547 -263 -186 267 1337 -793 387 -296 -943 -412 125 -603
6152f03N56P22o24N30q98k73R88K15k82J6j95k3j098R93j00R00m39j3o83k64J71
$$ -603 -47 675 51 581 -317 -590 398 613 331 347 152 129 -969 24 -76 824 385 372 -311 -575 -404
6173d04j09P24k79M88K4o37P71j505J601j348J072m14J91L78j867J695l87J57
$$ -404 -513 211 -68 420 444 -193 578 -927 674 -674 398 -16 175 553 -1314 381 -6 151
6191A51np23J066q02Q62j708K049j419M37Q18j096K73j098J958j968J395n27M90
$$ 151 146 -577 489 -313 549 -1159 890 -529 -92 726 -370 -97 -1195 763 -1205 190 -337 153
6209A53J20L55k332P09L66j58M28J102r16j454J710p30Q4N61p7K44k96R18j180
$$ 153 273 628 -1704 -995 -629 -787 -359 743 -173 -1627 83 -647 -563 -2 -79 165 -131 787 -393
6228c93J16K21l91M79P5k21q82R17k37R86j219J35Q31j111L47m47P78N01p30J13
$$ -393 -277 -56 -447 32 107 -114 -996 -79 -316 670 -549 -414 417 -694 -347 -794 -16 485 -245 -132
6248a32O2N19j193J703q44p08J482r80j15N9J54R26j520Q98k20P17p21j63j373
$$ -132 -70 449 -744 959 115 -593 889 -91 -206 -147 7 933 -587 311 91 808 87 -76 -1449
6267a449J042N87j84J336k106J97L25k29N02k14Q15r49M35N38p00J34p28J310
$$ -1449 -407 180 -4 1332 -774 -577 -252 -481 21 -193 622 -327 108 646 -54 80 -648 662
6285F62j520J633J28o95j26j240J667P11j916J185q31N1j21l91K97J90L20R0Q0
$$ 662 -858 775 903 208 82 -1158 509 1220 -696 489 -342 -291 -412 -803 -506 -316 4 94 174
6304A74J290j179n46J395j157M02k54n32L87M39m26m77r7R89n99l7n2m17J534
$$ 174 1464 285 -261 1134 -23 379 125 -407 -20 419 -7 -484 -581 408 -191 -228 -280 -697 837
6323H37k012J131K29q4N80k096J810q82R25j3n19J712j463jj735N56Q43Q9J261
$$ 837 -1175 -44 185 101 681 -1415 395 -487 438 425 -94 1618 155 154 -1581 -1025 -182 -93 1168
6342A168j882Q37k4j031J487o16R67j361P33J40k72Q8j754J291r01J438j64r06
$$ 1168 -714 123 99 -932 555 -61 906 -455 278 418 146 234 -1520 -229 -1130 308 144 -762
6360g62R05j8J12o14L79q40Q07R73j276J056p69m96L86K99l27m6P07j267R45p38
$$ -762 143 125 237 -377 2 -838 -31 942 -334 722 -47 -543 -157 142 -185 -231 476 -791 154 -584
6380e84J397j316j94j66k88R00N96M81m16L33j36p38L20P71l98j076m6J974j140
$$ -584 813 -503 -697 -863 -1151 -251 345 826 410 743 607 -131 189 960 562 -514 -560 1414 274
6399B74J44m68L82j017K56l24J177J26o53N17j59K8k39n1k56m70o1J294J93j037
$$ 274 418 -50 332 -685 -429 -753 424 550 -103 414 255 283 44 -7 -263 -733 -794 500 693 -344
6419c44Q68Q31j402N59m22R35j346L10L80J7j031J611k104J59J138M40k74j045
$$ -344 524 1355 -47 512 90 1025 -321 -11 369 386 -645 966 -1138 -979 159 599 325 -720
6437g20R84q28J4J210j235O86p40O62ln48p2k00K368k369J103j51P38j707m44
$$ -720 264 -564 -550 660 -575 111 -629 33 30 -518 -590 -790 1578 -791 312 161 899 -808 -1252
6456a252J433p04J061O17l60j265l3O94K3k64o94J135K92q77N75j153J296L3J66
$$ -1252 181 -523 538 1155 795 -470 -503 191 214 -50 -744 391 683 -194 381 -772 524 557 723
6475G23j200j75J388j578J165o83k8J087j378J035o42O41l75k13K33j90K40l13
$$ 723 -477 -652 736 -842 323 -360 -388 699 -679 356 -286 355 -20 -233 0 -190 50 -263
6493b63L23j22K26l47O14L08J14q30m66q67J508o93J054m92p35Q35r08J038M00
$$ -263 60 -62 164 -183 431 739 853 23 -443 -1310 198 -495 559 67 -668 167 -741 297 697
6512F97m5K08j002J63L11n29m59J313n2j8o31j162J894j887J526m75J94K69j017
$$ 697 652 860 -142 21 332 -197 -656 657 605 587 -44 -1206 688 -1199 327 -148 46 315 -702
6531g02J576j879J823j23k180J336j63J169j790J478j519Q84N1r61J481n38k88
$$ -702 874 -1005 818 695 -1485 -149 -312 857 -933 545 -974 -90 -39 -1000 481 -57 -345
6548c45m7R66l92m88Q22J22p60O70n86N77n48J56k09J646j858K71n43J335p33
$$ -345 -392 574 182 -306 516 638 -122 548 -38 539 -9 147 -62 1584 -274 -3 -546 789 56
6567E6p80L64q8K8J160j414J175k26o47N53j270Q66l56J289p04P06l14k35nj283
$$ 56 -724 -360 -448 -420 740 -674 501 275 -372 181 -1089 -223 -579 710 6 712 398 163 158 -1125
6587a125K226k072J587j245J012l90q45J243jj28k76R72j129p74J157j240J885
$$ -1125 1101 -971 616 -629 383 -7 -852 391 390 262 -14 958 -171 -945 212 -1028 857
6604H57p85k26L58P5J30l47K82K02n71n26m1Q12Mj62k26l26l39J946j171O65j1
$$ 857 72 -154 204 279 409 62 344 546 -25 -551 -592 220 224 62 -164 -490 -829 1117 -54 611 600
6625F00n28j89L66Q25j212l98m24J294j563R42J51N85N89j719R07K24j048J25
$$ 600 72 -117 249 1074 -138 -536 -960 334 -1229 -287 -136 449 1038 -681 226 450 -598 -473
6643d73O37P51j553J190l02j15R5m06N90n71P49j614Q42n66O05M34j67P37j231
$$ -473 164 915 -638 552 250 135 230 -176 414 -157 592 -1022 -180 -746 -141 293 126 863 -368
6662c68P54p78J281j43p35l03O74k25l3j014R43J44q28Q74q88K68J715j331Q7
$$ -368 386 -392 889 746 11 -292 382 157 124 -890 53 197 -631 243 -645 -377 1338 7 94
6681I4M85n53K8M65j977J469n18O24N32m72O18q93Q11p86J51k52r07J971j703
$$ 94 579 26 54 519 -1458 11 -507 117 649 177 795 -98 713 -73 78 -174 -1081 890 -813
6700h13J054q12k46O66j188J445k48J004j016j52L21p20M68J24O41K40N7j041
$$ -813 241 -571 -817 -151 -1339 106 -142 862 -154 -306 15 -705 -237 -113 528 768 825 -216
6718b16k39K30j71L66p06M23J598j774M75J33j022N72K51M39p92P26N8Q57r76
$$ -216 -455 -225 -396 -30 -736 -313 1285 -489 -14 119 -903 -331 -80 359 -433 293 351 1208 232
6737B32n4k95o88P10Q0O46j359K48L28m36J290j277L96r04J291Q93l40k89n04
$$ 232 178 -117 -805 -95 -15 631 -728 -480 -152 -588 702 -575 -179 -1083 208 1101 761 472 -32
6756c2J388j270r02J156l92q36P5M49J45J83k6j046J344m53O70o0l23N10l39k36
$$ -32 1356 86 -816 340 -52 -888 -813 -364 -219 -36 -62 -1108 236 -217 453 393 70 580 241 5
6776EQ03l44k37k53K42j130O97M19n39J077j013L44N3l57M04j188J710j142N5
$$ 5 808 464 227 -26 216 -914 -217 202 -337 740 -273 71 124 -233 171 -1017 693 -449 -394
6795c94M18o13Q79J07j25P91j087l53k19R01j63k87o67P52k58M43l85J189r47
$$ -394 24 -589 290 397 272 1063 -24 -377 -596 305 142 -145 -812 -60 -318 125 -260 929 -18
6814a8P35m85j980J292K88N87p05p0J300n40q13P87r52O30M11m07M69J0p60pJ180
$$ -18 717 232 -1748 -456 -168 419 -286 -356 944 404 -409 378 -574 56 467 60 529 539 -221 -228 952
6835I52r75J73o24M44j35n02J043J67P97j141j34N94j259P88j41P06j398J487
$$ 952 -23 150 -474 -30 -165 -667 376 543 1340 199 65 659 -600 188 47 753 -645 842
6853H42p71m76M30o05L20P37j399J078j641J336J77l43L45o07J594p18J16j005
$$ 842 71 -405 25 -580 -260 477 -922 156 -1485 -149 28 -315 30 -577 1017 299 415 -590
6871e90L38O64L00j198N06j69J9P61m84r92Q16j7j60P64n95K41K16p40K73k4O57
$$ -590 -252 412 712 -486 20 -149 -130 631 147 -845 -29 -46 -206 558 -37 204 420 -320 -47 -71 586
6892E86j172N0J732Q40k300k2L37P7o48l91J654l80n23O65r99N33m26j67j98J293
$$ 586 -586 -536 1196 2036 -264 -286 51 128 -520 -911 743 363 -160 505 -494 39 -387 -554 -752 541
6912E41j1j111N62p8m85m83R68L52n41n0p40K001o86J20o50P1L22k296K238O0
$$ 541 530 -581 -19 -97 -582 -1065 -97 255 -286 -336 -1076 925 239 359 -291 -220 102 -2194 44 104
6932A04J96j48l2J83j249P41N01N0o0l81M24r06J629l42p23o94O95o58Q14r3j14
$$ 104 300 152 120 303 -946 -205 296 346 286 -95 329 -577 1052 710 -13 -707 -12 -670 144 51 -63
6953f3qJ91n44Q57p11L1M85m60J17j16M3n25R24r15j87J923j772N15K90p81J469
$$ -63 -71 120 -424 433 -278 -247 238 -222 -105 -221 -178 -703 221 -694 -881 1042 -730 -215 75 -706 763
6974G63j535J113j259K67M31L7o86r0J651J2j43o15k32J206j676J053J111k432
$$ 763 -772 341 -918 -651 -220 -183 -869 -959 692 704 561 -54 -286 920 -756 297 1408 -1024
6992a024J936j378J732j403K32m24L95M66m37P81j435J971j939K49N11M62k58
$$ -1024 912 -466 1266 -137 95 -329 66 532 95 876 -559 1412 -527 -278 233 695 437
7009D37j462J450q78J080r31M29j12l81O44j218J274K64L6r99J85r23J049K34
$$ 437 -1025 425 -453 627 -304 125 13 -368 276 -942 332 596 632 -367 -182 -1105 -56 178
7027A78R35j259m18j74R30o49K84N71o48M73n22L65l97R3K48nM96N12j603K10
$$ 178 1113 -146 -564 -738 192 -457 -173 398 -250 223 -299 66 -331 -238 10 5 501 1013 -590 -380
7047c80N26j94L79J14q20j68O12j612K449j075l85l03R18J286k029J550j336J243
$$ -380 146 -48 331 445 -375 -543 69 -1543 906 -169 -554 -857 61 1347 -682 868 -468 775
7065G75j016M12M74p2m73p75j64J809j295Q34q79J735q21j164R62j033K245k647
$$ 775 -241 171 645 573 100 -675 -839 970 -325 509 -370 1365 544 -620 342 -691 1554 -1093
7083a093K187o92o46O55o48M10o13J369j288N69n17l28J044r19J07q26J871l89
$$ -1093 1094 402 -244 411 -237 173 -440 929 -359 210 -307 -635 409 -510 -403 -1229 642 253
7101B53n01J142j535J482k190J622k32J05l40o73J748r90l52N23J216j324L63
$$ 253 -248 894 -641 841 -1349 273 41 146 -194 -867 881 -109 -461 62 1278 -46 317
7118C17l86n49m5J281r35O06j51m08P46J12Q35l50j328P42j63n91n75K28N94N25
$$ 317 -69 -618 -663 618 -317 289 138 -270 476 588 1423 1073 -255 487 324 -267 -842 -614 -20 505
7138E05L04l88J74p00Qo29J393r41M60p19L4L72p65J551J201k646O22l11j43J188
$$ 505 809 421 595 -105 -97 -726 667 -274 186 -533 -499 -127 -892 659 1860 -786 -164 -475 -618 570
7158E70L79j411P65O42n65K33m45L46j106O34L75o12Q40k85j077L37o69J47N07
$$ 570 949 -462 303 945 380 613 168 514 -592 42 417 -195 645 360 -717 -380 -1049 -902 -395
7177c95P54o52J081k83j215Q55j144J718l69j82J41m28J16M91J075j927P11K65
$$ -395 359 -293 788 505 -710 145 -999 719 350 168 309 -119 -3 488 1563 -364 347 612
7195F12l48k69j600J125M38K84j168K047j515r92Q20O70m00J73l62Q44o64K19
$$ 612 264 -5 -1605 -480 -42 242 -926 1121 -394 -1386 -566 104 -296 -123 -485 359 -305 -86
7213h6j3K41M96m93J44n91J524j569N80q4r51J627j608J220m75k79Q34j546J233
$$ -86 -99 142 638 145 289 -302 1222 -347 233 149 -802 825 -783 437 -38 -317 517 -1029 204
7232B04j11j19J23J8j43m80O27K53l27o25J33J436j808Q99m71n52K246j811j16
$$ 204 93 -26 97 115 -28 -508 119 372 45 -580 -447 989 -819 80 -391 -943 1303 -508 -624
7251f24n72Q52K34n2O02M94Nr65J58n32J048q92l38J93j14J212j408Q63L44j113
$$ -624 -1196 -344 -110 -162 440 934 939 -26 132 -400 648 -244 -582 -389 -503 709 -699 164 508 -605
7271f05P07p25P24R19j041k27L84l19n47l81R48O6O39p66Q28j343J281m95q4N99
$$ -605 102 -623 101 1020 -21 -248 136 -183 -730 -1111 -163 -97 542 -224 604 -739 542 47 -37 562
7291E62n61J449j846R58n79N54p1Q9j32j707J686j115J225r79J84K7l36K21M13
$$ 562 1 1450 -396 562 -17 537 466 555 423 -1284 402 -713 512 -467 -283 -256 -592 -371 42
7310D2K13j000J06Q44m64j47K38p36J284J92r04k46j13P28q75P90L76r51J001
$$ 42 255 -745 -639 205 -259 -406 -168 -904 380 572 -332 -578 -691 37 -838 -48 328 -623 378
7329C78p37L89p20J295j080P94R82j555q41J780l18m68k83l30J008N47j458Q55
$$ 378 -359 30 -690 605 -475 319 1301 -254 -1095 685 367 -101 -384 -714 294 841 -617 238
7347B38m4k76L43j455K302o69O84j714L55m31M44N57m43j02m86K21J427j479O91
$$ 238 194 -82 261 -1194 1108 439 1123 -591 -236 -667 -223 334 -109 -211 -697 -476 951 -528 163
7366A63m04J172q24j74J7r13J629j494K447j813J04k8q68M64J71J54J113n30R37
$$ 163 -241 931 107 -67 -50 -963 666 -828 1619 -194 -90 -118 -986 -522 -351 -197 916 386 1323
7385A323j628N09K18k84M2L54O62j037K62r15J229r51L02r71K01J35L0Q68j74
$$ 1323 -305 204 422 138 180 534 1196 159 421 -494 735 -216 86 -885 -684 -549 -519 349 175
7404A75j77j19P51o44R1l25k08n2m62m54K425L69j516Q05n8j8m60J76L25o95J80
$$ 175 -2 -121 630 -14 77 -248 -456 -508 -970 -1424 1001 1370 -146 659 601 583 123 299 624 -71 109
7425A09j353J52R61l08O66j304J051n21N02k76J166j302M07%K59N30p91k99R41
$$ 109 -1244 -1092 -131 -439 227 -1077 -26 -547 -45 -321 845 -457 -50 -50 209 739 -52 -351 590
7444E90o55M02j229J232l07l46k58N92K15p39J030j096J058q44L46Q9j85Q80j326
$$ 590 -65 337 -892 340 33 -313 -571 21 236 -503 527 -569 489 -355 -9 80 -105 775 -551
7463e51l57J658p29M50l43Q7p40P73L12q06J66L90j009J5J228j35j289J079n30
$$ -551 -908 750 21 471 128 215 -525 248 560 -246 -80 310 -699 -684 544 409 -880 199 -331
7482c31M42k82K41O95j249K172k372L39K42R37l02l95p20o17O99L39M06p69O50
$$ -331 111 -171 70 765 -484 1688 -684 -345 -103 834 532 137 -583 -1200 -501 -162 244 -525 125
7501A25n25N23o61J48M35P60j438Q87m07n45m00O84P92o22q60J623O32j010N1
$$ 125 -400 123 -538 -390 45 805 -633 254 -153 -698 -1098 -414 378 -244 -1104 519 1151 141 192
7520A92P03r74P2K60p33J536j745J244r80N07J37j009J609q81p13K4J221j83m01
$$ 192 895 -79 -7 253 -480 1056 -689 555 -425 82 219 -790 819 -62 -775 -751 470 287 -114
7539a14R31j424J159m83m3k79N09P45j359J716j592j026Q89l73J124j100J170
$$ -114 817 -607 552 69 26 -253 256 1001 -358 1358 -234 -1260 -371 -744 380 -720 450
7556D50n96o8P27j622K407j264J54l58P2N34m29m81J86R00q77L42j236L93J548
$$ 450 -146 -214 513 -1109 1298 34 188 -170 -98 436 7 -474 -288 612 -265 77 -1159 -766 782
7575G82r35L65L19M12j216j66O07j525J196L12q71M70R70p7q69j43O13k89n57
$$ 782 -153 212 531 943 -273 -439 168 -1357 -161 151 -720 -250 720 643 -226 -369 244 -45 -602
7594f02O25J06p54N71Q10j494K07N66L1l08K02P62q47O44R8l39j526J697K78j316
$$ -602 23 129 -625 -54 756 -738 -531 35 66 -242 -40 722 -125 519 617 278 -1248 449 727 -589
7614e89N76M32m06p72J08M66L98L67m79r37J127m99o55K77R62j295N30L56p39
$$ -589 -13 419 13 -759 -651 -185 213 580 101 -836 291 -208 -863 -586 376 -919 -389 -33 -772
7633g72P24j260M06R03K72o95R51o59j542Q00P03M70k35r13J650r49j01L32L30
$$ -772 -48 -1308 -902 1 273 -422 529 -130 -1672 -872 -169 301 66 -847 803 -146 -247 85 415
7652D15O98j399Q02p35k77K77J60P92p50M21J67L52j540l34M82J174j68q91N11
$$ 415 1113 -286 516 -219 -496 -219 -59 733 -17 404 571 923 -617 -951 -469 705 537 -354 157
7671A57k00j055J176j027K327o54j129R18n27o7j21l57K52n65Q24K09p24P07K25
$$ 157 -43 -1098 78 -949 1378 724 -405 513 -14 -81 -202 -559 -307 -872 -48 161 -563 144 369
7690C69r29j01Q14J10N12q01l93j73Q45q1o07m1J069j513N24M96l60p48J226J88
$$ 369 -560 -661 153 263 775 -26 -419 -592 253 172 -435 -476 593 -920 -396 100 -260 -1008 218 406
7710D06p55M48q90J100j172Q84P15o40j82j288J429q9l59P29k76J301k101J134
$$ 406 -349 99 -791 309 -863 21 736 96 -86 -1374 55 -34 -393 336 60 1361 -740 394
7728C94j063K061j818P64q70Q84J037j967J274o22L52L77P7o79l57P97p60j50
$$ 394 -669 1392 -426 338 -532 352 1389 -578 696 74 426 803 880 201 -156 641 -119 -269
7746b69J543q81L21q46l49r41J639p31P9J408r09K85r28J484j767J626j024M72
$$ -269 1274 393 714 -132 -481 -1422 217 -514 -435 973 64 349 -579 905 -862 764 -260 212
7764B12M74k209N60J081O8l32P87N34r13j12P6j96k70l48J040o04N55M9l14L49
$$ 212 686 -1523 -963 118 186 -146 641 1175 262 150 226 30 -240 -588 452 -152 403 452 138 487
7784D87q26L04O14p73l20Q52rj034J027p88O81K48k78j647N12K63J424n84J34
$$ 487 -339 -35 579 -194 -514 338 329 -705 322 -466 215 463 185 -1462 -950 -687 737 153 287
7803B87K61P23k31k76L98k299J951j151J10k8k38J378l43N3q12M02J0m13l19n29
$$ 287 548 1271 1040 764 1162 -1137 814 -337 -227 -255 -493 885 542 595 -217 185 195 -218 -537 -1066
7823a066O44p97J244l12n8R74j048Q33l23q7k24N61o27m31J214p6J47m93L98l8
$$ -1066 -422 -1219 25 -287 -345 629 -419 414 91 4 -220 341 -286 -717 497 421 568 75 473 435
7843D35o02n37j57J643l83p82J024l49m8q65J010l01q2K70j97P26j008l36L08
$$ 435 -167 -704 -861 782 399 -383 641 292 244 -621 389 88 6 276 79 805 -203 -539 -231
7862b31M87n00J30J95M7o5P26j436N3J288o77J024k100R73o3r61P49M58p21R60
$$ -231 256 -244 -114 81 128 63 789 -647 -594 694 17 1041 -1059 -86 -149 -1110 -361 97 -624 336
7882C36k43n80J627q64%N47j032J191p39Q7L31n73J049j866K693j929J167j130
$$ 336 93 -487 1140 276 276 823 -209 982 243 330 661 88 1137 -729 1964 35 1202 72
7900G2O49k39k45k00L47M6j288N57K19j37K77M0M91j084N08P56j840J107O29M22
$$ 72 721 482 237 37 384 430 -858 -301 -82 -219 58 98 589 -495 13 769 -1071 36 665 1087
7920A087j446J53K66j129J342r74R42j13L27n32m48J569p99O16j210O40k21R2
$$ 1087 -359 -206 60 -1069 273 -701 241 128 455 -77 -525 1044 245 861 -349 291 70 162
7938A62n5j108l47J078L22L06m6m9l84l13r62J752j92n40N91J70J03q61M71J101
$$ 162 107 -1001 -1348 -270 52 358 312 263 -121 -434 -1396 356 164 -376 215 385 488 -373 98 1199
7958A199j030m02j74m27Q49m87o31O94J273p9j84r08l75N41J28m74O93m01n74
$$ 1199 169 -233 -407 -834 15 -472 -1103 -409 864 785 601 -307 -682 -141 -13 -487 206 -195 -769
7977g69O76M52P4n34J413r88k40m28m36R34m43k02N62n67k4Q44l59m0j91o7J018
$$ -769 -93 359 433 -101 1312 324 84 -344 -780 154 -289 -491 71 -496 -520 324 -35 -75 -266 -333 685
7998F85j387J428j009M53j75O00m52l00J343r55m73O00m78n35M26m23K92N46O01
$$ 685 -702 726 -283 170 -5 595 143 -157 1186 231 -242 358 -120 -655 -229 -652 -360 186 787
8017G87j875L15q9J689p93P5L62n68L47j167K369q06k05o33j54J29R3M28J80j499
$$ 787 -1088 -773 -862 827 34 109 471 -97 250 -917 1452 646 441 -192 -346 -217 -124 304 484 -1015
8037a015J075K8j95K51M44Q1n48J34k58M91l70N4k15o30J132r4n32J3k7P04j349
$$ -1015 60 88 -107 144 588 669 121 255 -3 488 118 172 -43 -673 459 365 -167 -154 -181 523 -826
8058h26J199m8ql37q69K108j461P45l98j084J364m10j5N92Q2j220Q97L33p52J220
$$ -826 373 325 317 -20 -889 1219 -242 503 105 -979 385 -25 -40 552 634 -586 311 644 -108 1112
8078A112k232J764j517J854p9k51M47j561J377j172n42L79k16J721j053N16j84
$$ 1112 -1120 644 -873 981 902 651 1098 -463 914 -258 -800 -421 -637 1084 31 547 363
8095C63n09J264q00P39j977J177o55J004j6j192J650j086R9p63R45O45j484J129
$$ 363 -146 1118 318 1057 -920 257 -398 606 590 -602 1048 -38 61 -702 243 888 -596 533
8113E33j249J996n20m20P0k57j77K51R73q75m12o48J71R21p48m7N4n07N05J99
$$ 533 -716 1280 760 340 410 153 -24 227 1200 325 -87 -735 -564 357 -391 -438 -384 -891 -386 -187
8133a87K61l73Q90o51Q0p73J496j197L91p3M96o5n96m45P63l1q07P07k98O31r66
$$ -187 74 -299 591 -60 20 -753 743 -454 -63 -136 360 295 -301 -746 17 -14 -821 -114 -412 219 -747
8154g47J083j57j636J456o9N9P79j427N71l05Q2p78P49o03J768j55j653J714j148
$$ -747 336 179 -1457 -1 -70 -11 768 -659 -88 -393 -311 -1089 -340 -943 825 670 -983 731 -417
8173d17P42j366J371k95j24n8J79R94k034P83r8M76P90r46R74j523Q10j38p48
$$ -417 325 -1041 330 35 -89 -147 32 1026 -1008 -225 -323 153 943 -3 971 -552 258 120 -628
8192f28P94j93o43p02J353N83j216Q46L54m38j045N94J182o95j83j03q14j25J798
$$ -628 166 -27 -670 -1372 -19 564 -652 194 548 110 -935 -341 841 146 -37 -140 -954 -1079 719
8211G19o24L70o37o87J474J41J76j516J451m7j167J203r58L99o39l98P48j496
$$ 719 95 465 -172 -859 615 756 932 -584 867 820 -347 856 -102 297 -342 -740 8 -1488
8229a488J311k93K61m90K4J444j322N29o66K50M94l90Q00l35n98Q51M4r32Q91
$$ -1488 -177 -470 -209 -699 -675 769 -553 -24 -690 -440 54 -336 464 129 -469 382 426 -506 385
8248C85k33j98j303R94N40N7j59K10j23P14n34k52j70R1M67m3k24R34o67P51j003
$$ 385 152 -46 -1349 -355 185 242 83 293 170 884 350 98 -72 19 486 443 219 1153 486 1237 234
8269B34p15o6M11J799j675K8j010K146n56n23j07Q3O66j268K28M75M04m14o54
$$ 234 -481 -547 -136 1663 -12 16 -994 1152 596 73 -34 49 715 -553 -325 150 554 140 -514
8288e14Q18r97Q9Q1J452m35m03Q74n93J062k416R81j03L89L9j088O29Q7l65L7
$$ -514 304 -693 -604 -523 929 494 91 965 372 1434 -982 -1 -104 285 324 -764 -135 -48 -413 -376
8308c76K39K86k39N41o83o96J373n42P05k05k53l20J193q77n37N79O08o88O92
$$ -376 -137 149 -90 451 -232 -928 445 -97 608 403 150 -170 1023 146 -391 188 796 108 800
8327H00p61L80n69R0K1L85r23M23L66j44R41j043l17N86%j76Ro78K91m82J524
$$ 800 39 419 -150 -60 -39 346 -577 -154 212 68 1009 -34 -351 235 235 59 68 -610 -319 -801 723
8348G23L03j265n06N49J128j34n13rm51J38k65J251j694J92K2P33j51k95L99j046
$$ 723 1026 -239 -745 -196 932 798 285 276 -175 -37 -302 949 -745 -553 -531 202 51 -244 155 -891
8368h91J685j179P58l7k22L74q91O17p83L11m26J185j42p27R14j032J183j044
$$ -891 794 -385 373 336 114 488 -403 214 -569 -258 -684 501 359 -368 546 -486 697 -347
8386c47J3N24m3J587k729P04O05L69j479J520j69j305J313n11m11O70k89o0q85
$$ -347 -334 190 147 1734 -995 -291 314 683 -796 724 555 -750 563 52 -359 311 22 -38 -923
8405i23J415j348J157m01m81R99j268l6J441j030p6L64p07P34K36O75j147O45
$$ -923 492 -856 301 -100 -581 418 -850 -886 555 -475 -551 -187 -894 -160 76 751 -396 249
8423B49j205Q86K30M20m81m70J138m31r32J384j339L12n26J398m4j439J420o88
$$ 249 -956 -70 160 580 99 -371 767 336 -596 788 -551 -239 -765 633 589 -850 570 -118
8441a18J080k051J598p43j76K93q93M35J307j712J125r98J480r51O15p21P42p14
$$ -118 962 -1089 509 -234 -410 -117 -1010 -575 732 -980 145 -853 627 -324 291 -430 312 -402
8459d02M80N32m69l08k06O84q99J45M95k91Q44j14k9k21q79P47m16N82l34k20
$$ -402 78 610 141 -167 -373 311 -588 -443 52 -239 605 491 462 241 -638 109 -307 275 -59 -279
8479b79m32J149J81o45J109j541M82j03m36O58r67J285j382R55L40j230R92j117
$$ -279 -711 438 619 -26 1083 -458 24 -79 -515 143 -824 461 -921 34 374 -856 136 -981
8497i81Q08k03O25K20OJ06j143L31P97j028J142j21k81k26P19j324M78J012j507
$$ -981 -173 -376 249 469 475 581 -562 -231 566 -462 680 559 278 52 771 -553 -75 937 -570
8516e70J330j225R28l49o40J248j218P15l6l83P55j118J38n93J782j483J090m51
$$ -570 760 -465 463 114 -526 722 -496 219 183 -200 555 -563 -425 -1018 764 -719 371 -80
8534h0m97J139l28l23M63j24m52M83Q10j839J139k75M29j040J09P58j41N3l49
$$ -80 -577 562 234 -89 374 250 -202 281 1091 -748 391 116 545 -495 -386 372 231 284 -65
8553f5r97r8J171K60m41n29Q56M68j152J80k22M64P24p67J96M3o73J161j662K205
$$ -65 -1062 -1160 11 271 -170 -699 157 625 -527 -347 -569 -105 619 -148 48 91 -582 579 -1083 1122
8573A122p52n17J395j982N63n22P51k69k02L22n21mJ777j097L3l84J154k04j592
$$ 1122 370 -147 1248 -734 -171 -693 58 -211 -413 -91 -612 -616 1161 64 97 -287 867 663 -929
8592i29O82K49r2m68j92J26Q48k48m27Q75r16K155p32j105N81j033O86K22k53
$$ -929 -247 2 -90 -558 -750 -624 224 -24 -451 424 -492 1663 931 -174 407 -626 60 282 29
8611B9J17j16r12O8Q85j040R51K86m61Mo8N45n11M70J3k74J061j584M73r83J174
$$ 29 146 30 -882 -814 71 -969 -18 268 -193 -189 -257 288 -223 247 260 -14 1047 -537 -64 -1047 127
8632A27q31O02P84J2o33m34J322j274P12J66j027J457r74P50j55j86J85o03N53
$$ 127 -704 -102 682 694 61 -373 949 -325 387 553 -474 983 9 759 604 418 603 0 553
8651E53J17J91j702Q49J16lL24p41J064p43l51k01J1P38n20j22j67L55j95p47
$$ 553 670 861 -841 8 124 121 445 -296 768 25 -326 -527 -516 222 -298 -420 -587 -232 -427 -1174
8671a174Q13P3M28m16j53J101r31q59J246K10o95L70K32j294Q57L5M32J13K11
$$ -1174 -361 -288 140 -276 -429 672 -259 -1118 128 338 -357 13 245 -1049 -192 -157 275 388 599
8690E99Q2L80j465N2O41o81O55N51j447nJ174j066K10m64Q69l15M60n0q32J050
$$ 599 681 1061 -404 -352 289 -392 263 814 -633 -638 536 -530 -320 -784 85 -230 230 180 -652 398
8710C98n59J15J480k487O90p71J976q03J475j596n88J303l59q7j20Q39j631O6
$$ 398 -161 -46 1434 -1053 -363 -1134 842 39 1514 -82 -670 633 274 187 67 906 -725 -659
8728f59k46P83J383k679J305J14n66P13o8K67L38o78j308J630o80L24Q38j342
$$ -659 -905 -122 1261 -1418 -113 1 -565 148 80 347 685 7 -1301 329 -351 -27 811 -531
8746e31J173j438R1l1Q45m85l91R45m97K79J220k338J934j047M50M6o15P83j30
$$ -531 642 -796 -705 -736 109 -376 -767 178 -319 -40 1180 -1158 776 -271 179 225 -390 393 263
8765B63L48j055K42J07J024j512O89J150j296P14j397J93R10o69K08M01j705J726
$$ 263 611 -444 -202 -95 929 -583 106 1256 -40 674 -723 -530 380 -289 -81 320 -1385 341
8783C41J249j677J280r03o15q32J267q87J016m11L80j255J487j431J602j91m21
$$ 341 1590 -87 1193 290 -325 -1157 110 -777 239 -172 208 -1047 440 -991 611 420 -1
8800ak61J48K66K84q04J736r87Q4j87o26N69q68J198k565J923R01j295J193j778
$$ -1 -262 -114 152 436 -368 1368 381 465 278 -348 221 -647 551 -2014 -91 810 -485 708 -1070
8819a070K285j681J314j134P0L18j221K176j227N51p02J037Q06j869P94k75L60
$$ -1070 1215 -466 848 -286 -216 102 -1119 1057 -170 381 -321 716 1522 -347 447 172 532
8836E32j039L95J31o03J204q60Q97j515N70L7M33K99j500P03O36o81L97p2O92
$$ 532 -507 -112 19 -584 620 -240 657 -858 -288 -251 182 481 -1019 -316 320 -361 36 -36 656
8855F56o99J73K62m40K75K09m64l63J11J161j736J633j636J336q48l46J559j003
$$ 656 -43 130 392 -48 227 436 -28 -391 -280 881 -855 778 -858 478 -370 -716 843 -160
8873a60R0J33n92N5O53o79P08K68m02l96M49j019J153l60m31J93M51n3k10O97
$$ -160 -70 63 -529 -474 179 -500 208 476 74 -322 127 -892 261 -99 -530 -337 114 61 -149 548
8893E48j088P55k84N86j38j018K648l299J163N29M77n96LP91j794O96m17m3J245
$$ 548 -540 215 -69 517 379 -639 2009 -1290 -127 402 879 283 286 1077 -717 -21 -438 -481 764
8912G64q80J116r70K60p43P2P3k9R33j564J197o82k68J015k47J51k89J485j755
$$ 764 -116 1000 30 290 -453 -381 -308 -337 596 -968 229 -453 -721 294 47 198 -91 1394 -361
8931c61K87o49K54J390j072n88R88o27R08r86m52P13K90p44N74p42J117q85O87
$$ -361 -74 -723 -469 921 -151 -739 249 -378 530 -456 -908 -195 95 -649 -75 -817 300 -585 102
8950A02M16n23m1K76m72j408J838O17j408j45K44l8R23k88N37j245J82J72J81
$$ 102 518 -5 -46 230 -242 -1650 188 805 -603 -748 -504 -542 381 93 630 -615 -433 -261 -80
8969h0Q59J00k682J885l8l79P76q35J417j006n15O61k09R48j53j268J16N55l9
$$ -80 779 879 -1803 82 44 -335 441 -394 1023 17 -498 163 -46 902 749 -519 -403 152 113
8988A13N83q88J254r83n99J232j351R55p61J95M46r21J225M03l10l94N93m03k96
$$ 113 696 -192 1062 79 -520 712 -639 316 -445 -250 196 -725 500 903 593 199 792 389 93
9007I3o9l89J257j415R55o37%P55k310J168J51K52P38j372J978j569J545j765
$$ 93 24 -365 892 -523 432 -205 -205 550 -1760 -592 -441 -189 549 -823 1155 -414 1131 -634
9025f34P49J05o39J810j693Q95P79j653m84J214k14j020N93O63n10n16L63L17
$$ -634 115 220 -419 1391 -302 593 1372 -281 -765 449 235 -785 -192 471 -39 -555 -192 125
9043A25J6m81J151j000j22J041j676L35O60m0k01M71l03J36o02J155L24p47j194
$$ 125 141 -340 811 -189 -311 730 -946 -611 49 9 -192 279 -24 112 -490 665 989 242 -952
9062i52J458q18J61K32J33j035L09N4J374o03j075P99p22O58j39J7K97p20P98
$$ -952 506 -312 -151 81 214 -821 -512 -458 916 313 -762 37 -685 -27 -166 -149 148 -572 226
9081B26Pn06K99l0L57j057K14N1J404j137R30q25m20J095o75K66K82p58J344j790
$$ 226 233 -273 26 -4 353 -704 -490 -439 965 -172 758 -67 -487 608 -67 199 481 -277 1067 -723
9101g23J535k108P57PrP94j049K176q32Ln54j164J833n85M72p43M69l02k75J421
$$ -723 812 -1296 -539 -532 -541 253 -796 1380 548 551 -3 -1167 666 81 553 -190 279 -23 -298 1123
9121A123k587J583k31M63L49k3n12o62J25N35j35M75k91m83K54N17l44l32N61
$$ 1123 -1464 119 -112 351 700 677 165 -497 -372 163 28 503 212 -271 -17 500 156 -176 385
9140C85N11j578N85L57n08o36J059o18N38o0R0o2r94J180k54M18o89M83j120P23
$$ 385 896 -682 -97 260 -248 -884 175 -443 95 35 125 63 -931 249 -5 413 -276 207 -913 -190
9160a90J39l09N01j38j94J07j86L89j264K514k240L18Q35j851J590p01J169q17
$$ -190 -51 -360 141 3 -191 -84 -270 119 -1145 1369 -871 -553 282 -1569 21 -680 489 -328
9178c28J340j348l52J20M12R90j349m00O81p50K050j128J017j240N82L70p52l5
$$ -328 1012 -336 -688 -568 -156 834 -515 -915 -234 -984 1066 -62 955 -285 297 667 -85 -120
9196a20q27J052J11K90j068k14L19J46M14P4P02n24j359K030j969J141M29o1m97
$$ -120 -947 105 216 506 -562 -776 -457 -311 103 177 879 355 -1004 1026 -943 198 627 566 69
9215F9q71K04n47N57M38M5j19q60J233j261M04M28L2J060k938J663J056j57n60
$$ 69 -802 -598 -1145 -588 -150 -105 -224 -1084 149 -1112 -708 -280 -248 812 -2126 -463 593 436 -124
9234a24P36j079J0P1N57o07Q17l01m4o88r5O31J48N90r45R96r08K20K42j338K70
$$ -124 612 -467 -457 -386 171 -436 381 80 36 -652 -747 -116 32 622 -323 673 -235 -15 227 -1111 -841
9255h41M8J772j150k05Q48j140Q47K70j051j52L46l58m88J525j195J467q29j7
$$ -841 -793 979 -171 -376 472 -668 179 449 -602 -754 -408 -766 -1254 271 -924 543 -286 -303
9273c03Q32m82lK49m01N68j70j52m06j476Q63R25J071l05q83J67k70k24J277q23
$$ -303 529 47 44 293 -108 460 290 138 -268 -1744 -881 44 1115 810 -73 94 -176 -400 877 54
9293E4l40M96J22R8l53L67m72j1j025J027O69j774J328j28p10K83M09K29j736
$$ 54 -286 210 332 430 77 444 -28 -39 -1064 -37 632 -1142 186 58 -652 -369 40 269 -1467
9312a467K416o72J80r16M39Q18j025L00k92M88m0j20qk37m87Q96n64J87J53R73
$$ -1467 949 277 457 -459 -20 798 -227 73 -219 269 229 109 101 -136 -623 273 -291 -104 49 1022
9332A022j507R67k64J37M00j293J053r70m04O56m60Q28l54L32K54o53L56o80J595
$$ 1022 -485 482 218 355 755 -538 515 -455 -859 -203 -663 165 -189 143 397 -256 100 -580 1015
9351A015k241J372Q34q55Q65j564J358j095J9O60J79m00j404J055l4L84k3K43
$$ 1015 -1226 146 980 125 990 -574 784 -311 -292 368 547 147 -1257 -202 -236 148 125 368
9369C68O36k436K623j326R61q25p51M14l7Q84j383J836r57J609r77o19n73J29
$$ 368 1004 -1432 1191 -135 826 1 -750 -336 -373 511 -872 964 7 1616 639 20 -553 -424
9387d24O02j63J56m40K84m13n37J036L43j139Q88N10m86l80J145k53r61L32K85
$$ -424 178 15 171 -269 15 -398 -935 101 444 -695 193 703 217 -163 982 729 -232 100 385
9406C85q26R0RJ11J21O97J93j204M3Q4J148j016o1M18n72M44J05N75j093J353
$$ 385 -441 -351 -342 -231 -110 587 780 -424 -381 -297 851 -165 -226 192 -380 64 169 744 -349 1004
9426A004q12L39q59k77J338j514P22K19J01m44n12L46N1M8M7K80j83o77J123n74
$$ 1004 192 531 -328 -605 733 -781 -59 160 261 -183 -695 -349 -298 -250 -203 77 -106 -783 340 -234
9446b34M87j26r74l0j69J827p36J112k168L57M49j342J925n31j76j74O37p85p01
$$ -234 253 127 -847 -877 -1046 781 45 1157 -1011 -654 -205 -1547 378 -153 -329 -503 134 -651 -1352
9465a352J217l01P92q35K14N91k21N88j303j5M55j3L46J10P35j129m7N07j09P97
$$ -1352 -135 -436 356 -479 -265 326 105 693 -610 -625 -170 -183 163 273 1008 -121 -168 339 230 1027
9485A027j369O06r67J36P06m6n2n91J214k211J678P40j267J084p74j67O82J13
$$ 1027 -342 264 -703 -567 139 93 41 -550 664 -1547 131 871 -396 688 -86 -253 429 542
9503E42o22R4q35l97P47J662j233J14M39p58j75Q73P18m11L10k154K158r79n8
$$ 542 -80 14 -821 -1218 -471 1191 -42 72 511 -247 -422 451 1169 758 1068 -1086 1072 93 35
9522C5M6k63K98j12O11n54j40O02m70O26N2q19j25j34l04l7J858j034K95K98l19
$$ 35 81 -182 116 4 615 61 -79 523 53 679 731 -88 -213 -347 -651 -688 1170 136 431 729 410
9543D10o45l33J652r47N99o86j62q3K11m97q66J430p32J494r84r31K438j945Q0
$$ 410 -235 -568 1084 137 736 50 -112 -195 16 -481 -1347 83 -649 845 -139 -1070 1368 -577 -497
9562d97Q50l95l75O69L40k202J364J087q7k59q61J099r31kp21J73R37K36L23j929
$$ -497 353 -42 -417 252 592 -1610 -246 841 754 495 -366 733 -198 -200 -921 -748 189 425 748 -1181
9582a181Q09K42p76J769p69L77p74O48j222J169O6O46r98L74p98N1L53o7o80N58
$$ -1181 -372 -130 -906 863 94 471 -303 345 -877 292 358 1004 6 380 -418 -367 -14 -81 -761 -203
9602b03n15P86Mj54O3k53j02l20J701n87J29j5N97p35N1o35R25j566K307j352
$$ -203 -718 68 72 -82 -19 -272 -374 -694 1007 420 549 534 1131 396 447 -188 737 -829 1478 126
9622A26M56p16l74O76N7P21k68m38n21j282K478j640J222p05K58r8m33J559p50
$$ 126 582 -134 -508 168 225 946 678 240 -281 -1563 915 -725 497 -208 50 -48 -481 1078 328
9641C28o29K94J239j031o29J856n83q21q60M59M83j293J725j421J361j44k16k04
$$ 328 -301 -7 1232 201 -428 1428 845 24 -836 -377 106 -1187 538 -883 478 334 118 -86
9659h6r44P42q4N17L24o88R68m05q40M5J033j082k81M22N97m9p92k67Q58o61J137
$$ -86 -1030 -288 -372 145 469 -219 749 344 -496 -451 582 -500 -781 -359 238 189 -603 -870 -12 -673 464
9680D64o76j32P27k20n99P75k55j020J426K70j096Q79j44l61k13Q32k04k6J102
$$ 464 -212 -344 383 163 -436 339 84 -936 490 760 -336 543 399 38 -175 657 453 427 1529
9699A529j099l86m41J32M76r10nj06J067J90p45J41M44R52j614M05n87P57K59
$$ 1529 430 44 -397 -265 211 -699 -704 -810 257 447 -298 -157 287 1239 -375 30 -557 200 459
9718D59j167J271l86j163R92r22J366j447J390j135J063L95j051j86M3J010j099
$$ 459 -708 563 177 -986 6 -916 450 -997 393 -742 321 716 -335 -521 -478 532 -567
9735e67j55J089j385J81J220J75r91M47Rn87M25O4K90K95K52j015n6O98n50q3
$$ -567 -722 367 -1018 -837 383 558 -433 14 23 -564 -139 -75 215 510 762 -253 -309 389 -161 -244
9755b44r59P13R0Q71j100k6J215p70r7q2O12j54n82N40M14o07j47R24r26k85Q42
$$ -244 -1203 -490 -400 471 -629 -655 560 -210 -307 -389 223 69 -513 27 441 -166 -313 611 -315 -600 242
9776B42p85R58n11L7m30L98O2m10O98N38n05j21k57J72N76n51K70j400J768q32
$$ 242 -543 415 -96 -59 -489 -91 -29 -439 259 797 292 171 -86 86 662 111 381 -1019 749 -83
9796h3n99L68L78L49j034O64j124L33J167l40O58j010Q99j809O62Q42o42J121
$$ -83 -682 -314 64 413 -621 43 -1081 -748 419 79 737 -273 626 -1183 -521 321 -321 800
9814H00j585J876j889J073L66l75j056P7J146m01o8M74j006N42j108K213p17j36
$$ 800 -785 1091 -798 275 641 266 -790 -713 433 32 -36 438 -568 -26 -1134 1079 362 226
9832B26m84L00n2n00L69j18P65q72J101n35M96n36n02M12p13M19N93p51M81J67
$$ 226 -258 42 -10 -510 -141 -259 506 -366 735 200 696 160 -342 70 -643 -224 369 -382 99 266
9852B66R19j205r6Q18r88Q87o83N47n51J5m24j056L76K15J633o0j328J264n07
$$ 266 1185 -20 -116 702 -286 601 -82 465 -86 -71 -495 -1551 -1175 -960 673 613 -715 549 42
9871D2l14R53o40O2O0K56m17k97K91j294M76M46O89o15J85K65l31O04l42J4j10
$$ 42 -272 681 41 103 163 419 2 -295 -4 -1298 -822 -376 313 -302 -117 148 -183 421 79 93 -17
9892a7L11Q3o74M99L49j408J160q55P50K88L16k32N47j438J0M93q50J033p78P91
$$ -17 294 377 -297 202 551 -857 303 -552 198 486 802 570 1117 -321 -311 182 -668 365 -413 378
9912C78p53j04N70j187J238J93k55o12P96n82l68J538j325M98k97j44J515k314
$$ 378 -375 -479 91 -1096 142 335 80 -532 264 -318 -686 852 -473 25 -272 -416 1099 -1215
9930a215K510j722M01M65r84Q26j072Q58p37J126p24j87M17o82Q37j087J394j9
$$ -1215 1295 -427 -26 439 -545 281 -791 67 -670 456 -268 -455 -38 -720 117 -970 424 405
9948D05j510J411j179L98L58K15n41Q43p08M3P08N01j106Q99m24L5m44n39L88
$$ 405 -1105 306 -873 -475 -117 98 -443 400 -308 -265 443 944 -162 737 313 348 -96 -635 -247
9967b47J80J44K19m84n4M95K34n73Q21r42M68l84R58l53o39M55r50J82Q53j609
$$ -247 -67 77 296 -188 -242 253 487 -86 735 -207 261 -123 835 482 -157 298 -652 -470 383 -1226
9987a226K123r99j87n9J57O69p99J479j228J164q22M94p21k10O99j387K191j829
$$ -1226 897 -102 -289 -348 -191 478 -321 1158 -70 1094 272 766 45 -165 534 -853 1338 -491
10005d91j83L45p2Q88j013P33j161J448l47j018J419j63k42l65N89j42l1K16j287
$$ -491 -674 -329 -401 487 -526 207 -954 494 147 -871 548 385 143 -222 367 225 194 410 -877
10024h77P85N0N41j40j62j018J159M21o23K30m15j231P86q29J400j43p5o45O42
$$ -877 -92 -42 499 359 197 -821 338 759 136 366 -49 -1280 -494 -1323 77 -66 -141 -786 -144
10043a44N76l76N27m10k59p47J046p09R68o54J647j245q84Q41L9j028O63J1q18
$$ -144 432 56 583 173 -86 -833 213 -496 472 -182 1465 220 -664 177 216 -812 -149 -138 -956
10062i56N15j018J889o58R6K3M86j68rJ20p50K70R97r66J222j067L10m89m41Q59
$$ -956 -441 -1459 430 -228 -132 -109 377 209 200 320 -430 -160 837 -129 1093 26 336 -153 -594 265
10082B65j148J510r4n31K45p11N7p58R56Q3N64M18r39q0p26P69R67n08p18P31
$$ 265 -883 627 533 2 247 -464 -407 -1165 -209 -126 438 856 -83 -163 -889 -120 847 339 -379 352
10102C52q92l64J463j623R30K7n61J325n84J519k695Q90J18Q34n36m95J83M22
$$ 352 -540 -904 559 -1064 -134 -107 -668 657 73 1592 -1103 -213 -95 739 203 -292 -109 313
10120C13m25L73K17M49j680P54m63L93O08j787J174k38R16l64l00Lj82J3N4M14
$$ 313 -112 261 478 927 -753 1 -462 -69 539 -1248 -74 -312 604 240 -60 -57 -239 -226 -172 242
10140B42m17J848j07r92j133n58J092M05n46Q78M37J69n80p98K11l6o84k82O14
$$ 242 -175 1673 1566 574 -559 -1117 -25 380 -166 712 1149 1318 738 -60 151 115 -569 -851 -237
10159b37Q70o81M74K09j032Q0R43j344J308Q06j949O92q44J297n87O91L81j032
$$ -237 633 -48 426 635 -397 -317 626 -718 590 1396 -553 139 -705 592 5 696 1077 45
10177D5J97k26n75M19N15k71j041Q15N35p6q13o80Q89l0J434j526J903k323O5
$$ 45 242 16 -559 -140 375 104 -937 -122 413 337 -476 -1156 -267 -297 1137 -389 1514 -809 -744
10196g44P08R66j312o12J090Q3k39K99j59m89M41k37p4P90n89J68O31j097K07
$$ -744 -36 930 -382 -994 96 179 -60 239 80 -409 32 -205 -279 511 -78 90 721 -376 -169
10215a69M10P82o77r79J167p40J82j53M7n89R93Q1N45j64j464k49N76J475j670
$$ -169 241 1023 346 -633 534 -206 -24 -177 -130 -719 274 355 900 736 -728 -977 -401 1074 -596
10234e96L51n4q18J663j534R76L15n53l22J169j155R80r34L31O63j238K150k102
$$ -596 -245 -299 -1117 546 -988 -12 303 -250 -572 597 -558 422 -512 -181 482 -756 1394 -708
10252g08Pn32O34K147j066l07j076O18L89m91O18j640R31K47K5q3j52j2J00Q85
$$ -708 -701 -1233 -599 1548 482 175 -901 -283 106 -385 233 -1407 -476 -229 -204 -287 -439 -451 -351 534
10272E34j752J118N00j625J324P40M16j530K84j55J758j849L74o4q52J011J72
$$ 534 -1218 -100 400 -1225 99 839 1255 -275 9 -146 1612 -237 137 73 -779 232 404
10289D04p51l12J014o67J53O01m29N1J26q61J550j183J188j215n58K334k567R65
$$ 404 -347 -659 355 -312 -159 442 13 64 190 -671 879 -304 884 -331 -889 1445 -1122 -157
10307a57L57L73l87p07J420o89r81M83J53J00m52L42R35k42m96j357R45k09J141
$$ -157 200 573 186 -521 899 210 -771 -288 -135 -35 -487 -145 790 548 52 -1305 -360 -569 572
10326E72q07R68o39q80R09K04p01O01J34k20l62M90R4k87J54r6q18J185L83j401
$$ 572 -235 733 94 -786 123 327 -374 227 361 141 -221 269 363 76 230 134 -684 501 884 -517
10346e17K44k08Q93P89k377K015l71j550J587m77j194Q48O11r38J142m6k97J72
$$ -517 -273 -481 412 1201 -1176 839 468 -1082 505 28 -1166 -318 293 -645 497 451 154 326
10364C26m38J058j930J898m96r93L16j045K388j514J786j663Q18l12o57N17k03
$$ 326 -112 946 -984 914 418 -575 -259 -1304 1084 -430 1356 -307 511 199 -458 59 -144
10381a44j4j183K209m73j097K089k011N99j70j06j21N56L35J11l14j045J347k02
$$ -144 -158 -1341 868 395 -702 1387 -624 -25 -195 -301 -422 134 469 580 266 -779 568 366
10399C66m17m0j36O17q70Q38j635o0J416j006Q40O38k57l05j08K27M79j033M23
$$ 366 -51 -91 -227 390 -480 358 -1277 -1337 79 -927 -87 551 294 -11 -119 108 587 -446 -23
10418b3K09R8k54L55J08q35Q05K0L48j236K39Q02o79M63l1J557j955K37j28q3
$$ -23 186 284 30 385 493 -342 463 483 831 -405 -166 636 -43 420 389 1946 -9 228 100 17
10438A7K59p88N35j039P35l73J039K4j196J053l5o34r16N55J145j75P7Q8j05n25
$$ 17 276 -512 23 -1016 -281 -654 385 409 -787 266 231 -403 -1319 -764 381 206 283 371 266 -259
10458b59K14P13n88P73l27r60R26r18R87j279J034m98J66m2p27P89r35J867k009
$$ -259 -45 668 80 853 526 -434 492 -426 561 -718 316 -182 -16 -58 -785 4 -931 936 -1073
10477a073J617p92K2J86p84J533j148R68j596R02m03R53R7p29L74J83q14N12Q57
$$ -1073 544 -248 -226 -40 -824 709 -439 529 -1067 -165 -568 385 482 -247 127 310 -504 8 865
10496H65o33j009J676m66p01n42J864p53m77R21j078P08o89k07N48k72j66R46
$$ 865 232 -777 899 433 -268 -810 1054 301 -176 745 -333 375 -314 -521 27 -245 -411 535
10514E35o14K22Q5l99K42O52n50q81J139j316Q14J403j209j22K12j38l68P46j1
$$ 535 -79 143 228 -171 71 723 173 -708 431 -885 -71 1332 123 1 213 75 -293 453 442
10533D42j129J196r91M22L17j61j85L49p42K71k24O20q08P54m31J111j081j77
$$ 442 -687 509 -482 -60 257 96 -89 260 -482 -211 -435 185 -623 131 -300 811 -270 -447
10551d47J133j236O60j767J903o62J052M94j392J288q58L99j819J559K85j013
$$ -447 686 -550 110 -1657 246 -416 636 1130 -262 1026 168 567 -1252 307 592 -421
10567d21R64k032K222j267L13J056j039M41k030L086q34K32o65L44l29n23R19
$$ -421 543 -1489 733 -534 -221 835 -204 237 -1793 1293 459 691 26 370 41 -482 437
10584D37j01j573K40J139k18M54o33J96M60K4r79O18K44K20j001M67m75J321n41
$$ 437 336 -1237 -997 142 -76 378 -255 -59 401 425 -554 64 308 528 -473 -6 -481 840 299
10603B99o02q91P28K69j17J312j784M87N48J51o85P34j349J946j100p66J547j070
$$ 299 -303 -1194 -466 -197 -314 998 -786 -299 249 400 -285 449 -900 1046 -54 -820 727 -343
10621c43J064j514O37N79j50L77m28R34j845M88o47K59J185l40p8j526J410l95
$$ -343 721 -793 -156 423 273 650 222 1156 -689 -201 -848 -589 596 256 178 -1348 62 -333
10639c33K31J20j011J162l44K46j6K29k44Q6J195k377m75J440J4J22k47J02j15
$$ -333 -102 18 -993 169 -175 71 55 284 40 126 1321 -1056 -1531 -91 -77 45 -202 -100 -215
10658b15M63q97J011m99P50L18p89j2n64J327q08k65L93P44o22j017K80O66j319
$$ -215 248 -649 362 -137 613 931 142 130 -434 893 85 -180 213 957 335 -682 -402 264 -1055
10677a055N13N89L36J87j840J259L1M19O4q55K47K34L64j468J043p37K90J256
$$ -1055 -542 47 383 570 -1270 -11 20 439 503 -352 -105 129 493 -975 68 -669 -379 877
10695H77o69o0q2J75J251k132R42q04J002J42j33n91p42J982p96j34n7N76K96
$$ 877 208 148 66 241 1492 -640 302 -502 500 642 509 -82 -824 1158 362 228 171 747 1043
10714A043j472K99L57k3k52k04k84J46J041j832P28m50N61Q14l01P76n90L93j072
$$ 1043 -429 -130 227 204 -48 -252 -536 -390 651 -1181 -453 -903 -342 472 171 947 357 750 -322
10733c22J043r32n43J275r18P60m4j4M8j24M57j834J823k02L94n2o00n8l52Q09
$$ -322 721 -211 -754 521 -397 363 319 305 353 229 686 -1148 675 473 867 815 215 157 -195 614
10753F14R11k482O76o49J479j93l5J88n38P35m94r66J66Q36j233O32J216r40P87
$$ 614 1525 -957 -281 -930 549 356 321 509 -29 706 212 -754 -588 248 -985 -353 863 -77 710
$$ [...]
16383g81
##END NTUPLES=NMR FID
##END=
