##TITLE=31P_DE-80H_X3
 64 sc D2O
 26.2.2025
##JCAMPDX= 6.0         $$ Bruker NMR JCAMP-DX V2.0
##DATA TYPE= NMR FID
##DATA CLASS= NTUPLES
##ORIGIN= UXNMR, Bruker Analytische Messtechnik GmbH
##OWNER= root
$$ XWIN-NMR		Version 3.5
$$ Wed Jun 24 11:33:58 2026 Russian Standard Time (UT+4h)  Yarkov@DPX200
##.OBSERVE FREQUENCY= 81.013821
##.OBSERVE NUCLEUS= ^31P
##.DELAY= (6, 6)
##.ACQUISITION MODE= SIMULTANEOUS
##.ACQUISITION SCHEME= undefined
##.AVERAGES= 64
##.DIGITISER RES= 17
##SPECTROMETER/DATA SYSTEM= spect
##.PULSE SEQUENCE= zgpg30
##.SOLVENT NAME= D2O
##.SHIFT REFERENCE= (INTERNAL, D2O, 0, 243.863)
##AUDIT TRAIL= $$ (NUMBER, WHEN, WHO, WHERE, WHAT)
$$ ##TITLE= Audit trail, XWIN-NMR		Version 3.5
$$ ##JCAMPDX= 5.01
$$ ##ORIGIN= Bruker BioSpin GmbH
$$ ##OWNER= Yarkov
$$ C:/Bruker/XWIN-NMR/data/yarkov2/nmr/P31/2/audita.txt
$$ ##AUDIT TRAIL=  $$ (NUMBER, WHEN, WHO, WHERE, WHAT)
(   1,<2026-06-24 11:33:27.29 +0400>,<Yarkov>,<DPX200>,
      <created by zg, POWCHK disabled, PULCHK disabled
       configuration hash MD5:
       00 E9 B6 7A A2 85 ED C7 34 08 36 98 17 FE 4E 26
       data hash MD5: 32K
       D0 A9 2B C5 D2 30 AA 25 68 C9 0C 53 37 DB 6D B4>)
$$ ##END=
$$ 
$$ hash MD5
$$ 3E 9D 2C 06 3D 49 20 83 84 3E 66 5B E4 19 FC E8
##$RELAX= 
##$RELAX= 
##$RELAX= 
##$RELAX= 
##$RELAX= 
##$RELAX= 
##$RELAX= 
##$RELAX= 
$$ Bruker specific parameters
$$ --------------------------
##$DU= <C:/Bruker/XWIN-NMR>
##$EXPNO= 2
##$NAME= <P31>
##$PROCNO= 1
##$TYPE= <nmr>
##$USER= <yarkov2>
##$AMP= (0..31)
100 100 100 100 100 100 100 100 100 100 100 100 100 100 100 100 100 100 
100 100 100 100 100 100 100 100 100 100 100 100 100 100 
##$AQSEQ= 0
##$AQ_mod= 1
##$AUNM= <au_zg>
##$AUTOPOS= <>
##$BF1= 81.014009
##$BF2= 200.13
##$BF3= 200.13
##$BF4= 200.13
##$BF5= 200.13
##$BF6= 200.13
##$BF7= 200.13
##$BF8= 200.13
##$BYTORDA= 1
##$CFDGTYP= 0
##$CFRGTYP= 5
##$CHEMSTR= <none>
##$CNST= (0..31)
1 1 145 1 1 1 1 1 1 1 1 1 1 1 1 1 1 1 1 1 1 1 1 1 1 1 1 1 1 1 1 1 
##$CPDPRG= <waltz16>
##$CPDPRG1= <>
##$CPDPRG2= <waltz16>
##$CPDPRG3= <>
##$CPDPRG4= <mlev>
##$CPDPRG5= <mlev>
##$CPDPRG6= <mlev>
##$CPDPRG7= <mlev>
##$CPDPRG8= <mlev>
##$CPDPRGB= <>
##$CPDPRGT= <>
##$D= (0..31)
0 1 0 0 0 0 0 0 0 0.06 0 0.03 2e-05 3e-06 0 0 0.0002 0 0 0 0 0 0 0 0 0 
0 0 0 0 0 0 
##$DATE= 1782286406
##$DBL= (0..7)
120 120 120 11 120 120 24 19 
##$DBP= (0..7)
150 150 150 150 150 150 150 150 
##$DBP07= 0
##$DBPNAM0= <>
##$DBPNAM1= <>
##$DBPNAM2= <>
##$DBPNAM3= <>
##$DBPNAM4= <>
##$DBPNAM5= <>
##$DBPNAM6= <>
##$DBPNAM7= <>
##$DBPOAL= (0..7)
0.5 0.5 0.5 0.5 0.5 0.5 0.5 0.5 
##$DBPOFFS= (0..7)
0 0 0 0 0 0 0 0 
##$DE= 6
##$DECBNUC= <off>
##$DECIM= 4
##$DECNUC= <off>
##$DECSTAT= 4
##$DIGMOD= 1
##$DIGTYP= 9
##$DL= (0..7)
0 0 52 120 120 21 21 25 
##$DP= (0..7)
150 150 150 150 150 150 150 150 
##$DP07= 0
##$DPNAME0= <>
##$DPNAME1= <>
##$DPNAME2= <>
##$DPNAME3= <>
##$DPNAME4= <>
##$DPNAME5= <>
##$DPNAME6= <>
##$DPNAME7= <>
##$DPOAL= (0..7)
0.5 0.5 0.5 0.5 0.5 0.5 0.5 0.5 
##$DPOFFS= (0..7)
0 0 0 0 0 0 0 0 
$$ [...]
##$SUBNAM1= <"">
##$SUBNAM2= <"">
##$SUBNAM3= <"">
##$SUBNAM4= <"">
##$SUBNAM5= <"">
##$SUBNAM6= <"">
##$SUBNAM7= <"">
##$SUBNAM8= <"">
##$SUBNAM9= <"">
##$SW= 400.765351723535
##$SWIBOX= (0..15)
0 1 3 0 0 0 0 0 0 0 0 0 0 0 0 0 
##$SW_h= 32467.5324675325
##$TD= 32768
##$TD0= 1
##$TE= 0
##$TE2= 300
##$TE3= 300
##$TEG= 300
##$TL= (0..7)
0 120 53 12 22 120 120 120 
##$TP= (0..7)
150 150 150 150 150 150 150 150 
##$TP07= 0
##$TPNAME0= <>
##$TPNAME1= <>
##$TPNAME2= <>
##$TPNAME3= <>
##$TPNAME4= <>
##$TPNAME5= <>
##$TPNAME6= <>
##$TPNAME7= <>
##$TPOAL= (0..7)
0.5 0.5 0.5 0.5 0.5 0.5 0.5 0.5 
##$TPOFFS= (0..7)
0 0 0 0 0 0 0 0 
##$TUNHIN= 0
##$TUNHOUT= 0
##$TUNXOUT= 0
##$USERA1= <user>
##$USERA2= <user>
##$USERA3= <user>
##$USERA4= <user>
##$USERA5= <user>
##$V9= 5
##$VALIST= <valist>
##$VCLIST= <CCCCCCCCCCCCCCC>
##$VD= 0
##$VDLIST= <DDDDDDDDDDDDDDD>
##$VPLIST= <PPPPPPPPPPPPPPP>
##$VTLIST= <TTTTTTTTTTTTTTT>
##$WBST= 1024
##$WBSW= 4
##$XGAIN= (0..3)
0 0 0 0 
##$XL= 0
##$YL= 0
##$YMAX_a= 8078
##$YMIN_a= -3432
##$ZGOPTNS= <>
##$ZL1= 120
##$ZL2= 120
##$ZL3= 120
##$ZL4= 120
##$ABSF1= 60
##$ABSF2= -190
##$ABSG= 5
##$ABSL= 3
##$ALPHA= 0
##$AQORDER= 0
##$ASSFAC= 0
##$ASSFACI= 0
##$ASSFACX= 0
##$ASSWID= 0
##$AUNMP= <proc_1d>
##$AZFE= 0.1
##$AZFW= 0.5
##$BCFW= 1
##$BC_mod= 2
##$BYTORDP= 1
##$COROFFS= 0
##$CY= 9.86611175537109
##$DATMOD= 1
##$DC= 1
##$DFILT= <>
##$DTYPP= 0
##$F1P= 182.462994727601
##$F2P= 168.069089081705
##$FCOR= 0.5
##$FTSIZE= 0
##$FT_mod= 0
##$GAMMA= 1
##$GB= 0
##$INTBC= 1
##$INTSCL= 1
##$ISEN= 30
##$LB= 1.5
##$LEV0= 0
##$LPBIN= 0
##$MAXI= 11.51145
##$MC2= 0
##$MEAN= 0
##$ME_mod= 0
##$MI= 1.244541
##$NCOEF= 0
##$NC_proc= 0
##$NLEV= 6
##$NOISF1= 0
##$NOISF2= 0
##$NSP= 1
##$NTH_PI= 0
##$NZP= 1
##$OFFSET= 243.8632
##$PC= 1.4
##$PHC0= 1583.601
##$PHC1= 73.15952
##$PH_mod= 0
##$PKNL= yes
##$PPARMOD= 0
##$PSCAL= 0
##$PSIGN= 0
##$REVERSE= no
##$SF= 81.0140731611343
##$SI= 65536
##$SIGF1= 0
##$SIGF2= 0
##$SINO= 80
##$SIOLD= 65536
##$SREGLST= <31P.CDCl3>
##$SSB= 0
##$STSI= 0
##$STSR= 0
##$SW_p= 25641.0256410257
##$SYMM= 0
##$S_DEV= 0
##$TDeff= 0
##$TDoff= 0
##$TI= <>
##$TILT= no
##$TM1= 0
##$TM2= 0
##$TOPLEV= 0
##$USERP1= <user>
##$USERP2= <user>
##$USERP3= <user>
##$USERP4= <user>
##$USERP5= <user>
##$WDW= 1
##$XDIM= 64
##$YMAX_p= 0
##$YMIN_p= 0
$$ End of Bruker specific parameters
$$ ---------------------------------
##NTUPLES= NMR FID
##VAR_NAME=  TIME,          FID/REAL,        FID/IMAG
##SYMBOL=    X,             R,               I
##VAR_TYPE=  INDEPENDENT,   DEPENDENT,       DEPENDENT
##VAR_FORM=  AFFN,          ASDF,            ASDF
##VAR_DIM=   16384,         16384,           16384
##UNITS=     SECONDS,       ARBITRARY UNITS, ARBITRARY UNITS
##FACTOR=    3.08e-05,      1,               1
##FIRST=     0,             0,               0
##LAST=      0.5045964,     0,               0
##MIN=       0,             -3432,           0
##MAX=       0.5045964,     8078,            0
$$ Real data points
##PAGE= N=1
##DATA TABLE= (X++(R..R)), XYDATA
$$ [...]
9467B83r02R75o45O11l37j000J617j184R37r92Q44J927l393K054j289J274j225
$$ 283 -619 356 -289 322 -15 -1015 602 -582 355 -637 207 2134 -1259 795 -494 780 -445
9484d45j39J266j373J809j717N82j148M07O36m22o58M9Q04K26p3J230j220N51
$$ -445 -584 682 -691 1118 -599 -17 -1165 -758 -122 -544 -1202 -1153 -349 -123 -196 1034 -186 365
9502C65o73L35q11J791n30j326P07p82K557j593J3J225k586J977k163J523O22
$$ 365 -308 27 -784 1007 477 -849 -142 -924 1633 40 53 1278 -1308 669 -1494 29 651
9519F51j358K14l36J071p38J629j304N45p79n21J165r7K22n18J03P50k234J209
$$ 651 -707 -493 -829 242 -496 1133 -171 374 -405 -926 239 142 364 -154 -51 699 -1535 -326
9537c26NL79l37k41Q87k22n12o13O79J077m45j389J136k00n03J227O7m77Q25j059
$$ -326 -321 58 -279 -520 367 145 -367 -980 -301 776 331 -1058 78 -122 -625 602 669 192 1017 -42
9557d2Q76j439J164l22k90P77q21O66j234J05J099p19J63l63M60M42j683J724
$$ -42 834 -605 559 237 -53 724 -97 569 -665 -560 539 -180 -17 -380 80 522 -1161 563
9575E63o51J034j214J65L26j613N59L93J195j384J118o98r85J079j155K866k120
$$ 563 -88 946 -268 -103 223 -1390 -831 -438 757 -627 491 -207 -1192 -113 -1268 1598 -522
9592e22O33O98j321l28q02J963r97K024j329m19J152o75K36J009j743P56r66J614
$$ -522 111 809 -512 -840 -1642 321 -676 1348 19 -400 752 77 313 1322 -421 335 -631 983
9610I83j293M53r67J127l44m30J452r97L32q80R27O40j681J838k067J170r52J546
$$ 983 -310 143 -824 303 -41 -471 981 -16 316 -564 363 1003 -678 1160 -907 263 -689 857
9628H57l74j294L58n3L66l57P41p9k25J369j368K8l5R28L43j768J468n29p37n5
$$ 857 483 -811 -453 -506 -140 -497 244 165 -60 1309 -59 -31 -66 862 1205 -563 905 376 -361 -416
9648d16J182k40k58m8l33m53J342o98N84j7m49o45J337l24j923J515L80o98Q75
$$ -416 766 526 268 220 -113 -566 776 78 662 645 196 -449 888 564 -1359 156 536 -162 713
9667G13j673J305k134J388m8J174p94m58R56j712K209j076j4Q5q50J938j382N01
$$ 713 -960 345 -1789 -401 -449 725 -69 -527 429 -1283 926 -150 -164 -79 -929 1009 -373 128
9685A28n41M27j37p57P88l2J223j620Q39m38j79K21l48J082j690J424O4j248J157
$$ 128 -413 14 -123 -880 -92 -124 1099 -521 318 -120 -299 -78 -426 656 -1034 390 454 -794 363
9704C63j63Q64j737J102o2m83Q08R0P25j903J14Q32p42j52p03J489P02j285l13
$$ 363 200 1064 -673 429 367 -116 692 782 1507 -396 -282 550 -192 -344 -1047 442 1144 -141 -454
9723d54N92P0j909K899L14j522J18q90K207k329O13O97j153J477O9j011j41J097
$$ -454 138 208 -1701 1198 1512 -10 108 -782 1425 -904 -291 406 -747 730 799 -212 -353 744
9741G44q46N62Q0J06j036N94l81J01o44J045l88O79L90k026J426j154J527j027
$$ 744 -102 460 540 646 -390 204 -177 -76 -720 325 -63 616 1006 -1020 406 -748 779 -248
9759b48Q02j030j90J832j613R28o68O97j324R81M44j690J561o75J207o27o4k85
$$ -248 554 -476 -666 1166 -447 481 -187 510 -814 167 611 -1079 482 -193 1014 387 323 38
9777C8m20Q95m06N56j344k6J151j033Q25j153N02K93o92K277k149J674j618O04
$$ 38 -382 513 107 663 -681 -707 444 -589 236 -917 -415 -122 -814 1463 -686 988 -630 -26
9795b6J14k54J193j319P07j456Q60K15j727K789j217P33j309Q30K84p63k15J30
$$ -26 88 -166 1027 -292 415 -1041 -181 34 -1693 1096 -121 612 -697 133 417 -346 -561 -431
9813d31J430j794L20N9l07J144k79P72k174J625j50l91J352k241K04j00J695O84
$$ -431 999 -795 -475 -416 -723 421 142 914 -1260 365 215 -176 1176 -1065 -861 -961 734 1418
9831A418k094J505j877J246j092P44R19o74J55k72O66j446J615N46j183R0O4j452
$$ 1418 -676 829 -1048 198 -894 -150 769 95 250 -22 644 -802 813 1359 176 266 330 -1122
9849a122J64R00l87N12J53M0r78J38j83J758j857N53J22k52R67j202J469j445
$$ -1122 -958 -58 -445 67 220 260 -718 -580 -763 995 -862 -309 -187 -439 528 -674 795 -650
9867f50M33O47j225P2j83L205l456N43J763q74l98j272K332k676J395J53l08R82
$$ -650 -217 430 -795 -723 -906 2299 -1157 -614 1149 275 -123 -1395 937 -1739 -344 -191 -499 483
9885D83r51J362r43J94p1m79O18j617K531j530N69j54j47l25R64kq72J42K24q18
$$ 483 -468 894 -49 145 74 -405 213 -1404 1127 -403 166 12 -135 -460 504 502 -370 -228 -4 -822
9905h22J719j565k9j1M54J159r74k67J83k55m56J584k30j726J372p38Q47j221
$$ -822 897 -668 -697 -708 -254 905 -69 -336 -153 -408 -864 720 490 -1236 136 -602 245 -976
9923i76M60N89r6j35j041R40O43m31r96J138o12J128j11l06n49N7n04J673k93
$$ -976 -516 73 -23 -158 -1199 -259 384 -47 -1043 95 -517 611 500 194 -355 -298 -802 871 578
9942E78m78j60j26L61J49L25n35j10K88p65P20J178q91j37p94O21l27O52j773
$$ 578 100 -60 -186 175 324 649 114 4 292 -473 247 1425 534 397 -397 224 -103 549 -1224
9961a224R61J129j179m7p46J935k481K023L8q25J172r52K122k320M54Q28q80Q75
$$ -1224 -263 866 -313 -360 -1106 829 -1652 371 409 -416 756 -196 1926 -394 60 888 8 883
9979H83m11O23j510J259L4j342P68j113N12l53K93J40M44M72j746P96j15O82M1
$$ 883 472 1095 -415 844 878 -464 304 -809 -297 -650 -357 -217 227 699 -1047 -251 -366 316 357
9998C57Q3O21j588P04n60R09n34N65L19j721Q93l78r1P41k27m35O3Q15p1k93n23
$$ 357 440 1061 -527 177 -383 526 -8 557 876 -845 48 -330 -421 320 93 -342 -279 536 465 172 -351
10019c51M2K17K11R44j126m69J065q51r52J041oj42K21O2o51J222J5j724K198
$$ -351 -309 -92 119 1063 -63 -532 533 -318 -1270 -229 -235 -377 -156 -94 -745 477 492 -1232 966
10038I66J86j267J5R09q00M91j407P47R5L9o3N54m87N46j139J810j025O97l0j617
$$ 966 1152 -115 -100 809 9 500 -907 -160 -65 -26 -89 465 -22 524 -615 1195 170 867 837 -780
10058g80O13K23o45M30J01J38j662K844j249K97r64J31J64k87J959j910J283j430
$$ -780 -167 56 -589 -159 -58 80 -1582 1262 13 310 -654 -523 -359 -646 1313 -597 686 -744
10076g44J075k65j546J868n23N84m75P36j112O87O19p90nm27Q46j085K50N97m65
$$ -744 331 66 -1480 388 -135 449 -26 710 -402 285 904 114 109 -318 528 -557 -307 290 -175
10095a75Q09j338J494j108O15J69j348R79N3N59l56p17R82l0j49k68r53R86K99
$$ -175 634 -704 790 -318 297 466 -882 97 150 709 353 -364 618 588 439 171 -782 204 503
10114E03j170Q12J03r66L90O30r28J809p58M74n91Q4n18l03k91O33m36P35o28
$$ 503 -667 145 248 -718 -328 302 -626 1183 425 899 308 392 -126 -429 -720 -87 -523 212 -416
10133d16J084p85P69q30j9k51N0Q45J66j127J19P52q56J45J16k71Q09o68J129
$$ -416 668 -117 652 -178 -197 -448 -398 447 613 -514 -395 357 -499 -354 -238 -509 300 -368 761
10152G61Q46k391J469j038kP01j013P88l91O5j28J246j471L7P93j579J546q04
$$ 761 1607 -784 685 -353 -355 346 -667 121 -270 -205 -333 913 -558 -521 272 -1307 239 -565
10170e65J464j748J850n15q11J477j867N55J12L96k4j087J354r67J133q78k71
$$ -565 899 -849 1001 486 -325 1152 -715 -160 -48 348 324 -763 591 -376 757 -121 -392
10187c92Q78k76P81o56M94j550R38L94r81R85j042J219l15q2j54m44J57j000N39
$$ -392 486 210 991 335 829 -721 217 611 -370 615 -427 792 477 395 241 -203 -46 -1046 -507
10206e07J55m98J630p95j86o21P31K32O9l58L21j06O7n23J048k3o33m59J137j66
$$ -507 -352 -850 780 -15 -201 -822 -91 141 210 -148 173 67 134 -389 659 636 3 -456 681 515
10226E15j512M93k31N37L89r33J362j78j74j84J168j513m22K15k82J566j467J571
$$ 515 -997 -504 -735 -198 191 -742 620 442 268 84 1252 -261 -683 -468 -750 816 -651 920
10244I20o87j476J190K52P87j554J078J12r46K06J72k16j054J551q85n79J533
$$ 920 233 -1243 -53 199 986 -568 510 622 -324 -118 54 -162 -1216 335 -550 -1129 404
10261D04m88L3O71j09q17j74R79j357K628l275J970j489N28N06r39J942j359j5
$$ 404 -84 -51 620 511 -306 -480 499 -858 1770 -1505 465 -1024 -496 10 -929 1013 -346 -361
10279c61l17N04j96r25J698r15P4M32n41Q76J56O91j242Q24j260M78O03r61M78
$$ -361 -678 -174 -370 -1295 403 -512 -438 -6 -547 329 485 1176 -66 758 -502 -24 579 -382 96
10298I6j615J044n09Q12J67o0P22j347K84K5J214k15j692J570n82Q72k52r05J053
$$ 96 -1519 -475 -984 -172 -5 -65 657 -690 -406 -381 833 618 -1074 496 -86 786 534 -371 682
10317F82j100Q9N94o81j1J21P89k18l01J129j513J153r49l64M81m74Q48j02k53
$$ 682 -418 -329 265 -416 -427 -306 483 265 -36 1093 -420 733 -216 -580 -99 -573 275 173 -80
10336h0q52J334o54Q28P19j522j14m04R58k32K66Q67k094O64K05O27q80J074K56
$$ -80 -932 402 -252 576 1295 -227 -341 -745 213 -19 247 1114 -980 -316 -111 516 -364 710 966
10355I66k161J009l97J133j785J705m58j139J543q68J376p46p06N47q4j73M89
$$ 966 -1195 -186 -583 550 -1235 470 12 -1127 416 -452 924 178 -528 19 -65 -238 251
10372B51l23L21%O88j105j89n24O60j15J188n63m78J382k746J718L11M47j705
$$ 251 -72 249 249 937 -168 -357 -881 -221 -336 852 289 -189 1193 -1553 165 476 923 -782
10390g82N96Q48q8o67L19N67q74m81J548k113K070j430L12K57M40L28r54O86N35
$$ -782 -186 662 574 -93 226 793 -81 -562 986 -1127 943 -487 -175 82 522 850 -104 582 1117
10409A117k056J300o01P38p81K4Q12j340J707n39q15M22p5J13K02j66p0j56l8
$$ 1117 -939 361 -240 498 -283 -259 553 -787 920 381 -434 -12 -87 26 228 62 -8 -164 -202
10428b02M1J322j468J98K65n6j39j096L06P20l85L52r02K080j656R20L84p63j462
$$ -202 -161 1161 -307 -109 156 100 -39 -1135 -829 -109 -494 -142 -1044 1036 -620 300 684 -79 -1541
10447a541J562K97j642J967j185J493j314m10O18j400K030j148O93L49r98J414
$$ -1541 21 318 -1324 643 -542 951 -363 -773 -155 -1555 475 -673 20 369 -629 785
10463G85r28J158p97N09j550L07J407j588M02m81J372p15Q4N72j420K0j30k17
$$ 785 -143 1015 218 727 -823 -516 891 -697 -295 -776 596 -119 -35 537 -883 -863 -993 -1210
10481a210J710J10r62L86R87j193M75l55p4l37J109k29j230J151k79r13R91k36
$$ -1210 500 610 -352 34 1021 -172 303 -52 -126 -463 646 417 -813 338 59 -854 137 -99
10499i9L96j230J374r73P25N38o50M20j043J33J24O02l72L27p82N84m61R98J21
$$ -99 297 -933 441 -532 193 731 81 501 -542 -409 -285 317 -55 272 -510 74 -387 611 732
10518G32m2j373R13K86J78q96K55P2M56j647J869j845J655j345Q35k12l46J086
$$ 732 690 -683 230 516 694 -202 53 125 581 -1066 803 -1042 613 -732 103 -109 -455 631
10536F31j510K589k598J338n16o29J290j571K137k153J751j74k49O89j432J465
$$ 631 -879 1710 -888 450 -66 -695 595 -976 1161 -992 759 585 336 1025 -407 1058
10552A058k271J145n14J070L27j362J330j853L37P78K3j42j008J614r55P44r04
$$ 1058 -1213 -68 -582 488 815 -547 783 -1070 -733 45 68 -74 -1082 532 -423 321 -583
10569e83q8J408r82J346j220J512k594J137q0R1J92l56K68n55N23j53n67R82J9
$$ -583 -671 737 -245 1101 -119 1393 -1201 -64 -144 -53 139 -217 51 -504 19 -134 -701 281 300
10588C00p5p97L07n5j81k49K8L67k0m32J215R66j593j052Q54N95N53n34r71O82
$$ 300 225 -572 -265 -320 -501 -750 -722 -355 -375 -807 408 1374 -219 -1271 -417 178 731 197 -774 -92
10608i2p97K065j372j080J212k56q28J633q66J202j854J585j005q4O21q34J291
$$ -92 -889 1176 -196 -1276 -64 -320 -1148 485 -381 821 -1033 552 -453 -537 84 -750 541
10625E41n42L73j795R20O86n19J15j10P14l96p98K204k740J987o00R96j760k50
$$ 541 -1 372 -1423 -503 183 -336 -221 -331 383 -13 -811 1393 -1347 640 40 1036 -724 -974
10643i74J241p70N99M18J98q17k12j92N22J36l77K32N35q69J88M92k35o59l4M66
$$ -974 267 -503 96 514 712 -105 -317 -509 13 149 -228 4 539 -330 -142 350 115 -544 -578 -112
10663a12N21j169M20L12M55j36m50o20M30j28O62J39m89k06q70Q16N07R21j203
$$ -112 409 -760 -340 -28 427 291 -159 -779 -349 -477 185 324 -165 -371 -1241 -425 82 1003 -200
10682b00Q4p33N79%o39J718q11P80Q27j133K10k47l17j34JOoO15j259J307o24
$$ -200 -116 -849 -270 -270 -909 809 -2 778 1605 472 682 435 118 -16 -15 -9 -15 600 -659 648 24
10703B4K97n07j22N91n77l00J634j760J706n72k68K32M36j475J300m31n52N39
$$ 24 321 -186 -308 283 -294 -594 1040 -720 986 414 146 378 814 -661 639 208 -344 195
10721A95r67J119L19n12o93L4J426q18k71N61j411K530k851J812q86l51N76k97
$$ 195 -772 347 666 154 -539 -505 921 103 -168 393 -1018 1512 -1339 473 -413 -764 -188 -485
10739d85R34j31J06N4%j548L98J617j686R97p70J742J01k545K488k016J579r95
$$ -485 449 318 424 478 478 -1070 -672 945 -741 256 -514 1228 1329 -1216 1272 -744 835 -160
10757a60J298k3j146M11o77P84l08K70m12r31Q06r72R34r5j0L89m57J68q0M74
$$ -160 1138 1115 -31 380 -297 487 179 449 37 -894 -88 -1060 -126 -221 -231 158 -299 -131 -211 263
10777B63r11J682m11j523N30K32M02j136J601n31j454K180j467O55o72M09O7j47
$$ 263 -648 1034 623 -900 -370 -138 264 -872 729 198 -1256 924 -543 112 -560 -151 -84 -231
10795b31j67j72P01P39j196J407n38j265O8Q50O12j720O48L79q28L46P0L74m00
$$ -231 -398 -570 131 870 -326 1081 543 -722 -654 196 808 -912 -264 115 -713 -367 -297 77 -323
10814c23Q60r00J221k0j491J223j308J169j240O24k44N85J141k390Q92j1J000
$$ -323 537 -363 858 838 -653 570 -738 431 -809 -185 -429 156 1297 -1093 -201 -212 788
10831G88j34n92l83l47J359j275M88J046j669J550k043K757j536Q52k628J189
$$ 788 654 62 -321 -668 691 -584 -96 950 -719 831 -1212 1545 9 861 -1767 -578
10847e78J915j820P23j91k80k6J30J365j264n33p3J101J4j059J549j993J163o44
$$ -578 1337 -483 240 49 -231 -257 -127 1238 -26 -559 -632 469 483 -576 973 -1020 143 -501
10865e01J455L60k175J503q50J952j943j48R76j491J037j325J593k44l06K49M65
$$ -501 954 1314 -861 642 -208 1744 -199 -347 629 -862 175 -1150 443 199 -107 142 607
10882F07p33n05P03l89J63J21J61j27q57R89J08n64R51j257P18R87j015Q00q75
$$ 607 -126 -631 72 -317 -154 -33 128 1 -856 133 241 -323 628 -629 89 1076 61 861 -14
10901a4N53p77J146o03P3Q5p37J190r12m10j06N19M74j491J228j130K92J449j067
$$ -14 539 -238 908 305 378 463 -274 916 4 -406 -512 7 481 -1010 218 -912 -620 829 -238
10920b38M28j284K676j627k55q45N72J189o22l7j007J367mj087J335n75M00j426
$$ -238 190 -1094 1582 -45 -300 -1145 -573 616 -6 -43 -1050 317 313 -774 561 -14 386 -1040
10938a040J16J239r70J102j227J378j124J99k23P29K07q89J487j395J128j031
$$ -1040 -924 315 -655 447 -780 598 -526 -327 -550 179 386 -503 984 -411 717 -314
10954c14N07o03O60N38j597J038N31j134N34p33N59j7o67K309k322j1J64R29j220
$$ -314 193 -410 250 788 -809 229 760 -374 160 -573 -14 -31 -698 1611 -711 -722 -558 371 -849
10973h49J748n42J223j176q66J80q00P63Q47j217O76n77m8J270n50j28r09R33
$$ -849 899 357 1580 404 -462 -282 -1082 -319 528 -689 -13 -590 -638 632 82 -46 -955 -22
10991b2n3Q3N75l70P91l82q5l68o04J537k523K612j986P19J73k34J128r78L58
$$ -22 -75 8 583 213 1004 622 537 169 -435 1102 -1421 1191 -795 -76 97 -137 991 13 371
11010C71J48j2j95l53J14o47J611j182k65J044j449J425Q4m65n92J021k71j726
$$ 371 519 507 312 -41 73 -574 1037 -145 -410 634 -815 610 694 229 -363 658 387 -1339
11028a339J914j766O28l36O28P03j554K231j850K33l50R28P22j745K189k809J429
$$ -1339 575 -1191 -563 -899 -271 432 -1122 1109 -741 -508 -858 70 792 -953 1236 -1573 -144
11045a44J33R68j542k32Q95o66K79m12J362m13j126J751p84J613k771R12j81m11
$$ -144 -11 957 -585 -817 78 -588 -309 -721 641 228 -898 853 69 1682 -1089 -177 -358 -769
11063g69J534j162P42j837J425m36M72q2N48m65L7K97p5q99M14r8Q06K2q5o17
$$ -769 765 -397 345 -1492 -67 -503 -31 -113 435 -30 7 304 229 -670 -256 -354 452 474 389 -228
11083b28J6N94J43k42N2m8m97p35J064q49O09k51J014j088J386n34J169k051J041
$$ -228 -212 382 525 283 335 287 -210 -945 119 -730 -121 -372 642 -446 940 406 1575 -476 565
11102E65p02l18j110J246l57J91J058n97M73m25Q33m74p89P84o06M90M81m04j278
$$ 565 -137 -455 -1565 -319 -676 -485 573 -24 449 24 857 383 -406 378 -228 262 743 339 -939
11121i39j36J984j155J213r12l96M15k85J551k538K474j522J030M59j379J85j451
$$ -939 -1075 909 -246 967 55 -341 74 -211 1340 -1198 1276 -246 784 1243 -136 49 -1402
11138a402K814o58n02l46q09K068q89k12M07p48K00K07N94j948J653k004J226
$$ -1402 1412 754 252 -94 -903 1165 276 64 471 -277 -77 130 724 -1224 429 -1575 -349
11155c49K66n05Q46O5N47o32m58q85J567r73r5M58j91j07Q16O98q62M53r71K64
$$ -349 -83 -588 258 323 870 238 -220 -1105 462 -511 -606 -148 -339 -446 370 1068 206 659 -312 -48
11175d8j88J001j164O22l4O25j150Q1K19L13n13J152j869J560L11q22l58m94p00
$$ -48 -236 765 -399 223 189 814 -336 -255 -36 277 -236 916 -953 607 918 96 -262 -756 -1456
11194a456J532p1o43M70m5O7M61m74M80p1K25j900J030J6m90J412j229K418j920
$$ -1456 76 5 -638 -168 -213 -146 315 -159 321 250 475 -1425 -395 -379 -869 543 -686 1732 -188
11213a88P39j387J237J057k257J234j018P44K7j052Q73j249J208j018J843j483
$$ -188 551 -836 401 1458 -799 435 -583 161 188 -864 9 -1240 -32 -1050 793 -690
11229f90N51N4j034J970j179K16K90p56J249j427J507j217J402P2j362J276j319
$$ -690 -139 -85 -1119 851 -328 -112 178 -578 671 -756 751 -466 936 1008 -354 922 -397
11246c97J157k22l69O50j205Q8j99j26J72k66Q81k27m72q1J730o46l39j68j14
$$ -397 760 538 169 819 -386 -298 -497 -623 -451 -717 164 -63 -535 -616 1114 468 129 -39 -153
11265a53L29j32K07n33K32j64R13p13M63m99M34j066J033j59N56p61P0k0L10n96
$$ -153 176 44 251 -282 -50 -214 699 -14 449 -50 384 -682 351 192 748 -13 57 37 347 -249
11285b49P3N07m52j115Q29o60M73P19M56K97q45K75j730J913r28J023n09p62P53
$$ -249 -176 331 -121 -1236 -407 -1067 -594 125 581 878 33 308 -1422 491 -437 586 77 -685 68
11304F8r66J081p90O77M72j600R29J46P72o96l95Q03r81J156r76J288j667n19
$$ 68 -898 183 -607 70 542 -1058 -129 17 789 93 -302 501 -480 676 -300 988 -679 -1198
11322a198j27J363jo36J761k511J425L28p06R6m96J023J41m36K19m34M17m66L72
$$ -1198 -1325 38 37 -599 1162 -1349 76 404 -302 -206 -702 321 462 26 245 -189 228 -238 134
11341A34q78n8J422r85J152j174R87j169J081Q46j371L5L20P23k307J285Q61j472
$$ 134 -744 -802 620 -365 787 -387 600 -569 512 1358 -13 22 342 1065 -1242 43 904 -568
11359e68N34M52p40m73J215k40q77J524k97K70j515J66O71o96P10p41R07P04j377
$$ -568 -34 418 -322 -795 420 180 -697 827 530 800 -715 -549 122 -574 136 -605 302 1006 -371
11378c71J482j429M62k82J72o02J98M69k26n0j79K51P43k73p38K04J287p26p50
$$ -371 1111 -318 144 -138 34 -568 -370 99 -127 -177 -356 -105 638 365 -373 -169 1118 392 -358
11397c58O21m14R99k71n75j34M42J50k478K105k67P05m75p25R00j75j1o03J613
$$ -358 263 -151 848 577 2 -132 310 460 -2018 87 -180 525 50 -675 225 50 39 -564 1049
11416A049n31q34L49p92J532m75Q5l30M44k85m10K19j033J688p4j321O23l08O62
$$ 1049 518 -316 33 -759 773 298 383 53 497 212 -198 21 -1012 676 602 -719 -96 -404 258
11435B58o72R37n87l88M28M0Q42j542M38L12O99l0q53Q6r78J512l93p19J630j684
$$ 258 -414 523 -64 -452 -24 16 858 -684 -246 66 765 735 -118 -32 -1010 502 109 -610 1020 -664
11455f64J435l94Q6k3m42K38j33M61m69o92R35m43qL83p04J411j798R75q49K52
$$ -664 771 377 463 440 -2 236 103 564 95 -597 338 -105 -113 270 -434 977 -821 154 -695 -443
11475d43M85o78K133j538P74o60L91M1l85p6j152J193j01q23J102J1r7j135J789
$$ -443 42 -636 1497 -41 733 73 464 505 120 44 -1108 85 -16 -839 263 274 177 -958 831
11494H31q14J08K61j1R92j375J06P76n61k62l13L32n07J055j298J708j719N41
$$ 831 17 125 386 375 1367 -8 98 874 313 51 -262 70 -437 618 -680 1028 -691 -150
11512a50J471j251r10o30J399m20m69Q24j56J506k009J174r17K37R65k334K326
$$ -150 1321 70 -840 -1470 -71 -491 -960 -136 -292 1214 -795 379 -538 -301 664 -1670 656
11529F56j388J131j96j16j117L4J353n49P85j54l03O06p89P21j325P66L53M25
$$ 656 -732 399 203 87 -1030 -996 357 -192 593 439 136 742 -47 674 -651 115 468 893
11547H93p12R3k69Qj43P67q43J95j57K06P56j455O0O45j70L31J10j08l38R19P45
$$ 893 181 274 5 13 -130 637 -206 -11 -168 38 794 -661 -601 44 -126 205 315 207 -131 788 1533
11568A533j753P93k74J22q02J667q02q30L26m97J86p39J602k26j16J088k024J278
$$ 1533 -220 573 299 421 -381 1286 484 -346 -20 -517 -331 -1070 532 306 190 1278 -746 532
11586E32p54O18j015M69Q70j005K99m58J191p21P61j488J78K461k248Q59r37N81
$$ 532 -222 396 -619 -150 720 -285 14 -444 747 26 787 -701 -523 1938 -310 549 -388 193
11604A93r3n51P86m96N53r19J741j412R10j041R96k17k594J896K38o13Q01j332
$$ 193 100 -451 335 -161 392 -527 1214 -198 712 -329 667 450 -2144 -248 -10 -623 178 -1154
11622a154K610j405q4L46j154O66j52J543j349K85J4O11r16j075K288r37r7J97
$$ -1154 1456 51 -33 313 -841 -175 -327 1216 -133 152 166 777 -139 -1214 1074 137 40 237
11640B37m50k56Q88k53k04k92m3K44M22j90N76m69o91J519j882Q62j253J409O28
$$ 237 -213 -469 419 166 -38 -330 -373 -129 293 103 679 210 -481 1038 -844 18 -1235 174 802
11659H02j612J501o64m5K32o6L6n55J272o45k91L28m11O60j97K73j737J531n43
$$ 802 -810 691 27 -18 214 148 184 -371 901 256 -35 293 -118 542 345 618 -1119 412 -131
11678a31O19l11r58J411j572J067j013Q60j39j329J904j108J021q22K84M72r70
$$ -131 488 177 -781 630 -942 125 -888 -28 -167 -1496 408 -700 321 -501 -217 255 -715
11695g15M44n95P82o41N36M06k30Q45j626K14k59N02J557j396K30M84j57q15j38
$$ -715 -271 -866 -84 -725 -189 217 -13 832 -794 -580 -839 -337 1220 -176 54 538 381 -434 -572
11714e72J055j104P34j089O95N69L97r42J97J524k068J620q94l36L57l41R85q58
$$ -572 483 -621 113 -976 -281 288 685 -257 -60 1464 -604 1016 122 -214 143 -198 787 -71
11732g1R35l18n25N77n3j02m21J52o43Q30l57q9J158k102J188J199j000j36q80
$$ -71 864 546 21 598 545 443 22 174 -469 361 4 -85 1073 -1029 159 1358 358 222 -658
11751f58J470m75j071R62K88j0j100n20P06l9J356j544N2Q42l86N47o36O04j195
$$ -658 812 337 -734 228 516 506 -594 -1114 -408 -447 909 -635 -583 259 -127 420 -216 388 -807
11770h07J036p8l40K63j537J743l8J69j0L83K5m32l41r47J541M8q67J257k149
$$ -807 229 151 -189 74 -1463 280 242 411 401 784 809 377 36 -911 630 678 -189 1068 -1081
11789a081K111j551M2P49r22R86o34o4m71N96L94M89p01L71L71m90j086Q56q62
$$ -1081 1030 -521 -479 270 -652 334 -300 -364 -835 -239 155 644 -57 314 685 195 -891 -35 -897
11808h97J685k471K607j945J303L01p86Q41j754K672k564J278M41j585J292j394
$$ -897 788 -1683 924 -1021 282 583 -203 638 -1116 1556 -1008 270 711 -874 418 -976
11824i76J664j382Q84l52K32L55j477K818j383j309P19M87j297L52Q34l55M98
$$ -976 688 -694 190 -162 70 425 -1052 1766 383 -926 -207 280 -1017 -665 169 -186 312
11841C12M45j660J519j223l45J020K79L3q13K3L11n53Q29n88j48J034r16M91l09
$$ 312 757 -903 616 -607 -952 68 347 380 -433 -410 -99 -652 177 -411 -559 475 -441 50 -259
11860b59O21j404K220q60O81j961P09J084k009J929j83K63j129J274p82q87J338
$$ -259 362 -1042 1178 318 999 -962 -253 831 -1178 751 568 831 -298 976 194 -693 645
11877F45j294J521m10j843J762p99J509j887J198j288O12M52r49J570k294K364
$$ 645 -649 872 462 -1381 381 -418 1091 -796 402 -886 -274 178 -771 799 -1495 869
11893H69j594M99J060k002J231o53J261k95q71K23p10J595j064n9M42l43M3O73
$$ 869 -725 -226 834 -1168 63 -590 671 376 -495 -272 -982 613 -451 -510 -68 -411 -368 305
11911C05QO88j190K35o03K45l55P61p31Q18K88q40J425p66J54j202J079o65m22
$$ 305 313 1001 -189 46 -557 -312 -667 94 -637 181 469 -371 1054 288 442 -760 319 -346 -768
11930g68J433n32K22p46R70k00n05J95r49J473L56j102m61O99Qn16k4O94k3Q51
$$ -768 665 133 355 -391 579 379 -126 69 -880 593 949 -153 -614 85 93 -423 -447 247 224 1075
11950A075j388J050k056Q92J071m70O71q73q22J181O97j88j422J567o95N39q81
$$ 1075 -313 737 -1319 -427 644 174 845 -28 -850 331 1028 840 -582 985 290 829 -52
11967e2j7J111n97J166j416N42j601M73Q79n95J910k502J064j165R63J22q5J001
$$ -52 -69 1042 445 1611 195 737 -864 -391 488 -107 1803 -699 365 -800 163 285 200 1201
11985A201k504J979j963J466p94J31Q33j149R87j064J84J135j545K236j598K74
$$ 1201 -1303 676 -1287 179 -615 -484 349 -800 187 -877 -693 442 -1103 1133 -465 -191
12001a91O99j11L81k517K063q45Q71j998J690j39p94J565j336J447j418M62L13
$$ -191 508 397 778 -1739 324 -521 350 -1648 42 -97 -891 674 -662 785 -633 -171 142
12018A42o98M43P81n36R61j154J9K19L87q45j59J296k82m54q67M37L24L57m90
$$ 142 -556 -113 668 132 1093 -61 -42 177 564 -281 -440 856 574 120 -747 -310 14 371 -119
12037a19l54N67p7J85%j156M44J159m63m20M72K50n8k36m72O7j01N28L01j224
$$ -119 -473 94 17 202 202 -954 -510 649 186 -234 238 488 430 194 -278 -211 -312 216 517 -707
12057g07J090j571J527j183J264l06m3Q67q41N32n39k00R04j512J46l70J858n88
$$ -707 383 -1188 339 -844 420 114 71 938 97 629 90 -110 794 -718 -572 -942 916 328
12075C28m21M43j278J183o15N25l75n83J053j212R49o19J821j848N75P97j185
$$ 328 -93 350 -928 255 -360 165 -210 -793 260 -952 -3 -622 1199 -649 -74 723 -462
12092d62J107q96R93j449k18J238j164K4K77J024J60l26l42P2L08o25N74k96j352
$$ -462 645 -251 742 -707 -925 313 -851 -827 -550 474 634 308 -34 38 346 -279 295 -1 -1353
12111a353K036j985J362n51O82j053J339P44j198j37R81L65k312J022N31n53q3
$$ -1353 683 -1302 60 -491 191 -862 477 1221 23 -114 867 1232 -1080 -58 473 -80 -163
12128a63n94N15J197k084J468j225O51m80L02J467j673K46K90M66j14m67M52j238
$$ -163 -757 -242 955 -1129 339 -886 -235 -715 -413 1054 -619 -373 -83 383 269 -198 254 -984
12146i84R09q69J85J209p85NR48l85j107J111K61j446J113m67Q9o53J43J103q52
$$ -984 -75 -944 -759 450 -335 -330 618 233 -874 237 498 -948 165 -302 -213 -866 -723 380 -472
12165d72J092o56J279j480K71M12j873K268r44Q65j12m02l42R4J007j046P58j003
$$ -472 620 -36 1243 -237 34 446 -1427 841 -103 762 650 248 -94 0 1007 -39 719 -284
12183b84j22M71j053J508j175J438J01j676J421p84P9K01Q96j303J88j03M69m04
$$ -284 -406 65 -988 520 -655 783 884 -792 629 -155 -76 125 1021 -282 -94 -197 272 -132
12201a32n64J088l78J99l67k81M22j63L44L24O92j352n82N64N42j295J307j221
$$ -132 -696 392 14 213 -154 -435 -13 -176 168 492 1184 -168 -750 -186 356 -939 368 -853
12219h53J000l94L29J090n87K45o89n58J669r16L06K54l5r85j79M85L49J53o73
$$ -853 147 -247 82 1172 585 830 141 -417 1252 336 642 896 861 -124 -303 182 531 684 11
12238A1k33N0P51m45l85Q59j177J074L12j156K14P0J78j282J932k130K286k065
$$ 11 -222 -172 579 134 -251 608 -569 505 817 -339 -125 -55 123 -1159 773 -1357 929 -1136
12256a136J546p69p1O05p93J224p67Q78l71r9N94j522J465n66P04j252N6P45k71
$$ -1136 410 -359 -430 175 -618 606 -161 717 346 247 841 -681 784 218 922 -330 -274 471 200
12275B00N74j678Q93l03n71J952j207J90m72Q61m62j378J331o38J80N60M81j82
$$ 200 774 -904 -11 -314 -885 1067 -140 50 -422 439 -23 -1401 -70 -708 -528 32 513 331
12293C31q31N15j521J959q59Q17J052j408l56q4J178r20O3n60l45R23p47J643
$$ 331 -500 15 -1506 453 -406 411 1463 55 -301 -385 793 -127 -64 -624 -969 -46 -793 850
12311H50l13j223N31L60n44k37R02M57j62j81J68p55P06p04J039q55p29M60O73
$$ 850 537 -686 -155 205 -339 -576 326 783 621 440 608 -147 559 -145 894 39 -690 -230 443
12330D43j32l01L26m71N29j246P68J021j063L15J01j64K62j052R71r33J350j179
$$ 443 311 10 336 -135 394 -852 -84 937 -126 189 290 126 388 -664 307 -626 724 -455
12348d55L11o82O09o1j322K214j295Q31k29J81Q16j955J727j780K483j333J73
$$ -455 -144 -826 -217 -278 -1600 614 -681 150 -79 102 918 -1037 690 -1090 1393 60 233
12365B33p29M6J464k286L031k927R33O91q83J704j445J618j504k40P05n94Q07
$$ 233 -496 -450 1014 -1272 1759 -1168 -235 456 -427 1277 -168 1450 -54 -294 411 -183 624
12382F24r57Q50l64l07L56j139R50j88O11j109P43J42K3q48O40K54n82K036j607
$$ 624 -333 517 153 -154 202 -937 13 -175 436 -673 70 212 235 -613 27 281 -301 1735 128
12401A28l10P60j189P21J29k20P65j733K423k491O97J27k17M28R08j248K54M14
$$ 128 -182 578 -611 110 239 19 784 -949 1474 -1017 -320 -193 -410 18 926 -322 -68 346
12419C46N3m49J4L65r36M6RP48j138M00M80j18P2J25J03q43J137J21k03Q4j583
$$ 346 399 -50 -36 329 -607 -561 -552 196 -942 -542 -62 -180 -108 17 120 -723 414 535 332 416 -1167
12440a167K271k16j155o6J84O20n10K87k02R81j141L72P63j012P71o92O58n12
$$ -1167 1104 888 -267 -333 -149 471 -39 248 46 1027 -114 258 1021 9 780 88 746 234
12458B34k61q93R1J781k241K394j129j29n24O58M50p24J195j464M08R2n99k0K84
$$ 234 -27 -920 -829 952 -1289 1105 -24 -153 -677 -19 431 -293 902 -562 -154 -62 -661 -681 -397
12477c97Q46k113J282m9l75J506p46k12p33J600L42M7l98r63J965j549M83p01
$$ -397 449 -1664 -382 -431 -806 700 -46 -258 -991 609 951 998 600 -363 1602 53 536 -165
12495a65N23J68j530J067J66J4j224N82J769j857Q12j111P99M19o46P10M11r27
$$ -165 358 526 -1004 63 229 243 -981 -399 1370 -487 325 -786 13 432 -214 496 907 -20
12513b0M53o59m06N23l9J57j44R64r51R79j293J179m79p43k6k93J097L57q52p81
$$ -20 433 -226 -632 -109 -148 9 -135 829 -122 857 -436 743 264 -479 -505 -798 299 656 -196 -977
12533i77L36J426j224N24p16J474j582K73J144j355J370l66r96J315j740J283
$$ -977 -641 785 -439 85 -631 843 -739 -466 678 -677 693 327 -669 646 -1094 189
12549A89j453J730l62O73Q68j507J197j750K85L41O1l69j49O83j343J205K41m81
$$ 189 -1264 466 104 777 1645 138 1335 -415 -130 211 272 -97 -246 437 -906 299 540 59
12567E9k18k36Q68r36J145r09j06p10J75J012q11J650k249Q55J50n76K273k058
$$ 59 -159 -395 473 -463 682 -227 -333 -1043 -868 144 -667 983 -1266 -411 -261 -837 1436 -622
12585f22J072j460O84J93k72M89R1J42q69O17n51k01J454p29J41j291O00R81j215
$$ -622 450 -1010 -326 -133 -405 84 175 317 -552 65 -486 -687 767 38 179 -1112 -512 469 -746
12604g46J90P39j091M22K45Q87j242J698k519R62J754k212N61n75K022j192J25
$$ -746 -556 183 -908 -486 -241 646 -596 1102 -1417 -455 1299 -913 -352 -927 1095 -97 28
12621B8K36j159K357j713j51P1N87M02j117J379j954J571p47J39L1l99Q07j21
$$ 28 264 -895 1462 -251 -402 -331 256 658 -459 920 -1034 537 -210 -71 -40 -439 368 247
12639B47k05L18j243J375j798R07L33o9P67j647J503j151J774j714M18R44j211
$$ 247 42 360 -883 492 -1306 -399 -66 -135 632 -1015 488 -663 1111 -603 -185 759 -452
12656d52Q21j281J408j586J491K82k76J29j747J777l45L42j1j384N52l22J050
$$ -452 369 -912 496 -1090 401 683 407 536 -1211 566 221 563 552 -832 -280 -602 448
12673D48j219Q13k79J56R36r79J583k498J684L76j530J150n49j226J123P51k83
$$ 448 -771 42 -237 -81 855 -124 1459 -1039 645 1021 -509 641 92 -1134 -11 740 457
12690D57j20o13J65K4L23M26j29p01M75n87M12j67o51P76p33J59J546j509l52
$$ 457 337 -276 -111 -87 236 662 533 -168 307 -280 132 -35 -686 90 -643 -484 1062 -447 -799
12709g99K67J174l34j262J013L58K42q82pL80j44m18o16Q99K60k3j446R72N99
$$ -799 -532 642 308 -954 59 417 659 -223 -230 150 6 -412 -1028 -129 131 108 -1338 -366 233
12728B33q17J173j648J353M6J5L86p05K28p73J275o45O8Q45j356J414j369J806
$$ 233 -584 589 -1059 294 340 355 741 36 264 -509 766 121 189 1034 -322 1092 -277 1529
12746A529j675P84p49l57N09n27N02r51J770q19J207l58j398J929k119J095p45
$$ 1529 -146 638 -111 -468 41 -486 16 -935 835 16 1223 865 -533 1396 -723 372 -373
12763c73n43J135j76o77q5J201j437J243m93n7R35r23k83O54j6r2l39J224j395
$$ -373 -916 219 43 -634 -719 482 -955 288 -205 -262 673 -250 -533 121 105 13 -326 898 -497
12782d97M74n41M0P45k91j58k07L86R02p52Q04j447P22P76j189J290j508L71M85
$$ -497 -23 -564 -524 221 -70 -228 -435 -49 853 101 905 -542 180 956 -233 1057 -451 -80 405
12801D05L0l35K8n64Q33J28k46q58R22O03n19o82L87R68j701J55J10P97m61r3
$$ 405 435 100 128 -436 397 525 279 -579 343 946 427 -255 132 1100 -601 -446 -336 461 0 -93
12821i3R00j150J192j306J560j304R74j323P23l67m23J830k335J726j219J124
$$ -93 807 -343 849 -457 1103 -201 773 -550 173 -194 -617 1213 -1122 604 -615 509
12837E09L42j203K80J31j125J369q86J061j129J710j725J156j036n88J564k039
$$ 509 851 -352 -72 59 -1066 303 -583 478 -651 1059 -666 490 -546 -1134 430 -1609
12853a609K084p00L90j60l61L34j303J041j145K421p17j024J11J142J074j867
$$ -1609 475 -225 165 5 -356 -22 -1325 -284 -1429 992 275 -749 -638 504 1578 -289
12869b89L92n96K6J056n35l29j3n95J73J75j47P56K42q29N86N02p94L35J79j05
$$ -289 103 -493 -467 589 54 -275 -288 -883 -710 -535 -682 74 316 -513 73 575 -219 116 295 190
12889A90k34L33n54o6P74l58j05N54r44M74j012O24q5n11J172o40J467j328Q58
$$ 190 -44 289 -265 -331 443 85 -20 534 -410 64 -948 -324 -409 -920 252 -388 1079 -249 609
12908F09k52l58n68j20Q57p83J579J15k281K108k043K570j824Q41M89j726J237
$$ 609 357 -1 -569 -689 168 -615 964 1079 -1202 906 -1137 1433 -391 450 939 -787 450
12925D50q97J090j827J526l67q02Q85k670L902k105J287o27m06O29j475J591n81
$$ 450 -447 643 -1184 342 -25 -827 58 -2612 1290 -815 472 -155 -561 68 -1407 184 -397
12942c97N33N16q02J580j777J673k843K811j162Q64j19j880K147j710M49N45j388
$$ -397 136 652 -150 1430 -347 1326 -1517 1294 132 996 877 -1003 1144 -566 -117 428 -960
12959i60K104k117Q68j24p32J616q54J444j934J537j036J04l45Q78k51r1J146
$$ -960 1144 -973 -105 -229 -961 655 -199 1245 -689 848 -188 -84 -429 449 198 107 1253
12976A253j138O83l84k27j051l31J324L55m94p1R44j452P1r8J356o27Q52j233
$$ 1253 115 798 414 187 -864 -1195 129 484 -10 -81 863 -589 -518 -616 740 113 965 -268
12994b68P17j89q92J116O0L28j517Q17k28k79k92L29M99j350J171j57m23O56k91
$$ -268 449 260 -632 484 544 872 -645 172 -56 -335 -627 -298 201 -1149 22 -135 -558 98 -193
13013a93J91j15O29n97k71Q91j464J449r96J212k07o86J97o16K411j837l33N50
$$ -193 -2 -117 512 -85 -356 535 -929 520 -476 736 529 -157 40 -576 1835 -2 -335 215
13031B15r70J842j81r92n27P81m73J21J443k027J636k416J825m89J008o64j01
$$ 215 -755 1087 906 -86 -613 168 -305 -184 1259 -768 868 -1548 277 -212 796 132 31
13048C1J569l055J501K69j640K022j487K54m86P29k89k10J771j010p59K73J065
$$ 31 1600 -1455 46 315 -1325 697 -790 -536 -1022 -293 -582 -792 979 -31 -790 -517 548
13065E48q89J37j4o63N10j402K429p09m79O7KM69M0M00p03M55N55j310R03j08
$$ 548 -341 -204 -218 -881 -371 -1773 656 -53 -532 -465 -463 6 46 446 -257 198 753 -557 346 238
13085B38k74q13P19J44j20O56m12n54O42K92L6j352O50J058j058k39n97J401k2
$$ 238 -36 -849 -130 14 -106 550 138 -416 226 518 554 -798 -148 910 -148 -387 -984 417 395
13104C95j26N58m78J07N58l11o54L38K44p66j310M31J313n32m85Q27p78J480q23
$$ 395 269 827 349 456 1014 703 49 387 631 -135 -1445 -1014 299 -233 -718 109 -669 811 -12
13123a2N46r90Q91O41k041J424k149K438n07j502J616n83J159j320J094l72m61
$$ -12 534 -456 435 1076 -965 459 -1690 748 241 -1261 355 -228 931 -389 705 333 -128
13140a28n4n35J548k301J342L3r96K338j883J257m95l42M89m75j026J031K13l94
$$ -128 -182 -717 831 -1470 -128 -95 -1091 1247 -636 621 126 -216 273 -202 -1228 -197 16 -378
13158c78J000n17o74K06m18Q70j87l43O20k4J4L47K58j169k98J489n78q14P87
$$ -378 622 105 -569 -363 -781 89 -98 -441 179 155 169 516 774 -395 -693 796 218 -596 191
13177A91m62j95M78J04n96Q55q56O41m18P7P95j188J130j04o90L48o6m40m65O62
$$ 191 -271 -466 12 116 -480 375 -481 160 -258 -181 614 -574 556 452 -238 110 44 -396 -861 -199
13197a99Q18j473O93j25M47m62P81K36j471P94o55M85K80j3j212J399P53k420
$$ -199 619 -854 -161 -286 161 -301 480 716 -755 39 -616 -131 149 136 -1076 323 1076 -1344
13215a344K544j544O09j432J000M11r03J517j541J247j257J021p75p26K164j510
$$ -1344 1200 -344 265 -1167 -167 244 -659 858 -683 564 -693 328 -447 -1173 991 -519
13231e19J073j249P41J68j318K521k493J764p1r45Q73j938K542n72k15q42O07
$$ -519 554 -695 46 214 -1104 1417 -1076 688 617 -328 545 -1393 1149 577 362 -480 127
13248A27P1K36o49k28m20J405r23R35j241M53M18P23j520N12N54l84Q42n01j133
$$ 127 198 434 -215 -443 -863 542 -381 554 -687 -234 184 907 -613 -101 453 69 911 410 -723
13267g23J182j705Q69N86n9M64m08m52l48J024O5j290O15j076J033R49q85O12
$$ -723 459 -1246 -377 209 150 614 206 -246 -594 430 495 -795 -180 -1256 -223 726 -159 453
13285D53q97J765k070J138j245Q56J92p47J630j323O58j309J550j214J68K266
$$ 453 -444 1321 -749 389 -856 0 192 -555 1075 -248 410 -899 651 -563 -395 1871
13301A871l151J490k19L06j347N39L35j040K006j446J062j216J37R08n34J067
$$ 1871 -1280 210 -9 297 -1050 -511 -176 -1216 790 -656 406 -810 -673 235 -299 768
13317G68j365Q38j35p28R19j131J310J67o05r81J663k01j235J293j168K011k171
$$ 768 -597 241 106 -622 297 -834 476 643 38 -943 720 519 -716 577 -591 1420 -751
13334g51J414n98n39L21m72J969j323o54O93q33K213l000K371q49j9J75j232J732
$$ -751 663 65 -474 -153 -625 1344 21 -633 60 -773 1440 -1560 811 -38 -57 118 -1114 618
13352F18j349J639o25L70o77j03J340j533L68o35P90M58q33N62n70N11J45l02
$$ 618 -731 908 283 653 -24 -127 1213 -320 48 -587 203 661 -172 390 -180 331 476 174
13370A74m11j02K09M36j073N40J43R89k052J367N00o70P5L43o2l50n5j76M88m26
$$ 174 -237 -339 -130 306 -767 -227 -84 905 -1147 220 720 50 125 468 406 56 1 -175 313 -113
13390a13l21J126j366M61K60n33K17k70J265r64J303j166L80k44j84J169j970
$$ -113 -434 692 -674 -213 47 -486 -269 -539 726 -238 1065 -101 279 35 -149 1020 -950
13407i50O46R02l93M10q73R40j061J177l74j849J733o5P1Q89k324K213k027J427
$$ -950 -304 598 205 615 -258 682 -379 798 424 -1425 308 243 314 1203 -1121 1092 -935 492
13425D92j491J373q06R9J578j891J483r23J293j995J942j13j345N58n83J038p17
$$ 492 -999 374 -432 -333 1245 -646 837 -86 1207 -788 1154 1041 -304 254 -329 709 -8
13442hK98l49m30O50o76N44o54J254l67j055L74L3k18Q04q01J35n94J008L86j
$$ -8 290 -59 -489 161 -515 29 -625 629 262 -793 -419 -386 -604 200 -601 -466 -1060 -52 334 333
13462C33J39j84O0q09j91M96N20o04K54j313J149j53n2N79Qk66p3q5k07J125j465
$$ 333 472 288 348 -461 -652 -156 364 -240 14 -1299 -150 -303 -355 224 232 -34 -107 -192 -399 726 -739
13483g39J365m56J096j886M1O91K54k86k56R17q56p96O79m69J076k02Q64j413
$$ -739 626 170 1266 -620 -579 112 366 80 -176 741 -115 -911 -232 -701 375 173 1037 -376
13501c76P69q42l65J730j745J396n95Q4j200J51O10j407J880J08o14J05JL36j288
$$ -376 393 -449 -814 916 -829 567 -28 56 -1144 -993 -383 -1790 90 198 -416 -311 -310 26 -1262
13520a262J515p86N33P24l81O79j557O56m16l38L97j06J222m96J89p00O50L85
$$ -1262 253 -533 0 724 343 1022 -535 121 -295 -633 -236 -342 880 384 573 -127 523 908
13538I08j672O03o3N51j182J99J260r36J838j536K11K46j123J310j555J465m16
$$ 908 -764 -161 -224 327 -855 -656 604 -332 1506 -30 181 427 -696 614 -941 524 108
13555A08N64m85k37R95j635o38J498k02O5q1O43q27k45m3L7R22q75R27k51k99
$$ 108 672 187 -50 945 -690 -1328 170 -32 33 -48 595 -232 -477 -520 -483 439 -436 491 240 -59
13575e9L66L25J04o12K77r8r50J462j563J136p76r9R09j21L46j223M09l16J49
$$ -59 307 632 736 124 401 303 -647 815 -748 388 -388 -487 422 301 647 -576 -167 -483 -334
13594c34r0J079N29j088N76j649J155j713J345M62j385K777j816l36L67m94J407
$$ -334 -424 655 1184 96 672 -977 178 -1535 -190 272 -1113 1664 -152 -488 -121 -615 792
13611G92M45q06r56J131j006J130K23j169J437k139K207r53m82O36q56J188j261
$$ 792 1237 431 -525 606 -400 730 953 -216 1221 -918 1289 336 -146 490 -366 822 -439
13628d39N35k38n2J176j211J177j307L8M31R20q37r14N6R10n66J00R31J76q24
$$ -439 96 -142 -194 982 -229 948 -359 -321 110 1030 193 -721 -665 245 -321 -221 710 886 62
13647F2R98k005K372j384k07k4o78J286r84M78P1k75M95r71J383q26P10J72j614
$$ 62 1060 -945 1427 43 -164 -188 -866 420 -564 -86 -15 -290 205 -766 617 -209 501 673 -941
13666i41J781q67j99J78J38L03j757J038Q3m69J02R17k18j64R15j419R37J44j417
$$ -941 840 -27 -226 -48 90 393 -1364 -326 -243 -712 -610 307 89 -75 840 -579 358 502 -915
13685i15R00r4P5K76j324J360j125J153p39K754k912J41O50j001R94p85R39j90
$$ -915 -15 -109 -34 242 -1082 278 -847 306 -433 2321 -591 -450 200 -801 193 -592 347 157
13703A57L68j8p69p58N82N42j88J048j273M73K77p24J247q79l5J044k307K288
$$ 157 525 507 -262 -1020 -438 104 -84 964 -309 164 441 -283 964 85 50 1094 -1213 1075
13721A075j344P62j190L91O26k05Q09j516J740j493R16O7K88J34q91P7m80M7L58
$$ 1075 -269 493 -697 -306 320 115 924 -592 1148 -345 571 638 926 1060 169 246 -234 -187 171
13740A71j299O85K48J96NJ016n07j215P45m30O72o69l83O90j18N93j271J168l05
$$ 171 -1128 -443 -195 1 6 1022 515 -700 45 -385 287 -382 -765 -75 -193 400 -871 297 -8
13759hK88l86J44m01J10J70K03j276R25L85P03j152N16N22j006N10j108O86N05
$$ -8 280 -106 38 -363 -253 -83 120 -1156 -231 154 857 -295 221 743 -263 247 -861 -175 330
13778C30Q8J54j364J543p13o38J283q05J070k843K334j19Q19r53o43R23k77J591
$$ 330 418 572 -792 751 38 -600 683 -122 948 -1895 439 320 1139 186 -457 466 189 1780
13796A780j729L40n12r63K038j545J007j839J741J97o40J016k113K614k014J910
$$ 1780 51 391 -121 -1084 954 -591 416 -1423 318 515 -125 891 -1222 1392 -622 1288
13812A288r91l24L57l44R40j062O52j090J578k07j298Q62j095P32j364Q77M59
$$ 1288 297 -27 330 -14 926 -136 516 -574 1004 797 -501 361 -734 -2 -1366 -489 -30
13829c0o74J279j461P83o15J691q19j375L154j016m76r3K51l0j013P16L0J0M6
$$ -30 -704 575 -886 -103 -718 973 154 -1221 1933 917 441 348 599 569 -444 272 302 312 358
13848C58j311M59N83L03m65j106J334o2k81j32R37n05m28Q10l88j65k29J4K13
$$ 358 -953 -494 89 392 -73 -1179 155 93 -188 -320 617 112 -316 494 106 -59 -288 -274 -61
13867f1j01k61K26M8J15m76j72Q65j65o30P86j132P73P28j442J967q34Q66j527
$$ -61 -162 -423 -197 -149 -34 -510 -682 183 18 -612 174 -958 -185 543 -899 1068 234 1100 -427
13886d27k74J928j456K016j398k78m24m73K166j902J680j488R04j46j620J927
$$ -427 -701 1227 -229 1787 389 111 -313 -786 1380 -522 1158 -330 574 428 -1192 735
13902G35j358J140j559J533n2l55N17j040J245j558J319j855N59M73o79J48M49
$$ 735 -623 517 -1042 491 439 84 601 -439 806 -752 567 -1288 -729 -256 -935 -787 -338
13919c38K42j53n03J889j317N19r41M78N1q48J108n59L15J00Q8KK15j287P00M82
$$ -338 -96 -249 -752 1137 -180 339 -602 -124 -73 -921 187 -372 -57 43 131 133 348 -939 -239 243
13939B43K35j7l71N2j122N53Q37l78o48J500j057J138p09k46k09P88m6j50l60
$$ 243 478 461 90 142 -980 -427 410 32 -616 884 -173 965 256 10 -199 589 543 393 33
13958C3k46q25J246q45N57O67K6j22Q5K17n17J08k175K753l4j531P4N64M97k99
$$ 33 -213 -1038 208 -637 -80 587 613 491 576 793 276 384 -1791 962 928 -603 -529 35 532 233
13978B33L7J418k062J768j125J129k488J811o62q58O92n30Q36l13R19k52j547
$$ 233 270 1688 -374 1394 269 1398 -1090 721 59 -799 -107 -637 199 -114 805 553 -994
13995i94M04k16J079n50L67J53n26J874j732q9m11R84o63P13l95J66L32r96m1
$$ -994 -590 -806 273 -277 90 243 -283 1591 -141 -230 -641 343 -320 393 -2 164 496 -500 -541
14014e41N76k22J003j773P28J33j39L73p13J159r55Q59j402J890o50r17J90Q7
$$ -541 35 -187 816 -957 -229 -96 -235 138 -575 584 -371 488 -914 976 326 -591 -401 -314
14032c14J34N43Q58j84r99J45N66K61j172K32l91J95J170j015P81J03j537L52
$$ -314 -180 363 1221 1037 38 183 749 1010 -162 70 -321 -126 1044 29 810 913 -624 -272
14050b72r24J624J58q45O05l92q79Q84k0m80j13J888k064J490k57o82P65n72Q13
$$ -272 -1196 428 586 -259 346 -46 -925 -41 -61 -541 -654 1234 -830 660 403 -279 486 -86 727
14069G27q81R17j248Q78l46j20N87r06m91m30J198R13m84l13q33R10N15M09j032
$$ 727 -154 763 -485 393 47 -73 514 -392 -883 -1313 -115 798 314 1 -832 78 593 1002 -30
14088c0n93J062j301J709q14O18o60p56R94q31K439l112J657r01K5J82N27L20
$$ -30 -623 439 -862 847 33 651 -9 -765 229 -602 1837 -1275 382 -519 -494 -312 215 535
14106E35q99j12P73m28Q50k093J636o10O49p17L51l11J40J587j630L70n15N41
$$ 535 -364 -476 297 -131 719 -1374 262 -348 301 -416 -65 -376 -236 1351 -279 91 -424 117
14124A17n42N72p40N70P0l05M2Q81p53P60j231J222p33N66p75j28J652j387L3
$$ 117 -425 147 -593 -23 47 -258 -216 665 -88 672 -559 663 -70 496 -279 -407 1245 -142 -109
14143a09O84k02j441R00p78J082j00J203j923J112m31O65o73p69P70m97J570k061
$$ -109 575 373 -1068 -168 -946 136 36 1239 -684 428 -3 662 -11 -780 -10 -507 1063 -998
14161i98M70O99k96N99j270J469o82k47R08j272J185k29m56L9K32L74j519J754
$$ -998 -528 171 -125 474 -796 673 -9 -256 652 -620 565 336 -120 -81 151 525 -994 760
14179G60n39n71j55J232N40j816J064j378J469n41n66J779j726J778k057Q79p91
$$ 760 221 -350 -505 727 1267 -549 515 -863 606 65 -501 1278 -448 1330 -727 152 -639
14196f39O89k05r27J101J51L62j057p6M72K98L09j336O84R96l51M02n63O65r21
$$ -639 50 -155 -1082 19 170 532 -525 -601 -129 169 478 -858 -174 822 471 873 310 975 54
14215E4O99p29m63N80r17M31J094r05P10o94P36n81K42j527R52O42m90N69J31
$$ 54 753 24 -439 141 -776 -345 749 -156 554 -140 596 15 257 -1270 -318 324 -166 403 534
14234E34j182J590j446R07q79O54q07R08P04j677J607j053J363r26m91J022j393
$$ 534 -648 942 -504 403 -476 178 -629 279 983 -694 913 -140 1223 297 -194 828 -565
14251e65L24m24R75L7n00J199j580O44J67l48J44J106j808k69J641o23o44J06
$$ -565 -241 -665 310 347 -153 1046 -534 110 277 -71 73 1179 -629 -898 743 120 -524 -418
14269d18J17K60l24j16oJ000p03L5L29j320K308r23q87M11n22O22j513K131j90
$$ -418 -301 -41 -365 -481 -487 513 -190 -155 174 -1146 1162 239 -648 -237 -759 -137 -1650 481 291
14288B91J52n44r19L34j09P76n56J274j152m63J610j664K529j807J879j058m62
$$ 291 443 -101 -1020 -686 -795 -19 -575 699 -453 -916 694 -970 1559 -248 1631 573 111
14305A11j04K96Q47k459J655o61J293m21m12q18M00J119m36M12L88j773J024o26
$$ 111 7 303 1150 -1309 346 -315 978 557 145 -673 -273 846 410 822 1210 -563 461 -165
14323a65l61O76m77J43L53n88m11J348l19o05Q08p36K40J590k671J033m10J293
$$ -165 -526 150 -327 -184 169 -419 -830 518 199 -406 402 -334 -94 1496 -1175 -142 -552 741
14341G41j051R00L5p46M78r79Q70j318R94Q54j364J128j045J354j530J261j40
$$ 741 -310 590 625 -121 357 -622 248 -1070 -76 778 -586 542 -503 851 -679 582 442
14358D42n76O46j485P04J177r03N26k009K084j068J368j400P22N12j434K057k178
$$ 442 -134 512 -973 -269 908 5 531 -1478 606 -462 906 -494 228 740 -694 1363 -815
14375h15K159k504Q42P20j548K335r92k4l00O81p79p86K217j017P02l2k73r32
$$ -815 1344 -1160 -318 402 -1146 1189 197 173 -127 554 -225 -1011 1206 189 891 859 586 -346
14393c46o97J491j282M18r14J778n01K52N76j302P67K53j35K94q8P9l94J30l93
$$ -346 -1043 448 -834 -416 -1330 448 -53 199 775 -527 240 493 358 652 564 643 249 379 -14
14412a4j27j1p13N73k07O2J149p79j041J424K58L45j452J89K75J39J1j265J403
$$ -14 -141 -152 -865 -292 -499 -437 712 -67 -1108 316 574 919 -533 -344 -69 70 81 -1184 219
14431B19p51N49N9j15K92r02j83Q6J153l4j231N79N01k1j057L16K67L64p17M01
$$ 219 -532 17 76 -39 253 -649 -832 -746 407 373 -858 -279 222 201 -856 -540 -273 91 -626 -225
14451b25L54p38J813j834Q86k92m66M31q36J168n87k25N1O78M50j069K09j34o3
$$ -225 129 -609 1204 -630 256 -36 -502 -71 -907 261 -326 -551 -500 178 628 -441 -232 -366 -429
14470d29m22P00M48j005Nj073K225n80m8m0p35J537j007Q33o78N35j92r7j71l26
$$ -429 -851 -151 297 -708 -703 -1776 449 -131 -179 -219 -954 583 -424 409 -269 266 74 -23 -194 -520
14490e20J080n18q97J096o29J011m20k6o62P34J05m82M44j348J718l47M22j179
$$ -520 560 42 -855 241 -388 623 203 177 -485 249 354 -128 316 -1032 686 339 761 -418
14508d18Q82K2j127J055J02j115Q14K21Q0m52o23R81l5k73o7L25p21J70P35j069
$$ -418 464 486 -641 414 516 -599 215 436 516 64 -559 422 387 114 47 372 -349 -179 556 -513
14528e13J005m1Jj073j69J491p13j37J207j325N37Q17j014k98J206j330M57O37
$$ -513 492 451 452 -621 -790 701 -12 -149 1058 -267 270 1087 73 -225 981 -349 108 745
14546G45m20J57j383J171j022Q40J370k032J448j736K54O0q7J562j669K373k629
$$ 745 325 482 -901 270 -752 88 1458 -574 874 -862 -608 -548 -635 927 -742 1631 -998
14563i98K40O27j52Q17o51K88n50L75M65j033J692j710J156p43J278j079J9Q92
$$ -998 -758 -131 -283 534 -117 171 -379 -4 461 -572 1120 -590 566 -177 1101 22 41 933
14581I33k392K872j026K51j066N63O26j634J704j040O41m58k63m41J44P15n76
$$ 933 -1459 1413 387 638 -428 135 761 -873 831 -209 432 -26 -289 -730 -586 129 -447
14598d47J079j196R19k43P18N9l87l47j60O41l80l62q32Q18p74R77j054J525n19
$$ -447 632 -564 355 112 830 889 502 155 -5 636 256 -106 -938 -120 -894 83 -971 554 35
14617C5K75M92n73J106P1q17n41K23Q86q43O33j001o01j01J162n79r05J864n50
$$ 35 310 802 229 1335 1406 589 48 271 1157 314 947 -54 -655 -756 406 -173 -1078 786 236
14636B36j25Lm85J132k55Q03j007k00o99p34J861j321K343j868J512j762l61J803
$$ 236 111 114 -371 761 506 1309 302 102 -597 -1331 530 -791 1552 -316 1196 -566 -927 876
14654H76k395J476j564J804m32N77j107l46J623j177J216m45J98N17j171J230
$$ 876 -1519 -43 -1607 197 -235 342 -765 -1111 512 -665 551 106 304 821 -350 880
14670H80j055P68j372J120m36o73J726k212K028o72J216p14l61o80N58l3n57J14
$$ 880 -175 593 -779 341 -95 -768 958 -1254 774 102 1318 604 243 -437 121 88 -469 -355
14688c55J391j719Q86k18P55j688K050j868J82R84p97o3Q25Q80k087Q62L6j151
$$ -355 1036 -683 203 -15 740 -948 1102 -766 -584 400 -397 -460 365 1245 -842 20 56 -1095
14706a095J497o09M02j01P13o10m14M56q11m41J174k52N68L1j097J573j427O08
$$ -1095 402 -207 195 94 807 197 -217 239 -572 -1013 161 -91 477 508 -589 984 -443 165
14724A65q14O45m56p09J271j101J036kp9J257j812Q70K85P59j686k10J182q76
$$ 165 -649 -4 -460 -1169 102 -999 37 35 -44 1213 -599 271 556 1315 -371 -581 601 -275
14742b75O52j488K405k037K34J003p57Q80p47M0j18K83N48q78m18l4P79L25m7
$$ -275 377 -1111 1294 -743 -509 494 -263 617 -130 -90 -208 75 623 -255 -673 -707 72 397 350
14761C50J89n94M82p41K410k494j87J30k39J493j819J351j030J86R02j746K263
$$ 350 539 -55 427 -314 2096 -398 -585 -455 -694 799 -1020 331 -699 -513 389 -1357 906
14778I06j725K163j709P15L37j297m4Q78Q0l38q6k16k90O86j177P35N43L52N17
$$ 906 -819 1344 -365 350 687 -610 -654 224 304 -34 -120 -336 -626 60 -1117 -382 161 513 1030
14797A030r99P24j663M04n18J697j33K00r46Qj563J726O3J140j705J321j344j743
$$ 1030 31 755 -908 -504 -1022 675 542 742 -204 -196 -1759 -33 30 1170 -535 786 -558 -2301
14815b301K134l59J233M0n00o60oK072k350Q38l90J39R72Qq92k32J192m52j708
$$ -2301 -167 -526 707 747 247 -413 -419 1653 -697 141 -249 -110 862 870 -22 -254 938 486 -1222
14834a222O87k71J118j655K354j492J005L28j596K100j298l48q49R15L52n34J095
$$ -1222 -535 -806 312 -1343 1011 -481 524 852 -744 1356 58 -290 -1139 -224 128 -406 689
14851F89j510J089j098R28P9p52J926k343P21M13M55N24j325J715k369j29J742
$$ 689 -821 268 -830 98 177 -575 1351 -992 -271 142 597 1121 -204 1511 -858 -987 755
14868G55j93n57o42J579j270M28O0l38P04m56k3k86P67j559J840o5j214Q45M51
$$ 755 562 5 -637 942 -328 100 160 -178 526 70 47 -239 528 -1031 809 744 -470 375 826
14887H26q35Rl82J779j859J478m34q71N55n81O40R0r87l83J199N02j069N09K78
$$ 826 -9 0 -382 1397 -462 1016 582 -289 266 -315 325 415 -572 -955 244 746 -323 186 464
14906D64q62R54j129P81j91Q64l44J112o26p59J008k323Q62J027r27J795j908
$$ 464 -398 556 -573 208 17 881 537 1649 1023 264 1272 -1051 -189 838 -89 1706 -202
14923b02J136j347J472j655M74J020k348K609j608K34J42j128J279j424J667n08
$$ -202 934 -413 1059 -596 -122 898 -1450 1159 -449 -215 -73 -1201 78 -1346 321 -187
14939a87J025o37q76K314k922J702j241J650j163q63K062j550J460j783J444l20
$$ -187 838 201 -675 1639 -1283 419 -822 828 -335 -1198 864 -686 774 -1009 435 115
14955A15j48M86r76J186k381J849q93J222l73j186J082r22J974k047P29R02l47
$$ 115 -33 453 -523 663 -1718 131 -762 460 87 -1099 -17 -939 1035 -1012 -283 619 272
14972B72O64j293R50q82R20r09R96l22j256J175q14j05m00J300q52Q98P58n31
$$ 272 936 -357 593 -289 631 -278 718 396 -860 315 -499 -604 -1004 296 -556 342 1100 569
14990E69p34N86k05l83O31o91P98q90J095r37j73L74J19r22j53J440j959K010
$$ 569 -165 421 216 -167 464 -227 571 -319 776 -161 -334 40 159 -763 -916 524 -1435 575
15008E75J22j336J169m81K4n51M74Q6J55P7p70J523K55j486N31p08P25j561K732
$$ 575 697 -639 530 49 73 -478 -4 82 237 314 -456 1067 1322 -164 367 -341 384 -1177 1555
15027A555j026j828J668k95R02j268Q04j244O04J64m62P11J47q81RJ277r77m21
$$ 1555 529 -1299 369 74 976 -292 512 -732 -128 36 -426 285 432 -449 -440 837 -140 -561
15045e61K026j779J257k042K126j151l73J190j790K510j713L20J64j108J726j650
$$ -561 1465 -314 943 -1099 1027 -124 -497 693 -1097 1413 -300 20 184 -924 802 -848
15061h48J019j112R92o45m29J911k303J839M5P5J74k360J794j386J164o51m42
$$ -848 171 -941 51 -594 -1023 888 -1415 424 469 544 718 -1642 152 -1234 -70 -721 -1163
15078a163Q03N09r4P68jq66K63n8j167J201j378K074o2o65o26j62L75N3O77o03
$$ -1163 -360 149 55 823 822 -44 219 161 -1006 195 -1183 891 829 164 -462 -624 -249 -196 481 -122
15098a22j083J155J85L68k95L9n97k4J302k098J347k85j54L84o20O37n46P15r48
$$ -122 -1205 -50 135 503 208 247 -350 -374 928 -1170 177 -108 -262 122 -498 139 -407 308 -640
15117f40J079J80o47J028k074O34K66l49J390k145J392n0j8k8j035J700r81J167
$$ -640 439 619 -28 1000 -1074 -440 -174 -523 867 -1278 114 64 46 18 -1017 683 -298 869
15135H69k096J297K55q47J553k182K146j794J294k33o58P35p46K159k712J256
$$ 869 -1227 70 325 -522 1031 -1151 995 -799 495 262 -396 339 -407 1752 -960 296
15151B96Nl64Pj085K499j758M04q6m4J78N80N81j735L0J31P03O59j180j4L16L56
$$ 296 301 -63 -56 -1141 1358 -400 4 -82 -126 52 632 1213 -522 -492 -361 342 1001 -179 -193 123 479
15172D79q46L54L28j343J313p78Q70j040m63J940n67j278J569j025n9L71J237
$$ 479 -367 -13 315 -1028 285 -493 377 -663 -1126 814 247 -1031 538 -487 -546 -175 1062
15189A062j438O0P93j044J291M28j149q34L43J986k313J448k76n04J398k071K201
$$ 1062 -376 -316 477 -567 724 1152 3 -831 -488 1498 -815 633 357 -147 1251 -820 1381
15206A381r60n41j6L38M56j608J206j075J340j269J851j392k60J130n13J231j485
$$ 1381 421 -120 -136 202 658 -950 256 -819 521 -748 1103 -289 -549 581 68 1299 -186
15223a86J677j984Q0P57j436J262j126R18J89n21J347j610J235o72k64K28r71
$$ -186 1491 -493 -413 344 -1092 170 -956 -38 151 -370 977 -633 602 -70 -334 -106 -1077
15240a077O80L50J580k531N76J376j799K394k867J821j301Q60o53m38K119j191
$$ -1077 -397 -47 1533 -998 -422 954 -845 1549 -1318 503 -798 62 -591 -1029 1090 -101
15256a01R81j289N40k54j54O32r44J325j328K77l97j70L025j722N5p95J083o54
$$ -101 880 -409 131 -123 -277 355 -589 736 -592 -315 -712 -882 2143 421 476 -319 764 110
15274A10J73K81j86J9j27o45N60p55J514j073K48M98J69j215m0Ml44k9J613j168
$$ 110 283 564 378 397 270 -375 185 -570 944 -129 119 617 786 -429 -469 -465 -809 -838 775 -393
15294c93J099j282J861n42j469K059j802j44P60Q0K94p30M33J99Jq72R18k29o17
$$ -393 706 -576 1285 743 -726 1333 -469 -613 147 227 521 -209 224 423 424 -448 470 241 -376
15313c76J30q79J922p35n6q63J26J477l30m56o97J69N67L05L20k407K701j57m34
$$ -376 -246 -1125 797 62 6 -857 -731 746 416 -40 -737 -568 -1 304 624 -1783 918 761 327
15332C27j101R90l40o8Q74j686R64Q46j978J218m67J357j240M85n01O54P40j954
$$ 327 -774 216 -124 -192 682 -1004 -40 806 -1172 46 -421 936 -304 181 -320 334 1074 -880
15350h80J606j057p56J484o21R0j284J673o28n30K134j115m16L91L61j143R19
$$ -880 726 -331 -1087 397 -224 -134 -1418 255 -373 -903 1231 116 -300 91 452 -691 228
15367B28K00L3n15l13N71n96O18l37j77K41j40R37j265j28J469j093l98O67p92
$$ 228 428 461 -54 -367 204 -392 226 -111 -288 -47 -187 750 -515 -643 826 -267 -665 2 -790
15386g90J236k92N11o46Q02j170O91p3r22R58o98J117q17q40J392j517P19L34
$$ -790 446 154 665 19 821 -349 342 269 -653 305 -393 724 -93 -933 459 -1058 -339 -5
15404ej60n1K28J67p10J338j219R37J66r94J114q56Q41j148M70N42j083J490j324
$$ -5 -165 -216 12 179 -531 807 -412 525 691 -303 811 -45 796 -352 118 660 -423 1067 -257
15423b57n7r50J168j32o36J382j221P16k10K0o85R21N2p28K331j704O63m77k60
$$ -257 -314 -1264 -96 -228 -864 518 -703 13 -197 -177 -862 59 111 -617 1714 10 673 196 -64
15442f4R96j166P47j518J177l00P47m04j082J186q47J591j816J058k44r87R70
$$ -64 932 -234 513 -1005 172 -128 619 215 -867 319 -528 1063 -753 305 61 -926 44
15459D4j035K179j136m14k21L48l11Q30j21j74m08M94O89j377P56O6L88j088P64
$$ 44 -991 1188 52 -362 -583 -235 -546 284 163 -11 -419 75 764 -613 143 209 597 -491 273
15478B73K66m16M22N55k67q72m31J5N81J054j638P64n65J379j042l33N18j51M26
$$ 273 539 123 545 1100 833 -39 -470 -455 126 1180 -458 306 -259 1120 78 -255 263 112 538
15497E38m29q55L03J189k10j465O57L93J01p72J07J896k436K473k440J023l19
$$ 538 109 -746 -443 746 536 -929 -272 121 222 -550 -443 1453 -983 1490 -950 73 -246
15514b46L08R21n72L85l83L46j057m26J706j491J561k516J45J463J90r73J52R97
$$ -246 62 983 411 796 413 759 -298 -724 982 -509 1052 -1464 -1319 144 334 -639 -487 510
15532E10j735J513m11L73O67j870P74r0R58r16Q2J4k07N00N07N53n36r49l57N34
$$ 510 -1225 288 -123 250 917 -953 -179 -269 689 -227 -145 -131 -338 162 669 1222 686 -263 -620 -86
15552h6P49j184J475j423N36M82n02r98K2j71J434k93m76n94P61K02Q62q83L17
$$ -86 663 -521 954 -469 67 549 47 -951 -929 -1100 334 41 -435 -1029 -268 -66 796 -87 230
15571B30n89J084j149O52j064R09l14M65L58r15J434j187M91r01L52m72J73n2
$$ 230 -359 725 -424 228 -836 73 -241 224 582 -333 1101 -86 405 -496 -144 -616 -443 -495
15589d95l94J418k98J01r13M4m73M53J960k228M20P99r5l01j0j42r14N52M56J12
$$ -495 -889 529 231 332 -581 -537 -1010 -557 1403 -825 -405 394 299 -2 -12 -154 -1068 -516 -60 52
15609E2N27q53N12j414J161O52n71k39o77J382j988J259L9J0Q97j552J913k094
$$ 52 579 -274 238 -1176 -15 637 66 -173 -850 532 -1456 -197 -158 -148 749 -803 1110 -984
15627i84K348j267l39N40n27Q18k085K321p76n03O39j9K50L64j050N63k88J411
$$ -984 1364 97 -242 298 -229 589 -1496 825 49 -454 185 166 416 780 -270 293 5 1416
15645A416j454O5j936K153j18K81q98l8P43l4l46R53j198N69J13l86k8j61P83
$$ 1416 -38 27 -1909 244 126 407 -491 -529 214 180 -166 787 -411 158 271 -115 -143 -304 479
15664D79o09K99J195j161M77j385J618p60L0k55N69l51j70P82j013J057r76K65
$$ 479 -130 169 1364 203 680 -705 913 153 183 -72 497 146 -24 758 -255 802 -174 91
15682I1N63M53q17o85Q71j48k12L84p85L94j75n74N29n36l80R60L58n93L47O14
$$ 91 654 1107 290 -395 476 328 116 500 -285 109 -66 -640 -111 -647 -1027 -67 291 -302 45 659
15702F59r64Q68j078J352j232R83p28lp96k85K667k514P10K72J8n7j36J418k208
$$ 659 -305 563 -515 837 -395 588 -140 -143 -939 -1224 1443 -1071 -361 -89 -71 -128 -264 1154 -1054
15721a054J871r15J81M01o63Q86n81M10p04o1Q05j472K131j738M70J080j34o08
$$ -1054 817 -98 83 484 -179 707 126 536 -168 -229 576 -896 1235 -503 -33 1047 913 305
15739C05j521J417m89J518r03k25M88j317J551n37J84M04n09N9j214R78j658N91
$$ 305 -1216 201 -288 1230 327 102 590 -727 824 287 471 875 366 425 -789 189 -1469 -878
15757h78R93j037P24O20J75j355P94K95q95Q64N84j768P67K13o94R10k85o06Q40
$$ -878 115 -922 -198 422 597 -758 36 331 -564 300 884 -884 -117 96 -598 312 27 -579 261
15776B61o02j12R03l00N35k52M12K29k187K350j938J329L79k266K006j170K594
$$ 261 -341 -453 450 150 685 433 845 1074 -1113 1237 -701 628 1007 -1259 747 -423 2171
15793B171k198R47n83r59O69n69J252j110O45L90j100M7K88J483k042J713j489
$$ 2171 -27 920 337 -622 47 -522 730 -380 265 655 -445 -398 -110 1373 -669 1044 -445
15810d45O82Q17j898M02L84j78r68M87M43K7J136j423Q51o49l6P32j149J639j841
$$ -445 237 1054 -844 -442 -58 -236 -1204 -717 -274 -247 889 -534 317 -332 -368 364 -785 854 -987
15829i87L22r4N63R47j770J305p2K29j382M38P72k6O0k58O62m94j592J631j232
$$ -987 -665 -759 -196 751 -1019 286 214 443 -939 -501 271 245 305 47 709 215 -1377 254 -978
15848i78J740j217O49m46J064n04N48k84j017K99N85j4j257R83q67R01N5L9k17
$$ -978 762 -455 194 -252 812 308 856 572 -445 -146 439 425 -832 151 -716 185 240 279 62
15867F2l37N44O8P17j809K470j833l30j6K49r94O4J674k168J955P6j57L64p8Q7
$$ 62 -275 269 337 1054 -755 1715 -118 -448 -464 -215 -1209 -1145 529 -1639 316 392 235 599 521 608
15887F08j107K19o7l19J697j715Q46o17P37j36o2J11j172J885j730K136j417j387
$$ 608 -499 -280 -347 -666 1031 -684 162 -455 282 146 84 195 -977 908 -822 1314 -103 -1490
15905a490K489j248P18j372J037k91q05L08m94J533J76o90p51Q22O04m76P15k177
$$ -1490 999 -249 469 -903 134 -157 -962 -654 -1148 385 561 -129 -880 -58 546 70 785 -1392
15923a392J395K76J62M4k65n2k50P38j285J302O5p73q08J960L5j167n47k74J123
$$ -1392 3 279 441 485 220 168 -82 656 -629 673 738 -35 -843 1117 1152 -15 -562 -836 287
15942B87m75K34P34l74j230N14q0N83m64j26j87L57j95N78L65k39j213J299q52
$$ 287 -188 46 780 406 -824 -310 -390 193 -271 -397 -584 -227 -422 156 521 282 -931 368 -484
15961d84M81l2l55J126j099M69j70L38j128M63n86P83J021j714J563j399R21m37
$$ -484 -3 -35 -390 736 -363 106 -64 274 -854 -391 -977 -194 827 -887 676 -723 198 -239
15979b39M80J095j562K67j14o98K056k594J190L09p88N31j76L82k05J251j161
$$ -239 241 1336 -226 41 -73 -771 1285 -1309 -119 190 -598 -67 -243 139 -66 1185 24
15996B4L69l77j436J967j292J139j095L30J316j076j4N24n78o60J042m60J024
$$ 24 393 16 -1420 547 -745 394 -701 -371 945 -131 -145 379 -199 -859 183 -277 747
16013G47p23j5R79k261K053j459P53L69j417K813k658J276n32N60K13Q60k318
$$ 747 24 9 988 -1273 780 -679 74 443 -974 1839 -819 457 -75 485 698 1558 -760
16030g60O51R40J68m58n90J52M62j344Q99N66O9q74j30K83l56M54j270O43P86
$$ -760 -109 831 999 541 -49 103 565 -779 120 686 755 -119 -249 34 -322 132 -1138 -495 291
16049B91m53m95P78m22j13m79K765k215o49J850q84Q97j323k58O36j086O71M43
$$ 291 -162 -657 121 -301 -414 -893 1872 -343 -992 858 -26 871 -452 -710 -74 -1160 -489 -46
16067d6J232l12o99m8q57J50n73J723j132J477j254P43J51p20K50j353J909k320
$$ -46 1186 874 175 127 -730 -580 -1153 570 -562 915 -339 404 555 -165 85 -1268 641 -1679
16085a679J811L51k93J510k684J841q87k2M5p78K386j314k68n24P96j22n86Q63
$$ -1679 132 483 190 1700 -984 857 -30 -52 -7 -785 1601 287 19 -505 291 169 -417 446
16103D46q2k82q38O76J322j359L70n25L51l54R37n17K32R51k573J409p14O58n96
$$ 446 364 82 -756 -80 1242 -117 253 -272 79 -275 662 145 377 1328 -1245 164 -550 108 -488
16122d88l16Q04q90J707m92K8J77k91k2p32l4J342p78K07m88kl86L57K80J14j297
$$ -488 -804 0 -890 817 325 353 530 239 217 -515 -549 793 15 222 -266 -268 -654 -297 -17 97 -1200
16143a200J380o0l71j59J327m86j512Q01L05j46j288J755k2j16j348J562m47M50
$$ -1200 180 120 -251 -410 917 431 -1081 -280 25 -121 -1409 346 324 208 -1140 422 -25 425
16161D25K1j520P26j99J522r8n87N84k003J390j207Q64K43q17R95k28P06j116
$$ 425 446 -1074 -348 -547 975 877 290 874 -1129 261 -946 -82 161 -656 339 111 817 -299
16179b99J204Qj549J332l31O24j160L31M37j440J573j680J728p41L96L21r68R92
$$ -299 905 913 -636 696 365 989 -171 160 597 -843 730 -950 778 37 433 754 -214 778
16197G78p34L25n48k06N85p29J586j802J168m63J78p13M54N0j89J330j047m90
$$ 778 44 369 -179 -385 200 -529 1057 -745 423 -40 138 -575 -121 -71 -260 1070 23 -467
16215d67J110j035J647j594J127o63O34j892R36N61k8L83j337L36O03RK26j109
$$ -467 643 -392 1255 -339 788 125 759 -1133 -197 364 336 719 -618 -282 321 330 556 -553
16233e53J219j548J996o19j066J095m15j43o45P55N82m42Qm1r31J673j193R99
$$ -553 666 -882 1114 495 -571 524 109 -34 -679 76 658 216 224 183 -748 925 -268 731
16251G31q83L36R8n3P69p63l13q32J322K82j945J437j59L50n06j79n2r55J524
$$ 731 -152 184 282 229 998 235 -78 -910 412 694 -1251 186 27 377 -129 -308 -360 -1315 209
16270B09j016J482j138o10R43l30J409j535J240j014M80K48j313K591k529J798
$$ 209 -807 675 -463 -1073 -130 -460 949 -586 654 -360 120 368 -945 1646 -883 915
16286I15p35K3l57j583K905k592K603k294J566o74m42Q38r36J998k353N79J198
$$ 915 180 203 -154 -1737 1168 -1424 1179 -1115 451 -223 -665 173 -763 1235 -1118 -539 659
16303F59k049J912p86Q32j405J407r59N03R66j415K074r64j0j117n80Q09k45P15
$$ 659 -1390 522 -264 568 -837 570 -389 114 1080 -335 1739 775 765 -352 -932 -123 -368 347
16321C47l47j306P23M18l20Q91j182R32n40O58q51n97R89P46p3k59p21L13O30
$$ 347 0 -1306 -583 -165 -485 406 -776 156 -384 274 -577 -1174 -185 561 488 229 -492 -179 451
16340D51O22n13k27q96J285j191Q80M22j988J961j181J068j881J458m76L2J247
$$ 451 1073 560 333 -563 722 -469 411 833 -1155 806 -375 693 -1188 270 -206 -174 1073
16357A073j655R57n86m98J158j978J619j338K128m34p39J351j287P18j417Q59
$$ 1073 -582 375 -211 -709 449 -1529 90 -1248 880 446 -293 1058 -229 489 -928 -69
16373f9q7o98N4P90J307k304K282j810Q66J096
$$ -69 -156 -854 -800 -10 1297 -1007 1275 -535 331 1427
16383A427
$$ 1427
$$ Imaginary data points
##PAGE= N=2
##DATA TABLE= (X++(I..I)), XYDATA
0@%%%%%%%%%%%%%%%%%%%%%%%%%%%%jKnQqQoMlJJJqJ2j4J6j5J8k0J8j9J9k4L0k8
$$ 0 0 0 0 0 0 0 0 0 0 0 0 0 0 0 0 0 0 0 0 0 0 0 0 0 0 0 0 0 -1 1 -4 4 -4 4 -2 2 -1 0 1 2 -6 6 -8 8 -7 11 -9 9 -10 9 -15 15 -13
53a3L1l8M4n3O3p3Q2r0J05j34J78k49M39l724K006J650L09j028L20N41K06k045
$$ -13 18 -20 24 -29 34 -39 43 -47 58 -76 102 -147 292 -3432 -1426 224 533 -495 -175 366 572 -1473
75a473J400m92N02l2L09q09K77o16R30q4J669j516K03o7J79o08R08k30N53p44
$$ -1473 -73 -565 -63 -95 214 -595 -318 -934 -4 -88 1581 65 268 201 380 -228 680 450 1003 259
95B59n78O55o24R42j220P77j12P69p86n34j32J521j200O99o40P17Kq03K19j144
$$ 259 -319 336 -288 654 -566 211 99 868 82 -452 -584 937 -263 436 -204 513 515 -288 -69 -1213
115a213J159n69N36Q42k16j143Q4J316L09j468J340j111O40j33K7R60j899J447
$$ -1213 -54 -623 -87 755 539 -604 -520 796 1105 -363 977 -134 506 373 400 1360 -539 908
133I08j649J095n16Q51J16j294J713k384J250j54k72J511k304J452j416J930r10
$$ 908 -741 354 -162 689 805 -489 1224 -1160 90 -64 -336 1175 -1129 323 -1093 837 -73
150g3J2M01q59N89o25J291o03o0K52j107J395J70L98j908l67J528r05J732j723
$$ -73 -61 340 -519 70 -555 736 133 73 325 -782 613 783 1181 -727 -1094 434 -471 1261 -462
169d62J235o18n79N61m84Q53k34J10o96N01l45n13K87r0k1K0P31P32j482n01L74
$$ -462 773 155 -424 137 -347 506 272 382 -314 187 -158 -671 -384 -474 -495 -475 256 988 -494 -995 -621
190f21M67k15l46Q33k31k53J117j173J068k014K648k281J337R3j029R63p21R81
$$ -621 -154 -369 -715 118 -113 -366 751 -422 646 -1368 1280 -1001 336 429 -600 363 -358 623
208F23j024K80J183j173L31o50K76q53J904m75r29Q64j397J889j260k34M27m56
$$ 623 -401 -121 1062 -111 220 -430 -154 -1007 897 422 -507 357 -1040 849 -411 -645 -218 -674
226f74M33o80K139j517n61J276l40M77j645M64j4J371r17J47M08l91J66o98R71
$$ -674 -241 -921 1218 -299 -860 416 76 553 -1092 -628 -642 729 -188 -41 367 -24 142 -556 415
245D15q4j399K217j604J437o14K39Rm75k95J39j85O06q33l95J117j22j498J946
$$ 415 331 -1068 1149 -455 982 368 607 616 141 -154 -15 -200 406 -427 -822 295 173 -1325 621
264F21j471k2J240j505J555N8l47L7j44O18m10K26k24Q53j45j725J550n30L19
$$ 621 -850 -872 368 -1137 418 476 129 166 22 640 230 456 232 1085 940 -785 765 235 554
283E54r09M95k20L28r03K421k738jj82J188K77L6p37R49q79M52m89n93J333j76
$$ 554 -355 140 -80 248 -655 1766 -972 -973 -1155 33 310 346 -391 558 -321 131 -358 -951 382 206
303B06p15N38N47p16m97M13J43n74J426j501K107j870N26m01O84k27k161K678
$$ 206 -509 29 576 -140 -637 -224 -81 -655 771 -730 1377 -493 33 -368 316 89 -2072 606
321F06j325J627l00k49K65j465J356j192J432p95l17J290k066J534n34R90j066
$$ 606 -719 908 608 359 624 -841 515 -677 755 -40 -357 933 -1133 401 -133 857 -209
338b09Q31l51j154Q53j399J460j156J012K01r05K563k899J726L56j635J372j033
$$ -209 622 271 -883 -30 -1429 31 -1125 -113 88 -817 1746 -1153 573 929 -706 666 -367
355c67J475k522K396j476Q76n68O10N96j201Q10n23L09j325J63J290n64O6n47
$$ -367 1108 -1414 982 -494 382 -186 424 1020 -181 629 106 415 -910 -747 543 -21 45 -502
373e02R3L81p2L61j625L74J108J38p44N52q20J823j449K9l46L41L57K17k61P33
$$ -502 -409 -28 -100 261 -1364 -990 118 256 -488 64 -756 1067 -382 -353 -699 -358 -1 216 -45 688
393F88j65J28m39r66Q39p24j73M58M81o07m49J437L00j226K173k499J545m07M07
$$ 688 523 651 212 -754 85 -639 -812 -354 127 -480 -929 508 808 -418 1755 -744 801 394 801
412H01q93J19J25O35p93M18O14p71l69O58q51Q81j327Q88j04q70M51j731L110
$$ 801 -92 27 152 787 -6 412 1026 255 -114 544 -307 574 -753 135 31 -839 -388 -2119 991
431I91q16R10j352j22P81j394J909j464P70K06j274J840j351O20j49J32J13k68
$$ 991 175 1085 -267 -389 392 -1002 907 -557 213 419 -855 985 -366 254 105 237 350 82
449H2R95j380L30m30M42o82o0J827j734J585r08N16o2r97J215n47N84j017p28
$$ 82 1077 -303 27 -403 39 -643 -703 1124 -610 975 67 583 521 -476 739 192 776 -241 -969
468i69L53O4R97j803J984j381J95J719j110M45m44k73j115J955j212K51M04k88
$$ -969 -616 -552 445 -1358 626 -755 -560 1159 49 494 50 -223 -1338 617 -595 -344 60 -228
486b28K94l21n49J100p57L7R35j057N46r32J191j341pK396k139P40p59J390m33
$$ -228 66 -255 -804 296 -461 -424 511 -546 0 -932 259 -1082 -1089 1307 -832 -92 -851 539 106
505A06J03j84q14J066j95N72k382K712j8k222K05O01O66j37O07p40o16K71K02
$$ 106 209 25 -789 277 82 654 -1728 984 966 -1256 -1051 -450 216 79 686 -54 -670 -399 -197
524a97K16p02K40l60L92J395j504J395m38o65Q77o34J599k214J472j522Q68O41
$$ -197 19 -683 -443 -803 -411 984 -520 875 437 -228 649 15 1614 -600 872 -650 218 859
542H59j131J523k61L57j578P88O3r60k05R66L0j479P71l19M83N61j124M69OnM07
$$ 859 -272 1251 990 1347 -231 557 620 -340 -545 421 451 -1028 -257 -576 -93 468 -656 -187 -181 -186 221
563B21j92J041j088k83k63K79O02n41p8n76J660j282l13P23M66R84j728N37J024
$$ 221 29 1070 -18 -301 -564 -285 317 -224 -302 -878 782 -500 -813 -90 376 1360 -368 169 1193
582A193j225O5j006P03O1j30Q08j100P12r59J215J23m03l0j781K613j161J122
$$ 1193 -32 33 -973 -270 -209 -339 469 -631 81 -878 337 460 57 27 -1754 859 -302 820
600H20j76j957J392k12N77l97k24M13r4j57q54K142j705O29O32k926K305l37L52
$$ 820 644 -1313 79 -133 444 47 -177 236 142 -15 -869 1273 -432 197 829 -2097 208 -129 223
619B23p90L99O42j59O77k200K117j424J209p38l39O89m02j6l03K25L53M24n6j151
$$ 223 -567 -168 474 315 992 -1208 909 -515 694 -44 -383 306 -96 -112 -415 -190 163 587 531 -620
639f20P21j675J189L02j93R16j400J519j392R03p2r79J155N5p17P03m88L28j078
$$ -620 101 -1574 -385 -83 -276 640 -760 759 -633 270 198 -781 374 429 -288 415 -73 255 -823
658h23J465j53K16o66M28P18q23K22P79j644P26N20q98n08n53Q29j29o1o08J211
$$ -823 642 489 705 39 467 1185 362 584 1363 -281 445 965 67 -441 -994 -165 -294 -355 -963 248
678B48j619J281P98l18m03N30j61m73L42k89o06J481q84N30K54o73j0j88P49k181
$$ 248 -1371 -90 708 390 -13 517 356 -117 225 -64 -670 811 -73 457 711 38 28 -160 589 -1592
698a592K761k136J712m39j125K237k026O39m4n43J09oK286k799J736j543K56M21
$$ -1592 1169 -967 745 306 -819 1418 -608 31 -13 -556 -447 -453 1833 -966 770 -773 -517 -96
716i6m68J201j290J53K58q33J352n69k90j08m04J186l76J126j772J068L51n39
$$ -96 -564 637 -653 -500 -242 -1075 277 -292 -582 -690 -1094 92 -284 842 -930 138 489 -50
734e0m75J948j22k334J559j391M92K93l14K47n1J01l08N18p57N49Q95j19j26p84
$$ -50 -525 1423 1301 -1033 526 -865 -373 -80 -394 -147 -198 -97 -405 113 -644 -95 800 681 555 -229
754b29J035j555L34J14J00O00l83k37m23J283m2q21M20N54j592R80j9J11r97J503
$$ -229 806 -749 -415 -301 -201 399 16 -221 -644 639 597 -224 196 750 -842 138 119 230 -767 736
774G36j671J945l27q20N50l75q54M31K178r33j546K206j212J486j643j203J562
$$ 736 -935 1010 683 -137 413 38 -816 -385 1793 860 -686 1520 308 1794 151 -1052 510
791E10n84n79j7O79Q71j406P64l59P98j141N03n22j133K247j097R60r65J035k49
$$ 510 -74 -653 -670 9 880 -526 238 -121 677 -464 39 -483 -1616 631 -466 494 -471 564 315
810C15j778K612k092R68j374K128j270r04K439j899J115k091K797q64j76Q81j799
$$ 315 -1463 1149 -943 25 -1349 779 -491 -1395 1044 -855 260 -1831 966 102 -74 807 -992
827i92J971j117M78k32j40ml66J075ln82j26N74o33j208J244l61O84j137J225
$$ -992 979 -138 340 108 -32 -36 -402 673 670 88 -38 536 -97 -1305 -61 -422 262 -875 350
846C50N74p28P03j002K75L15o47J279j475q18M50k74J295Q7l13p89N59M58j330
$$ 350 924 196 899 -103 172 487 -160 1119 -356 -1174 -724 -998 297 384 71 -718 -159 299 -1031
865a031O87j10j97J67J860j475O35j097R86J33m18p59J229p31M14j429N54N11
$$ -1031 -344 -454 -651 -484 1376 -99 536 -561 425 558 140 -619 610 -121 293 -1136 -582 -71
883g1o91K162j825K90K4l1J170j664R56j070R60j314J706j388n05J893j976K028
$$ -71 -762 1400 -425 -135 -111 -142 1028 -636 320 -750 210 -1104 602 -786 -1291 602 -1374 654
901F54p22p29Q10l54J158k276K649j223q7M14p74K016j878J226k040J088K5k07
$$ 654 -68 -797 13 -341 817 -1459 1190 -33 -120 294 -480 1536 -342 884 -1156 -68 -43 -250
919b50o6L08K89o60n46Q53r69J346l44j0J079k25j587J38P13m91P94n33K90R97
$$ -250 -316 -8 281 -379 -925 -72 -1041 305 -39 -49 1030 805 -782 -644 69 -422 372 -161 129 1126
939A126j225J67q78J203o9k36p44L3M23p63R90K95j342J094J75p41k70R98j41
$$ 1126 -99 68 -810 393 324 88 -656 -623 -200 -963 27 322 -1020 74 249 -492 -762 236 95
958I5l89r4L33Q17m06o21J85n81N58J480p47m81r80J642k032P19Q10K1n88j643
$$ 95 -294 -388 -55 762 356 -265 -80 -661 -103 1377 630 149 -831 811 -1221 -502 308 329 -259 -1902
978a902K473j389J793j959J045K94m84K81m68o2J53L58J269k497J001O07M42j854
$$ -1902 571 -818 975 -984 61 355 -129 152 -316 -378 -225 133 1402 -1095 -94 513 955 -899
996h99J076M30L6pj571J521n20l2M53O06r00m63J616k194R45p80J451o96j523
$$ -899 177 607 643 636 -935 586 66 34 487 1093 193 -270 1346 -848 97 -683 768 72 -1451
1015a451J165M61Lj15R4J314j866P72j452J815j97j914J435J41L91j912J549L17
$$ -1451 -286 175 178 63 157 1471 -395 377 -1075 740 543 -1371 64 205 596 -1316 233 550
1033E50r69Q80j72L24n64K87j401Q60o12P59N24q13J092j913P01Q5M6K57j48M89
$$ 550 -419 461 289 613 49 336 -1065 -205 -817 -58 466 -347 745 -1168 -467 -382 -336 -79 -227 262
1053B62K8N21j389N30M61o6o05L80l95N09k80Q31k98M60j05p91p4k38K29L33m34
$$ 262 290 811 -578 -48 413 347 -258 122 -273 236 -44 787 489 949 844 53 -21 -259 -30 303 -131
1074a31j40N14o13N7R99m69j535J396m36O9j59N80j41r12J936j892L14O40l23
$$ -131 -271 243 -370 -313 686 217 -1318 78 -358 -289 -448 132 -9 -921 1015 -877 -563 77 -246
1093b46Q30o51j30j93L73M99L43j91j584K094j941J137J305k723J185j162J709
$$ -246 584 -67 -197 -390 -17 482 825 634 -950 1144 -797 340 1645 -1078 107 -1055 654
1110F54j998J175o62M62M44p55J123p67M28l19j53Q14p30J007J74k21j268J247
$$ 654 -1344 -169 -831 -369 75 -680 443 -324 104 -215 -368 446 -284 723 897 676 -592 655
1128F55Q49k162J105q6Q13j978J157J33m90q54Q46K70j79k39K04l7M00j484Q70
$$ 655 1504 -658 447 361 1174 -804 353 486 -4 -858 -12 258 79 -160 44 7 407 -1077 -207
1147b07m32O44o5r22M59j23J038n85Q46q86L48J30J36j94L49o57O06P33j217Q09
$$ -207 -639 5 -60 -982 -523 -646 392 -193 653 -233 115 245 381 187 536 -121 485 1218 1 810
1167H10j230O69j058J055l05j08j83N8J065j132K22N45r17J042j130J635j103
$$ 810 -420 249 -809 246 -59 -167 -350 -292 773 -359 -137 408 -509 533 -597 1038 -65
1184f5M50p56N41Q1k75P18j959K293m18r29K45o97R41q36J246n37L84J39j286
$$ -65 385 -371 170 251 -24 694 -1265 1028 610 -319 -74 -771 170 -666 580 43 427 566 -720
1203g20J943k127Q63J510j280k30l78N60j024J075J226j259O54r07J03p46J177
$$ -720 1223 -904 -41 1469 189 -41 -419 141 -883 192 1418 159 813 -94 9 -737 440
1220D40o14j13K133k428K63l0K45J84n50Q51q29J408o85P57j496o29J390q2N14
$$ 440 -174 -287 1846 -582 -319 -349 -104 80 -470 381 -448 960 275 1032 -464 -1093 297 215 729
1239G29J15j251N56p97n10N45J380j386J750q11kK83j22p54M14j61K85m64m35
$$ 729 844 -407 149 -648 -1158 -613 767 -619 1131 320 318 601 479 -275 139 -22 263 -201 -636
1258f36P28r29L93l17R70k31m17J163m23n92o31J629j624J348m91P66q1j434J208
$$ -636 92 -837 -444 -761 209 -22 -439 724 301 -291 -922 707 -917 431 -60 706 625 -809 399
1277C99k92RM2j221J720j114J187j766J300o74p55K044j499J785j630Q25j487
$$ 399 107 116 158 -1063 657 -457 730 -1036 264 -410 -1165 879 -620 1165 -465 360 -1127
1294a127J238k47n79J086r45J134k77p50J284j593J405j358J758o09p39o79L53
$$ -1127 111 -136 -715 371 -574 560 283 -467 817 -776 629 -729 1029 420 -319 -998 -645
1311f45J125o45k04M0p00J582n93j15J94N88J2j059P88j333P00r01Q95N17R02
$$ -645 480 -165 -369 -329 -1029 553 -40 -155 39 627 639 -420 368 -965 -265 -1166 -271 246 1148
1330A148j513M55OJ37n39K05K52p12l29K081j468J07L34l46J36q28J019Qk47J76
$$ 1148 -365 90 96 233 -306 -101 151 -561 -890 1191 -277 -170 164 -182 -46 -874 145 153 -94 82
1350H2n23M08l17O63n3p1m24k45J063r02l96Q88L15L63k95j360O61N20o19l34
$$ 82 -441 -33 -350 313 260 189 -235 -480 583 -319 -715 173 488 851 556 -804 -143 377 -242 -576
1370e76N82o80O85K35o50P56m38J298j974J256m98l53J085k114K496k093R17p00
$$ -576 6 -674 11 246 -404 352 -86 1212 -762 494 -4 -357 728 -1386 1110 -983 -66 -766
1388g66J485K51j018J049j412J269o20l6L17p19J441k186K158j837J078m8k141
$$ -766 719 970 -48 1001 -411 858 238 202 519 -200 1241 -945 1213 -624 454 406 -1735
1405a735K107j253O02q78J173M21p02J300k175R63p7n35Q56o30J183r27J74q81
$$ -1735 372 -881 -279 -1157 16 437 -265 1035 -1140 -177 -254 -789 67 -563 620 -307 -133 -1014
1423a014J314j95m43Q25J39o89J219l96r42m63M73L74O85o28j230M73O03j702
$$ -1014 300 105 -338 487 626 -63 1156 760 -182 -645 -172 202 887 259 -971 -498 105 -1597
1441a597J218J58R90j267J84lO05L53k78j77m54K81q26J660l60p67k17j337J684
$$ -1597 -379 -221 769 -498 -314 -317 288 641 363 186 -268 13 -813 847 487 -280 -497 -1834 -150
1460a50J83j44M65j034J761k370J997q4l31Ko78J365j649M67j1K57M22j877J996
$$ -150 33 -111 354 -680 1081 -1289 708 624 293 295 -383 982 -667 -200 -211 46 468 -1409 587
1479E87p71R78j094j14R26r66J985j810J88J97R79j568j093K388j043J069k20
$$ 587 -184 794 -300 -414 512 -454 1531 -279 -91 106 1085 -483 -1576 812 -231 838 618
1496F18m91O30j866J799k54O6n14L68J358j824J186P15j761M95m15M47m2j72m74
$$ 618 127 757 -1109 690 436 502 -12 356 1714 -110 1076 1791 30 525 110 557 515 343 -131
1515a31P00K51j394O59k42o82Q58j22J03j31j59Q90m12o29Q63j008O83P7m05J040
$$ -131 569 820 -574 85 -157 -839 19 -103 0 -131 -290 600 188 -441 422 -586 97 174 -231 809
1535H09o66r51J126k45j012R12m6k77J55J8r31J757o44m12J293j139R9P0o4L74
$$ 809 143 -808 318 73 -939 -27 -73 -350 -195 -177 -1108 649 5 -407 886 -253 -154 -84 -148 226
1555B26o50J400j553J010j384J154k47n20J124k104K589k380J609l80O5N5P45
$$ 226 -424 976 -577 433 -951 203 -44 -564 560 -1544 1045 -1335 274 -106 -41 14 759
1572G59p25j398J379K41j02M41j121J604j487k39K24P41m31j088K797k453q36
$$ 759 34 -1364 15 256 154 595 -526 1078 -409 -648 -424 317 -114 -1202 1595 -858 -1694
1589a694R43O40J119j425P82j066J105r37O05l5q77J653j596P52n39R05j00O07
$$ -1694 -751 -111 1008 -417 365 -701 404 -533 72 37 -840 813 -783 -31 -570 335 235 842
1607H42P3l81k62L25q69k95M32R61j403M95j08J191j073o64K74Q46k68L7k4J110
$$ 842 915 534 272 597 -272 -567 -135 826 -577 -82 -190 1001 -72 -736 -462 384 116 153 129 1239
1627A239j190O32j358M35k65J536o88n09N55j396K504j970p54J565J172j156k25
$$ 1239 49 681 -677 -242 -507 1029 341 -168 387 -1009 1495 -475 -1229 336 1508 352 127
1644A27n7M51m98R01n54n29m93n61J835j024J418j751M44M52j379J491j043J223
$$ 127 70 521 23 924 370 -159 -652 -1213 622 -402 1016 -735 -291 161 -1218 273 -770 453
1662D53p76M35O46j668Q26l42N97p43J204n63n38J754j309J54l30q6J055j560
$$ 453 -323 112 758 -910 -84 -426 171 -572 632 69 -469 1285 -24 130 -200 -286 769 -791
1680g91J573r77L46n95O88k11j559Q69L73Q02n64J17N12j362K013n61k74o93O28
$$ -791 782 -195 151 -444 244 33 -1526 -657 -284 518 -46 71 583 -779 1234 673 399 -294 334
1699C34r03O84L32j009L19R24j84o98j53k02k16J371k59J23P75o20m91M93k23
$$ 334 -569 115 447 -562 -243 681 497 -201 -354 -556 -772 599 340 463 1238 618 127 620 397
1718C97j76J718j926o94R41K99r5l03p8J20n54k52J059M43m89p72J77p67P67m90
$$ 397 221 1939 13 -681 260 559 464 161 83 203 -351 -603 456 899 410 -362 -185 -952 -185 -675
1738f75R26K19j514J998j069j040J688m94P42j149Q05j391J164M21j402K198k507
$$ -675 251 470 -1044 954 -115 -1155 533 39 781 -368 437 -954 210 631 -771 1427 -1080
1755a080J233j96O1j13K26l23q20J981l83j073L11j48R52j434J307j392P96J92
$$ -1080 153 -43 18 -95 131 -192 -1012 969 586 -487 -176 -324 628 -806 501 -891 -95 97
1773I7m94R96p33k45N09m64O70m54K87j032J098j1J89P46j940M05k69J210k45
$$ 97 -397 599 -134 -379 130 -334 336 -118 169 -863 235 224 413 1159 -781 -376 -645 565 320
1792C20l49k56J59m29n33J954j200J560m43j209O72J47Q2j25m10M8JP14j069P80
$$ 320 -29 -285 -126 -555 -1088 866 -334 1226 783 -426 246 393 475 350 -60 -12 -11 703 -366 414
1812D14n40O85k67j477K200j750K52J78R24j218J125j302L30J87k94K38J604j319
$$ 414 -126 559 292 -1185 1015 -735 -483 -305 619 -599 526 -776 -446 -259 -553 -315 1289 -30
1830c0o31P15l47l5l55Q06K59j186Q03k02J911k091L25J20m16L07J56Q78j809
$$ -30 -661 54 -293 -328 -683 123 382 -804 -1 -203 1708 -383 -58 62 -354 -47 109 987 -822
1849h22J078j219M34p3P60O54j240J557j040J320j781m60Q17R8o64P84n47J009
$$ -822 256 -963 -529 -602 158 812 -428 1129 89 1409 -372 -832 -15 83 -581 203 -344 665
1867F65j332K224k240J628j093L54O98k232J497j096J413o22N91N18l88L98k091
$$ 665 -667 1557 -683 945 -148 206 904 -1328 169 -927 486 -136 455 973 585 983 -1108
1884a108R00L47m89J105q46j72O06k7n20j04l90j26M37P97K62K4r68n59P35J43
$$ -1108 -208 139 -350 755 -91 -263 343 316 -204 -308 -698 -824 -387 410 672 696 -272 -831 -96 47
1904D7p5P04o91j01k73J563j428j94J279j08l30j046N89p06O42J81j36m93J273
$$ 47 -28 676 -15 -116 -389 1174 -254 -448 831 723 393 -653 -64 -770 -128 53 -83 -576 697
1923F97o36n67q63M32J095j174J728p26m9M30n58N17j245J135n09n66N43R6J169
$$ 697 61 -506 -1369 -937 158 -1016 712 -14 -63 367 -191 326 -919 216 -293 -859 -316 -220 949
1942I49m76m09n53Q19l82j810K835k152J718l33j124K589k502J456j657J361j002
$$ 949 473 64 -489 330 -52 -1862 973 -1179 539 206 -918 1671 -831 625 -1032 329 -673
1959f73N42k38m5N12j11O85l59q41J184j165J089j076M97j624Q46R79j003J655
$$ -673 -131 -369 -414 98 -13 672 313 -528 656 -509 580 -496 1 -1623 -777 202 -801 854
1977H54p19j48j55R12j053R60p95J56n31P0J512j56j592N2L5J638j877J458j43
$$ 854 135 -13 -168 744 -309 651 -144 12 -519 -449 1063 907 -685 -633 -598 1040 -837 621 478
1996D78q87k83n0J82M33J2n53O15l05L88j093J390L6K01o92O71O98j723J148n85
$$ 478 -409 -692 -742 -560 -127 -115 -668 -53 -358 30 -1063 327 363 564 -128 543 1241 -482 666 81
2016H1L94j241J431K63o98p60m17M93k36P64m99M22J54o33O89m70j26J009K53
$$ 81 475 -766 665 928 230 -530 -947 -454 -690 74 -425 -3 151 -482 207 -263 -389 620 873
2035H73k97m44j1o48J425p57j037K429j657N10j426J635N19j592l70l48J576j320
$$ 873 576 132 121 -527 898 141 -896 1533 -124 386 -1040 595 1114 -478 -848 -1196 380 -940
2053i40J062m67N29N57j151N6m07J402p01k10J370k008R60L18m29J67n84J401
$$ -940 122 -345 184 741 -410 -354 -761 641 -60 -270 1100 -908 52 370 -59 108 -476 925
2071I25j794J315r85N0J541r54J234k542J956q10P3l76m35J246j115j88K014j055
$$ 925 -869 446 -539 -489 1052 98 1332 -1210 746 -64 9 -367 -802 444 -671 -859 1155 100
2089A00K67K00j012J269L35j466K35o46M96J68P76n32k48l68J432r49m13n32K08
$$ 100 367 567 -445 824 1159 -307 -72 -718 -222 -54 722 190 -58 -426 1006 57 -356 -888 -680
2108f80R05M07m9k56m35l48K82k11m75M25K07J098j102O6N32k4j462P92L72j91
$$ -680 225 632 583 327 -108 -456 -174 -385 -860 -435 -228 870 -232 -166 366 342 -1120 -328 44 -147
2128a47q51R44o75J494j776J218m8l04J329j944J079o87l96N80L6J834k574J730
$$ -147 -998 -54 -729 765 -1011 207 159 -145 1184 -760 319 -368 -764 -184 -148 1686 -888 842
2146H42j309J288p94m29J419j303J262j623R1K460k844J629j554J810J15j330
$$ 842 -467 821 27 -402 1017 -286 976 -647 -556 1904 -940 689 -865 945 1060 -270
2162b70L45n71R80J65L70j136LJ783k311J124p82N39p17K18j194J150k95q1J328
$$ -270 75 -496 484 649 1019 -117 -114 1669 -642 482 -300 239 -478 -260 -1454 -304 -599 -680 648
2181F48j348M01J197r87O27o67L13q04J047N9n8j83n62m52O80l41M90K5J70j258
$$ 648 -700 -299 898 -89 538 -129 184 -620 427 486 428 245 -317 -769 -89 -430 60 85 255 -1003
2201a003Q61p75J648j225L49P37j219n06J652r50N18n01k1M6P05R93j775L59M65
$$ -1003 -142 -917 731 -494 -145 592 -627 -1133 519 -431 87 -414 -435 -389 316 1309 -466 -107 358
2220C58p29J99m62o7N26q1n19N14J117n77K06j654K077j883Q87O69r27m68O54
$$ 358 -371 -172 -634 -701 -175 -256 -775 -261 856 279 485 -1169 908 -975 -88 581 -346 -814 -160
2239a60R98j436N90l5m2K21o15K48k39n24J724p46P24q93J38o29J520k30p99L15
$$ -160 838 -598 -8 -43 -85 136 -479 -231 -470 -994 730 -16 708 -185 -47 -676 844 614 -185 130
2259A30j121J354j240J697n1j557J078p09K060k267J101n98K32M41j323P49p23
$$ 130 -991 363 -877 820 769 -788 290 -419 1641 -626 475 -123 109 550 -773 -24 -747
2276g47J647L60j822J28k24J102j178M84P89l89k1O33q02m99K81Q11j288R70q6
$$ -747 900 1260 -562 -434 -658 444 -734 -250 539 150 129 762 -40 -539 -258 553 -735 235 149
2295A49r92L46N78O79p37l87M12o50P34r54O54R1o52O72n42J434j116N66o55J022
$$ 149 -843 -497 81 760 23 -364 48 -602 132 -822 -168 -77 -729 -57 -599 835 -281 285 -370 652
2315F52k75j460J617j199J169k5L38l86o49M30o21N30L53M0L72q10j081l20K079
$$ 652 377 -1083 534 -665 504 479 817 431 -218 212 -409 121 474 514 886 76 -1005 -1325 754
2334G54j238J459j08j992P50j351K965j714O83p38j73J135r45J257n87P52j916
$$ 754 -484 975 867 -1125 -375 -1726 1239 -475 208 -530 -703 432 -513 744 157 909 -1007
2351a007O26O77j452K136j495Q67K54j303L85o46J305q85J279l10Q66l24K23o53
$$ -1007 -381 296 -1156 980 -515 352 606 -697 -312 -958 347 -538 741 431 1297 973 1196 543
2369E43r77l43J317j379J011j607J207rQ93p82M22n23m13J354jo82j58Q49q95
$$ 543 -434 -777 540 -839 172 -1435 -228 -237 656 -126 296 -227 -640 714 713 31 -127 722 -173
2388a73L7j14J095j222l24R55j537J825k55l49J04M72m81q24L59o27R92n57J096
$$ -173 -136 -250 845 -377 -701 254 -1283 542 287 -62 42 514 33 -791 -432 -1059 -67 -624 472
2407D72j078J22J322j446J585k573N84L40R72p34J66m3o45K123j955J208n14n93
$$ 472 -606 -484 838 -608 977 -1596 -1012 -672 300 -434 -268 -311 -956 1167 -788 420 -94 -687
2425f87J078n87J164j834P49M16q48J605q23l32j091J256L23n14j69n98J223o03
$$ -687 391 -196 968 -866 -117 299 -549 1056 233 -99 -1190 66 389 -125 -294 -892 331 -272
2443b72P86k87j23J75j058O82l26J798j388J595j857O12J23r21L76J20O03k8l18
$$ -272 514 227 104 279 -779 -97 -423 1375 -13 1582 -275 337 460 -461 -85 35 638 610 292
2462B92J00o95L35R3m98R02q18J44p5l30J126j315J373p59M27l43M26j295J039
$$ 292 392 -303 32 125 -373 529 -289 -145 -220 -550 576 -739 634 -125 302 -41 385 -910 129
2481A29j49p20R60k08n2L68l98n16M14n0L01q41J587j177K4k2P58k94o87J106
$$ 129 -20 -740 220 12 -40 328 -70 -586 -172 -222 79 -762 825 -352 -328 -350 408 114 -573 533
2501E33j283J60L35M68j04l12J582j718P63k42r56O72r82J583j131J5J349j317
$$ 533 -750 -590 -255 213 109 -203 1379 -339 424 182 -774 -102 -1084 499 -632 -617 732 -585
2519e85J103j464J693r90k6p78J388N30k099J874j549J583q50M00j91q0M10r77
$$ -585 518 -946 747 -243 -269 -1047 341 871 -1228 646 -903 680 -170 230 39 -41 369 -608
2537f08J289j044K68Q11j900K743k885J294j265J949p79M36m3k73M64K61p54M58
$$ -608 681 -363 -95 716 -1184 1559 -1326 -32 -1297 652 -127 309 266 -7 457 718 -36 422
2555D22j54M14q23p4R2J64J047j266L38k59J220j224n15K85r72P03m70J042P6
$$ 422 268 682 -141 -215 -123 41 1088 -178 160 -99 1121 -103 -618 -333 -1305 -602 -1072 -30 46
2574D6j055J203m09Q29r35l34J355j294l79J93J938j416L07P29j735J101o77M70
$$ 46 -1009 194 -215 614 -321 -655 700 -594 -973 -780 1158 -258 49 778 -957 144 -533 -63
2592f3p15Q97J01R12n09pp25M85k30L22p61J65N45j66j68r74K295k741J455j112
$$ -63 -778 119 220 1132 623 616 -109 376 146 468 -293 -128 417 251 83 -891 1404 -1337 118 -994
2612i94j98K231k054J183p64Q26o78L14J511k114J541j007L6m74O44P54j325K263
$$ -994 -1192 1039 -1015 168 -596 230 -448 -134 1377 -737 804 -203 -167 -641 3 757 -568 1695
2630A695j735o52M97K03O05j021J351q79n21jL72J260q00p8k75M86O7k26k50j084
$$ 1695 -40 -692 -195 8 613 -408 943 64 -457 -458 -86 1174 374 296 21 507 574 348 98 -986
2650i86J151l28l47J8L11O15j208J422q19M91j480N94K092k087P54J63r00J262
$$ -986 165 -163 -510 -492 -181 434 -774 648 -171 320 -1160 -566 1526 -561 193 356 -544 718
2668G18n11j94j169L64J73L31J79k53m44J443j04j518J738k30j048Q68M55q51
$$ 718 207 13 -1156 -792 -619 -288 -109 -362 -806 637 533 -985 753 523 -525 343 798 -53
2686e3M84q72R61k11K50o71J075p41p15J48n33J472P4o94M91p41Q30j06l98k29
$$ -53 431 -441 520 309 559 -112 963 222 -493 -345 -878 594 668 -26 465 -276 554 448 50 -179
2706a79p75J759k239J833p6j92k79N00Q59j436J969j820O68n44K85m35q80K029
$$ -179 -954 805 -1434 399 323 131 -148 352 1211 -225 1744 -76 592 48 333 -102 -982 1047
2724A047j111RO2oo86m82J735j354J209p2N26j012J12L13j144J971q50L81m10
$$ 1047 -64 -55 7 1 -685 -1167 568 -786 423 351 877 -135 -23 290 -854 1117 267 648 238
2743B38p66N11j110J082l32J372j77j511J168j305M61N09M02o04l52K99k28Q08
$$ 238 -528 -17 -1127 -45 -377 995 818 -693 475 -830 -369 140 542 -62 -414 -115 -343 465
2761D65r0j89l25r42J838k94m57n56O4J319j141O37oj330K235k574P18J3k85R83
$$ 465 375 186 -139 -1081 757 463 6 -550 -486 833 -308 329 323 -1007 1228 -1346 -628 -615 -900 83
2781H3j81J58r49K134j069R9k61j212R81q46J070Q08j09k11j523R08J98N48m16
$$ 83 -98 60 -889 1245 176 275 14 -1198 -217 -1063 7 815 706 495 -1028 -120 78 626 210
2800B10o99K163j985O56m39M44l70j175J346j833J717k37Q96j589M68R37l17J38
$$ 210 -489 1674 -311 345 -94 350 -20 -1195 151 -1682 35 -202 694 -895 -427 510 193 331
2818C31j902K496j470l90J273j004J705j152l20J547j118j42n12J399j510J104
$$ 331 -1571 925 -545 -935 338 -666 1039 -113 -433 1114 -4 -146 -658 741 -769 335
2834C35j101k00J140O31n41j004J126l5o77P44j448J103n91O50m10m4N98p11R14
$$ 335 -766 -966 174 805 264 -740 386 351 -326 418 -1030 73 -518 132 -278 -322 276 -435 479
2853D79l43P64k254P20J97J78Q67r52L35p06L88K39l83K38j013J632j078J60P77
$$ 479 136 900 -1354 -634 -437 -259 608 -344 -9 -715 -327 -88 -471 -233 -1246 386 -692 -532 245
2872B45q60J409j008O29K24j686R01l8j31j01j257K849m01j042m76O67M98j692
$$ 245 -615 794 -214 415 639 -1047 -146 -184 -315 -416 -1673 1176 775 -267 -743 -76 422 -1270
2890a270J771o51m30k65J016K19j564K031j313J314m5j063J262j291P28j477J296
$$ -1270 501 -150 -580 -845 171 390 -1174 857 -456 858 813 -250 1012 -279 449 -1028 268
2907B68p17m50O65M90n81o17R51q55P18J317j141j2j332J092M7N38p35J338N88
$$ 268 -449 -899 -234 256 -325 -942 9 -846 -128 1189 48 36 -1296 -204 -157 381 -354 984 1572
2926A572k841K725k133N44P48j411J772k165J271k31O17j97k48K7r1%k5k76k91
$$ 1572 -1269 1456 -677 -133 615 -796 976 -1189 82 -149 468 271 23 50 -41 -41 -66 -342 -633
2945f33M23J415k250R30P56J120r31j459J446k82n13m49j14J348p59o36J04L81
$$ -633 -210 1205 -1045 -115 641 1761 830 -629 817 535 22 -427 -541 807 48 -588 -484 -103
2963a03P42j333J301p91K52P09n80k77p45J59L90R76j575L12M79J61J303r52N57
$$ -103 639 -694 607 -184 68 777 197 -80 -825 -666 -276 700 -875 -563 -84 77 1380 428 985
2982I85l13r38J279j114J93J33q72J501j583J135m60j18M27j088J185l11J950
$$ 985 672 -266 1013 -101 92 225 -647 854 -729 406 -54 -172 255 -833 352 41 1991
2999A991l355J584n43K58P08o64J625k663K323j519R47r80J106q29l72P69o78
$$ 1991 -1364 220 -323 -65 643 -21 1604 -1059 1264 -255 692 -288 818 -11 -383 386 -292
3016b92o08P97n40J211j107J542j277k84M48O17J175l446J863K2k2R3k77J458
$$ -292 -900 -103 -643 568 -539 1003 -274 -558 -110 507 1682 -1764 99 121 99 192 -85 1373
3034A373j825J414j526M31q7n6J120k069K250q24j60p62m77J213o0j51N66L88
$$ 1373 -452 962 -564 -133 -220 -276 844 -1225 1025 201 41 -721 -1198 15 -45 -196 370 758
3052G58p28r12J449p51O70l50m1K57N70o26j494J091q1j058J630p86M25o69K06
$$ 758 30 -882 567 -184 486 136 95 352 922 296 -1198 -107 -188 -1246 384 -402 23 -646 -440
3071d40J116p73O80o02p07J562j529K07K12K2p6K88J635j825L01m83Q08j526L82
$$ -440 676 -97 583 -19 -726 836 -693 -486 -274 -252 -328 -40 1595 -230 71 -412 396 -1130 -748
3090g48J921j210L05j141R64R5P71n66j194J990j865K316j171k12J117k394K810
$$ -748 1173 -37 268 -873 91 186 957 391 -803 1187 -678 1638 467 255 1372 -1022 1788
3107A788j541M30r73k82J135p86J214n46r6P17j36o29l73L8L85k44p92J189N50
$$ 1788 247 677 -296 -578 557 -229 985 439 343 1060 924 295 -78 -40 345 101 -691 498 1048
3126A048k401J694q46R26j317J856j561Q32K09rp55K63kO14m89R23j901J479j365
$$ 1048 -1353 341 -505 421 -896 960 -601 231 440 431 -324 -61 -63 551 62 985 -916 563 -802
3145h02J212N62j009l05M10j430Q72K49P04o9r01O11j129J882j095j14N62j10
$$ -802 410 972 -37 -342 68 -1362 -490 -241 463 394 -507 104 -1025 857 -238 -352 210 100
3163A00n98L90M17n24P78k9p95O07j008P54j125J538j101Q76J064k330J783k056
$$ 100 -498 -108 309 -215 563 534 -261 346 -662 92 -1033 505 -596 280 1344 -986 797 -1259
3181a259J516r53R48K94p81R67m68j85j195Q29Q09j839K643j899R94j204Q84m88
$$ -1259 257 -696 252 546 -235 732 264 79 -1116 -287 522 -1317 1326 -573 421 -783 101 -387
3199c87R65K43j125K351k818R98N26j964J958j979J223j87K2l27p68P50n19K979
$$ -387 578 821 -304 2047 -771 227 753 -1211 747 -1232 -9 -196 -174 -501 -1269 -519 -1038 1941
3217A941k205J148j033J40R9j178J460p89j29R0p71K178k89j384L95k43k64N83
$$ 1941 -264 884 -149 -9 90 -1088 372 -417 -546 -456 -1227 951 662 -722 -327 -570 -834 -251
3235b51N28p89Q63j144K41N81MK96j27j080Q67n46l07m14J144J745j583L54o44
$$ -251 277 -512 351 -793 -552 29 33 329 202 -878 -11 -557 -864 -1278 -134 1611 28 382 -262
3254b62J669j604p97J362r91Q12m38Q22o38m81M7l79J439k29m97n2JR53k012J096
$$ -262 1407 -197 -994 368 -623 189 -249 573 -65 -546 -499 -878 561 332 -165 -217 -216 737 -1275 -179
3274a79n74K013j404M15M3j463J910r59J647j557K55n96j003J795j25N32j006
$$ -179 -753 1260 -144 271 314 -1149 761 -198 1449 -108 147 -449 -1452 343 218 750 -256
3291b56q4O40Q7j65q16J092m16j283Q90M44O76r50k70K71J105j556L08m51J32
$$ -256 -340 300 387 222 -594 498 82 -1201 -311 133 809 -141 -411 -140 965 -591 -283 -734 -602
3310f02N91j098J060k01p72J909n36k05n55R02o62j00J384j233M46j120J047p52
$$ -602 -11 -1109 -49 -250 -1022 887 351 146 -409 493 -169 -269 1115 -118 328 -792 255 -497
3328d97q44J954j63p76L07M8J45P61j071q85J631o79O40j308J396n74K21k1K20
$$ -497 -1341 613 450 -326 -19 29 174 935 -136 -1021 610 -69 571 -737 659 85 306 285 505
3347E05k28M94o18J3n40n78R36l23q6n47O18n92l04J927q96J67j20j41l07q7J248
$$ 505 277 771 153 166 -374 -952 -16 -339 -425 -972 -354 -946 -1250 677 -219 -52 -172 -313 -620 -707 541
3368E41j248J075N04j001R36j987J231l66N01j55j50Q58j672Q61j14K64p83J072
$$ 541 -707 368 872 -129 807 -1180 51 -315 186 31 -119 739 -933 -72 -186 78 -705 367
3386C67K99r58P51n61R26j754R70l67L93J221l009R83NJ462o01K59k62r73J279
$$ 367 666 -292 459 -102 824 -930 40 -327 66 1287 -1722 -739 -734 728 127 386 124 -849 430
3405D30n61J162k71j99N1q29M33j062J053K86k095K601k380J475j342J729p53
$$ 430 -131 1031 760 561 612 -217 216 -846 207 493 -1602 999 -1381 94 -1248 481 -272
3422b72k3K18M07k68m07M68R20j669J21P62n69O8j41J865j175M40r91J64O46K85
$$ -272 -295 -77 330 62 -345 123 1043 -626 -505 257 -312 -244 -385 1480 305 745 -246 -82 564 849
3442H49j074O1k1o39o10J242p36O26o95J260L41q36O96k14r9o4J40O41k013N63
$$ 849 -225 -164 -185 -824 -1434 -192 -928 -302 -997 263 604 -232 464 250 151 87 227 868 -1145 -582
3462e82O1N52M37m75l24Q66J33r26n29J107j611J631j790J840r48P54r90Q55J01
$$ -582 -521 31 468 -7 -331 535 668 -258 -787 320 -1291 340 -1450 390 -558 196 -794 61 162
3481A62n20J450j915J568j293Q56J63j141J480j771J578r11K67L78p07J200q46
$$ 162 -358 1092 -823 745 -548 308 471 -670 810 -961 617 -294 -27 351 -356 844 -2
3498bM00j025M38l14n3J889q00j047L36N27j10J54Q83j118P97m22r06L18J15k22
$$ -2 398 -627 -189 -503 -556 1333 533 -514 -178 349 239 393 1276 158 955 533 -373 -55 60 -162
3518a62p04rK210k049N60j58Q28r14J415j012l01M90M4n37n97R35m89Nj02l07
$$ -162 -866 -875 1335 -714 -154 -312 516 -398 1017 5 -296 194 238 -299 -896 39 -450 -445 -547 -854
3538h54J281o31r10J808k270J129m75J079l99M62L6p16M81q83O82M86L42l59j367
$$ -854 427 -204 -1114 694 -1576 -447 -922 157 -242 220 256 -460 21 -862 -180 306 648 289 -1078
3557a078L80j168K136Q05j130l12m70R54m93R05j107k53K288j123L1q8K89r9J77
$$ -1078 -698 -1866 270 1075 -55 -367 -837 117 -376 529 -578 -831 1457 334 365 277 566 467 644
3576F44J409k841J153n15K35M5K28l19n82R53n24L53k49J83q1L99K41j683J710
$$ 644 2053 -788 365 -150 85 130 358 39 -543 410 -114 239 -10 173 92 491 732 -951 759
3595G59l50k06P90j429J567k337J869m83j027K235l099K825k334J777j419k38
$$ 759 409 203 993 -436 1131 -1206 663 180 -847 1388 -1711 1114 -1220 557 -862 -1100
3611a100J334o31R74j394p1N34p66L30J09O47J89k45m7O34M84q55m79J64Q43j220
$$ -1100 234 -397 577 -817 -888 -354 -1120 -790 -681 -34 155 -90 -137 497 981 126 -353 -189 654 -566
3631e66M35L6p36O19J07o09O18o2L27k73M79O1k18r94L16J176o04p9j43r19K243
$$ -566 -131 -95 -831 -212 -105 -714 -96 -158 169 -104 375 436 218 -776 -460 716 112 33 -110 -1029 1214
3652A214k131K5K28p3N53J54J586j169p65L74n45Q22j063J286n17j73K85r96K091
$$ 1214 -917 -892 -664 -737 -184 -30 1556 387 -378 -4 -549 273 -790 496 -21 -194 91 -905 1186
3671A186j253N98p85JK41q3lL77N16j531l23J590r95J584j379N14q64M70N24j681
$$ 1186 -67 531 -254 -253 -12 -95 -98 279 795 -736 -1059 531 -464 1120 -259 255 -609 -139 385 -1296
3691a296K630j572J308j032J19l36l73O64n18N84n04J45M34J06p89N29N33p41
$$ -1296 1334 -238 1070 38 157 -179 -552 112 -406 178 -326 -181 253 359 -430 99 632 -109
3709a09qM34n2r24L48J015j509m06O62m68J367l30L94pP48p10K07n99o24M34l87
$$ -109 -117 317 265 -659 -311 704 -805 -1211 -549 -1017 350 20 414 407 1155 445 652 53 -571 -137 -524
3730e24M09P23j516l2R23n96J081o36Kj048J261q81q9O79l02J146p53J799j958
$$ -524 -115 608 -908 -940 -17 -613 468 -168 -166 -1214 47 -834 -923 -244 -546 600 -153 1646 -312
3749c12R57P37j303M67r01O19n92J60K326j717L23q99J040j014n00R38l08O38
$$ -312 645 1382 79 546 -355 264 -328 -168 2158 441 764 -135 905 -109 -609 329 21 659
3767F59j000R22j83r68J342j492K477k226P54j230N71J017o81L40j517J518M19
$$ 659 -341 581 398 -570 772 -720 1757 -469 285 -945 -374 643 -38 302 -1215 303 722
3784G22p64P20j487J559j434Q1P1P74P8r61J881k443J436m52J45M4J2K88q19J485
$$ 722 -42 678 -809 750 -684 -603 -532 242 320 -641 1240 -1203 233 -219 -74 -30 -18 270 -549 936
3804I36o69Qm12K66K89p31P25l74N2j074O35k31J8K46K62l40M88k94k41J000p67
$$ 936 267 275 -137 129 418 -313 412 38 90 -984 -349 -580 -562 -316 -54 -394 94 -200 -441 559 -208
3825b08L76J00K96n05q11J112k16M31Pj22o32k85J255p32P73j166O19q34p24Q08
$$ -208 168 268 564 59 -752 360 144 575 582 460 -172 -457 798 66 839 -327 292 -542 -1266 -458
$$ [...]
##END NTUPLES=NMR FID
##END=
