##TITLE=31P_DE-80H_X3
 64 sc D2O
 26.2.2025
##JCAMPDX= 6.0         $$ Bruker NMR JCAMP-DX V2.0
##DATA TYPE= NMR FID
##DATA CLASS= NTUPLES
##ORIGIN= UXNMR, Bruker Analytische Messtechnik GmbH
##OWNER= root
$$ XWIN-NMR		Version 3.5
$$ Wed Jun 24 11:18:44 2026 Russian Standard Time (UT+4h)  Yarkov@DPX200
##.OBSERVE FREQUENCY= 81.013821
##.OBSERVE NUCLEUS= ^31P
##.DELAY= (6, 6)
##.ACQUISITION MODE= SIMULTANEOUS
##.ACQUISITION SCHEME= undefined
##.AVERAGES= 64
##.DIGITISER RES= 17
##SPECTROMETER/DATA SYSTEM= spect
##.PULSE SEQUENCE= zgpg30
##.SOLVENT NAME= D2O
##.SHIFT REFERENCE= (INTERNAL, D2O, 0, 243.863)
##AUDIT TRAIL= $$ (NUMBER, WHEN, WHO, WHERE, WHAT)
$$ ##TITLE= Audit trail, XWIN-NMR		Version 3.5
$$ ##JCAMPDX= 5.01
$$ ##ORIGIN= Bruker BioSpin GmbH
$$ ##OWNER= Yarkov
$$ C:/Bruker/XWIN-NMR/data/yarkov2/nmr/P31/2/audita.txt
$$ ##AUDIT TRAIL=  $$ (NUMBER, WHEN, WHO, WHERE, WHAT)
(   1,<2026-06-24 11:18:01.12 +0400>,<Yarkov>,<DPX200>,
      <created by zg, POWCHK disabled, PULCHK disabled
       configuration hash MD5:
       00 E9 B6 7A A2 85 ED C7 34 08 36 98 17 FE 4E 26
       data hash MD5: 32K
       23 AE 58 EE 9E B1 1D 5C A8 DC A5 03 E0 78 F0 B8>)
$$ ##END=
$$ 
$$ hash MD5
$$ 56 8C A7 E7 E3 DD 00 8C F2 51 E8 ED 3D 9F 9A 48
##$RELAX= 
##$RELAX= 
##$RELAX= 
##$RELAX= 
##$RELAX= 
##$RELAX= 
##$RELAX= 
##$RELAX= 
$$ Bruker specific parameters
$$ --------------------------
##$DU= <C:/Bruker/XWIN-NMR>
##$EXPNO= 2
##$NAME= <P31>
##$PROCNO= 1
##$TYPE= <nmr>
##$USER= <yarkov2>
##$AMP= (0..31)
100 100 100 100 100 100 100 100 100 100 100 100 100 100 100 100 100 100 
100 100 100 100 100 100 100 100 100 100 100 100 100 100 
##$AQSEQ= 0
##$AQ_mod= 1
##$AUNM= <au_zg>
##$AUTOPOS= <>
##$BF1= 81.014009
##$BF2= 200.13
##$BF3= 200.13
##$BF4= 200.13
##$BF5= 200.13
##$BF6= 200.13
##$BF7= 200.13
##$BF8= 200.13
##$BYTORDA= 1
##$CFDGTYP= 0
##$CFRGTYP= 5
##$CHEMSTR= <none>
##$CNST= (0..31)
1 1 145 1 1 1 1 1 1 1 1 1 1 1 1 1 1 1 1 1 1 1 1 1 1 1 1 1 1 1 1 1 
##$CPDPRG= <waltz16>
##$CPDPRG1= <>
##$CPDPRG2= <waltz16>
##$CPDPRG3= <>
##$CPDPRG4= <mlev>
##$CPDPRG5= <mlev>
##$CPDPRG6= <mlev>
##$CPDPRG7= <mlev>
##$CPDPRG8= <mlev>
##$CPDPRGB= <>
##$CPDPRGT= <>
##$D= (0..31)
0 1 0 0 0 0 0 0 0 0.06 0 0.03 2e-05 3e-06 0 0 0.0002 0 0 0 0 0 0 0 0 0 
0 0 0 0 0 0 
##$DATE= 1782285480
##$DBL= (0..7)
120 120 120 11 120 120 24 19 
##$DBP= (0..7)
150 150 150 150 150 150 150 150 
##$DBP07= 0
##$DBPNAM0= <>
##$DBPNAM1= <>
##$DBPNAM2= <>
##$DBPNAM3= <>
##$DBPNAM4= <>
##$DBPNAM5= <>
##$DBPNAM6= <>
##$DBPNAM7= <>
##$DBPOAL= (0..7)
0.5 0.5 0.5 0.5 0.5 0.5 0.5 0.5 
##$DBPOFFS= (0..7)
0 0 0 0 0 0 0 0 
##$DE= 6
##$DECBNUC= <off>
##$DECIM= 4
##$DECNUC= <off>
##$DECSTAT= 4
##$DIGMOD= 1
##$DIGTYP= 9
##$DL= (0..7)
0 0 52 120 120 21 21 25 
##$DP= (0..7)
150 150 150 150 150 150 150 150 
##$DP07= 0
##$DPNAME0= <>
##$DPNAME1= <>
##$DPNAME2= <>
##$DPNAME3= <>
##$DPNAME4= <>
##$DPNAME5= <>
##$DPNAME6= <>
##$DPNAME7= <>
##$DPOAL= (0..7)
0.5 0.5 0.5 0.5 0.5 0.5 0.5 0.5 
##$DPOFFS= (0..7)
0 0 0 0 0 0 0 0 
$$ [...]
##$SUBNAM1= <"">
##$SUBNAM2= <"">
##$SUBNAM3= <"">
##$SUBNAM4= <"">
##$SUBNAM5= <"">
##$SUBNAM6= <"">
##$SUBNAM7= <"">
##$SUBNAM8= <"">
##$SUBNAM9= <"">
##$SW= 400.765351723535
##$SWIBOX= (0..15)
0 1 3 0 0 0 0 0 0 0 0 0 0 0 0 0 
##$SW_h= 32467.5324675325
##$TD= 32768
##$TD0= 1
##$TE= 0
##$TE2= 300
##$TE3= 300
##$TEG= 300
##$TL= (0..7)
0 120 53 12 22 120 120 120 
##$TP= (0..7)
150 150 150 150 150 150 150 150 
##$TP07= 0
##$TPNAME0= <>
##$TPNAME1= <>
##$TPNAME2= <>
##$TPNAME3= <>
##$TPNAME4= <>
##$TPNAME5= <>
##$TPNAME6= <>
##$TPNAME7= <>
##$TPOAL= (0..7)
0.5 0.5 0.5 0.5 0.5 0.5 0.5 0.5 
##$TPOFFS= (0..7)
0 0 0 0 0 0 0 0 
##$TUNHIN= 0
##$TUNHOUT= 0
##$TUNXOUT= 0
##$USERA1= <user>
##$USERA2= <user>
##$USERA3= <user>
##$USERA4= <user>
##$USERA5= <user>
##$V9= 5
##$VALIST= <valist>
##$VCLIST= <CCCCCCCCCCCCCCC>
##$VD= 0
##$VDLIST= <DDDDDDDDDDDDDDD>
##$VPLIST= <PPPPPPPPPPPPPPP>
##$VTLIST= <TTTTTTTTTTTTTTT>
##$WBST= 1024
##$WBSW= 4
##$XGAIN= (0..3)
0 0 0 0 
##$XL= 0
##$YL= 0
##$YMAX_a= 5137
##$YMIN_a= -5067
##$ZGOPTNS= <>
##$ZL1= 120
##$ZL2= 120
##$ZL3= 120
##$ZL4= 120
##$ABSF1= 60
##$ABSF2= -190
##$ABSG= 5
##$ABSL= 3
##$ALPHA= 0
##$AQORDER= 0
##$ASSFAC= 0
##$ASSFACI= 0
##$ASSFACX= 0
##$ASSWID= 0
##$AUNMP= <proc_1d>
##$AZFE= 0.1
##$AZFW= 0.5
##$BCFW= 1
##$BC_mod= 2
##$BYTORDP= 1
##$COROFFS= 0
##$CY= 9.86611175537109
##$DATMOD= 1
##$DC= 1
##$DFILT= <>
##$DTYPP= 0
##$F1P= 182.462994727601
##$F2P= 168.069089081705
##$FCOR= 0.5
##$FTSIZE= 0
##$FT_mod= 0
##$GAMMA= 1
##$GB= 0
##$INTBC= 1
##$INTSCL= 1
##$ISEN= 30
##$LB= 1.5
##$LEV0= 0
##$LPBIN= 0
##$MAXI= 11.51145
##$MC2= 0
##$MEAN= 0
##$ME_mod= 0
##$MI= 1.244541
##$NCOEF= 0
##$NC_proc= 0
##$NLEV= 6
##$NOISF1= 0
##$NOISF2= 0
##$NSP= 1
##$NTH_PI= 0
##$NZP= 1
##$OFFSET= 243.8632
##$PC= 1.4
##$PHC0= 1583.601
##$PHC1= 73.15952
##$PH_mod= 0
##$PKNL= yes
##$PPARMOD= 0
##$PSCAL= 0
##$PSIGN= 0
##$REVERSE= no
##$SF= 81.0140731611343
##$SI= 65536
##$SIGF1= 0
##$SIGF2= 0
##$SINO= 80
##$SIOLD= 65536
##$SREGLST= <31P.CDCl3>
##$SSB= 0
##$STSI= 0
##$STSR= 0
##$SW_p= 25641.0256410257
##$SYMM= 0
##$S_DEV= 0
##$TDeff= 0
##$TDoff= 0
##$TI= <>
##$TILT= no
##$TM1= 0
##$TM2= 0
##$TOPLEV= 0
##$USERP1= <user>
##$USERP2= <user>
##$USERP3= <user>
##$USERP4= <user>
##$USERP5= <user>
##$WDW= 1
##$XDIM= 64
##$YMAX_p= 0
##$YMIN_p= 0
$$ End of Bruker specific parameters
$$ ---------------------------------
##NTUPLES= NMR FID
##VAR_NAME=  TIME,          FID/REAL,        FID/IMAG
##SYMBOL=    X,             R,               I
##VAR_TYPE=  INDEPENDENT,   DEPENDENT,       DEPENDENT
##VAR_FORM=  AFFN,          ASDF,            ASDF
##VAR_DIM=   16384,         16384,           16384
##UNITS=     SECONDS,       ARBITRARY UNITS, ARBITRARY UNITS
##FACTOR=    3.08e-05,      1,               1
##FIRST=     0,             0,               0
##LAST=      0.5045964,     0,               0
##MIN=       0,             -5067,           0
##MAX=       0.5045964,     5137,            0
$$ Real data points
##PAGE= N=1
##DATA TABLE= (X++(R..R)), XYDATA
$$ [...]
7906B67J28j30l55M77J18n19Q86r32o11K62R70p86P6L70m51O22p55M23p22J521
$$ 267 395 265 -90 387 505 -14 872 -60 -671 -409 561 -225 -149 221 -230 392 -363 60 -662 859
7926H59j240L43P02j254J054N5L92m50n18p18K79J496j232M91nm72O52n28M71
$$ 859 -381 -38 664 -590 464 519 911 461 -57 -775 -496 1000 -232 259 254 -218 434 -94 377
7945C77K15M52J31j660J687k635K704j288j076J050L6P2j82J76k12r18P61r43
$$ 377 592 1044 1175 -485 1202 -1433 1271 -17 -1093 -43 -7 65 -117 59 -153 -1071 -310 -1253
7963a253K456k038O30M79n02J5j053J452j310J661k52j12m89K54N47p12L03j136
$$ -1253 1203 -835 -205 274 -228 -213 -1266 186 -1124 537 285 173 -316 -62 485 -227 76 -1060
7981a060Q74J232j935J977k071Q80j03k85Q83o82J445j903J103m28P68l40L18
$$ -1060 -186 1046 -889 1088 -983 -103 -206 -491 392 -290 1155 -748 355 -73 695 355 673
7998F73k12q67K98k60L70M38l29j27p04J44L83L69K59p72K114k092J71O34l26
$$ 673 461 -406 -108 -368 2 440 111 -16 -720 -576 -193 176 435 -337 1777 -315 -144 490 164
8017A64o92J686j051j130R42M53m23k06O00J09o39O81m82j10k04m37J30K39j34
$$ 164 -528 1158 107 -1023 -81 372 -51 -257 343 452 -187 494 12 -98 -302 -739 -609 -370 -504
8036e04Q11p46K033k304L39J188k160J399R0M42j739J464q64Q91P92k383J865
$$ -504 307 -439 1594 -710 -371 817 -1343 56 146 588 -1151 313 -551 340 1132 -1251 614
8053F14j568M53P94n20J412j973J464j790J096p10N50R10q90J09p01J005r9r16
$$ 614 -954 -501 293 -227 1185 -788 676 -1114 -18 -728 -178 732 -158 -49 -750 255 156 -760
8071g60J327o79m33Q30K2P25j920P85q04J309L05o80r48r5R05L89N3o99M79o31
$$ -760 567 -112 -545 285 307 1032 -888 -103 -907 402 707 27 -921 -1016 -111 278 331 -368 111 -520
8091e20o61K971j868J45m85O73M78j208N75l56M74m73m28J390o04N39p27o86L64
$$ -520 -1181 1790 -78 67 -418 255 733 -475 100 -256 218 -255 -683 707 103 642 -85 -771 -407
8110d07O45M34j137J432j843P26j43r68J615q18N57k58l79K382j824P71l38j24
$$ -407 238 672 -465 967 -876 -150 -293 -1261 354 -464 93 -165 -544 1838 14 785 447 323
8128C23n99N03k99n58J060k24r97O02P97k81J14n81nP85o80J041o97o62J299j761
$$ 323 -276 227 -72 -630 430 206 -791 -189 608 327 441 -140 -145 640 -40 1001 304 -358 941 -820
8148h20R49N8o81J846k137J316r05N77q6j174J536j314J333j281M20R19j850J971
$$ -820 129 187 -494 1352 -785 531 -374 203 117 -1057 479 -835 498 -783 -363 556 -1294 677
8166F77j167L73N5K45L97k277J771o8n05Q32k16J110r97k89J60Q77r60j5m48M69
$$ 677 -490 -117 -62 183 580 -1697 74 6 -499 333 117 1227 230 -59 101 978 18 3 -445 24
8186B4J748r88r95p01P17l42Q4M72l05m79J070q9O04p82k94R01m74J061p75J27
$$ 24 1772 784 -211 -912 -195 -537 -453 19 -286 -765 305 216 820 38 -256 645 171 1232 457 584
8206E84r30P34L76j231J126j703Q38R92j968J367q82J185j496J397r44M26P9J31
$$ 584 -346 388 764 -467 659 -1044 -206 786 -1182 185 -697 488 -1008 389 -555 -129 -50 81
8224H1Po7P9M1J5r52m37J948o48M88j439R09N37o73j99J75L2q95J148J002j471
$$ 81 88 21 100 141 156 -796 -1233 715 67 555 -884 25 562 -111 -310 -135 -103 -998 150 1152 -319
8245c19J565j918J356k228J682n41p7J320j901J279m84m19R30o65Q63Lq68L8P12
$$ -319 1246 -672 684 -1544 138 -403 -480 840 -1061 218 -266 -685 245 -420 443 446 -422 -384 328
8264C28n86Q6J665l273J973m46k13O55K70M14j239O24m72m40O62m95J122j401
$$ 328 -258 -172 1493 -1780 193 -253 -466 189 459 873 -366 258 -214 -654 8 -487 635 -766
8282g66P24n66J099p1m18po27K074j405j24K3J050n76j080J611j177P35j133M49
$$ -766 -42 -608 491 420 2 -5 -632 1442 37 -87 -64 986 410 -670 941 -236 499 -634 -185
8301a85L25k71N82j68m94Q03r82J028j002l47N13n36R01l44o2n97J01M33Q24r59
$$ -185 140 -131 451 283 -211 592 -390 638 -364 -711 -198 -734 167 -177 -239 -836 -735 -302 522 -437
8321d37N58o03P14L96J58j574J235r52Q38m51N7M97o87J433j264K35Q5k31L03
$$ -437 121 -482 232 628 786 -788 447 -505 333 -118 -61 436 -251 1182 -82 153 238 7 310
8340C10j664J972j941K324k026r58J994q46J527j05k8j795L49K213k132J721j161
$$ 310 -1354 618 -1323 1001 -1025 -1983 11 -835 692 587 559 -1236 -887 1326 -806 915 -246
8357b46Q03j027L11l33n5J298N9n20n7m79J015j976J256r63P56mK94l14j086J708
$$ -246 557 -470 -159 -492 -547 751 810 290 233 -246 769 -1207 49 -914 -158 -162 132 -182 -1268 440
8377D40j5J20n79j79n89K27j19L01R67P6j710J519j318J811k047O76m43Q81M12
$$ 440 425 545 -34 -213 -802 -575 -694 -393 574 650 -1060 459 -859 952 -1095 -419 -862 19 431
8396D31j04J89n01l15n5L71N39j169K90R91r18J304j044P73j610K585j272J75
$$ 431 327 516 15 -300 -355 16 555 -614 -324 667 -251 1053 9 782 -828 1757 485 660
8414F60l52j741K518r55m96L94j68J01O47q49M61O6J68j7L61n12J189j946O76
$$ 660 308 -1433 1085 130 -366 28 -140 -39 608 -241 220 286 454 437 798 286 1475 -471 205
8433B05l52j291P16Q46M24l72n94J295j019N38p8o53K9m99K411j194Q35k625K218
$$ 205 -147 -1438 -722 124 548 176 -418 877 -142 396 318 -335 -306 -805 1606 412 1247 -1378 840
8452H40j856J025J149r91k05n38N39m97l4Q55j080J105R2J64q0k74n35j69J032
$$ 840 -1016 9 1158 167 -38 -576 -37 -534 -568 287 -793 312 404 568 488 214 -321 -490 542
8471E42q13m10O15o82J326l01j43P68k187J827q52P29q73L08k58O60M00j120J194
$$ 542 -271 -681 -66 -748 578 277 134 902 -1285 542 -310 419 -454 -146 -404 256 656 -464 730
8490G30j156R81j07j037P99p5P95j037L48n54l01J147j653J969j301J115q1j059
$$ 730 -426 555 448 -589 210 135 930 -107 241 -313 -614 533 -1120 849 -452 663 582 -477
8508d77K04n76J299j166M24m89O38l34O79M84r53O93o34j066J782j366J213l85
$$ -477 -273 -849 450 -716 -292 -781 -143 -477 202 686 -267 426 -208 -1274 508 -858 355 -30
8526c0o57J322n70Q31j405J126N47j190M99j417M69k82J554j798P01J239j594
$$ -30 -687 635 65 896 -509 617 1164 -26 473 -944 -475 -757 797 -1001 -300 939 -655
8543f55J069j229M75J011j075Q38j332J250n1j062J818j111J09j563K399j228
$$ -655 414 -815 -340 671 -404 434 -898 352 301 -761 1057 -54 55 -1508 891 -337
8559c37J082p47J18K8j081J721j092Q13L5j222l95J153J79k32k92M61n65N50j352
$$ -337 745 -2 116 144 -937 784 -308 505 540 -682 -1077 76 255 23 -269 192 -373 177 -1175
8578a175J138j015Q68L12O1k20lR81j168o22j00O25K31j51k6O79k88M54j583O83
$$ -1175 -37 -1052 -184 128 189 -31 -34 947 -221 -843 -943 -318 -87 -238 -264 415 127 581 -1002 -319
8598c19L75o99Q44m95J121j343N85j1N02O25m62K75j618O55l86M91j021L81J361
$$ -319 56 -643 201 -294 827 -516 69 58 560 1185 723 998 -620 35 -351 140 -881 -500 861
8617H61j491R35k89k3J250p94m14j088J479O32j609R77j01J272j992N69k49m85
$$ 861 -630 305 16 -7 1243 449 35 -1053 426 1058 -551 426 325 1597 -395 174 -75 -560
8635e60J104k136J704j202J630m55k4L56j019Q86l23J36l9q15J409j40l98j487
$$ -560 544 -1592 112 -1090 540 85 61 417 -602 284 -39 97 58 -757 652 512 114 -1373
8653a373J613L06j376J546j465J525q73M21k62r53J278j34j40o06Q17j091M50
$$ -1373 240 546 -830 716 -749 776 -97 324 62 -891 387 253 113 -493 324 -767 -317
8670c17L22j370J920j40j18J35p69P15j305J726j491P42N97j95n32M69p64J024
$$ -317 5 -1365 555 415 297 432 -337 378 -927 799 -692 50 647 452 -80 389 -375 649
8688F49q31O14j151J584m03p01L53j154J840j390J171M35j018o67J55R17n45N50
$$ 649 -182 432 -719 865 462 -239 114 -1040 800 -590 581 1016 -2 -669 -514 403 -142 408
8706D08m86r3J31q18J825j016N63o03j2n74o00J586k391K140M15p82J266k199
$$ 408 -78 -171 -40 -858 967 -49 514 -89 -101 -675 -1275 311 -2080 60 475 -307 959 -1240
8724a240J276l24L84K17l88n00k70J429r61J52J51j18j13l37N60r2M57j399R16
$$ -1240 36 -288 96 313 -75 -575 -845 584 -377 -225 -74 -192 -305 -642 -82 -174 283 -1116 -200
8743b00M38j659J993j763K63J648j955N47k65J666r76P71j24o04l56L07P76p42
$$ -200 238 -1421 572 -1191 -928 720 -1235 -688 -953 713 -263 508 384 -220 -576 -269 507 -235
8761b35Q2L94j854K444j474L68l63K63J214j038k91J55J255j568M46J61m22J232
$$ -235 -153 241 -1613 831 -643 -275 -638 -375 839 -199 -490 -335 920 -648 -202 -41 -463 769
8779G69l90l59k48J166l13j323J977k087L22O2k03P55m99L68j73J374j372M32
$$ 769 379 20 -228 938 625 -698 1279 -808 -486 -424 -627 128 -371 -3 -176 1198 -174 258
8797B58J24r93P13l54O85l85j313K058k291J718K38o59J83j648K628j690LN54
$$ 258 382 -611 102 -252 433 48 -1265 793 -1498 220 458 -201 -18 -1666 962 -728 -725 -171
8815a71M5j257M12J149q51M70J95L13R90k165J809o51k35P18n50M66q46R00r47
$$ -171 -126 -1383 -971 178 -673 -203 -8 305 1295 -870 939 288 53 771 221 687 -159 741 -206
8834b06O08P6k78l4r48J075KN0p82r6J615o77o76J4J498o29q54q90P37Po41K062
$$ -206 402 478 200 166 -782 293 295 345 -437 -533 1082 405 -271 -257 1241 612 -242 -1132 -395 -388 -1029 1033
8856A033j295j20R01j179R4M80O32j077R44p37r41J059M50k58M72j105J316j93
$$ 1033 -262 -382 519 -660 -566 -86 546 -531 413 -324 -1265 -206 244 -14 458 -647 669 476
8874D76n57O0m05J432p43j63j56L69q2j130J516j151J572o45k040J722j664K027
$$ 476 -81 -21 -426 1006 263 100 -56 313 231 -899 617 -534 1038 393 -1647 75 -1589 438
8892D38p30O43j84J33L10q60m8N06R2K51J58l33n69P52j219Q36l32j035R90m72
$$ 438 -292 351 167 300 610 -250 -298 208 300 551 709 376 -193 559 -660 176 -156 -1191 -201 -673
8912f73M6J39J054j609L13J087p49R01j218J516j509M45M93n52N95m03J100j672
$$ -673 -627 -488 566 -1043 -730 357 -392 509 -709 807 -702 -257 236 -316 279 -124 976 -696
8930f96k67J429j318J008J63j09J91k65m08L2R64m15N07n21q07J73R1J131r47
$$ -696 -963 466 -852 156 319 210 401 136 -272 -240 724 309 816 295 -512 -339 -248 883 -64
8949f4m92Q30n44J112j491K40P37K06m59m17N32Q8O28j015j65P69m03l74K71P97
$$ -64 -556 274 -270 842 -649 -409 328 534 75 -342 190 278 906 -109 -274 495 92 -282 -11 786
8969G86o76K17j000L71L54m82K1N54j89P08r68R23k38j84j61l59l15q06K020j145
$$ 786 110 327 -673 -302 52 -430 -409 145 -44 664 -304 619 381 197 36 -323 -638 -1444 576 -569
8989e69K64R94r70K446l539K046n25n43J473j700J633j219p4N59K17p33J8R19
$$ -569 -305 689 -281 2165 -1374 672 147 -396 1077 -623 1010 -209 -283 276 493 -240 -222 697
9007F97j950J326r8o36J534q77K33p8J33R0j62Q14j244J99j791K691j973J170
$$ 697 -1253 73 -25 -661 873 -4 229 151 284 374 212 1026 -218 -19 -1810 881 -1092 78
9025G8R9q88J494r78J286j786N49J200j747J751k423J630M64j14j07o49L11j282
$$ 78 177 -711 783 -195 1091 -695 -146 1054 -693 1058 -1365 265 729 615 508 -141 170 -1112
9043a112J291J31j08P95j866J655M55p64m65n88R80o00M34p08J279p11R28o92
$$ -1112 179 310 202 997 -869 786 1241 477 12 -576 404 -196 238 -470 809 98 1026 334
9061C34j362J606j446J247k68j1Q46j956O49M8K60m02M1J553j699K42O6M66N77
$$ 334 -1028 578 -868 379 111 100 946 -1010 -361 -313 -53 -455 -414 1139 -560 -318 -252 214 791
9080G91j412J112k4m44M12j89k0n35j79j81J062k46o29P83J041j658K58R7q1l09
$$ 791 -621 491 467 23 435 246 226 -309 -488 -669 393 147 -482 301 1342 -316 -58 39 -42 -351
9100c51O54n36L33L77j334J625r74J146n70Q8j201L82L35n4J198j375J086J80
$$ -351 303 -233 100 477 -857 768 -206 940 370 458 -743 -361 -26 -80 1118 -257 829 1009
9118A009m87q70L16R63j518J65l0Q03J096k575P74M50M21n04p94J360l71j71o40
$$ 1009 522 -348 -32 931 -587 -422 -452 351 1447 -1128 -354 96 517 13 -781 579 208 37 -603
9137f03O81j066Q63L66q91J185m21k66O55p89J670j739J529l83j678N78mO50j336
$$ -603 78 -988 -125 241 -650 535 114 -152 503 -286 1384 -355 1174 791 -887 -309 -313 337 -999
9156i99J270j438M21L88q29J014m12P09j445J352m49M68m65j080J969l94o11J297
$$ -999 271 -1167 -746 -358 -1187 -173 -585 124 -1321 31 -418 50 -415 -1495 474 80 -531 766
9174G66r49Q64j442J501r75M42k74j35j05l10L25l97j34J308j004J083j57p20
$$ 766 -183 681 -761 740 -235 207 -67 -202 -307 -617 -292 -689 -823 485 -519 564 407 -313
9192c13K03j55J083p37Q72j283j20N65r20Q65m00J312n10o19j15l09J817j664
$$ -313 -110 -265 818 81 953 -330 -450 115 -805 60 -340 972 462 -157 -272 -581 1236 -428
9210d28J494n74m33j16o02J172j763J779r01P99J76j610N18K15N41N98o21R71
$$ -428 1066 492 59 -57 -659 513 -1250 529 -372 427 603 -1007 -489 -274 267 865 244 1215
9228A215k238M81J268r44k92L50M90q44R55m69J271j777P98P14j778K32M10L91
$$ 1215 -1023 -542 726 -218 -510 -160 330 -514 441 -28 1243 -534 264 978 -800 -568 -158 233
9246B33n19J141o87M57k56j67m25N38J01j376J236P89j46o85L50q98J517j812
$$ 233 -286 855 168 625 369 202 -223 315 416 -960 276 1065 919 234 584 -314 1203 -609
9264f09P83o19Q11l52o2Q92r40k41j9p6J070L4Q29r58j6J27o63R72o51N28j075
$$ -609 174 -445 366 14 -48 844 -96 -337 -356 -432 638 672 1501 543 527 654 -9 963 312 840 -235
9285b35K36n93M54R21r40M08K24l5M33n73N32j545K156o14m02j510O36J433r76
$$ -235 1 -592 -138 783 -157 251 475 440 873 300 832 -713 1443 829 427 -1083 -447 986 10
9304A0J019m95j040o8l62J024j044J541l62P04l12j489Q34q55Q82m05j2J573q28
$$ 10 1029 534 -506 -574 -936 88 -956 585 223 927 615 -874 -40 -895 -13 -418 -430 1143 315
9323C15m04l35R61j328J380L24j700O80k82N90o84K09J665j621k4j51P35j307
$$ 315 -89 -424 537 -791 589 913 -787 -107 -389 201 -483 -274 1391 -230 -254 -405 330 -977
9341i77J269n29L85L50L4j11n29n73P64m22J117r66k31R14m58O35p37J262j607
$$ -977 292 -237 148 498 532 421 -108 -681 83 -339 778 -188 -419 495 37 672 -65 1197 -410
9360d10K35q04O87K06j334J744j23J02n05L23R7j669L265j973k69J340j360J328
$$ -410 -175 -979 -292 -86 -1420 324 201 303 -202 121 218 -1451 1814 -159 -428 912 -448 880
9378H80j290J026j657k88J646P8o1r27l61M50N51l83l58N82r91R26R23p70O32
$$ 880 -410 616 -1041 -1329 317 395 334 -593 -954 -504 47 -336 -694 -112 -1103 -177 746 -24 608
9397F08P0jj523O56R43j758J271j097J298o73J62J038r30P39j532Q14k38L08J164
$$ 608 678 677 -846 -190 753 -1005 266 -831 467 -206 -44 994 64 803 -729 85 -153 155 1319
9416A319k121R54k98R37j094J80o45L01n4M67J290j767O10p4J63L57k24Q78j566
$$ 1319 -802 152 -146 791 -303 -123 -768 -467 -521 -54 1236 -531 79 5 168 525 301 1179 -387
9435c87N88j87m99o42M91Q14m41L01k50M63Q68p79Q79j325j315K630k062N60O30
$$ -387 201 14 -485 -1127 -636 178 -263 38 -212 251 1119 340 1219 -106 -1421 1209 -853 -293 337
9454C37K74j436j94J020J4N47Qn53J6J91O23n57j244J037r39J288j769J292j093
$$ 337 611 -825 -1019 1 15 562 570 17 33 224 847 290 -954 83 -856 432 -1337 -45 -1138
9473a138J899k32j693K557j421J554k792Q79N60j454J947k263K199o80p1N25r73
$$ -1138 761 529 -1164 1393 -28 1526 -1266 -387 173 -1281 666 -1597 602 -78 -149 376 -597
9490e97J794k42j203o52J019p43J99P26l08L69Q62n98j500J190m53m24J108j648
$$ -597 1197 955 -248 -900 119 -624 -425 301 -7 362 1224 626 -874 316 -137 -561 547 -1101
9508a101J483K25l71N41j001j30R1K67J53l57N51p20M27k28L35L32k68N6o33N10
$$ -1101 382 607 236 777 -224 -354 -263 4 157 -200 351 -369 58 -170 165 497 229 285 -348 162
9528A62K12l58r44Q69K61l62j43M03L67j027M02%j52Q23n26Q56o51j64m45r5O39
$$ 162 374 16 -928 -59 202 -160 -303 100 467 -560 -158 -158 -310 513 -13 843 192 28 -417 -512 127
9549A27p48l3N27q98Q30o98R75J43j566K305j260K95k65K95J830j069p59l56M86
$$ 127 -621 -654 -127 -1025 -195 -893 82 225 -1341 964 -296 -1 -266 29 1859 790 31 -325 161
9568A61j47O12r35R54K0j129R49j75k15j04M1J075j605L25R84k548J909r72J341
$$ 161 14 626 -309 645 665 -464 485 310 95 -9 32 1107 -498 -173 811 -1737 172 -800 541
9587E41r36J63q46O31J374j477J713j147L34j29p62R95r06Q80r66J476l99K77
$$ 541 -395 -232 -1078 -447 927 -550 1163 16 350 221 -541 454 -452 428 -538 938 539 816
9605H16k62k609K896j186Q91n62j09L85j421K106j843P17k8R37j26j015O48j601
$$ 816 554 -2055 841 -345 546 -16 -125 260 -1161 945 -898 -181 -209 728 602 -413 235 -1366
9623a366J696j73m15j97P75J51l53q46J262o05Q21j67n36K16q36O1k76O83j081
$$ -1366 330 157 -258 -455 320 471 118 -728 534 -71 750 583 47 263 -573 -512 -788 -105 -1186
9642a186J726m11K94K29o42O72r19M55r54N7J135k72j15o95O74j77k70R46p18
$$ -1186 540 129 423 652 10 682 -237 218 -736 -679 456 184 69 -626 48 -129 -399 547 -171
9661a71J23R73r90J08o92J364j242O61m89N72K13l43r7J5M78k01o48J135j495
$$ -171 -48 925 -65 43 -649 715 -527 134 -355 217 430 87 -10 5 483 282 -366 769 -726
9680g26O12M35L36l14o94Q75j237J305j570P10j209R23N31j642J686k79k22P17
$$ -726 -114 321 657 343 -351 524 -713 592 -978 -268 -1477 -554 -23 -1665 21 -258 -480 237
9698B37o02J278j359M91oj30j08j087J644j452O46R8J085M39j849J702j033P07
$$ 237 -365 913 -446 45 39 -91 -199 -1286 358 -1094 -448 -350 735 1174 -675 1027 -6 701
9716G01m88P25j253L81n00R8l30k32J183J29j369J711j399J43R12k52o43N35N37
$$ 701 213 938 -315 66 -434 -336 -666 -898 285 414 -955 756 -643 -500 412 160 -483 52 589
9735E89Nj903J695r06J048o49L60j85j3P69j778Q62j90J12o05L06L86M32M88r26
$$ 589 594 -1309 386 -520 528 -121 239 54 41 810 -968 -106 -296 -184 -789 -483 -97 335 823 -103
9755a03J30j46l69P15j024P62o21J412q38n26N72l78K14%N55o17J82N93m50O00
$$ -103 27 -119 -488 227 -797 -35 -656 756 -82 -608 -36 -414 -200 -200 355 -262 -80 513 63 663
9775F63kk82o59K10q4o81J517j652J502k31p71n07M80Q63j138J505j822J084J037
$$ 663 661 379 -280 -70 -154 -835 682 -970 532 301 -470 -977 -497 366 -772 733 -1089 -5 1032
9794A032k004P32J29m56J238o81K53n56j67J72k67J40M56P17j442J924j299p7
$$ 1032 -972 -240 -111 -567 671 -10 243 -313 -480 -308 -575 -435 21 738 -704 1220 -79 -156
9812a56M01j542J218j49P30L84n94q71M63l20M70m20o74M52N48L19l98j038R79
$$ -156 245 -1297 -79 -228 502 886 292 -579 -116 -436 34 -386 -1060 -608 -60 259 -139 -1177 -198
9831a98q42J321r24N73L88m08L91M43q76J42o20N16M27j674J375l13m0K59M34
$$ -198 -1040 281 -643 -70 318 -90 301 744 -132 10 -610 -94 333 -1341 34 -279 -319 -60 374
9850C74j8o61J086q31J102j37n88n55j143K475j148J471k769J793m92n42N26o80
$$ 374 356 -305 781 -50 1052 915 327 -228 -1371 1104 -44 1427 -1342 451 -41 -583 -57 -737
9868g37J082k80L5j34j70j26n9R56p81N52p18N18K26n64Q9q49K250l30j059m82
$$ -737 345 65 100 -34 -204 -330 -389 567 -214 338 -380 138 364 -200 -111 -960 1290 960 -99 -581
9888e81n70J003m9J025r30j090J431n88m17kN83l36n84O18Q58n23j045J400Q27
$$ -581 -1151 -148 -197 828 -102 -1192 239 -349 -766 -768 -185 -521 -1105 -487 371 -152 -1197 203 1030
9907A030q51n32J007N32k461J395q18K18J003j256J382k55o44r3Q98n21J05k24
$$ 1030 179 -353 654 1186 -1275 120 -698 -480 523 -733 649 394 -250 -343 555 34 139 -85
9925h5M57o66J009r45K88k60P04j56j208Q47J47R94j260j45Q79p66l03P57N55
$$ -85 372 -294 715 -230 58 -202 502 346 -862 -15 132 1126 -134 -279 600 -166 -469 288 843
9944H43J24j200L60k59K06R4l9K6q34J862j253n10q2l15J164k005K669p55J57
$$ 843 967 -233 127 -132 74 168 129 155 -679 1183 -70 -580 -662 -977 187 -1818 851 96 253
9963B53n42R45m03k87O70j267J053K47j173m32M42J863k082J384k45k65P26j204
$$ 253 -289 656 253 -34 636 -631 422 669 -504 -936 -494 1369 -713 671 426 161 887 -317
9981c17J023j266J673k086J453m76QL97n34l54K63N78o53j96P51j419J759k63
$$ -317 706 -560 1113 -973 480 4 12 409 -125 -479 -216 362 -291 -487 264 -1155 604 341
9999C41p40j8O78j79l69J254k136K077J46k449J510K14p33K87l46j59j28J109
$$ 341 -399 -417 261 82 -287 967 -1169 908 1054 -1395 115 329 -404 -117 -463 -622 -750 359
10017C59j594O23O10J43N02j132J210j761J265J41q20j91n51J300j044J681j023
$$ 359 -1235 -612 -2 141 643 -489 721 -1040 225 366 -454 -645 -1196 104 -940 741 -282
10034b82M19J071j319p84P87k07J298j042J30j49r16J986r26M46p52O3l53L67
$$ -282 137 1208 -111 -895 -108 -315 983 -59 71 -78 -994 992 66 512 -240 -177 -530 -163
10052a63K55j241K252j782L24Q9J248j067M42P04q76L99j115J050j340P24J255
$$ -163 92 -1149 1103 -679 -355 -266 982 -85 357 1061 185 584 -531 519 -821 -97 1158
10069A158k188J571j559J253r7m39Q15k523J429p52J521L91p83Q37j060L63k10
$$ 1158 -1030 541 -1018 235 138 -301 514 -2009 -580 -1332 189 580 -203 634 -426 -63 -273
10086b73K87N46q24K17L97L5j630K655j695j88Q17p90J153j456J014q20j14J632
$$ -273 14 560 -264 -47 350 385 -1245 1410 -285 -473 344 -446 707 -749 265 -555 -669 963
10104I63j830J494o86O82m21k64l20O84q89J87k55O60M42l87j246Q77O50q57L59
$$ 963 -867 627 -59 623 202 -62 -382 302 -587 -400 -655 5 447 60 -1186 -309 341 -516 -157
10123a57l09j0P67k6j81j291J144p10K142j131K12m00j811J450L7l91N4m25J656
$$ -157 -466 -476 291 265 84 -1207 -63 -773 1369 238 450 50 -1761 -311 -274 -665 -611 -1036 620
10142F20j243M06j87M47O54j085O10j024K94k04J092j067J690N6j409J108j178
$$ 620 -623 -217 -404 43 697 -388 222 -802 -508 -712 380 -687 1003 1059 -350 758 -420
10159d20q6K99j92P81q83R95n70M28l09k68J421j707J489j136K43pJ38O53k438
$$ -420 -506 -207 -399 382 -501 494 -76 352 43 -225 1196 -511 978 -158 85 78 216 869 -1569
10178a569K241J06J49j784J188n52k45J80R13l35j275L77J751j540P14r92J63
$$ -1569 672 778 927 -857 331 -221 -466 -286 627 292 -983 -606 1145 -395 319 -673 -510
10195e10J073p79J292o44n38J91P22q45M13R33j363l85j38JQ15l53O22M80j094
$$ -510 563 -216 1076 432 -106 85 807 -38 375 1308 -55 -440 -578 -577 238 -115 507 987 -107
10214a07n12J052k64K24o56k83J464j125k98J575j648L58l0n5P72o9j195J467
$$ -107 -619 433 169 393 -263 -546 918 -207 -505 1070 -578 -220 -250 -305 467 398 -797 670
10232F70k55j368J79J132n7n31o67N72l6J35J734k281J573j372L96L00P7q7j19
$$ 670 415 -953 -774 358 301 -230 -897 -325 -361 -226 1508 -773 800 -572 -176 124 201 114 -5
10251eL16p90J813j760L72o09P23O90k206J788p78J004q63j271K235j485R55l58
$$ -5 311 -479 1334 -426 -54 -663 60 750 -1456 332 -446 558 -305 -1576 659 -826 129 -229
10269b29K49J80k68J782l326J893r67K90K56l17N55j133K82R07m58J156j340N40
$$ -229 20 200 -68 1714 -1612 281 -686 -396 -140 -457 98 -1035 -753 154 -304 852 -488 52
10287E2O05k75r47M64Q33r10J00p61J389k50j946K316q72j54n86N40J329m38N8
$$ 52 657 382 -565 -101 732 -178 -78 -839 550 300 -1646 670 -202 -356 -942 -402 927 489 547
10306E47q30P86j42j411R84k44O67r31L12K53q05J26J56K10j10P48o30j98K034
$$ 547 -283 503 361 -1050 -66 -310 357 -574 -262 -9 -814 -688 -532 -322 -432 316 -314 -512 1522
10325A522j313n9K31j027j84M00L84p28Q86j72r94J376j147J489n73J04j073R26
$$ 1522 209 150 381 -646 -830 -430 -46 -774 112 -60 -1054 322 -825 664 91 195 -878 48
10343D8J076j207Q14j211R00q55P24o92m44J002O1O10q8j114J301j697J608k87
$$ 48 1124 -83 731 -480 420 -435 289 -403 -847 155 216 826 738 -376 925 -772 836 549
10361E49R34j365n53M40q08J541j329j00q4k6M70q0N14j080J799o62r68J175q90
$$ 549 1483 118 -435 5 -803 738 -591 -691 -775 -801 -331 -411 103 -977 822 160 -808 367 -523
10380e23J178j016R56j32q84J276j537N92j02K36k50m50N49P31q79N62J60J98
$$ -523 655 -361 595 463 -421 855 -682 -90 -192 44 -206 -656 -107 624 -255 307 467 665
10398F65q38L47o67P20J05N95j360n20R99j246N83L08j47N40j077R25p54N50J004
$$ 665 -173 174 -493 227 332 927 -433 -953 46 -1200 -617 -309 -456 84 -993 -68 -822 -272 732
10417G32m57n5q61k97L39p83J221r2O8q13J391j517J368k00n99M67J07P84N51
$$ 732 275 220 -641 -938 -599 -1382 -161 -253 -185 -998 393 -1124 244 44 -555 -88 19 803 1354
10436A354j494L48l18R22R5k18r31P56K36j93R70k169J456o42L40p94P4M41J22
$$ 1354 -140 208 -110 812 907 689 -242 514 750 557 1527 -642 814 172 512 -282 -208 233 355
10455C55r42N61J40J268j562J199j912J091l9k02K4j275J508j751J968l26J87
$$ 355 -587 -26 114 1382 -180 1019 -893 198 159 -43 -19 -1294 214 -1537 431 105 292
10472B92j088J122j91q38J269l79p87M83m52J47R72k03q72M13j109L32J137N03
$$ 292 -796 326 135 -703 566 187 -600 -117 -569 -422 550 347 -525 -112 -1221 -889 248 751
10490G51o74j63K50M46q4p01K88m9L90N39j977O47K37J47N40K8n76M1K00n20J562
$$ 751 77 -86 164 610 526 -175 113 64 454 993 -984 -337 -100 47 587 615 39 80 280 -240 1322
10511A322j089j33j48j0m96J054l52l44N76j854J828j305R05K31q58J432n70Q41
$$ 1322 233 100 -48 -58 -554 500 148 -196 380 -1474 354 -951 -46 185 -673 759 189 1030
10529A030r92j365J515j234J519j650J369p19J194K35j254P48n62J390j272O10
$$ 1030 38 -1327 188 -1046 473 -1177 192 -527 667 902 -352 396 -166 1224 -48 562
10545E62L30j160J116j243L83m10M19J32J9M48o30o48j2L05R37j178J107n55M44
$$ 562 892 -268 848 -395 -12 -422 -3 129 148 596 -34 -682 -694 -389 548 -630 477 -78 366
10564C66l31P39J64j396J176j316O12J01p51R52m43R28p26O55j218P93m24j255
$$ 366 35 774 938 -458 718 -598 14 115 -636 316 -127 801 75 730 -488 305 -119 -1374
10582a374K181j041P04q41o40R01O63P31j726P30j18r54K51p30N32Q66J42l02
$$ -1374 807 -234 470 -371 -1011 -110 553 1284 -442 288 170 -784 -533 -1263 -731 135 277 -25
10600b5j365J278M38M01J65r10J38l32k12P6J261j820N47k72R69l69p33J183j267
$$ -25 -1390 -112 326 727 892 -18 120 -212 -424 -348 913 -907 -360 -632 337 -32 -765 418 -849
10619h49N93J273j829J402j276L2J8J025P07j403J371l360K385L42l88J466j615
$$ -849 -256 1017 -812 590 -686 -654 -636 389 1096 -307 1064 -2296 89 431 43 1509 -106
10636a06M37p33J81J63p85j86N6K082j613J418J78j372O16r34J185j691J092r4
$$ -106 331 -402 -221 -58 -843 -1029 -973 1109 -504 914 1092 -280 336 -598 587 -1104 -12 -106
10654a06j320J512j303J841l75j080J97M76J375k164P09Q8J314o27r74J326j353
$$ -106 -1426 86 -1217 624 249 -831 -634 -158 1217 -947 -238 -150 1164 537 -437 889 -464
10671d64J843o49o15r27o95J436J267j604J1K85R19j350O00j30l46R49k54M79
$$ -464 1379 730 115 -812 -1507 -71 1196 -408 -397 -112 807 -543 57 -73 -419 530 276 755
10689G55p17j78Q12j21J49q76J37l76M12L88j208J073k79j76J30L16Q15q12l83
$$ 755 38 -140 672 551 700 -176 -39 -415 -3 385 -823 250 -29 -205 -75 241 1056 244 -139
10708a39K8L53j266L81L3Q99K51q30J229j888P50R82r13J246j667J348q99R89
$$ -139 -111 242 -1024 -643 -610 289 540 -290 939 -949 -199 783 -130 1116 -551 797 -102 887
10726H87N0o48J69j546J307j426J154N57J67r27O58p7o74n73J639j716J625o01
$$ 887 937 289 458 -1088 219 -1207 -53 504 671 -256 402 325 -349 -922 717 -999 626 25
10744B5O95j068J060j256k75J403j527Q53Q2L20J88o08K91o68M34p96K76Q99m20
$$ 25 720 -348 712 -544 -819 584 -943 -90 -8 312 500 -108 183 -485 -51 -847 -571 328 -92
10763i2l29j208Q72m40J586l56k74J85L57l04kl50j098J406j150J665o41Q40p83
$$ -92 -421 -1629 -757 -1197 389 33 -241 -56 301 -3 -5 -355 -1453 -47 -1197 468 -173 667 -116
10782a16J355j335L99m01k80l4n89J585n17R09n64q25Q12j514R37L82n87Q79j267
$$ -116 1239 -96 303 -98 -378 -412 -1001 584 67 976 412 -413 399 -1115 -178 204 -383 496 -771
10801g71Q12l66Q54o6L83L41j354P83j029M9n18J503j738J396p94q83J856j339
$$ -771 41 -325 529 463 846 1187 -167 616 -413 -364 -882 621 -1117 279 -515 -1398 458 -881
10819h81Q13N25j572J171o22J399q61j65R83n61l2r53J424r60O71j14p67N79j277
$$ -881 -68 457 -1115 56 -566 833 -28 -193 790 229 197 -756 668 -292 379 265 -502 77 -1200
10838a200J871n38N42m23M25l07j949K153j573J924n86m61O93j179L87K10l99
$$ -1200 671 133 675 252 677 370 -1579 574 -999 925 339 -122 571 -608 -221 -11 -410
10855d10Q56n90P4m41R14o77Q10K88p60L92k35K00m06j2K99q16J458L15m6j012
$$ -410 446 -144 -70 -511 403 -274 536 824 64 456 221 421 15 3 302 -514 944 1259 1213 201
10875B01j338J545j113J398p70m33O5jJ182k53p29M93n03L56p43Q31J24M77K44
$$ 201 -1137 408 -705 693 -77 -510 -445 -446 736 483 -246 247 -256 100 -643 188 312 789 1033
10894A033p98p69j28J300j057L75k69L60J010j497J424j098K70L63j977K116j143
$$ 1033 235 -534 -662 638 -419 -44 -313 47 1057 -440 984 -114 156 519 -1458 658 -485
10911d85L03q95J820j511o30J788r22M60k65N72j68j063K469j171L61N46q60N93
$$ -485 -182 -1077 743 -768 -1398 390 -532 -72 -337 235 67 -996 1473 302 663 1209 349 942
10929I42m37M09j233J70q63J550r23J94J383j578J270k072R64j71r38J944j343
$$ 942 505 914 -319 -149 -1012 538 -385 -191 1192 -386 884 -1188 -224 -395 -1333 611 -732
10946g32J823m1j807J435r69N74j309J619j369J483L8j185P0M11L07n87Q93p91
$$ -732 1091 1050 -757 678 -291 283 -1026 593 -776 707 745 -440 -370 41 348 -239 654 -137
10964a37k70L21r02P80k09P08n38j77P74m10J041q55n0M69j250N12KR26J61j054
$$ -137 -407 -86 -988 -208 -417 291 -247 -424 350 -60 981 126 76 545 -705 -193 -191 735 896 -158
10984a58l09r50J048R29j134M74o42P71n03O02P5o13n69P82J126k246J408K46
$$ -158 -467 -1417 -369 560 -574 -100 -742 29 -474 128 203 -410 -979 -197 929 -1317 91 337
11002C37j711K154j510J096j541K12J379j146J176n98K09J45j00J21m61J663k414
$$ 337 -1374 780 -730 366 -1175 -963 416 -730 446 -152 57 202 102 223 -238 1425 -989
11019i89J696n35M75k75q50Q28o59J770k064J340q52o36Q85n43J416k132J530
$$ -989 707 172 647 372 -478 350 -309 1461 -603 737 -115 -751 134 -409 1007 -1125 405
11036D05M29n91j086L84P82j471J164N4n51O44n91J567j620N96O9j76J408m54
$$ 405 834 243 -843 -459 323 -1148 16 70 -481 163 -428 1139 -481 115 184 8 1416 962
11054I62p89j02p71J183J86q94j003R56N90o91K21l15P42J20Q9j252k5J061k97
$$ 962 173 71 -700 483 669 -225 -1228 -272 318 -373 -152 -467 275 395 484 -768 -793 268 -29
11073b9M94k9j79K05q01Q96q80P20Rl37J166j876N72O51o16l4j65N91p0o66p6
$$ -29 465 436 257 462 -339 557 -323 397 406 69 1235 -641 -69 582 -34 -68 -233 358 288 -378 -454
11094d54J262m54J56N27o45K25p76Q15n01o66L84j727K376O02q4p42j391Q13j35
$$ -454 808 354 510 1037 392 617 -159 656 155 -511 -127 -1854 522 1124 1040 298 -1093 -280 -415
11113d15Q56j497J235o86m56J032m87J362r32O24P27j739J62k13J5j358J982j18
$$ -415 441 -1056 179 -507 -963 69 -418 944 12 636 1363 -376 -214 -427 -412 -1770 212 94
11131I4k63L21o71j0l39J239m05R4P83j188L44p32K42J323j598J142j713K139
$$ 94 -169 152 -519 -529 -868 371 -34 60 843 -345 -1 -733 -491 832 -766 376 -1337 802
11149H02j267N39K11p13M21o05Q29j039J847j124j92Q80j226J052l51J61l43M29
$$ 802 -465 74 285 -428 -7 -612 217 -822 1025 -99 -291 589 -637 415 64 225 -118 311
11167C11N30j420j13P07J46K29p68k10P1J536o72o73O32M09j382M87M62J184k114
$$ 311 841 -579 -692 15 161 390 -378 -588 -517 1019 347 -326 306 715 -667 -180 282 1466 -648
11186f48J682k024O75N93n40L41K59N32j563J294j060l98R94l6K55p60Q50o32
$$ -648 1034 -990 -315 278 -262 79 338 870 -693 601 -459 -857 137 101 356 -404 446 -186
11204a86k60M69R6O88j070L21n44P9J400k276K349j867P50N02m39J73k08J311
$$ -186 -446 23 119 807 -263 58 -486 -407 993 -1283 1066 -801 -51 451 12 185 -23 1288
11222A288j264l48l63Q4N60r39K158j762J221q32J25P20MM25j643J261k55r11
$$ 1288 24 -324 -687 -603 -43 -982 1176 -586 635 -197 -72 648 652 1077 -566 695 440 -471
11240d71R35r29M97m37m93K129k411J775n53Q23p97M11n21n94O01l92J400o71
$$ -471 464 -465 32 -405 -898 1231 -1180 595 42 865 68 479 -42 -636 -35 -427 973 302
11258C02o2n8m20L56m1m10M18K28Jj623J813n84k47j86J099k26n66r04M38R8R38
$$ 302 240 182 -238 118 77 -333 85 313 314 -1309 504 -80 -327 -513 586 360 -206 -1110 -672 -574 364
11279C64r96O52o05n9L31O81p81M8N18m96j97J77O41N23j589J076l19M80r95L81
$$ 364 -632 20 -585 -644 -313 368 -413 -365 153 -343 -540 -363 278 801 -788 288 -31 449 -546 -165
11299a65J43n85J143j461P76n6q43J569j092J490n08M56j57j348O38K0N49k81
$$ -165 -22 -607 536 -925 -149 -205 -1048 521 -571 919 411 867 710 -638 0 20 569 288
11317B88n03j90p10J460q39K162k67j357K72o30K89o33J048P07m35L45n87R63
$$ 288 -215 -405 -1115 345 -494 1668 1401 44 316 -314 -25 -658 390 1097 662 1007 420 1383
11335A383j562j40p89J131j37M52N70k63j55j109O73q07k91j48J130P97m28j461
$$ 1383 -179 -319 -1108 23 -114 338 908 645 490 -619 54 -753 -1044 -1192 -62 735 307 -1154
11353a154K541j610Q78o13J199p92n78m5Q1j253J004P52M87l45p61p6J127j373
$$ -1154 1387 -223 655 42 1241 449 -129 -174 -93 -1346 -342 410 897 552 -209 -285 842 -531
11371e31M02j09J204j324p58J248q23L58J210j026P09L63o9J038l493J983j305
$$ -531 -129 -238 966 -358 -1116 132 -691 -333 877 -149 560 923 854 1892 -1601 382 -923
11388i23J654k079J531P2K55n38k58J407j705Q35j192P64P04q08J375j681J230
$$ -923 731 -1348 183 255 510 -28 -286 1121 -584 251 -941 -177 527 -281 1094 -587 643
11405F43k29n33N2O3O34j300M98j24J64l04p67K807l084K099L42q98M17j356J521
$$ 643 414 -119 -67 -4 630 -670 -172 -296 -132 -436 -1203 1604 -1480 619 961 63 480 -876 645
11424F45j341J089q31R09L84q64Q53j141K19O49o1o35o25J504k65M22l40j440
$$ 645 -696 393 -438 471 855 -9 844 -297 -78 571 510 -125 -750 754 489 911 571 -869
11442h69J524p97O25p66j565K337l34M44J2k94O3j466R47J061n20L37k49p0j131
$$ -869 655 -142 483 -283 -1848 489 155 599 611 317 380 -1086 -139 922 402 739 490 420 -711
11461g11K9R51Q65k045N93N09L59k07l94o64L86J285j82q56N6l05K44r30J528
$$ -711 -682 269 1134 -911 -318 191 550 343 -51 -715 -329 956 774 -82 -26 -331 -87 -1017 511
11480E11p65q19K446k195J696r80QL60k015K196q84Q74n61l64P04j59K62n80P99
$$ 511 -254 -1073 1373 -822 874 -106 -98 262 -1753 443 -441 433 -128 -492 212 53 315 -265 534
11499E34q56L41O53r60j2L40N36q26k75N79j88N47n04N60o95J72J92j166J847
$$ 534 -322 19 672 -288 -300 40 576 -250 -525 54 -134 413 -91 469 -226 -54 138 -1028 819
11518H19j708J046O89j097N77p81Q98p69J845j642r02J850j195J481q10M14j574
$$ 819 -889 157 846 -251 326 -455 443 -326 1519 -123 -1025 825 -370 1111 301 715 -859
11535h59Q18M57p75J589o75j135k74J133r72L49q11O90J148j120L68P29r67J91
$$ -859 -41 416 -359 1230 555 -580 -854 279 -693 -344 -1155 -465 683 -437 -69 660 -307 -116
11553a16J66M05n83J03lp27j31K91k38J071j050J079k96j343K263p09o83L79j94
$$ -116 50 455 -128 -25 -28 -755 -886 -595 -833 238 -812 267 -29 -1372 891 182 -501 -122 -316
11572c16L92M85k94o42R52q13J54N33r28l49P31J096j092M65r59R56J29j426J391
$$ -316 76 561 267 -375 577 -236 -82 451 -477 -826 -95 1001 -91 374 -585 371 500 -926 465
11591D65j278O77J50J97Q64r85J8j615K035r67o2J201l17P96j380J630k616K338
$$ 465 -813 -136 14 211 1075 90 108 -1507 528 -439 -501 700 383 1179 -201 1429 -1187 1151
11609A151r7q53J189j285k29k88j042J547o12O38M88q6L14l38o08o36J329o09
$$ 1151 1054 201 1390 105 -124 -412 -1454 93 -519 119 607 521 835 497 -111 -747 582 -27
11627b7P13r4k105J086q42J330l95m80L73q50J011K57N61q3P8o86m2m26K02K71
$$ -27 686 592 -1513 -427 -1269 61 -334 -814 -441 -1291 -280 -23 538 455 533 -153 -195 -621 -419 -148
11647a48J491j031q99l93J852j401N00L52j371J115o36K12N67j34j9n94J286j592
$$ -148 1343 312 -587 -980 872 -529 -29 323 -1048 67 -569 -357 210 76 57 -537 749 -843
11665h43J482L01j51K87j020J93r43K230r91j128O81n43J356k188K042k280J861
$$ -843 639 940 789 1076 56 249 -694 1536 545 -583 98 -445 911 -1277 765 -1515 346
11682C46o5j805J952n24J341j640L63q14Q3N79j71R76p34M02M67j085J142j400
$$ 346 281 -1524 428 -96 1245 -395 -32 -846 -763 -184 -355 621 -113 289 756 -329 813 -587
11700e87J451j561O26J35m34L98o81J301j292Q69l19j307J229J92R87j656M95
$$ -587 864 -697 -71 64 -370 28 -653 648 -644 225 -94 -1401 -172 20 1007 -649 -154
11717a54M52l32N44j091Q47j090N01R49n78J067j38p51l95L49l09k89m32M01L85
$$ -154 298 -34 510 -581 266 -824 -323 626 48 1115 977 226 -169 180 -129 -418 -850 -449 -64
11736f4K14O39j122J00l80N97J70j229M05J431k59j97L6j148N07l6m68Q39L01
$$ -64 150 789 -333 -233 -613 -16 154 -1075 -670 761 502 305 341 -807 -300 -336 -804 35 336
11755C36Q3q13J816j172J6p66J517q34q39N56L42k24P2o91J06P5J973k166J31
$$ 336 419 -394 1422 250 266 -500 1017 183 -656 -100 242 18 90 -601 -495 -420 1553 -613 -482
11774d82q81J596J56p86R05o42R06j303J104l65p13P92j635K071j51j684J330
$$ -482 -1363 233 389 -397 508 -134 772 -531 573 208 -505 287 -1348 723 572 -1112 218
11791B18j078K056j774O55J54J28o22p64J368j308J653q34J47Q30k229J305M75
$$ 218 -860 1196 -578 77 231 359 -263 -1027 341 -967 686 -148 -1 829 -1400 -95 380
11808C80n26R78j079K00K32P35o22n26l52k24m1m02K065p82Q01k12j521K02Q48
$$ 380 -146 832 -247 -47 185 920 298 -228 -580 -804 -845 -1247 818 36 837 625 -896 -694 154
11827A54n45k35J720m84J27n0j127J91M95l01N14k24p5l56N19j019O27J95l57
$$ 154 -391 -626 1094 610 737 687 -440 -249 246 -55 459 235 160 -196 323 -696 -69 126 -231
11846b31J09k89K37k05K4J345j260j43K12M00N48r54P35n58Q98k03o41n79J03
$$ -231 -122 -411 -174 -379 -355 990 -270 -413 -201 199 747 -207 528 -30 868 665 24 -555 -452
11865d52J584j693Q10p30L70N42r1O15j392J061n78j09o29J73J336j373o16R34
$$ -452 1132 -561 249 -481 -111 431 340 955 -437 624 46 -63 -692 -519 817 -556 -1172 -238
11883b38p58J991k108N78Q0R11o63J92o30k77J711o89J064k204N81J145j057J095
$$ -238 -996 995 -1113 -535 -455 456 -207 -15 -645 -922 789 100 1164 -1040 -459 686 -371 724
11901G24p90J39J4k22o88M22J384k042J277n61O67o21j35M00r26P55J13q1J83
$$ 724 -66 73 87 -135 -823 -401 983 -1059 218 -343 324 -297 -432 -32 -958 -203 -90 -171 12
11920A2n69J252N9j33l73m5N27j47r8j180L33J978k235K033k215P8J726j213q1
$$ 12 -557 695 754 621 248 203 730 583 485 -695 -362 1616 -619 1414 -801 -723 1003 -210 -291
11939b91J53L31O2q14J054j260J062r26J115j371J491j127R58N80o61l57r3j75
$$ -291 -138 193 255 -559 495 -765 297 -629 486 -885 606 -521 437 1017 356 -1 -94 -269
11957b69K70K30R21n75k4J64q78N08j734J729j15j5r94J256J33r11J348j639O86
$$ -269 1 231 1152 577 553 717 -161 347 -1387 342 227 212 -782 474 607 -304 1044 -595 91
11976I1q43J036J95r10J383j441O97k17j42K70l5j5J32J41J72j35o23N1K222j916
$$ 91 -752 284 479 -431 952 -489 208 -9 -151 119 84 69 201 342 514 379 -244 -193 2029 113
11996A13r8L94O2l84r62K093k026K050q72j25R97j204P64j795P94Q03K09K92j143
$$ 113 15 409 471 87 -875 1218 -808 1242 370 245 1242 38 802 -993 -199 604 813 1105 -38
12015c8Q76j456J872j713N04l64K00j94K4J046J35m92k21k57j1L90N90p18p74
$$ -38 838 -618 1254 -459 45 -319 -119 -313 -289 757 892 400 179 -78 -89 301 891 173 -601
12034f01j56Q35k13r98J468N2j280P45m07k49J181J43N10j816J683r87M27o1j956
$$ -601 -757 78 -135 -1133 335 387 -893 -148 -555 -804 377 520 1030 -786 897 -90 337 276 -1680
12053a680J675R4L51j187R72L61k8j41k76Q9j79J48p23J28O49p79N97LJ109j551
$$ -1680 -5 89 440 -747 225 586 558 417 141 230 51 199 -524 -396 253 -526 71 74 1183 -368
12073c68l28K285j856J99N4n3M56j282M44LN09p69J730q97k69R02k47L57p28j199
$$ -368 -696 1589 -267 -68 -14 -67 389 -893 -449 -446 63 -706 1024 127 -142 760 513 870 142 -1057
12093a057J330l10L66m66M18q48R26k73n19J637q76N38j454J034j06j59O37j652
$$ -1057 273 -37 329 -137 281 -567 359 86 -433 1204 328 866 -588 446 340 181 818 -834
12111h34Q79j46j79M48n57K91m01Q93P09j853K47Q00L69j063Q83r04N53L52j276
$$ -834 45 -101 -280 168 -389 -98 -499 394 1103 -750 -503 297 666 -397 486 -418 135 487 -789
12130g89J969j634l39K637j126M8k51j002j1J91J152q34M06m05L80K78m42k59
$$ -789 1180 -454 -793 1844 718 766 515 -487 -498 -307 845 11 417 12 392 670 228 -31
12148c1o5J10j883K357m05K39J217k263R34p90J178m71k02j83m34J316j009M70
$$ -31 -96 14 -1869 488 83 322 1539 -724 210 -580 598 127 -75 -258 -692 624 -385 85
12166H5Q72k560K234r17R96j401L04O91j271J424j155K012k330K063j050q54K549
$$ 85 957 -1603 631 -286 710 -691 -387 304 -967 457 -698 1314 -1016 1047 -3 -857 1692
12183A692j902m58N09M7P89o39J58n77R07j170Q00j03n44L32o88J463j024N02
$$ 1692 -210 -668 -159 -112 677 38 196 -381 526 -644 156 53 -491 -159 -847 616 -408 94
12201I4n56k43J128m18j40k16j57J327j561J055K30j403Q89K2k0j27L15N3Q7m62
$$ 94 -462 -705 423 5 -135 -351 -508 819 -742 313 543 -860 29 51 31 -96 219 272 359 -103
12221a03k86J254k134J369P9l13Q05p69J217j328Q60O6l31r74N89P44r15O59l29
$$ -103 -389 865 -1269 100 179 -134 671 -98 1119 -209 651 717 386 -588 1 745 -170 489 160
12240A60R4k42j38J058j588J019m97P80n08o48J086j164n41N87P45J306j509M32
$$ 160 254 12 -126 932 -656 363 -134 646 138 -510 576 -588 -1129 -542 203 1509 0 432
12258D32q54L00q15L50J189j087Q53j560J816N2j401J591k064K607k205L55N26
$$ 432 -422 -122 -937 -587 602 -485 368 -1192 624 676 -725 866 -1198 1409 -796 -441 85
12275H5n61M99n76M20P0K82n0n95L5q02J920q63R0N12o88P77o24Q19q89m82Q03
$$ 85 -476 23 -553 -133 -63 219 169 -426 -391 -1193 727 -136 -46 466 -222 555 -69 750 -139 -621 182
12296A82m4J23o00Q72J05k69l4j80M27j9q60N57j093J753j890R92k70K50J44o13
$$ 182 138 261 -339 533 638 369 335 155 582 563 -297 260 -833 920 -970 22 -248 2 146 -467
12316d67J400l39p28M14k5j78l78M34O02o45l35j48J955q32o6j101P85n00N7l15
$$ -467 933 594 -134 280 255 77 -301 133 735 90 -245 -393 1562 730 664 -437 348 -152 -95 -410
12336d10L67J58o17P17q0l80Q91k20j268k6J368r97L28L86j651J376m93J557j142
$$ -410 -43 115 -502 215 135 -245 646 426 -842 -868 500 -497 -169 217 -1434 -58 -551 1006 -136
12355a36J65m00o23J792j806J695M62j349j6n57K389k686J194k10M51O73j267
$$ -136 29 -371 -994 798 -1008 687 1149 -200 -216 -773 1616 -1070 124 -86 365 1038 -229
12372b29p27K24O30K05k22L3o7Q99n64L18K80o09j05j283K699j264J391j462J41
$$ -229 -956 -732 -102 103 -119 -86 -153 746 182 500 780 171 66 -1217 1482 218 1609 147 288
12391B88P13j333R72k114K345j131L42J227k025JJ287n89j93K13R65j189J109
$$ 288 1001 -332 640 -1474 871 -260 82 1309 -716 -715 572 -17 -210 3 968 -221 888
12408H88o97p4J18n16O00k171J692l96N12M23j288N69J060o18O44j49K69N44j470
$$ 888 191 117 235 -281 319 -1852 -160 -556 -44 379 -909 -340 720 102 746 597 866 1410 -60
12427f0K4K6Q20k15l13J95r63k88jp13Q72J209j183O60r08N93N78n39Q86j096
$$ -60 -36 -10 810 595 282 477 -486 -774 -775 -1488 -616 593 -590 70 -838 -245 333 -206 680 -416
12447d16J078k75j158J112m73P56m93p04M28j1M60o78Q10o58N41j37j73J210j931
$$ -416 662 387 -771 341 -132 624 131 -573 -145 -156 304 -374 436 -222 319 182 9 1219 -712
12466g12K508j761P48j236K25J70p07J621j504Q63n65k38Q08n14R04j796J476
$$ -712 1796 35 783 -453 -228 -58 -765 856 -648 215 -350 -588 220 -294 610 -1186 290
12483B90r43N49J792j729J015j158Q73j088p23Q65j18K98J77N0J222r95j78m39
$$ 290 -653 -104 1688 -41 974 -184 689 -399 -1122 -257 -375 -77 100 150 1372 377 199 -240
12501b40K89o82P24P94q71N62j310O57k21k39J520n54m73m83O05L72j210N09q46
$$ -240 49 -633 91 885 14 576 -734 -77 -298 -537 983 429 -44 -527 78 450 -760 -251 -1097
12520a097N25Q43o21K39O35j196r6N21k54P24j50r09J437r75L48K51q8O66p36
$$ -1097 -572 271 -350 -111 524 -672 -768 -247 -501 223 73 -836 601 -374 -26 225 137 803 67
12539F7Q32k203J741j032r0L47L68P98n22k8k11n27Q99q9k17j256M77O70O56k77
$$ 67 899 -1304 437 -595 -685 -338 30 828 306 278 67 -460 439 350 133 -1123 -646 24 680 403
12559D03j191J313j150J101m01p90K36n2J736j057L04k92o72J314j187P93j34
$$ 403 -788 525 -625 476 75 -715 -479 -531 1205 148 452 160 -512 802 -385 408 274
12576B74N44j197L74J218j838N59K06L46m75k18j32j223J816K32q2R8J44r45K66
$$ 274 818 -379 -5 1213 -625 -66 140 486 11 -207 -339 -1562 254 486 404 502 646 -299 -33
12595c3j58L79K86p36JP45p04k04J74O3O58p32O91m31O43p62j64M23n27K95L56
$$ -33 -191 188 474 -262 -261 484 -220 -424 -250 -187 471 -261 430 -1 642 -120 -284 139 -388 -93 263
12616B63l14L60k32K84m40L57o36l9J24O56J74n39N09j315M95P34j378J488L95
$$ 263 -51 309 77 361 -79 278 -358 -397 -273 383 557 18 527 -788 -293 441 -937 551 946
12635I46J14j74j507J213j001M14l34J155k56j232O52r55J491j215Q56k11L70
$$ 946 1060 886 -621 592 -409 5 -329 826 570 -662 -10 -965 526 -689 167 -44 326
12652C26O02j231K51n21J583j033j631K263r37N2K53R81o00m8n97m12Q88n11R
$$ 326 928 -303 -52 -573 1010 -23 -1654 609 -328 -276 -23 958 358 310 -287 -699 189 -322 -313
12671c13L0N24N50j840N25O5N51j60L05q20O20l50p20Q51j15M84L24j78L2M06
$$ -313 -283 241 791 -1049 -524 -459 92 -68 237 -583 37 -313 -1033 -182 -297 187 511 333 365 771
12691G71l18R72j882O10K98l72m73M97J87r96J149mp21l41N31M77n48o52R22L59
$$ 771 453 1425 -457 153 451 79 -394 103 290 -706 443 439 -282 -623 -92 385 -163 -815 107 466
12711D66K61j819J155k87R51r22O11J97q72K9R33Q6q19r13K223r40L08j237N54
$$ 466 727 -1092 63 -224 727 -195 416 613 -259 -230 703 789 -30 -943 1280 340 648 -589 -35
12730c5L83J52K50j765J554l07R49p44r11J322k482K278k86M9k28L47r05J63M96
$$ -35 348 500 750 -1015 539 232 1181 437 -474 848 -1634 644 358 407 179 526 -379 -216 280
12749B80M54M91J28q00m7j7p44J232j713J01K38L53o95R66j79Q10j687Q84Q09
$$ 280 734 1225 1353 553 506 489 -255 977 -736 -635 -397 -44 -739 227 48 858 -829 55 864
12768H64j406K389j704J643j768r28J001j094J483l13j30J192k064J229q19L49
$$ 864 -542 1847 143 1786 18 -910 91 -1003 480 167 37 1229 -835 394 -425 -76
12784g6N12p60J160j667N81o29J061k49J257j450l47J73M86N63r93M61M56j004
$$ -76 436 -324 836 -831 -250 -879 182 -67 1190 -260 -607 -434 52 615 -378 83 539 -465
12802d65R65j472R61Q6l34k23N42N11p23J158j474j61N64m99P95j405N70R17J10
$$ -465 500 -972 -11 75 -259 -482 60 571 -152 1006 -468 -629 -65 -564 231 -1174 -604 313 423
12821D23J68q85M21m97M85M58n41L36j131P70O59j805J078j821L289k262J490
$$ 423 591 -294 127 -370 115 573 32 368 -763 7 666 -1139 -61 -1882 1407 -855 635
12838F35o34o70J262k52K42m23J62K96r68J103j881K000j269r7O00l5Jq40P59
$$ 635 1 -669 593 341 583 160 322 618 -350 753 -1128 872 -397 -494 106 71 72 -768 -9
12857iM1N98j245O36o46J370o41m05M07p37R15N03j389N85m08J972n90q08P71
$$ -9 32 630 -615 21 -625 745 104 -301 106 -631 284 787 -602 -17 -425 1547 957 149 920
12876I20j643o36R34Q89L69j222J070j470R08k90m51J327j423J607j187R0J09
$$ 920 -723 -1359 -425 464 833 -389 681 -789 119 -171 -622 705 -718 889 -298 -208 -99
12893i9k05Q7M60K89j124J647j757J182j042j38Q44n00J3L54q62K344k560J943
$$ -99 -304 -217 243 532 -592 1055 -702 480 -562 -700 144 -356 -343 11 -851 1493 -1067 876
12911H76n94j465K404j975O47o21N90K58J98l33j8Q49j602J283j486J896k27j836
$$ 876 282 -1183 1221 -754 -107 -728 -138 120 318 -15 -33 816 -786 497 -989 907 680 -1156
12929a156J024j666J968J02j123J351j348J538o71L39l12N87O29j865J689r36
$$ -1156 -132 -1798 170 272 -851 500 -848 690 19 358 46 633 1262 -603 1086 150
12945A50L9j096J210P79j922NQ37J72l30q29J740r48J534j112M96j682L94L69
$$ 150 189 -907 303 1082 -840 -835 2 174 -156 -985 755 -193 1341 229 725 -957 -563 -194
12963a94L90M58q70P80r08L82m85P61J28j448q6O97p21J839j245J069q86J021
$$ -194 196 654 -216 564 -344 38 -447 314 442 -1006 -1092 -395 -1116 723 -522 547 -339 682
12981F82j126K60N94Jm8J49r95p9P06j030N47l9L71P11k26j93n49J05m62J255
$$ 682 -444 -184 410 411 363 512 -483 -562 144 -886 -339 -378 -7 704 478 285 -264 -159 -621 634
13001F34j453R00r53J010j256K051j055k43J343p42j103L98o65J699j032K02R17
$$ 634 -819 81 -872 138 -1118 933 -122 -365 978 236 -867 -469 -1134 565 -467 -265 652
13018F52j97r24j75N42l11J22o57J651m56J85o13j091M73J149P23j720Q21P95
$$ 652 455 -469 -644 -102 -413 -291 -948 703 247 432 -181 -1272 -799 350 1073 -647 174 969
13036I69k214J789j339L5N10o77J249k15N13m62L07M90j329N38M93P73j839R34
$$ 969 -1245 544 -795 -760 -250 -927 322 107 620 158 465 955 -374 164 657 1430 -409 525
13054E25k29j274M14k12J533k105Q44O7K15q22M45J401j122K18j84K22R92j175
$$ 525 296 -978 -564 -776 757 -1348 -504 -437 -222 -1044 -599 802 -320 -102 -286 -64 928 -247
13072b47P70q54j66J202j068j03J016j089k87J121m97p65J621j391R74p52Q99
$$ -247 523 -331 -497 705 -363 -466 550 -539 -826 295 -202 -967 654 -737 237 -515 384
13089C84l35q92J276j041k86J609K39o44m84O89q81l41J020n3P2o92J112j502
$$ 384 49 -843 433 -608 -894 715 954 310 -174 515 -366 -707 313 260 332 -360 752 -750
13107g50J144Q80j630J881j043L05j99r49P29j290J468j131J617j140j04N1p13
$$ -750 394 1274 -356 1525 482 787 588 -361 368 -922 546 -585 1032 -108 -212 -161 -874
13124h74J097J11L55r49KK80q52J661j436R96j27Q63j810M4R65j383K170j128
$$ -874 223 334 689 -260 -258 22 -830 831 -605 391 264 1127 -683 -639 326 -1057 1113 -15
13142a5j419J246n06R42j070J170j11L35j919J360J473j888JP07K70o38O11n13
$$ -15 -1434 -188 -694 248 -822 348 237 572 -1347 13 1486 -402 -401 306 576 -62 549 36
13160C6k2K12m95P5J685j649J127j550J734m56n82K47j47k76k26P57m50O99m25
$$ 36 14 226 -269 -194 1491 -158 969 -581 1153 697 115 362 215 -61 -287 470 20 719 294
13179B94p46M53o89K63J545k161J417m9J83p97P21Rq66N00n68J316r7k277K214
$$ 294 -452 1 -688 -425 1120 -1041 376 327 510 -287 434 443 -423 77 -491 825 728 -1549 665
13198F65j806R02n60P32P03r28J7o74J590K77j263L42r48J069KR22M5k54q08p54
$$ 665 -1141 -239 -799 -67 636 -292 -275 -949 641 918 -345 -3 -951 118 120 1042 1087 833 25 -729
13218g29P12k048K019O86j569J203n66J397j855R98p63JL23p02J746j439J014
$$ -729 -17 -2065 -46 640 -929 274 -292 1105 -750 248 -515 -514 -191 -893 853 -586 428
13235D28o10P57j162o25K476k246R43R1p20J282m78P13j199N84L01n85L13N59
$$ 428 -182 575 -587 -1212 1264 -982 -39 52 -668 614 136 849 -350 234 535 -50 263 822
13253H22j99j31o93R27o2J91j391L19R66k25Jj393Q22p06J567j010N50j292M12
$$ 822 623 492 -201 726 664 855 -536 -217 749 524 525 -868 -46 -752 815 -195 355 -937 -525
13272e25O51l3j71j62L24j735P70J098k04k05N52j82j90M05J44q42N14o9n80J367
$$ -525 126 93 -78 -240 84 -1651 -881 217 13 -192 360 178 -12 393 537 -305 209 140 -440 927
13292I27j229R18j817P32Q43n08R81j627K070j820O93j7p96K328j589R03r31j46
$$ 927 -302 616 -1201 -469 374 -134 847 -780 1290 -530 163 146 -650 1678 89 992 61 -85
13310h5P98j104R49j320Q61J264q00j694L08N47m70Q04j66j752J848q45N76j742
$$ -85 713 -391 558 -762 99 1363 563 -1131 -823 -276 -746 58 -108 -1860 -12 -857 -281 -2023
13328b023J474N59k54M80o55J607j345J53l47n4M79n49J691k065J446p73m64M50
$$ -2023 -549 10 -244 236 -419 1188 -157 -4 -351 -405 74 -475 1216 -849 597 -176 -640 -190
13346a90k080K809j07J8J52j416J316o60J303j656K46O88o80R65k033K735q01
$$ -190 -2270 539 432 450 602 -814 502 -158 1145 -511 -265 423 -257 708 -1325 1410 609
13363F09m45J506k504J162m13O67o90j21j32j81J290j043O8M06J05p7n23M57j015
$$ 609 164 1670 -834 328 -85 582 -108 -229 -361 -542 748 -295 -227 179 284 207 -316 141 -874
13382h74J088M48j315J931j211J29k77j297K414j391J29Q49q86l42O16n20n93
$$ -874 214 662 -653 1278 67 196 -81 -1378 1036 -355 -226 623 -263 -605 11 -509 -1102
13399a102J679j6M27j764J22L48M65L64j353J627n31m31N23j479K233k148J225
$$ -1102 577 561 988 -776 -654 -306 159 523 -830 797 266 -165 358 -1121 1112 -1036 189
13416A89q80K667n05j673J048q88P24j020n12J018j222J220q60J189l25L41L27
$$ 189 -691 1976 1471 -202 846 -42 682 -338 -850 168 -1054 166 -694 495 170 511 838
13433H38p10K78p39j26k1m29K286j679O60k32Q06n08j27p1j202M52J598k74p86
$$ 838 128 406 -333 -459 -480 -909 1377 -302 358 126 932 424 297 226 -976 -524 1074 800 14
13452A4n02M94K79j83L49m66J56j89P95r92k51l54m7J142r5J178k114P82Q25J94
$$ 14 -488 6 285 102 451 -15 141 -48 747 -245 -496 -850 -897 245 150 1328 -786 -4 821 1015
13472A015Q6j492O76j290K220j071p40R25n39L47j543J964j280O74J85j963K122
$$ 1015 1101 -391 285 -1005 1215 144 -596 329 -210 137 -1406 558 -722 -48 137 -1826 296
13489B96l46M75L18k303K052j0K15j151J075k63j541K107j429J079j171J524j648
$$ 296 -50 425 743 -1560 492 482 697 -454 621 358 -1183 924 -505 574 -597 927 -721
13506g21N76R67m67N33r19K05j14l13N60p73K74N85m03K16j194J187j366J640
$$ -721 -145 822 355 888 -31 174 60 -253 307 -466 -192 393 -10 206 -988 199 -1167 473
13524D73j093J23N50J83j021N8J479N28j210J11l37P20j940J626P1j130M75J57
$$ 473 -620 -497 53 236 -785 -727 752 1280 70 181 -156 564 -1376 250 321 -809 -334 -177
13542a77L00K11K15K21n34n33m81J683j248K02K33m33J484j194l77K53R13r41
$$ -177 123 334 549 770 236 -297 -778 905 -343 -141 92 -341 1143 -51 -428 -175 738 -203
13560b03j5L81l67n89J26O99Q9J38J473k363J549j012K22K15n04J147j255N62
$$ -203 -218 163 -204 -793 -667 32 121 259 1732 -631 918 -94 128 343 -161 986 -269 293
13578B93k96o20J026l20M02o33K38J11r26J706o71p7p46k7J458j867J779q73J86
$$ 293 -3 -623 403 83 485 -148 90 201 -725 981 310 233 -513 -540 918 -949 830 -43 143
13597A43p03Q02r6p50Q47j728K843n46k09m71k32j71m13J422m21k88J132k731
$$ 143 -560 242 146 -604 243 -1485 1358 812 603 132 -100 -271 -684 738 317 29 1161 -1570
13615a570K282j236P07J33Q11p85j170Q10p41J390k12r9l3j403J368j501J205
$$ -1570 712 -524 183 316 1127 342 -828 -18 -759 631 419 320 287 -1116 252 -1249 -44
13632d4R04j081k65J67O62p33J253j551N82O92p91r6N74j95m70K04R90j416J339
$$ -44 860 -221 -486 -319 343 -390 863 -688 -106 586 -205 -301 273 78 -392 -188 802 -614 725
13651G25j57l27n97R79q62J170l81o27N05M66j124j32J25K36K30K21j068J82r7
$$ 725 568 241 -356 623 -239 931 550 -77 428 894 -230 -362 -237 -1 229 450 -618 -436 -533
13670e33P00J78m24k09J367j655J574r53P85k040O20J004j783J700j182J488o94
$$ -533 167 345 -79 -288 1079 -576 998 45 830 -1210 -590 414 -1369 331 -851 637 -57
13687e7m72O46k29J114j661J80M12K40l34J04J695j993J52Q17q89J061q20N31
$$ -57 -529 117 -112 1002 -659 -479 -67 173 -161 -57 1638 -355 -203 614 -275 786 -34 497
13705D97m45M55q33l03J228j035O72j143P08Q0K73n44L12K13J83l74oq1K86p06
$$ 497 52 507 -326 -629 599 -436 236 -907 -199 -119 154 -390 -78 135 318 -56 -62 -143 143 -563
13725e63K50o57J475j570L01O60Q05k56q96K18j19P70l73m90M21j315J019Q53
$$ -563 -313 -970 505 -1065 -764 -104 701 445 -451 -233 -352 418 45 -445 -24 -1339 -320 533
13743E33j055J452j198l91R12p27M15K74J53j003R49j09j547O59M11J15R12j105
$$ 533 -522 930 -268 -659 253 -474 -59 215 368 -635 314 205 -1342 -683 -272 -157 755 -350
13761c50R15j047N47N48p67m68N77O68n69L33l04K83M1p95J12m01J051N53m77
$$ -350 565 -482 65 613 -154 -622 -45 623 54 387 83 366 407 -388 -276 -677 374 927 450
13780D50j059r23K874j206l2o74M10R12j431J349j673J867j200R55k061K569j265
$$ 450 -609 -1532 1342 136 104 -570 -160 752 -679 670 -1003 864 -336 619 -1442 1127 -138
13797a38n12J563j091k06N77k78J040q58L3R2J21o3j56Q21j680J473j158M17m09
$$ -138 -650 913 -178 -384 193 -85 955 97 130 222 343 280 124 945 -735 738 -420 -3 -412
13816d12o70J737j755J870l17j29R6m40K21r84J659o01N75r49j28Q39p02Q02j275
$$ -412 -1082 655 -1100 770 453 324 420 -20 201 -783 876 275 850 -99 -227 612 -90 712 -563
13835e63L21p52J035l49m20J279j074J105j105R4J062p97P53j270R44m57j71M88
$$ -563 -242 -994 41 -308 -728 551 -523 582 -523 -429 633 -164 589 -681 263 -194 -365 123
13853A23M8qk93L0K61j439Q30P56M1j29p39K23l2J67R3q75J633r6j96m96k97M53
$$ 123 171 163 -130 -100 161 -1278 -448 308 349 220 -519 -296 -328 -161 -68 -943 690 594 398 -98 -395 58
13875E8m92J108j528J063L99q13m24Q8J268j328J662j742J44P3Q13m78m15R59
$$ 58 -434 674 -854 209 608 -205 -629 -541 727 -601 1061 -681 -537 -464 349 -129 -544 415
13893D15j782J221O41o25J525k357J021N82j166j7o30J682k058K109q2K20r93
$$ 415 -1367 -146 495 -130 1395 -962 59 641 -525 -542 -1172 510 -1548 561 479 699 -294
13910b94q62K327j891J652j055P48o89q71J456p66M40L5Jm68M04j452O78J135
$$ -294 -1156 1171 -720 932 -123 625 -64 -935 521 -245 195 230 231 -237 167 -1285 -607 528
13928E28j185J063l28o43J115j203J643j302N81J63o97Q34m36k73J74N4J48q79
$$ 528 -657 406 78 -565 550 -653 990 -312 269 432 -265 569 133 -140 34 88 236 -643
13946f43P82q23K068j708r4Q40j652J653K66q29Q6J0K76o34N93m79n3O63p58m5
$$ -643 139 -684 1384 -324 -418 422 -1230 423 689 -140 -54 -44 232 -402 191 -288 -341 322 -436 -481
13966d81O43J004n29p23J374j234K66j736J016j63J040L0n51O17j165Q72n78N72
$$ -481 162 1166 637 -86 1288 54 320 -1416 -400 -563 477 507 -44 573 -592 280 -298 274
13984B74L4p19J111j141J300j225N99J030j851J756j522R57J16r26M33r62P90
$$ 274 308 -411 700 -441 859 -366 233 1263 -588 1168 -354 603 719 -207 226 -736 54
14001E4N6j70L74m94L11m79J034j018J669j965J079n65M85j3j354K025L51j268
$$ 54 110 -60 314 -180 131 -348 686 -332 1337 -628 451 -114 371 358 -996 1029 1380 112
14019A12k67q71J493n46l07J154k011J689j043K42N68r2M15p29N94l24J043j420
$$ 112 -155 -1026 467 -79 -386 768 -1243 446 -597 -355 213 121 536 -193 401 77 1120 -300
14037c00o2J048j019K66n35J241q94M41M09m75l7j44P89J92j554J395j891Q96
$$ -300 -362 686 -333 -67 -602 639 -255 186 595 120 83 -61 728 920 -634 761 -1130 -234
14055b34N7k11M93O00j306J178l98J0n47O1r19R87JR75o11o75J445r90J208o72
$$ -234 -177 -388 105 705 -601 577 179 189 -358 -297 -1216 -229 -228 747 136 -539 906 -84 1124 452
14075D52O51j399p21J519j487J243j311J142l49r88K282k218K50O10L66q31J415
$$ 452 1103 -296 -1017 502 -985 258 -1053 89 -260 -1248 1034 -1184 -934 -324 42 -789 626
14092F26m77l34L86j055P15J354j195k84p42J720j221o3L13k92J204r18M1q66
$$ 626 149 -185 201 -854 -139 1215 20 -264 -1006 714 -507 -570 -257 -549 655 -263 -222 -1088
14110a088K81N07%M81n65J851j553r4J367k195J71P10n50p96J580J490j254o98
$$ -1088 -807 -300 -300 181 -384 1467 -86 -180 1187 -1008 -837 -127 -677 -1473 107 1597 343 -355
14128c55l47J376k395J945m22k33R5O02l14M32n31l92M21K02n31M25m56K66P14
$$ -355 -702 674 -1721 224 -198 -431 -336 266 -48 384 -147 -539 -118 84 -447 -22 -478 -212 502
14147E02k08l84N9P5K58o43k28R74O15r77l07N71k657K935M6k34m18O02o61M52
$$ 502 294 -90 -31 44 302 -341 -569 405 1020 43 -264 307 -2350 585 631 397 -21 581 -80 372
14167C72m58j645K641p36M06k14j070J323n62K18K78J49k08j245J531j180J856
$$ 372 -86 -1731 910 174 580 366 -704 619 57 275 553 702 494 -751 780 -400 1456
14184A456k105qN14m2J562k703J197J407q48j40q94M28n9O89j233O36j07j020
$$ 1456 -649 -657 -143 -185 1377 -1326 -129 1278 430 290 -604 -176 -235 454 -779 -143 -250 -1270
14202a270J870n01j27Q67m54r01q09O03o77J999n95K35o36l07J807j287N16O95
$$ -1270 600 99 -28 839 385 -516 -1325 -722 -1399 600 5 240 -396 -703 1104 -183 333 1028
14220A028k367J596N08n43n80M90J240j112M70o55M69q12l13K1j79J510m85k45
$$ 1028 -1339 257 765 222 -358 132 1372 260 730 75 544 -268 -581 -560 -739 771 286 41
14238D1Q45r55J12k29l67k20l2P55J00K46j110R27k59K99j4o15J423j876J848
$$ 41 886 -69 43 -186 -553 -773 -805 -50 50 296 -814 113 -146 153 139 -476 947 -929 919
14257I19n16n92R78j562J260j478Q73n61k19J512j264J118j484J556o23m22p59
$$ 919 403 -189 789 -773 487 -991 -118 -679 -898 614 -650 468 -1016 540 -83 -505 -1264
14274a264m60J642p19Q27nr01J269j813K388j115N26k30o04N56l98N54p30J805
$$ -1264 -1724 -82 -801 26 21 -880 389 -1424 964 -151 375 145 -459 97 -301 253 -477 1328
14292A328j442n57J391j612P91j71j70J329m02l37n12O05J24M28K34r54n98k20
$$ 1328 -114 -671 720 -892 -101 -272 -442 887 485 148 -364 241 365 793 1027 73 -525 -745
14310g45J925k71m00m75J63K69n76M0m40K46J140p02K4q56l2R23j294J233K30
$$ -745 1180 909 509 34 197 466 -110 -70 -510 -264 876 174 198 -658 -690 233 -1061 172 402
14329D02J83p24J020j679J038O0n97J202m92l45J017j480R38j207Q40n65K86L90
$$ 402 585 -139 881 -798 240 300 -297 905 413 68 1085 -395 543 -664 176 -389 -103 287
14347B87n43O84k055J806l02N11j97n18J131k10o06l09m30K91M12O26m77L50j176
$$ 287 -256 428 -1627 179 -123 388 191 -327 804 594 -12 -321 -751 -460 -48 578 101 451 -725
14366g25N18J521l155L232j477N27m54M16k51n69J06N29J273j959Q89p34P78O69
$$ -725 -207 1314 -1841 1391 -86 441 -13 403 152 -417 -311 218 1491 -468 421 -313 465 1134
14384A134k062J654p38j06M25p57J484m21q09P03n29M55k98R63j923Q15k16k74
$$ 1134 -928 726 -12 -118 307 -450 1034 613 -196 507 -22 433 135 1098 -825 -10 -226 -500
14402e00Q51r34N09L65j328Q66L2Q52j430P13qj37j54n12J630j287q84J493r77
$$ -500 351 -583 -74 291 -1037 -171 -139 713 -717 -4 -12 -149 -303 -815 815 -472 -1356 137 -840
14421h40M62L00j87N61n68l81J132P18j355k7R8K2o6k60J45M79N50j41j261L97
$$ -840 -378 -78 -265 296 -272 -653 479 1197 -158 -185 -87 -65 -131 -391 -246 233 783 642 -619 -222
14441b22j151J808p63J593q69n12j38K88oj151J018j177Q82O21n61J711k286L63
$$ -222 -1373 435 -328 1265 396 -116 -254 34 28 -1123 -105 -1282 -400 221 -340 1371 -915 -552
14459e52l28n7J210l95R94j491j6Q17l86M35n73P56j096N87k13J037n71N23J038
$$ -552 -880 -937 273 -122 872 -619 -635 182 -204 231 -342 414 -682 -95 -308 729 158 681 1719
14478A719j847J11m18R12l96q12J098m2K45p05J113o32j321J964k335J541Q6J22
$$ 1719 -128 -17 -435 477 81 -731 367 325 570 -135 978 346 -975 989 -1346 195 281 403
14496D03K12j299J5J043j29L1J13l26l79j029J119L65m41oO87N84j701J377L58
$$ 403 615 -684 -669 374 245 276 389 63 -316 -1345 -226 139 -302 -308 379 963 -738 639 997
14515I97j127K78n6m40J224j896R20L24q31R27r30N60K030j893J068j570j84K38
$$ 997 -130 148 92 -348 876 -1020 -100 224 -607 320 -610 -50 1980 87 1155 -415 -599 -361
14533c61O97Q21j768O45m22M04L94p28Q46j708K437k435L348k519n23J433k011
$$ -361 336 1157 -611 34 -388 16 410 -318 528 -1180 1257 -1178 2170 -349 -872 561 -1450
14550a450J452M79N17j644J80P65j612K071j390J228oj406P64r04J660r23O34
$$ -1450 2 481 998 -646 -466 299 -1313 758 -632 596 590 -816 -52 -956 704 -219 415
14567D15p88J141l73j192M06K06K58o26J131j29j214J068o7L60q30k52P1j23J05
$$ 415 -373 768 395 -797 -391 -185 73 -553 578 449 -765 303 236 596 -234 -486 -415 -538 -433
14586d33m35J326k27j231J527m19K56j27P65r99l31J480j415J838j127J041r10
$$ -433 -868 458 231 -1000 527 108 364 237 1002 3 -328 1152 -263 1575 448 1489 579
14603E79n0M75j413j58R46m02R67j035K70J0n75O13O36q97j459J766j200Q95m99
$$ 579 529 1004 -409 -567 379 -23 944 -91 179 189 -386 227 863 -34 -1493 273 -927 -32 -531
14622e31k28J332j314J372j705J410P03k247K049j771j07L26J575l30o90p1j078
$$ -531 -759 573 -741 631 -1074 336 1039 -1208 841 -930 -1037 -711 864 534 -156 -227 -1305
14639a305J405j116J990j944O85J027q80N50k27P40q76q46J216j689J205j91M53
$$ -1305 100 -1016 974 -970 -285 742 -138 412 185 925 49 -797 419 -1270 -65 -256 197
14656A97J264j526J9m57J367n83m99j96L92J53l59Qq96J093M53j072R14j150J259
$$ 197 1461 -65 -46 -503 864 281 -218 -414 -22 131 -228 -220 -1116 -23 430 -642 272 -878 381
14675C81m80M8N24j135K265j353L60n02Q81p75j198J680r64P30j327K43J484j482
$$ 381 -99 -51 473 -662 1603 250 610 108 989 214 -984 696 -268 462 -865 -622 862 -620
14693f20J560j424J798j644o97K82o27K487k368P12J060o26J113l58k23l2o63
$$ -620 940 -484 1314 -330 -1027 -745 -1372 1115 -1253 -541 519 -107 1006 648 425 393 -270
14710b70Mq0N39m85K99l91N2K60l1J38l44k02J104p10Q66j304J322j271J530r24
$$ -270 -266 -346 193 -292 7 -384 -332 -72 -103 35 -309 -511 593 -117 749 -555 767 -504 1026 102
14730A02j019J620q01q9m41J539L2j089M68j242J439K3o44M81j381L39j05J550
$$ 102 -917 703 -98 -187 -628 911 943 -146 322 -920 519 542 -102 379 -1002 -663 -768 782
14748G82k273J802J513l271K297n70q5p81l44M31j1K344k792J855q13k95n6n01
$$ 782 -1491 311 1824 -1447 850 280 195 -586 -930 -499 -510 1834 -958 897 84 -211 -267 -768
14766g68L74J46J178Q5j887J230j014O86N62O9r68J27Q02J23o31r87J281j370
$$ -768 -394 -248 930 1015 -872 358 -656 30 592 661 -307 -180 622 745 114 -873 408 -962
14784i62K29L42M34L4p01j57J001p80J89O90n55O75p57K60K97j92k06Q83q39M64
$$ -962 -733 -391 43 77 -624 -781 220 -560 -371 319 -236 439 -318 -58 239 47 -159 724 -115 349
14804C49j037O20M53j195J157o45J146j26j394J276r31q06J628j162Q95k10J41
$$ 349 -688 -68 385 -810 347 -298 848 722 -672 604 -327 -1133 495 -667 228 18 159
14821A59m04j215J063O07Q52j972K039j365Q25k25n14J811k098P98k4K92p35M06
$$ 159 -245 -1460 -397 210 1062 -910 1129 -236 589 364 -150 1661 -437 361 337 629 -106 300
14839C00L54j310O82k7l98J00j93Q09m31M46m27k46J250o59J006k260J849p70
$$ 300 654 -656 26 -1 -399 -299 -492 317 -114 332 -95 -341 909 250 1256 -1004 845 75
14857G5J35n12j2J432k498J831r48Q62M81j241J203j872J701m35Q0j81j224J010
$$ 75 210 -302 -314 1118 -1380 451 -497 365 846 -395 808 -1064 637 202 282 101 -1123 -113
14875a13m17J130r09J10P93j656J706m99p4m56M14J73L6Q8j797K098K93q99k85
$$ -113 -530 600 -309 -199 594 -1062 644 145 71 -385 29 202 238 326 -1471 627 920 21 -264
14894b64L08K69k40p67L66P82Q10j489O80j753K17O55k59P20p76r7J074j07l91
$$ -264 44 313 73 -694 -328 454 1264 -225 455 -1298 -1081 -426 -685 35 -741 -838 236 129 -262
14913b62N67j020N23j46Q13p81Q73p79P46q53N48l26j170J830K56j065k1J15K74
$$ -262 305 -715 -192 -338 475 -306 567 -212 534 -319 229 -97 -1267 563 819 -246 -267 -152 122
14932A22k43J040j922P61N36o71J419j512J627j425j98J18P74P60j790K037j188
$$ 122 -121 919 -1003 -242 294 -377 1042 -470 1157 -268 -466 -348 426 1186 -604 1433 245
14949B45P0l10l84L91m27J707j180j05n9j41L42k43j05m24J66P9P39k10k08R0
$$ 245 315 5 -379 12 -415 1292 112 7 -52 -193 149 -94 -199 -623 -457 -378 361 151 -57 33
14969C3k88R31k96k32l62Q1M71j748J048J091k286K386j717J838j79l08j133J369
$$ 33 -255 676 380 148 -214 -133 338 -1410 -362 729 -1557 829 -888 950 771 463 -670 699
14987F99j38j192J200q82J000j272J25Q36o80P52j015l28J703l00O18k269Q85
$$ 699 561 -631 569 -313 687 -585 -460 376 -304 448 -567 -895 808 508 1126 -1143 -258
15004b58M68l89O70k40O19j257Q42k3j386P8J86J139j009M52L18j293J772j08
$$ -258 210 -179 491 251 870 -387 455 432 -954 -876 -690 449 -560 -108 210 -1083 689 581
15022E81p44o40J678r28k81Q57n34n51O50n58j57P28N61j117J444j399Q72o26
$$ 581 -163 -803 875 -53 -334 523 -11 -562 88 -470 -627 101 662 -455 989 -410 462 -164
15040a64P51P77j658J410j205J39l71q16J616k02L64o49O16j48j196Q67m07J147
$$ -164 587 1364 -294 1116 -89 50 -321 -1137 479 277 641 -8 608 460 -736 131 -276 871
15058H71q52M63o52j22J290j953L63J551n13J53k157K336j599J098l96m61J665
$$ 871 19 482 -170 -292 998 -955 -592 959 446 599 -1558 778 -821 277 -119 -580 1085
15075A085k95k95q54L95j58m86K16p41J834j45o53L90j427J235l49R73n87j00
$$ 1085 790 495 -359 36 -122 -608 -392 -1133 701 556 -97 293 -1134 101 -248 725 138 38
15093C8q09J269k40k84l19J126k87L66q90Q2K14Qk71l43j23N25R32j667L94Q09
$$ 38 -771 498 258 -26 -345 781 494 860 -30 52 266 274 3 -340 -463 62 994 -673 -279 530
15113E30r20J88q6R61j631R11P91p90j65o66L48L99K60l07j532J421P8O20m02
$$ 530 -390 -202 -288 673 -958 -47 744 -46 -211 -877 -529 -130 130 -177 -1709 -288 -210 410 8
15132HR57o13o65J171q69J321j043n54J152p63K73k300K608j056J127k92n16p25
$$ 8 965 352 -313 858 -11 1310 267 -287 865 102 375 -1925 683 -373 754 462 -54 -779
15150g79P19J109j342Q44p04l17O13r85J892q34m49K03p03N00M14J95r23J559
$$ -779 -60 1049 -293 551 -153 -470 143 -842 1050 216 -233 -30 -733 -233 181 376 -547 1012
15168A012p08j474K237j171R3J28j79m52J464p93r00J764p96n52O71m44%j18r7
$$ 1012 304 -1170 1067 -104 -11 117 -62 -514 950 157 -743 1021 225 -327 344 -100 -100 -218 -315
15187c15R49j341J432j85j45o00K34n88k00L34J094M5q90p76J528j825J649r60
$$ -315 634 -707 725 540 395 -205 29 -559 -759 -425 669 714 -176 -952 576 -1249 400 -560
15205e60J029n4m6j26j429K079j312O22K26p57K85K1K20r01J047n09q86J313j193
$$ -560 469 415 369 243 -1186 893 -419 203 429 -328 -43 -22 198 -703 344 -165 -1051 262 -931
15224i31J945j302Q04j1J17J08j363N50R02j112O89l66O58q38P04j504j29K165
$$ -931 1014 -288 516 505 622 730 -633 -83 819 -293 396 30 688 -150 554 -950 -1079 1086
15242A086r24J04k45R75j299kp90J307P29j633J271r17k43J002m39J90j005Q98
$$ 1086 162 266 21 996 -303 -305 -1095 212 941 -692 579 -338 -581 421 -18 172 -833 65
15260F5k17J7P88j478J135j239J417M2p74J022k48O71m15o65k22j22O37m69m43
$$ 65 -152 -135 653 -825 310 -929 488 530 -244 778 530 1201 786 121 -101 -223 414 -55 -498
15279d98Q69p12J035q88q36M42J47R61k42J59k0m58q05K011j403o34J06N12J534
$$ -498 371 -341 694 -194 -1030 -588 -441 520 278 437 417 -41 -846 1165 -238 -872 -766 -254 1280
15298A280q97k50P2j438R89L73M34o88O71o93p11L28J02Q63j173J439j306N41
$$ 1280 383 133 205 -1233 -244 129 563 -125 546 -147 -858 -530 -428 435 -738 701 -605 -64
15316f4M31J32j003J08N36k40l89P63k39p76L80N79m12K66j72n99J411j353K112
$$ -64 367 499 -504 -396 140 -100 -489 274 35 -741 -361 218 -194 72 -100 -699 712 -641 1471
15335A471K68k241J97J10N50j409J363n75OM70m63P02m38K71Q4K44p0j251Q75
$$ 1471 1739 -502 -305 -195 355 -1054 309 -266 -260 210 -253 449 11 282 366 610 540 -711 164
15354A64K5n8J62k26j10m41M96n02N20j22L36N54j344Q92k35r96R43P46r01o14
$$ 164 189 131 293 67 -43 -484 12 -490 30 -92 244 798 -546 346 111 -885 58 804 -97 -711
15374g11J149l09j93l48o00J47Q72N31m19o13J050n62k46L16m10J021p46n5Q73
$$ -711 438 129 -64 -412 -1012 -865 7 538 119 -494 556 -6 -252 64 -346 675 -71 -126 747
15393G47o44L48j051J617j180K41j236J317K01n52O87j179J460j289K32L41j43
$$ 747 103 451 -600 1017 -163 78 -1158 159 360 -192 495 -684 776 -513 -281 60 -83
15410h3N49n1R56k638K144r64J42J20j672J964l65R08p14q67P92p79P81r41J079
$$ -83 466 415 1371 -1267 877 -87 55 175 -1497 467 102 1010 296 -571 221 -558 223 -718 361
15429C61r47l5O69q20N65n85J023k96l59N37j500R71m00O35j002R20M16o9K48
$$ 361 -586 -621 48 -772 -207 -792 231 -65 -424 113 -1387 -416 -816 -181 -1183 -263 153 84 332
15448C32m31l85J74j27l80j67J573r69P10J27l11P37j156N98q09m13J902j265
$$ 332 -99 -484 -310 -437 -817 -984 589 -380 330 457 146 883 -273 325 -484 -897 1005 -260
15466b60J612j711J155j30j028p85L79J218j047J030j439J175p8J74p12P32O07
$$ -260 1352 -359 796 666 -362 -1147 -768 450 -597 433 -1006 169 91 265 -447 285 892
15483H92j152j80J143j286R34k03n34J235j646N30l12M39m24n32J659J72p44M7
$$ 892 -260 -440 703 -583 351 148 -386 849 -797 -267 -579 -140 -564 -1096 563 735 -9 38
15501C8P16Or63J037n45m38n28P24p97M87P41n77L35l50R04j039j062J213j49
$$ 38 754 760 -203 834 289 -149 -677 47 -750 -263 478 -99 236 -114 790 -249 -1311 -98 -247
15520b47O30j893K265j077o44J582k139J380L72L7q85J99O70j585J930q88R49
$$ -247 383 -1510 755 -322 -966 616 -1523 -143 229 266 -619 -420 250 -1335 595 -293 656
15537F56m28r71J847j564K97j179J766p80J28K49j74N25J71m65l42j53O82j631
$$ 656 228 -743 1104 -460 -163 -1342 424 -356 -228 21 -153 372 543 78 -264 -417 265 -1366
15555a366N39J051n41J297j432P37j45l90R33r38l46J675n06m99k21J017m65M57
$$ -1366 -827 224 -317 980 -452 285 140 -250 683 -255 -601 1074 568 69 -152 865 400 857
15573H57j566o6N26o00Q35j642J613o20M87O37q64J597r99l8j084J069M27n54
$$ 857 -709 -775 -249 -849 -14 -1656 -43 -663 -176 461 -403 1194 195 157 -927 142 569 15
15591A5J325q21o98m04J672r27l13N29j032P05r79M99J251j002R4r19J394o17
$$ 15 1340 519 -179 -583 1089 162 -151 378 -654 51 -928 -429 822 -180 -86 -1005 389 -228
15609b28R49l16m34L91L48K52k199J283r62N52J288j296Q74j523K28L74n08M07
$$ -228 721 405 -29 362 710 962 -1237 46 -916 -364 924 -372 502 -1021 -793 -419 -927 -520
15627e20j22J476j178L62j2Lq73L10J948m79j461N56j504K048k94J364j070n1
$$ -520 -642 834 -344 18 6 9 -864 -554 1394 915 -546 10 -1494 554 260 1624 554 503
15645E03n98L82Q66j632M28M96n60Q69j128J127j413L05q92R92R50k205J689K2
$$ 503 -95 287 1153 -479 -51 445 -115 754 -374 753 -660 -355 -1247 -255 695 -1510 179 201
15663B01o9O47q83l54J53O74j49p52K20L82m99K78L70l67o38J89Q75k82r64Q33
$$ 201 132 779 -104 -458 -305 369 220 -532 -312 70 -429 -151 219 -148 -786 -597 278 -4 -968 -135
15683a35o39J035J04o25P86j174R74J7p63J031j674P12J56J003m83j180P93j399
$$ -135 -774 261 365 -260 526 -648 326 343 -420 611 -1063 -351 -195 808 325 -855 -62 -1461
15701a461J651o78J324n58p99N38n1R51j801O60k11O69J254k467P75L52K05o84
$$ -1461 190 -488 836 278 -521 17 -34 917 -884 -224 -435 234 1488 -979 -204 148 353 -331
15719c31m88J004N13l72K46K24j524J597n01m38P41j419O37J87K35l63k62K87
$$ -331 -819 185 698 326 572 796 -728 869 368 -70 671 -748 -111 76 311 -52 -314 -27
15737b7r43J098K11j029R34J98J46l96m57m94J103R4j034Q85P70p94l33M96J046
$$ -27 -970 128 339 -690 244 442 588 192 -265 -759 344 438 -596 289 1059 265 -68 428 1474
15756A474j650k16K59p36O95r52J699k79O3m60n10M66p03J355J98j715J245J11
$$ 1474 -176 -392 -133 -869 -174 -1126 573 294 357 -103 -613 -147 -850 505 703 -1012 233 344
15774C44O23n99P23j492k66J686j912K317j802j38L05R62j016R62j077l21R96
$$ 344 967 368 1091 -401 -667 1019 -893 1424 -378 -516 -211 751 -265 697 -380 -701 295
15791B95j234J299J96p71l92N82M6o10K22J840j754J391q55N38p54K45q65R3J232
$$ 295 -939 360 556 -215 -607 -25 21 -589 -367 1473 -281 1110 255 793 39 284 -581 -488 744
15810G44j214R86j115M74O97j215J135j148J279l5K0J93n57L50M36j055j77q4
$$ 744 -470 516 -599 -125 572 -643 492 -656 623 588 608 801 244 594 1030 -25 -202 -286
15828b86O48o3q6j180K90R76q67J184k34R38j212L84m73J313r31n23k00j46P58
$$ -286 362 299 213 -967 -677 299 -568 616 382 1320 108 492 19 1332 401 -122 -322 -468 290
15847B90k51L12n9r32Q49j37j92Q70r57Q78j83n21r03Q00O86j057O40r70N89O88
$$ 290 39 351 292 -640 209 72 -120 750 -207 671 488 -33 -936 -136 550 -507 133 -837 -248 440
15867D40p02N35j395J138m05K19J162p15r95n20Q90L81R94P4r16L6j07K12j701
$$ 440 -262 273 -1122 16 -389 -170 992 277 -718 -1238 -348 33 1027 1101 185 221 114 326 -1375
15886a375J167P37o22N71j301L00o46J616n0N6Q03k585J455l84L95Q45o83n50
$$ -1375 -208 529 -93 478 -823 -523 -1169 447 397 453 1256 -1329 126 -258 137 982 299 -251
15904b51r33J148o94J435m73j33K70q36N88m73P52P58j264K67q51J613o33j08
$$ -251 -1184 -36 -730 705 232 99 369 -467 121 -352 400 1158 -106 161 -690 923 290 182
15922A82m96L72K28r12J400m40l51O44k47K16n11r7J12m09N61p9L5l03l09J117
$$ 182 -314 58 286 -626 774 334 -17 627 380 596 85 -12 100 -309 252 173 208 -95 -404 713
15942G13J6k258J520r8p46J318j76l64O39j322J011K56j009O47j055R48q5N20
$$ 713 729 -1529 -9 -107 -853 465 289 -75 564 -758 253 509 -500 147 -908 40 -45 475
15960D75K12j412J267O75p13m35j11N68p46J92j72J590q44k41p55L95R15j530
$$ 475 687 -725 542 1217 504 69 -42 526 -220 -28 -200 1390 546 305 -450 -55 860 -670
15978f70N28m43P57p34M14O38j083J191j596J007k2M8O5m64L63p63j48O47lL19
$$ -670 -142 -585 172 -562 -148 490 -593 598 -998 9 -13 35 100 -364 -1 -764 -912 -265 -268 51
15998E1p54O19r88R36l02R74o47m80J194j419J027M45K31N1j899J403m51P89n18
$$ 51 -703 -84 -1072 -136 -438 536 -111 -591 603 -816 211 656 887 938 -961 442 -9 780 262
16017B62j132J379o79J392j338R81j046l5O32o22R26m46J77O40N0j303k20M87
$$ 262 -870 509 -170 1222 -116 865 -181 -216 416 -206 720 274 451 1091 1141 -162 -382 105
16035A05J52M97j377Q3J11R91j168N25o06J169m86j22OJ81k04n9N50p76k54R14
$$ 105 257 754 -623 -540 -429 562 -606 -81 -687 482 -4 -126 -120 61 -143 -202 348 -428 -682 232
16055B32j508J611q50O8J124q26K01m29J83j205K115p17O01l66J17k97p04J254
$$ 232 -1276 335 -515 -447 677 -149 52 -377 -194 -1399 716 -1 600 234 351 54 -650 604
16073F04q33K74m40k33Q82p43J075p25j44M81j572J819J26r18L33M72q96J002
$$ 604 -229 45 -395 -628 254 -489 586 -139 -283 198 -1374 445 571 -347 -14 458 -438 564
16091E64M39j748J378j012O63j94L44j094m04J583j049J63M81l48J124j365L17
$$ 564 1003 -745 633 -379 284 90 434 -660 -1064 519 -530 -367 114 -234 890 -475 -158
16108a58L2l7J100r24N48k012K157j37p94N41r33R38O17j401k43J232o53m67J734
$$ -158 -126 -163 937 13 561 -1451 706 569 -225 316 -617 321 938 -463 -706 526 -127 -594 1140
16127A140j335p01J626j155Q01j286Q00p4m83P99m23J140r21O51o7L76m37k78
$$ 1140 -195 -896 730 -425 376 -910 -110 -184 -667 132 -291 849 -72 579 512 888 451 173
16145A73N85j738J532p11J100o57q43O74l52O57j168O7N46K33k96Q46M03p95m54
$$ 173 758 -980 552 -159 941 284 -559 115 -237 420 -748 -681 -135 98 -198 648 1051 256 -198
16164a98J019k012J493j67m76J099n10J223k176N25N69J10p88k00J231j286J233
$$ -198 821 -1191 302 135 -341 758 248 1471 -705 -180 389 499 -289 -489 742 -544 689
16181F89o7q03J030q20q5n11L46J77J54J55K08l09J43R77j466J003j14j027N91
$$ 689 622 -181 849 29 -56 -567 -221 -44 110 265 473 164 307 1284 -182 821 707 -320 271
16200B71k322J810kj37J478k376K277k253K748m67j198K39o96l35L71O22N39k27
$$ 271 -2051 -241 -243 -380 1098 -1278 999 -1254 1494 1027 -171 68 -628 -963 -592 30 569 342
16218C42j442P31L97p14J508l79J48N43j413L91M92j646J420p10R59j015K6m95
$$ 342 -1100 -369 28 -686 822 443 591 1134 -279 112 604 -1042 378 -332 627 -388 -362 -857
16236h57K54K75m14J164o19O62J77p99N68q23O33o92J331Pn08j8j227J197J3j039
$$ -857 -603 -328 -742 422 -197 465 642 -157 411 -412 221 -471 860 867 359 341 -886 311 324 -715
16256g15Q24L53l61J151m56j218n0J036j626J233j759J675j215J560K78q06J101
$$ -715 109 462 101 1252 796 -422 -472 564 -1062 171 -1588 87 -1128 432 710 -96 1005
16273A005m63j9j079L33l94N3J701j715J453M2l8p10r08J295j473K315k173R14
$$ 1005 542 523 -556 -223 -617 -564 1137 -578 875 917 879 169 -739 556 -917 1398 -775 139
16291A39k43o26J006n69N16M41j664Q43m95J650l08m05m39O31r7P5p76O26P5j027
$$ 139 -104 -730 276 -293 223 664 -1000 -157 -652 998 690 285 -154 477 380 455 -321 305 380 -647
16311f47M1L72R05j463J030j704J942n94N6J15R52n95n75j53J096j98l40j28k135
$$ -647 -606 -234 671 -792 238 -1466 476 -118 -62 53 1005 410 -165 -318 778 580 240 112 -2023
16330b023P52J612o97m5L8M36l60o97J323p19N65J53K5L82o61j034J039m65n58
$$ -2023 -1271 341 -356 -401 -363 73 -287 -984 339 -380 185 338 363 745 84 -950 89 -376 -934
16349i34J852L37k014R35q88J477q60R36j076j066K184j062J143r31J90O70j683
$$ -934 918 1255 -759 176 -712 765 -95 841 -235 -1301 883 -179 964 33 223 893 -790
16366g90J910j031J0l27j12L52n71L34j47J310j050J001o93L30Q06k653K316
$$ -790 1120 89 99 -228 -340 12 -559 -225 -372 938 -112 889 196 526 1332 -1321 995
16383I95
$$ Imaginary data points
##PAGE= N=2
##DATA TABLE= (X++(I..I)), XYDATA
0@%%%%%%%%%%%%%%%%%%%%%%%%%%%%%%%LnNrJ2j5J9k2K6l2L5l5M0m5N2n6N3o1P4
$$ 0 0 0 0 0 0 0 0 0 0 0 0 0 0 0 0 0 0 0 0 0 0 0 0 0 0 0 0 0 0 0 0 3 -2 3 -6 6 -9 10 -12 14 -18 17 -18 22 -23 29 -27 26 -35 39
50C9p7Q1q8J00j15J29j45J59j79K06k35K70l24M04n21P82M651n085J32N74r90
$$ 39 -38 43 -45 55 -60 69 -76 83 -96 110 -125 145 -179 225 -296 486 5137 52 184 758 -232
71b32J024j205j52N22q97R77l71Q23j514J166m80q97J659L18p26M53O60j918M84
$$ -232 792 -413 -565 -43 -940 37 -334 489 -1025 141 -339 -1236 423 741 15 468 1128 -790 -306
90c06J341j087o87J169k37j1m17O60O37p50Q35q55J81r39R4P73j044P60q25P29
$$ -306 1035 -52 -739 430 193 182 -235 425 1062 312 1147 292 473 -466 -372 401 -643 117 -708 21
110B1O37l4l20j207J856j699J628j084J07M53j307J178p32J309j116J157L39j821
$$ 21 658 624 304 -903 953 -746 882 -202 -95 358 -949 229 -503 806 -310 847 1186 -635
128f35J558j535M95q38J552p09M84K97n50j000R58K31M33j640J347o23o4q09P81
$$ -635 923 -612 -117 -955 597 -112 372 669 119 -881 77 308 741 -899 448 -175 -239 -1048 -267
147b67L93q81J506k070J680l60J311j155j009P36r89J580j94j149K310l227J190
$$ -267 126 -755 751 -1319 361 1 1312 157 -852 -116 -1105 475 281 -868 1442 -1785 -595
164e95J791j230J44j411J737j257Q37r83J246O15p87K82j127J965j527j9L21P33
$$ -595 1196 -34 110 -1301 436 -821 16 -967 279 894 107 389 -738 1227 -300 -319 2 735
182G35r7j010l0P48q99K67n09M87j162Q48O13l69O41j173Q39J144j375K31k74
$$ 735 638 -372 -402 346 -553 -286 -795 -308 -1470 -622 -9 -378 263 -910 -71 1073 -302 -71 -345
201c45J124j828R71M37j87M76q88K54j376Q44j89Q28m73M79J00n85Q03m45K80
$$ -345 779 -1049 -78 359 172 648 -240 14 -1362 -518 -707 121 -352 127 227 -358 445 0 280
220B80n64r93J477j137J603o30L53j071L37J023j268J714j784k43Q37K22P44j699
$$ 280 -284 -1277 200 -937 666 36 389 -682 -345 678 -590 1124 -660 -903 -66 156 900 -799
238g99J696r01j72O19r78N38n14L09j44J201m02r95J806j957M13p29J326k07q3
$$ -799 897 -4 -176 443 -535 3 -511 -202 -346 855 453 -542 1264 -693 -280 -1009 317 110 27
257B7J129j772N32j029J194K55p59N14n90Q93l96j19l41L08q8l44Q75n04m21J033
$$ 27 1156 -616 -84 -1113 81 336 -423 91 -499 394 -2 -121 -462 -154 -242 -586 289 -215 -636 397
277C97j506J756k01L96j0j498p2m68J223p05J783j315P94q85k76J533n60j641
$$ 397 -1109 647 446 842 832 -666 -738 -1206 17 -688 1095 -220 574 -311 -587 946 386 -1255
295a255K051p23K54j119R63L11j275K147j181L49l32r03M79q9J430k123J037K89
$$ -1255 796 73 327 -792 171 482 -793 1354 173 522 190 -713 -234 -323 1107 -1016 21 310
313C10k44R29k337J802q04J300m42j049QP42L17m99n22J057l23R04r31K69k016
$$ 310 66 995 -1342 460 -344 956 514 -535 -527 215 532 33 -489 568 245 1149 218 487 -1529
332a529Q93N22q20N28J708j901p97J015m86J759j135o79K294j862L28J17n02J183
$$ -1529 -636 -114 -934 -406 1302 -599 -1396 -381 -867 892 -243 -922 1372 -490 -162 -45 -547 636
350F36q40O75j124N03K49j74j53q33J233P52r95m4M80J085j706N52l52j31l28
$$ 636 -204 471 -653 -150 99 -75 -228 -1061 172 924 -71 -115 365 1450 -256 296 -56 -187 -515
369e15L30O02j93K35r30l47l37J379l49R7K77N97l65n98j577J941m5L34k21L85
$$ -515 -185 417 224 459 -471 -818 -1155 224 -125 -28 249 846 481 -117 -1694 247 202 536 315 700
389G00K8q83O15j487J133j13K62J294j910J030p83l41J293j204O42r55K520j815
$$ 700 728 -155 460 -1027 106 -7 255 1549 -361 669 -114 -455 838 -366 276 -679 1841 26
407B6j29N09j87O00j912J026k246J951M29l16P80j715K492o98j294P78j070J290
$$ 26 -103 406 219 819 -1093 -67 -2313 -362 67 -249 531 -1184 1308 610 -684 94 -976 314
425C14r18R84O18r27p32O46n51P23L41q32M4L93r49J628j131M70j88J51n93k89
$$ 314 -604 380 998 71 -661 -15 -566 157 498 -334 -290 103 -846 782 -349 121 -67 84 -509 -798
445g98L23j640K278n61P86r98J32O90k87O32p47N30m12p41J654r17n90L65O13
$$ -798 -475 -2115 163 -398 388 -610 -478 212 -75 557 -190 340 -72 -813 841 -76 -666 -301 312
464C12j3r68J186o2j33l06l46R72p33j90j76Q28N82r73J335k058O18m78J671N50
$$ 312 299 -669 517 455 322 16 -330 642 -91 -281 -457 371 953 -20 1315 -743 -125 -603 1068 1618
484A618j902p04Q61k50J58j21p46N30J401r37n41N66O08L54j320J075r58J613
$$ 1618 -284 -988 -127 -377 -219 -340 -1086 -556 845 -92 -633 -67 541 895 -425 650 -308 1305
502A305j215r83J659q96J654j341j80J24j574J107K2Q95k38p57J10L98J044k218
$$ 1305 90 -893 766 -130 1524 183 3 127 -1447 -340 -318 577 339 -418 -308 90 1134 -1084
520a084J098M24k50j162j85K034j472J520l82m99P52j007L79K04L30r06n31J165
$$ -1084 14 438 188 -974 -1159 875 -597 923 541 42 794 -213 166 370 700 -206 -737 428
538D28j941J742r39O30N94j18p10K89L25k37M70l26k7j66M11n32O85j5m77n03
$$ 428 -1513 229 -710 -80 514 396 -314 -25 300 63 533 207 180 14 425 -107 578 563 86 -417
558d17Q46j296J143j132J213j99j98j18l68J131n12Lq1k57J091j053Q11r63P08
$$ -417 429 -867 276 -856 357 158 -40 -158 -526 605 93 96 15 -242 849 -204 607 -356 352
577C52o10l65J361l66l76k77j03K26R05r66O95r34P1L91L23j600R88q96J066J549
$$ 352 -258 -623 738 372 -4 -281 -384 -158 747 -219 476 -458 -387 4 327 -1273 -285 -1181 -115 1434
597A434j293M25j418J395j246J185n96O25J31r89O57J69j58J36j96J18q25J745
$$ 1434 141 566 -852 543 -703 482 -114 511 642 -347 310 479 321 457 261 379 -446 1299
615A299k622J273R83j059M56p61J816j127n6k34Q47K31l021K023q76J772p43K83
$$ 1299 -1323 -50 933 -126 330 -431 1385 258 202 -32 815 1046 -1975 48 -828 944 201 484
633D84l76m60J862j699rJ90R30K65j461l6j80J329n8r78O56j391J196j452J374
$$ 484 108 -352 1510 -189 -198 -8 922 1187 -274 -310 -490 839 781 -197 459 -932 264 -1188 186
652A86J08j16L30j234R12j74q87J232j88k29L35j658J652j282J471L87n02m07
$$ 186 294 178 508 -726 186 12 -875 357 169 -60 275 -1383 269 -1013 458 845 343 -64
670f4m8N44k5j27j56K94j92o75K53m37J018l84J054q06M14j24j162J200m48J061
$$ -64 -112 432 407 280 124 418 226 -449 -196 -633 385 1 1055 249 663 539 -623 577 129 1190
690A190n29o23l90N28L51k78M06j172j13R14j232J632j411J215r09q8Q63p23M72
$$ 1190 661 38 -352 176 527 249 655 -517 -630 284 -948 684 -727 488 -421 -509 354 -369 103
709A03j99J084p80M6L99j347K367k456M86J306j498P24j116J056m56O56m89j306
$$ 103 -96 988 208 254 653 -694 1673 -783 -297 1009 -489 235 -881 175 -281 375 -114 -1420
727a420K671j396R5R9o16P57p91R07j41n55O28k24m41J10J093q80o4j46n21J751
$$ -1420 1251 -145 -50 49 -567 190 -601 306 165 -390 238 14 -427 -317 776 -104 -168 -314 -835 916
747I16q15k07R6k43L79j363J519l09P09j052Q39j16k07o12j07o56K791j322N17
$$ 916 101 -106 -10 -253 126 -1237 282 -27 682 -370 469 353 146 -466 -573 -1229 1562 240 757
766G57q88l26p51J148N2k38J149j366J415j285M17O3k39J98K92L66j728J063J30
$$ 757 -131 -457 -1208 -60 -8 -246 903 -463 952 -333 84 147 -92 106 398 764 -964 99 229
785B29o94J030r59J374k157J063R3k64P31j400R71J48m74L70q61J504k178K683
$$ 229 -465 565 -394 980 -1177 -114 -21 -285 446 -954 17 165 -309 61 -800 704 -1474 1209
803A209r49K56k78p63J408o20l04n99Q07o97K48J635j541J29p30J440j039L06
$$ 1209 260 516 238 -525 883 263 -41 -640 167 -530 -282 1353 -188 -59 -789 651 -388 -82
821h2R05q49R96j615J103Q14k462J539k41J127k001J616j400M71R23j456R17q7
$$ -82 823 -26 970 -645 458 1272 -1190 349 108 1235 -766 850 -550 -79 844 -612 305 218
839B18q3J31l29n92L16k57J07K80L15M09m67o66J13J153O48j797L21O2M9j402
$$ 218 135 266 -63 -655 -339 -596 -489 -209 106 515 48 -618 -505 648 1296 -501 -180 -118 -69 -1471
859a471J391k26j05n93P46m71M52J435j612R54j364J519k31J13j09j351J079n11
$$ -1471 -80 -306 -411 -1004 -258 -729 -277 1158 -454 500 -864 655 424 537 428 -923 156 -355
877c55L17q37K89M48q90J744k02o87L23r88J140r71J043l98o96P76k26L21j02
$$ -355 -38 -875 -586 -138 -1028 716 514 -173 150 -838 302 -669 374 -24 -720 56 -170 151 49
896D9J91l75m15J026O7n40K14M60j462L38Q85j119O54j184J552j866Q18J9M11
$$ 49 240 -135 -550 476 543 3 217 677 -785 -447 438 -681 -27 -1211 341 -1525 -707 -688 -277
915b77L4m59L3R81l55r6k73Q21j38K49p84J432j094l58n9M85P42q91Q58j382O28
$$ -277 -243 -702 -669 312 -43 -139 -412 409 271 520 -264 1168 74 -284 -343 142 884 -7 851 -531 97
936I7L63p84N76p7r68J028l65M06o1j513J771p51P09j764J177K95r91O36L19O66
$$ 97 460 -324 252 175 -793 235 -130 276 215 -1298 473 -278 431 -1333 -156 139 -852 -216 103 769
956G69m24L07m65l97Q81j762J560j886J350O43r98J129j594J920k032J418k15
$$ 769 345 652 187 -210 671 -1091 469 -1417 -67 576 -422 707 -887 1033 -999 419 204
973B04N30j407N74P06j980J395l97J81j74j091J799j5O08p09j05M24j278J054
$$ 204 734 -673 -99 607 -1373 22 -375 -194 -368 -1459 340 325 933 224 119 543 -735 319
991C19j772K263j919J702J005k430J305j541J544l17q72R40j219J695j416R47
$$ 319 -1453 810 -1109 593 1598 -832 473 -1068 476 159 -713 227 -992 703 -713 234
1007B34J07m26J16j549J530m55K5R26Q3j09j016M44K50R56j398m05J531j782J459
$$ 234 341 -85 31 -1518 12 -443 -418 508 591 482 -534 -90 160 1116 -282 -687 844 -938 521
1026E21j625N01L96j59L37J71l36q20J309q91O79Lm09J368j526L80K84j55l23
$$ 521 -1104 -603 -207 -366 -29 142 -194 -1014 295 -596 83 86 -323 1045 -481 -101 183 28 -295
1045b95o18J645r95Jl18l62K353J60k233J443k226K096j433J475j677J196O09
$$ -295 -913 732 -263 -262 -580 -942 1411 1571 -662 781 -1445 651 -782 693 -984 212 821
1062H21j487R80o77R45j369M60L10l28Q91j07K6L50l45M16k027J542p14R22j507
$$ 821 -666 314 -363 582 -787 -327 -17 -345 546 439 465 815 470 886 -1141 401 -313 609 -898
1081h98J212m20j27O55j211O72K68j31Q80j319J125p10J181j630m95P69k08J200
$$ -898 314 -106 -233 422 -789 -117 151 20 900 -419 706 -4 1177 -453 -948 -179 -387 813
1099H13j35l89q86J03R95q05M40o7l75r2r7p6N16N76j335J296m76O69j515P54
$$ 813 678 289 -597 -494 501 -304 136 69 -306 -398 -495 -571 -55 521 -814 482 6 675 -840 -86
1119h6k2O93o75M4L32l22o6K88q68J094o2j121J065j414J060k82J03J753k346
$$ -86 -108 585 -90 -46 286 -36 -102 186 -682 412 350 -771 294 -1120 -60 -342 -239 1514 -832
1138h32M61J566j337P99j880J868r57N02m32K99k88O6L01p85J681j255j02O9j132
$$ -832 -371 1195 -142 657 -1223 645 -312 190 -242 57 -231 -165 136 -649 1032 -223 -325 -256 -1388
1157a388J612m10J89J1P92m90j262J434n33N04j300R15o03qL30nR74p73N97K86
$$ -1388 224 -186 3 14 806 316 -946 488 -45 459 -841 74 -529 -537 -207 -212 762 -11 586 872
1177H72j181J764j486J734j593M24J246l517K164m58P47r68K63j124Q80N03j957
$$ 872 -309 1455 -31 1703 110 534 1780 -1737 427 -31 716 -252 11 -1113 -233 270 -1687
1194a687K254j574Q07P45m17K56p71O05p95q24L195k951J469n48M42L59q9Q7o15
$$ -1687 567 -1007 -200 545 128 384 -387 218 -577 -1401 1794 -1157 312 -236 206 565 476 563 -52
1213e2J04J12J00j106O85L83o63M65p17J364j313q2J990j825J38J156q29m70P61
$$ -52 52 164 264 -842 -157 226 -437 28 -689 675 -638 -720 1270 -555 -417 739 -90 -560 201
1232B01O58j456J473k138P13N62j96Q49p06J77j035J424j33j122R17J013l59r5
$$ 201 859 -597 876 -1262 -549 13 -183 666 -40 137 -898 526 393 -729 188 1201 842 747
1250G47j594O60m84K021j546N10J95k086K873k093J387j186L56L27l83J008j736
$$ 747 -847 -187 -671 1350 -196 314 509 -1577 1296 -797 590 -596 -240 87 -296 712 -1024
1267a024Q70Q16k273R90M15M56j499J068m4L37K60j111J254n66R22r17J159m50
$$ -1024 -154 662 -1611 -621 -206 250 -1249 -181 -225 112 372 -739 515 -51 871 -46 1113 663
1285F63L39n38p27K47l59N68M4j33J353k220J114j169J339Q5j119M22p87J876
$$ 663 1002 464 -263 -16 -375 193 237 104 1457 -763 351 -818 521 606 -513 -91 -878 998
1303I98j886R48N27j976J680o34n97M77J637k91r77L87j264J089J18p01J69q93
$$ 998 -888 60 587 -1389 291 -343 -940 -463 1174 883 -94 293 -971 118 236 -465 -296 -1189
1321a189K303j603q26J267l54M85J52P62j066P1Q84k752J140m48Q46O99j195J230
$$ -1189 1114 -489 -1315 -48 -402 83 235 997 -69 2 886 -1866 -726 -1174 -328 371 -824 406
1339D06j92Q69j843k26J758q81J014j752J638j095k60M40m28J010n87O08j102
$$ 406 214 1083 -760 -986 772 -109 905 -847 791 -304 -564 -124 -552 458 -129 479 -623
1356f23N23J081k107J504j67O63j920J705k90Q2K21m12o16o0O25o61J70O18j838
$$ -623 -100 981 -1126 378 211 874 -1046 659 369 451 672 260 -356 -416 209 -452 -282 336 -1502
1375a502K580j220J027l09k142K223r85P42l69l04N32o34O11j233J432q55K48
$$ -1502 1078 -142 885 576 -1566 657 -328 414 45 -259 273 -361 250 -983 449 -406 -158
1392a58P68j011Q85o37K25o29O92l53o53K83Q77r37l54J668N18j640P79j261J714
$$ -158 610 -401 484 -153 72 -557 135 -218 -871 -588 289 -648 -1002 666 1184 -456 323 -938 776
1411G76q25N62j967J023N42R43k504J309o79J429j049R05m73O98p72j109J970
$$ 776 -49 513 -1454 -431 111 1054 -1450 -141 -820 609 -440 465 -8 690 -82 -1191 779
1428G79q61O3m57P83o56O54l47M99l00J117j411P76n53J150k531K234l11o15j46
$$ 779 -82 -19 -476 307 -349 305 -42 457 157 1274 -137 639 86 1236 -1295 939 628 13 -133
1447a33r62K181j473o88M87L43n56J024J71m14l27L99o05J085j589K168j517O99
$$ -133 -1095 1086 -387 -1075 -588 -245 -801 223 394 -20 -347 52 -553 532 -1057 1111 -406 293
1465B93j01q08M40j202J596n83R69r95r0J051k470J837n49k98P81q68J045o95
$$ 293 192 -616 -176 -1378 218 -365 604 -391 -481 570 -1900 -63 -612 -910 -129 -997 48 -647
1483f47J640j136N31l07J89L23j077O72L70o82J627k130K027j059N3n51J99p55
$$ -647 993 -143 388 81 270 593 -484 188 558 -124 1503 -627 1400 341 394 -157 42 -713
1501g13P10m66l50K006k130J257k72q91J15M5J502n11k110K080o28M33m54j97
$$ -713 -3 -469 -819 1187 -943 314 42 -849 -734 -689 813 302 -1808 272 -356 77 -377 -574
1519e74O52J22l77J48rl94l09J149n68R68o29N55j067q5M04J35k96l17J243j417
$$ -574 78 200 -177 -29 -38 -432 -741 408 -160 808 179 734 -333 -418 -14 121 -175 -492 751 -666
1539f66L92O95j518J326m01k33j028K054J56j839K279q18j39m28N81n5l96P36
$$ -666 -274 421 -1097 229 -172 -405 -1433 621 777 -1062 1217 399 260 -168 413 358 -38 698
1557F98j037J87L11m01Q21j889J469o15P24K81M2K30k074K426j269J86l8p51Q42
$$ 698 -339 -152 159 -242 579 -1310 159 -456 268 549 591 821 -1253 1173 -96 90 52 -699 143
1576A43m20J053j775J462k45j367J171p79K104j556M50J91j004J305j219J336
$$ 143 -277 776 -999 463 218 -1149 22 -757 1347 -209 241 432 -572 733 -486 850
1592H50k33p82O14j183J101j333J504j868J173M38l76K23N37j073k99J30N66r5
$$ 850 617 -165 449 -734 367 -966 538 -1330 -157 281 -95 128 665 -408 -707 -577 -11 -106
1610a06N51j50p76M68n95O39q78j78J042j59R97j160L09j06N11m49k71J93p3Q37
$$ -106 445 295 -481 -13 -608 31 -847 -1025 17 -142 855 -305 4 -102 409 -40 -311 -118 -191 646
1630F46j082J499q14j13K10j307K258j668l9O54P5o76j04J114j273L44Q0K38Q36
$$ 646 -436 1063 249 136 346 -961 1297 -371 -410 244 319 -357 -461 653 -620 -276 -196 42 878
1649H78j508J607j391R04k5j226R86m25M74o29N60L89j274R11j251J655j604J653
$$ 878 -630 977 -414 490 465 -761 225 -200 274 -355 205 594 -680 231 -1020 635 -969 684
1667F84j808J365M42j762J482Q23j257j53r14J863l77Q43r91n08P34q72R53l28
$$ 684 -1124 241 683 -1079 403 1226 -31 -184 -1098 765 388 1231 240 -268 466 -406 547 219
1685B19p83j05J291j018j58Ll43R29o09R93j032r76K323j124K24J21r05R83n42
$$ 219 -564 -669 622 -396 -554 -551 -894 35 -574 419 -613 -1589 734 -390 -166 -45 -950 33 -509
1704e09l07l47M77J098k55J96o77J348j346q95J556p95P81N49o64O31l37r07j27
$$ -509 -816 -1163 -686 412 157 353 -324 1024 -322 -1217 339 -456 325 874 210 841 504 -403 -530
1723e30R70l69k01l02o10J785o72l2m2m02L23M3J093q32O35j474R90j65k66L07
$$ -530 440 71 -130 -432 -1042 743 71 39 -3 -405 -82 -39 1054 222 857 -617 373 208 -58 249
1743B49j018Q45J4l70P57k50R2j153J673q33o94Q88n98M42n8Kl09R49K3J39m04
$$ 249 -769 76 90 -280 477 227 319 -834 839 6 -688 200 -398 44 -14 -12 -321 628 651 790 386
1764C86j383J000p71J036J1n9Q13n46m36k51R82j172l02J106r25J682j849N52
$$ 386 -997 3 -768 268 279 220 1033 487 51 -200 782 -390 -692 414 -511 1171 -678 -126
1782a26Q06j683J053J0J050j870N57Q17j248N10J36m78m58J848n88l02k5M21q9
$$ -126 680 -1003 50 60 1110 -760 -203 614 -634 -124 12 -466 -924 924 336 34 9 430 341
1801C41r20N2L00m25R92N00q15q11J142J37r39O23j92O64p77N63K74o74N37l78
$$ 341 -579 -527 -227 -652 340 840 25 -786 356 493 -446 177 -15 649 -128 435 709 35 572 194
1821A94j411J293l12K13k27J016m83o37R97j584J853p89o80P03j432K486j162
$$ 194 -1217 76 -236 -23 -250 766 283 -354 643 -941 912 123 -557 146 -1286 1200 38
1838C8ko57J216r09J232m50p29J648j867Q15K86p46L13m84J450j256p4Q63n85
$$ 38 36 -621 595 -314 918 468 -261 1387 -480 335 621 -125 188 -296 1154 -102 -176 687 102
1857A02O41q93P14n98M18l4n32m41P83N83r32n52K000j263Q79j800P08l38J32
$$ 102 743 -150 564 -34 384 350 -182 -623 160 743 -189 -741 1259 -4 875 -925 -217 -555 -423
1876d23K77l10K46p74M56J28j05J118n89Q03o70k91J4K56M29q96K84m17O13O05
$$ -423 -146 -456 -210 -984 -528 -400 -505 613 24 827 157 -134 -120 136 565 -331 -47 -464 149 754
1896G54k101J711n47J320k200J295N85m07n84m21J112j362J379J51j374K33N87
$$ 754 -1347 364 -183 1137 -1063 232 817 410 -174 -595 517 -845 534 685 -689 -456 131
1913A31j11k29q90O46k54l4j30R77K78j01n45r0J257j084k40P3N87R85k164J030
$$ 131 20 -209 -1099 -453 -707 -741 -871 106 384 283 -262 -352 905 -179 -419 -346 241 1226 -938 92
1933I2p37J099j70j176J388q49m6k57P75o21j00N67p89J367p01L01o30O80o52
$$ 92 -645 454 284 -892 496 -353 -399 -656 119 -502 -602 -35 -824 543 -158 143 -487 193 -459
1952d59j42J225j601J704K22r45j27o11M18m98J235Q80j604J010r02J175r00r35
$$ -459 -601 624 -977 727 949 4 -123 -734 -316 -814 421 1301 -303 707 -195 980 80 -855
1970h55J808j138O93m07j31N18k32p22p43O54Q96l08Pj03k53O18j411P36k97M32
$$ -855 953 -185 508 101 -30 488 256 -466 -1209 -555 341 33 40 -63 -316 302 -1109 -373 -670 -238
1990b38N34m44K97Q84j668O05j59J32J69R3m98O95p43O32j280J608n41p46J036
$$ -238 296 -148 149 1033 -635 -30 -189 -57 112 205 -293 402 -341 291 -989 619 78 -668 368
2009C68l34q57L96Q04p47J303j709M84Q81j191j68N83P54m65m68O60l4P37j581
$$ 368 34 -823 -427 377 -370 933 -776 -292 589 -602 -770 -187 567 102 -366 294 260 997 -584
2028e84M48j28K02Q05j014j59o8N29M08j379J324N91o95q26Q92O49j194l08k23
$$ -584 -136 -264 -62 743 -271 -430 -498 31 439 -940 384 975 280 -546 346 995 -199 -507 -730
2047g30J802j999J125R7r04J097j674J754j273Q09O92j611R68r76K063p78l84
$$ -730 1072 -927 198 295 -609 488 -1186 568 -705 104 796 -815 153 -823 1240 462 78
2064G8N36j979J962j141J055j174O59J50O96J62j440L0K52k87O55M4L51p58j49
$$ 78 614 -1365 597 -544 511 -663 -4 146 842 1004 -436 -406 -154 -441 214 258 609 -149 -298
2083b98M60k75R71l02Q15j010j63o43K29j083K170l04j411P21J298k140O35k85
$$ -298 162 -113 858 556 1371 361 198 -445 -216 -1299 871 567 -844 -123 1175 -965 -330 -615
2101f15Q25K33K19K36q60K96q25M84k62K08O55q07J701j329l10M64m57P76j345
$$ -615 210 443 662 898 38 334 -491 -7 -269 -61 594 -213 1488 159 -151 313 -144 632 -713
2120g13J937p81J307j649j259J750k471J862j27Q6K53P6M20j305J920j386m94
$$ -713 1224 443 1750 101 -1158 592 -1879 -17 -144 -58 195 271 691 -614 1306 -80 -574
2137e74K34LR50j160Q23j772J661q19pO23J55J5p23J192j011J92N01r74J338j554
$$ -574 -340 -337 613 -547 276 -1496 165 -654 -661 -38 117 132 -591 601 -410 -218 283 -691 647 -907
2157i07O15l84M11J440k311K188j344P1N41j158Q00j356J735q79N24K61l45m58
$$ -907 -292 -676 -265 1175 -1136 1052 -292 -221 320 -838 -38 -1394 341 -538 -14 247 -98 -556
2175e56P1J462j575P42M51N42j385P11j549J078r41J363m00K69l92L9j41m19J259
$$ -556 -485 977 -598 144 595 1137 -248 463 -1086 -8 -949 414 14 283 -109 -70 -211 -630 629
2194F29j338J632j058l06J746k114J803j768N69L48l48J260r66M9o85J671r01
$$ 629 -709 923 -135 -441 1305 -809 994 -774 -205 143 -205 1055 89 138 -547 1124 223
2211B23p95J086j134K6l41J323j512R7K230j920K147k077J537j229r1O86m2O89
$$ 223 -572 514 -620 -594 -935 388 -1124 -1027 1203 -717 1430 -647 890 -339 -430 256 214 903
2229I03j278J44m57J051o8j372J272k86O57j521M18O63j98j33O18j33l18Q47p14
$$ 903 -375 -231 -688 363 295 -1077 195 -91 566 -955 -537 126 -72 -205 413 280 -38 809 95
2248I5j139J571k436J704K06j89N04j071J766j263N59k76n18l10j45J105n80O18
$$ 95 -1044 527 -1909 -205 1 -188 316 -755 1011 -252 307 31 -487 -797 -942 163 -417 201
2266B01o00m15P72K49N96m79l16m06P81r45L70J74o18J026j150M69J20n67J612
$$ 201 -399 -814 -42 207 803 324 8 -398 383 -562 -192 -18 -636 390 -760 -291 -171 -738 874
2285H74M48n12j049l58K043q49j243Q33q75J012n1m58M34j94M23j032N56j081
$$ 874 1322 810 -239 -597 1446 597 -646 187 -688 324 273 -185 249 55 478 -554 2 -1079
2303a079J474p28J10M83j18O88j070P47O13j422L10j503J070l94J786j270P52
$$ -1079 395 -333 -223 260 142 830 -240 507 1120 -302 8 -1495 -425 -819 967 -303 449
2320D49L99j866J582R5n90l58N18M41j393J601j711J442J89j656R39j97J070j129
$$ 449 848 -1018 564 659 69 -289 229 670 -723 878 -833 609 798 -858 81 -116 954 -175
$$ [...]
16383A58
##END NTUPLES=NMR FID
##END=
