##TITLE=31P_DE-80H_X3
 64 sc D2O
 26.2.2025
##JCAMPDX= 6.0         $$ Bruker NMR JCAMP-DX V2.0
##DATA TYPE= NMR FID
##DATA CLASS= NTUPLES
##ORIGIN= UXNMR, Bruker Analytische Messtechnik GmbH
##OWNER= root
$$ XWIN-NMR		Version 3.5
$$ Thu Feb 12 13:50:43 2026 Russian Standard Time (UT+4h)  Yarkov@DPX200
##.OBSERVE FREQUENCY= 81.013821
##.OBSERVE NUCLEUS= ^31P
##.DELAY= (6, 6)
##.ACQUISITION MODE= SIMULTANEOUS
##.ACQUISITION SCHEME= undefined
##.AVERAGES= 64
##.DIGITISER RES= 17
##SPECTROMETER/DATA SYSTEM= spect
##.PULSE SEQUENCE= zgpg30
##.SOLVENT NAME= CDCl3
##.SHIFT REFERENCE= (INTERNAL, CDCl3, 0, 243.863)
##AUDIT TRAIL= $$ (NUMBER, WHEN, WHO, WHERE, WHAT)
$$ ##TITLE= Audit trail, XWIN-NMR		Version 3.5
$$ ##JCAMPDX= 5.01
$$ ##ORIGIN= Bruker BioSpin GmbH
$$ ##OWNER= Yarkov
$$ C:/Bruker/XWIN-NMR/data/yarkov2/nmr/P31/2/audita.txt
$$ ##AUDIT TRAIL=  $$ (NUMBER, WHEN, WHO, WHERE, WHAT)
(   1,<2026-02-12 13:50:02.01 +0400>,<Yarkov>,<DPX200>,
      <created by zg, POWCHK disabled, PULCHK disabled
       configuration hash MD5:
       00 E9 B6 7A A2 85 ED C7 34 08 36 98 17 FE 4E 26
       data hash MD5: 32K
       30 A8 79 BB 40 7B 49 BD 18 D6 A2 B7 98 14 F5 0E>)
$$ ##END=
$$ 
$$ hash MD5
$$ BE 32 F3 13 B5 A7 47 7A EA 93 78 2E D0 BD B3 1C
##$RELAX= 
##$RELAX= 
##$RELAX= 
##$RELAX= 
##$RELAX= 
##$RELAX= 
##$RELAX= 
##$RELAX= 
$$ Bruker specific parameters
$$ --------------------------
##$DU= <C:/Bruker/XWIN-NMR>
##$EXPNO= 2
##$NAME= <P31>
##$PROCNO= 1
##$TYPE= <nmr>
##$USER= <yarkov2>
##$AMP= (0..31)
100 100 100 100 100 100 100 100 100 100 100 100 100 100 100 100 100 100 
100 100 100 100 100 100 100 100 100 100 100 100 100 100 
##$AQSEQ= 0
##$AQ_mod= 1
##$AUNM= <au_zg>
##$AUTOPOS= <>
##$BF1= 81.014009
##$BF2= 200.13
##$BF3= 200.13
##$BF4= 200.13
##$BF5= 200.13
##$BF6= 200.13
##$BF7= 200.13
##$BF8= 200.13
##$BYTORDA= 1
##$CFDGTYP= 0
##$CFRGTYP= 5
##$CHEMSTR= <none>
##$CNST= (0..31)
1 1 145 1 1 1 1 1 1 1 1 1 1 1 1 1 1 1 1 1 1 1 1 1 1 1 1 1 1 1 1 1 
##$CPDPRG= <waltz16>
##$CPDPRG1= <>
##$CPDPRG2= <waltz16>
##$CPDPRG3= <>
##$CPDPRG4= <mlev>
##$CPDPRG5= <mlev>
##$CPDPRG6= <mlev>
##$CPDPRG7= <mlev>
##$CPDPRG8= <mlev>
##$CPDPRGB= <>
##$CPDPRGT= <>
##$D= (0..31)
0 1 0 0 0 0 0 0 0 0.06 0 0.03 2e-05 3e-06 0 0 0.0002 0 0 0 0 0 0 0 0 0 
0 0 0 0 0 0 
##$DATE= 1770889801
##$DBL= (0..7)
120 120 120 11 120 120 24 19 
##$DBP= (0..7)
150 150 150 150 150 150 150 150 
##$DBP07= 0
##$DBPNAM0= <>
##$DBPNAM1= <>
##$DBPNAM2= <>
##$DBPNAM3= <>
##$DBPNAM4= <>
##$DBPNAM5= <>
##$DBPNAM6= <>
##$DBPNAM7= <>
##$DBPOAL= (0..7)
0.5 0.5 0.5 0.5 0.5 0.5 0.5 0.5 
##$DBPOFFS= (0..7)
0 0 0 0 0 0 0 0 
##$DE= 6
##$DECBNUC= <off>
##$DECIM= 4
##$DECNUC= <off>
##$DECSTAT= 4
##$DIGMOD= 1
##$DIGTYP= 9
##$DL= (0..7)
0 0 52 120 120 21 21 25 
##$DP= (0..7)
150 150 150 150 150 150 150 150 
##$DP07= 0
##$DPNAME0= <>
##$DPNAME1= <>
##$DPNAME2= <>
##$DPNAME3= <>
##$DPNAME4= <>
##$DPNAME5= <>
##$DPNAME6= <>
##$DPNAME7= <>
##$DPOAL= (0..7)
0.5 0.5 0.5 0.5 0.5 0.5 0.5 0.5 
##$DPOFFS= (0..7)
0 0 0 0 0 0 0 0 
$$ [...]
##$SUBNAM1= <"">
##$SUBNAM2= <"">
##$SUBNAM3= <"">
##$SUBNAM4= <"">
##$SUBNAM5= <"">
##$SUBNAM6= <"">
##$SUBNAM7= <"">
##$SUBNAM8= <"">
##$SUBNAM9= <"">
##$SW= 400.765351723535
##$SWIBOX= (0..15)
0 1 3 0 0 0 0 0 0 0 0 0 0 0 0 0 
##$SW_h= 32467.5324675325
##$TD= 32768
##$TD0= 1
##$TE= 0
##$TE2= 300
##$TE3= 300
##$TEG= 300
##$TL= (0..7)
0 120 53 12 22 120 120 120 
##$TP= (0..7)
150 150 150 150 150 150 150 150 
##$TP07= 0
##$TPNAME0= <>
##$TPNAME1= <>
##$TPNAME2= <>
##$TPNAME3= <>
##$TPNAME4= <>
##$TPNAME5= <>
##$TPNAME6= <>
##$TPNAME7= <>
##$TPOAL= (0..7)
0.5 0.5 0.5 0.5 0.5 0.5 0.5 0.5 
##$TPOFFS= (0..7)
0 0 0 0 0 0 0 0 
##$TUNHIN= 0
##$TUNHOUT= 0
##$TUNXOUT= 0
##$USERA1= <user>
##$USERA2= <user>
##$USERA3= <user>
##$USERA4= <user>
##$USERA5= <user>
##$V9= 5
##$VALIST= <valist>
##$VCLIST= <CCCCCCCCCCCCCCC>
##$VD= 0
##$VDLIST= <DDDDDDDDDDDDDDD>
##$VPLIST= <PPPPPPPPPPPPPPP>
##$VTLIST= <TTTTTTTTTTTTTTT>
##$WBST= 1024
##$WBSW= 4
##$XGAIN= (0..3)
0 0 0 0 
##$XL= 0
##$YL= 0
##$YMAX_a= 2398
##$YMIN_a= -989
##$ZGOPTNS= <>
##$ZL1= 120
##$ZL2= 120
##$ZL3= 120
##$ZL4= 120
##$ABSF1= 60
##$ABSF2= -190
##$ABSG= 5
##$ABSL= 3
##$ALPHA= 0
##$AQORDER= 0
##$ASSFAC= 0
##$ASSFACI= 0
##$ASSFACX= 0
##$ASSWID= 0
##$AUNMP= <proc_1d>
##$AZFE= 0.1
##$AZFW= 0.5
##$BCFW= 1
##$BC_mod= 2
##$BYTORDP= 1
##$COROFFS= 0
##$CY= 9.86611175537109
##$DATMOD= 1
##$DC= 1
##$DFILT= <>
##$DTYPP= 0
##$F1P= 182.462994727601
##$F2P= 168.069089081705
##$FCOR= 0.5
##$FTSIZE= 0
##$FT_mod= 0
##$GAMMA= 1
##$GB= 0
##$INTBC= 1
##$INTSCL= 1
##$ISEN= 30
##$LB= 1.5
##$LEV0= 0
##$LPBIN= 0
##$MAXI= 11.51145
##$MC2= 0
##$MEAN= 0
##$ME_mod= 0
##$MI= 1.244541
##$NCOEF= 0
##$NC_proc= 0
##$NLEV= 6
##$NOISF1= 0
##$NOISF2= 0
##$NSP= 1
##$NTH_PI= 0
##$NZP= 1
##$OFFSET= 243.8632
##$PC= 1.4
##$PHC0= 1679.209
##$PHC1= -1.240479
##$PH_mod= 0
##$PKNL= yes
##$PPARMOD= 0
##$PSCAL= 0
##$PSIGN= 0
##$REVERSE= no
##$SF= 81.0140731611343
##$SI= 65536
##$SIGF1= 0
##$SIGF2= 0
##$SINO= 80
##$SIOLD= 65536
##$SREGLST= <31P.CDCl3>
##$SSB= 0
##$STSI= 0
##$STSR= 0
##$SW_p= 25641.0256410257
##$SYMM= 0
##$S_DEV= 0
##$TDeff= 0
##$TDoff= 0
##$TI= <>
##$TILT= no
##$TM1= 0
##$TM2= 0
##$TOPLEV= 0
##$USERP1= <user>
##$USERP2= <user>
##$USERP3= <user>
##$USERP4= <user>
##$USERP5= <user>
##$WDW= 1
##$XDIM= 64
##$YMAX_p= 0
##$YMIN_p= 0
$$ End of Bruker specific parameters
$$ ---------------------------------
##NTUPLES= NMR FID
##VAR_NAME=  TIME,          FID/REAL,        FID/IMAG
##SYMBOL=    X,             R,               I
##VAR_TYPE=  INDEPENDENT,   DEPENDENT,       DEPENDENT
##VAR_FORM=  AFFN,          ASDF,            ASDF
##VAR_DIM=   16384,         16384,           16384
##UNITS=     SECONDS,       ARBITRARY UNITS, ARBITRARY UNITS
##FACTOR=    3.08e-05,      1,               1
##FIRST=     0,             0,               0
##LAST=      0.5045964,     0,               0
##MIN=       0,             -989,            0
##MAX=       0.5045964,     2398,            0
$$ Real data points
##PAGE= N=1
##DATA TABLE= (X++(R..R)), XYDATA
0@%%%%%%%%%%%%%%%%%%%%%%%%%%%%%%%%%%%%%%%%%%%%%%%%%%%%%%%lRj4J7k2K9
$$ 0 0 0 0 0 0 0 0 0 0 0 0 0 0 0 0 0 0 0 0 0 0 0 0 0 0 0 0 0 0 0 0 0 0 0 0 0 0 0 0 0 0 0 0 0 0 0 0 0 0 0 0 0 0 0 0 -3 6 -8 9 -13 16
61A6l8M6n5P7j40K492j497n73n44n62j55OL49M81N32L34K13j90l74n22m65l20
$$ 16 -22 24 -31 46 -94 2398 901 328 -216 -778 -933 -927 -578 -97 435 769 982 792 418 -104 -569 -889
83h89rK34M71N59L79K04p9m16n22m98k62n8K11M57M91M12K17j13l14m51m56l93
$$ -889 -898 -664 -193 366 745 949 870 454 -68 -566 -828 -886 -675 -218 273 685 902 789 475 24 -432 -825
105h25m6K41L80M95M48J69l3l25m01n54k73j02J09L98M29M77K97rl22m19n29l40
$$ -825 -871 -630 -250 245 693 862 829 504 103 -451 -724 -826 -717 -319 110 587 884 875 553 134 -395 -735
127g35j39J00M31N00M28K99j5k33m79m70l67j90J28L30M72M61K62Q6k57l59n03
$$ -735 -874 -774 -343 157 585 884 869 636 157 -313 -680 -870 -742 -412 60 521 783 869 612 253 -250
148b50m26j58O5L11N17M44K60P2j75m48m19l79k91M8K85M89M60L89R5j45m38n14
$$ -250 -676 -834 -769 -458 59 503 763 835 660 212 -207 -586 -877 -829 -544 -55 405 794 889 744 306 -208
170b08m36k29K2L26M44M83K85J25j23l26m64m64k77LK93L89M40L78J99j26l52
$$ -208 -644 -873 -851 -525 -81 402 687 812 689 363 -101 -565 -842 -839 -546 -157 283 661 860 734 382
191C82m39m78k39k0K12M18M03L60K05o0l66l93m42l10j00J97M72M09M21J20qk72
$$ 382 -57 -535 -774 -794 -582 -164 239 599 804 744 378 -15 -457 -767 -867 -670 -198 211 632 752 744 472
213D72n17l48l35j42K64L25M66L89K05Jk75m21m83l15j18J31L89M60L72K29J3
$$ 472 -45 -393 -728 -870 -606 -281 185 574 779 780 505 84 -399 -714 -832 -701 -312 148 520 749 762
234G62k68m28m34k65j58J28L28M15M12K69J0k10m37m44l47j49J12K74N29L95K57
$$ 762 494 66 -368 -633 -791 -663 -335 80 492 761 771 561 124 -320 -667 -816 -704 -430 99 494 751
255G51j9j91l64m32l22j75L6K66M78L33L20J32j60l88m76m06j29pL12L91M88K30
$$ 751 732 541 177 -255 -577 -752 -716 -450 28 361 681 813 653 265 -211 -617 -746 -753 -441 -50 438 668
277F68J14j20l59m22m22k59P6J52M53M41L67P6p2l84m15m34k08J5K08M12M34K26
$$ 668 782 662 303 -119 -541 -800 -724 -572 -119 322 689 765 693 309 -106 -540 -748 -733 -525 -113 321 547
299E47J93q1k95l94m11k72o4K24L61M52L50J92j18k91l89m42k55q3J47L84M31
$$ 547 740 659 364 -30 -441 -713 -777 -553 -192 260 610 802 684 393 4 -438 -693 -776 -629 -245 186
320A86L30K13qk53m12m10l37j12J40L72M95L08K09l3k43l49m11l14j41J66L04
$$ 186 516 729 721 468 56 -354 -691 -803 -663 -291 204 512 721 688 445 96 -315 -629 -770 -604 -300
341c00L92L45K37O9k16l75m16l74j07Q7L17M58M10J28K5j42l99l90k69j35j2K86
$$ -300 92 437 674 743 527 152 -264 -638 -745 -658 -341 117 527 655 680 538 139 -251 -520 -655 -667 -381
363c81L73M23K72P0j94l23m33l69k20O9L30L48L87L01O9j20l22l70m05k50L6J81
$$ -381 -8 415 687 757 563 240 -193 -562 -782 -713 -383 -35 352 653 722 602 280 -90 -495 -745 -709 -528
385e28M03M03L19J58q5l00m59l84k37J6K22L17L93L21J57q1k76m03l26k84l4J45
$$ -528 -125 278 597 755 670 370 -89 -473 -710 -694 -472 -155 238 559 716 635 359 -44 -370 -654 -688 -543
407e43L72M26L47J31j31k08m47l56k08r1J44L74L47K92K23l9k38l43m00k73j15
$$ -543 -171 255 602 733 602 394 -53 -409 -617 -708 -564 -190 157 449 672 633 395 52 -348 -621 -736
428g36J45K85M05L82J82j2k34l22m20k60o8J16K51L70L63K36k6j72l72l38l42
$$ -736 -591 -306 99 481 663 651 417 95 -325 -585 -653 -537 -286 84 447 683 657 485 113 -225 -567
449e67j26J00L15L45L43J68O4j63l39l55l27j24J06J92L29M12K54J6j55k81m29
$$ -567 -693 -593 -278 67 410 578 642 479 140 -215 -542 -666 -560 -368 -39 373 627 643 488 207 -222
470b22k32k72R7K99L57L76J82O0j38k76l74l25j56l7K52L75K86L12R2j17k77m19
$$ -222 -454 -726 -629 -330 27 403 585 645 507 231 -143 -468 -624 -661 -409 -34 252 564 656 539 262 -157
492a57k90j88M1J96L35L10K51J66j43k51l55l04j94n3K14K76M04K36J51j11k78
$$ -157 -447 -635 -594 -398 -63 247 498 664 521 270 -85 -389 -583 -636 -422 -146 258 494 645 534 256
513B56l39l33j79n6J84K87L78K72J42Nk76l64l45j77j33J67L28L51L01J92r1k41
$$ 256 -83 -416 -595 -651 -467 -180 198 470 612 617 341 -23 -368 -545 -678 -511 -183 168 469 661 570 329
535C29l18k82k59l4N0L11L29K73K13l6j83l42l34k62j09J51K77L88K54J87j9k64
$$ 329 11 -271 -530 -564 -514 -203 126 399 612 576 393 51 -283 -545 -654 -503 -226 162 416 603 584 320
557C20k46l50k22j24R5K47L30L70J88Kj74l41l45k77r4M1K99L34L26J83k9j41
$$ 320 74 -276 -498 -622 -527 -280 50 420 608 610 436 95 -250 -527 -621 -580 -281 53 379 562 533 392
579C92k94l13k60j39OK78L13L50K46L8j21l42l50k81j38P2K09L01L58K22N6j21
$$ 392 98 -215 -475 -614 -608 -330 -17 333 579 617 496 154 -196 -477 -615 -543 -334 -33 325 547 603 482
601D82k76l10l00j78m6K74K94L27K43R8j03l26k80l03j80K6J48L35L01K54O3n
$$ 482 206 -104 -404 -582 -628 -354 -60 267 510 608 505 179 -101 -404 -584 -558 -410 -75 226 480 543 538
623E38k97k85k73k72rJ38L06L77K51J48j11k05l11l71j36n4J72K13L31L07N5P2
$$ 538 241 -44 -317 -589 -598 -460 -154 223 474 622 511 306 -5 -376 -512 -566 -394 -181 150 457 512 584
645E84k17l27l70k24o2J65K21L77L12J31m0j89l05l76j77n7J02J87L97K83J32
$$ 584 367 40 -330 -554 -616 -451 -230 147 459 590 550 361 56 -320 -497 -554 -452 -265 132 415 547
666E47mj72k99l63k26p6J37K26K94L26J69K5j74l26k60k72j48R8K19K80L47J70
$$ 547 543 371 72 -291 -517 -593 -456 -230 64 390 559 584 410 84 -176 -448 -596 -498 -279 1 348 518
688E18O4j71k96k99k60j46J21K05L47K19J80M0j12k77k57k38j76M9J71K65L05
$$ 518 582 411 115 -184 -444 -590 -469 -264 83 302 482 522 410 133 -124 -362 -538 -489 -318 -53 252
709B52K39R0j60k31l06k72j01j1K00K16L28K01J03j29j82l14l00j29l4J92K59
$$ 252 491 581 421 190 -116 -388 -489 -500 -300 -84 244 445 548 419 237 -77 -377 -506 -540 -348 -89
730h9L22K05J01n8k69k41k85j65pJ49K61K96J42J21m0j81k92k61j40l0J26K08
$$ -89 233 438 539 481 212 -29 -314 -479 -486 -337 -76 220 362 483 443 262 -30 -291 -431 -461 -335 -127
752a27L14K30R7l1k26l01k39k03M3R6K02K70K44J38o4j07l01k69k17m7J24K22
$$ -127 187 417 514 483 257 -44 -283 -486 -443 -347 -145 125 369 507 443 336 35 -234 -451 -498 -374 -152
774a52L20J99J32o0j54k25k65j82j01J14K30K11K77J27lj57k57k31k50j1Q4J97
$$ -152 168 367 499 439 285 60 -205 -387 -488 -374 -144 67 344 471 468 311 54 -177 -427 -438 -354 -157
796a57K73K27Q7Kj57j71k64j87p8L2J85K33K79J64oj10k63k67k21j01J37J50K23
$$ -157 116 343 430 432 275 104 -160 -347 -425 -393 -208 25 304 468 462 352 89 -178 -399 -500 -363 -213 10
819A0K83J29Rj23j72k74j90j55J20P9K40K88J58N0j01k24k64j96j10K4J30K31
$$ 10 293 422 431 308 136 -138 -328 -483 -363 -284 -44 244 402 452 351 127 -137 -333 -443 -419 -289 -58
841e8L10J07P9q9j83k70k01j34J6R3K75K32K13O7r6k23k50j77o7l7J12K09K42
$$ -58 252 359 438 349 166 -104 -305 -439 -423 -330 -55 177 390 457 361 138 -112 -289 -356 -393 -281 -72 170
864A70K24J5pk21k30k37j73K1J41K30K48J86P8l2k08k69j79j16m8J30J76K40K01
$$ 170 394 409 402 181 -49 -286 -459 -438 -297 -67 181 367 445 413 205 -64 -243 -359 -407 -277 -101 139 340
887C40P6rk06k02k44j55m3J18K25K35J77J08n6j46j46l02j41n8J19J36K41J70
$$ 340 416 407 201 -1 -245 -400 -443 -325 -100 135 312 420 364 218 72 -230 -371 -429 -310 -174 67 237
909B37J47L5j92j45k74j78p7J22K08J62K03J30k2q8k17k24j05q3nJ87K54J60J41
$$ 237 384 419 227 82 -192 -370 -447 -325 -117 45 248 378 356 268 51 -173 -278 -361 -366 -179 75 235 376
932C76L2j14k08k19k05l9MJ95J92J76J07J7Mk19j74j75j41K7J06K51K19J46L7
$$ 376 408 294 86 -133 -338 -377 -373 -178 14 190 297 314 318 99 -75 -250 -391 -364 -258 -7 212 358 395
955C95q1j91j80k73n3M9J10K06K25M9N7j9j61k25j36j39rJ04K37J82J95M9j21
$$ 395 314 123 -57 -330 -383 -334 -224 -18 207 256 313 294 133 -92 -228 -367 -376 -272 -35 147 342 391 270
978B70p7k67j67j34L6J14J12K49J04R8m8q5k09k32j17k2J30J69K16J39O1l0j82
$$ 270 193 -74 -241 -375 -339 -225 -113 136 240 338 290 205 -4 -236 -353 -375 -245 -76 140 279 340 310 128
1001A28j60k05n7o6R7J78J67J82M6k3o1k21j75j54k2N5J78J88J75Q3m2j27j88
$$ 128 -32 -237 -294 -360 -263 -85 82 264 310 287 226 5 -170 -324 -346 -291 -113 75 250 333 291 164 -24
1024b4j68j42LN0J22K23J43J31j2j89r2k45q4n5O7J80J39J63P4L8j28j69j77j17
$$ -24 -192 -334 -331 -281 -159 64 207 338 326 137 45 -200 -284 -339 -272 -92 47 210 284 322 194 25 -152 -269
1048b69o4QJ77J90J69J68l8j50j81j50j35l3M2J47J88J01Q4O4q5j30k37j34n0
$$ -269 -333 -325 -148 42 211 379 341 191 10 -140 -275 -308 -266 -119 69 170 254 318 233 103 -134 -268 -318
1071c18O5R8J38K26R9N1j81j26j58j16q3K1J35J65J31J13N2j06j33k02j41q7Q0
$$ -318 -253 -155 -17 209 308 359 178 52 -106 -222 -305 -284 -149 16 147 260 312 206 73 -129 -270 -357 -277
1094b77J07J70K09Q7K5j50r9j41j62j06O5Q8J09J79J37Q9j30l7k66j35o5J6J06
$$ -277 -170 0 209 296 321 171 72 -69 -231 -337 -272 -184 -75 104 241 330 200 163 -103 -238 -303 -287 -181
1117a81J54K00R1J7p1j20j72j37o9K6M9J33J97J50O2o4j07j83j59j13l1J16J67
$$ -181 -27 173 264 281 210 90 -82 -219 -288 -262 -213 -80 117 267 329 265 158 -25 -184 -297 -328 -212 -45
1140d5J99J53K5q9q3j87j53l8m9O1J91J21J51Q4o3j61j37j69j21L3Q5J13J88J61
$$ -45 154 307 332 243 160 -27 -180 -218 -267 -206 -15 106 257 341 278 117 -20 -189 -310 -277 -192 -79 109 270
1164B70mk1o6j63k11q7M0PJ80J57J09J26q7p7j59j62j53OQ5J47J87P6R2j2j28
$$ 270 266 245 179 16 -195 -282 -242 -235 -55 102 211 337 250 173 14 -148 -301 -295 -210 -63 124 200 292 280 152
1189A52j45j86j29oL3J73J80J30J39q4p3j97k11m1m2O6J72J14J45Q7Rj26j52q1
$$ 152 7 -179 -308 -314 -281 -108 72 202 341 257 184 -13 -224 -265 -307 -241 -69 45 190 277 286 160 8 -73
1213g3j77n5L1J68J73J53J00p1p3j65j04j65k6M9R2K13R1J08Ol0j75j81j87j0
$$ -73 -250 -305 -274 -106 67 220 320 249 176 11 -93 -258 -284 -235 -143 70 161 269 275 245 70 -111 -298 -308
1237c08N5Q7J45J86J15K3j18j27j14j51r4Q0M6J33J87P6L7J0k22j28j71n4N2J26
$$ -308 -253 -166 -21 165 280 303 185 58 -56 -207 -301 -221 -175 -42 145 221 258 268 46 -82 -253 -307 -255 -129
1261a29J56J85J6N8j21o9j59j50j00L6Q2J98J69R4J2r4p7j22j70q9j1J30J42J81
$$ -129 27 212 228 286 165 96 -63 -213 -313 -277 -195 3 172 266 278 184 107 -15 -185 -274 -285 -155 -13 168
1285A68P2MK3j41k05j18l6p5R1J99J01J65N9m4j59k06j09l2lQ9J26J39R2M8j3
$$ 168 240 244 267 126 -79 -197 -233 -308 -217 -18 83 248 307 263 104 -102 -211 -243 -246 -157 -31 108 200 248 235
1310B35j30p2k13j04j0P4K03J00J80K2l8j49j65j18j00kQ5J49J41J24N7j9p5j66
$$ 235 105 33 -180 -284 -294 -220 -17 83 263 285 247 98 -67 -185 -285 -287 -202 -53 88 212 269 250 175 9
1334Ij86o2q6R6J71J77P8O8pj42j63j62l2l6R6J22R0J67P9j7q9j53j62j44j6N0
$$ 9 -177 -239 -325 -229 -58 119 197 265 258 116 -47 -209 -241 -277 -181 -59 31 198 277 260 171 18 -144 -288 -304 -254
1360b54J55J51J21Q4lj24j39j15p9n8M7J28J58J19R3Jq9j84j67q5k4M8J29J66
$$ -254 -99 52 173 257 254 130 -9 -124 -203 -261 -214 -86 72 191 284 285 196 12 -155 -240 -264 -216 -87 79
1384G9R4J11j8p7j68j65r5j2PP6J77J33J52n7k5j78j64j41%K0J32K03O3J10M4
$$ 79 173 284 266 189 21 -144 -239 -251 -244 -168 9 142 294 237 212 34 -130 -271 -271 -251 -119 84 147 257 301
1409C01j49j15j06j02j19KJ23J95J50J14k7n5j61j48j37r3P8J26J16J79J15Ll9
$$ 301 152 37 -69 -171 -290 -288 -165 30 180 294 267 212 51 -97 -234 -327 -249 -123 -7 172 287 290 251
1432B51j59j49j41q2l8R9K61J31J38M3j03j61j78j12n5l9J05J92Q4J60K9k3j27
$$ 251 92 -57 -198 -280 -318 -219 42 173 311 354 251 90 -88 -200 -255 -294 -189 3 87 247 276 253 126
1455A26j63j70p9l9R2J72K35M6L0Kj04j93j76m6mM1J84J39J28Q0l6q8k05j75j01
$$ 126 -37 -207 -286 -325 -233 -61 174 220 250 252 148 -45 -221 -267 -271 -230 -46 93 221 301 265 177 -28 -203 -304
1480c04J0J03J24J69J50J1l0j12j58p8j29RK8P2K04J18J13nj18j66j50j41l5R1
$$ -304 -294 -191 -67 102 252 263 233 121 -37 -115 -244 -235 -207 -135 69 187 300 295 177 11 -139 -280 -315 -224
1504b24J28J66J43R9n3o0j72j64j23J5J1M3K80R0J48j4j33r9j54k17PK0J40J70
$$ -224 -96 70 213 312 259 199 27 -137 -260 -245 -234 -191 89 179 327 313 180 81 -73 -290 -283 -263 -123 47
1528D7J32J27m6k8j43k10j12m6QJ07J67J59J73l9l1j54j74j48o6L6Q4J71J22J69
$$ 47 179 306 260 232 89 -121 -233 -279 -271 -164 3 162 335 296 265 111 -63 -211 -277 -241 -157 14 136 305
1552C05qq7q8j67j70p8L5R5J21K58O5O5j35p0j86j28r8L2O4J39J39J29P6m1j48
$$ 305 297 210 122 -45 -215 -293 -258 -163 -42 216 281 346 211 141 -45 -173 -271 -239 -175 -36 103 232 308 267 119
1577A19j80r5j49M9J01J13J95R9M3o2j08j74j45p3l2R7J22J65J24P2l6n6j30k43
$$ 119 -61 -156 -305 -256 -155 -42 153 252 295 233 125 -49 -194 -267 -299 -202 -80 85 209 281 245 189 59 -184
1601a84r3%M7J41J80J20O8l7j25j05j67n0r1J05P0J48J92J14n4j19j20k24j05
$$ -184 -277 -277 -230 -89 91 211 279 242 117 12 -155 -205 -296 -191 -121 27 219 333 279 160 40 -184 -289
1624b89qP0J50J57J44K8J6o2j15k76r5m3P2J24J85J55M7L9o5k04j72r8o4Q7R3
$$ -289 -297 -227 -77 80 224 252 268 206 91 -185 -280 -323 -251 -127 58 213 260 299 234 30 -142 -240 -304 -217 -124
1649a24J36J68P2N2q2j47j57p8j62R8O2J81J29J09j0n2j25j79j49qn5J46J76J88
$$ -124 12 180 252 304 222 75 -82 -160 -322 -224 -162 19 148 257 247 195 70 -109 -258 -266 -321 -175 1 189
1673A89M5J9J4j46k18j39q2j4J62J21J83R7O6m8k02j28j57n3MM1J73J98Q3P8m1
$$ 189 234 253 267 121 -97 -236 -318 -332 -170 -49 134 231 297 249 47 -81 -238 -291 -287 -246 -73 125 208 286 245
1698B45r4k07j85m8qP5K00J38J09K4m1p6k22j60n3%P5J71J31J69L7k1r2k27r3
$$ 245 151 -56 -241 -289 -297 -222 -22 116 225 249 208 132 -90 -250 -303 -303 -228 -57 74 243 280 259 167 -60 -153
1723a53j92J01k5J82J97R6J26p3j06j76j09j47l1N2J58J93J48M2j0j28j33j82
$$ -153 -345 -244 -269 -87 110 206 332 259 153 -23 -132 -279 -310 -258 -100 93 241 283 273 145 12 -170
1745a70j43LM8J69J40J54M9M6j08j36k39r2j2K5J26J85J28J31p8k9j49k38r6q3
$$ -170 -313 -310 -262 -93 47 201 250 296 188 52 -187 -279 -291 -266 -140 45 173 304 226 197 48 -190 -286 -369
1769c69J09J69Q3J66Q8K9j17o5j89j84k2PR9J64J79J34K0o9j41j92j31o1K1Q1
$$ -369 -260 -91 -8 158 246 275 158 93 -96 -280 -302 -295 -196 -32 147 281 301 232 91 -101 -232 -293 -272 -191
1793a91J54J74J48L7o0j34k22j16m4oK1K26J74K4J60j03j64j26k27%l7J37J67
$$ -191 -37 137 285 322 262 128 -94 -210 -254 -260 -239 -13 161 185 345 242 78 -48 -275 -275 -312 -175 -8
1816hJ71R7M6m9j63j12j81n1o7P6J88J64J06R5n7j43j68j15j16l3J03J82J31J38
$$ -8 163 260 306 257 94 -18 -199 -250 -317 -241 -53 111 217 312 255 112 -56 -171 -287 -320 -217 -35 96 234
1840B34P3k4j08j96j10j72L0R1R6J87J11Q3n3r0j83j34p0p0J21Q1J87J64J4J5
$$ 234 307 283 175 -21 -131 -303 -273 -182 -86 101 212 295 242 152 -31 -165 -235 -305 -184 -103 84 248 262 277
1864B77k9k51j17j11m9M3J54J43J39Q7mj06j87j26j33L6k1J10K09J52Q8Op3k10
$$ 277 248 -3 -120 -231 -280 -237 -83 60 199 286 282 176 -11 -137 -270 -234 -255 -145 64 216 304 310 237 27
1888B7j89p4m5J4J37J20J60J21j5n3j31j61j80k6M5J01J46J90J24j7n4j75j48
$$ 27 -162 -236 -281 -267 -130 -10 150 271 256 203 72 -89 -269 -295 -250 -149 -3 187 311 294 240 65 -83
1911h3j55J3j7J28J66J13O7M8k7j50j58j23j26L7J03J07K39R4J4p0j18j98r8p9
$$ -83 -238 -225 -242 -114 52 165 232 280 253 103 -55 -178 -304 -267 -164 -57 182 276 290 220 102 -96 -194 -273
1935b73k2O2K00J42J11J06p0j01k55j26qo1J50J11J92J81o3Jj60j71r3r1l7R1
$$ -273 -295 -233 -33 109 220 326 256 155 -100 -226 -234 -295 -145 -34 158 339 276 277 117 -54 -147 -238 -275 -184
1959a84R5K26J02M8l3r1k06j41j14K5M6J79J84P5Q0j1j19j14k07j03o9J14J16
$$ -184 -89 137 239 287 254 163 -43 -184 -298 -273 -227 -48 136 211 291 280 161 47 -160 -263 -332 -218 -102
1982a02J63J59M1N0j11j99j63r2j2K9J31J80J15J24j9p6j77j93j00l1N5O9K06
$$ -102 61 220 261 311 200 1 -162 -254 -266 -237 -106 74 189 313 294 218 41 -152 -252 -283 -228 -159 47
2005D7J29J10L8j31j39j75q6o9L2J41Q3K20K6R4j36j20j62j86kL9Q6J55J97J16
$$ 47 176 286 324 193 54 -121 -207 -276 -244 -103 -20 200 226 320 184 64 -98 -284 -286 -247 -161 -6 191 307
2029C07lp0j67j44j45n2J7J10J05J80J51K6r8p3k11j58r5K3J04J89J58P6N2n0
$$ 307 304 234 67 -77 -222 -274 -257 -147 -42 138 289 315 217 144 -67 -225 -320 -297 -193 -4 154 230 282 232
2053B32j19j89q3j10q6J86J27J52R9R0Lj42j12k95k5o1J63J05J40J62N3j00k9
$$ 232 113 -76 -159 -269 -355 -169 -42 110 209 299 302 160 48 -247 -272 -333 -170 -65 75 237 290 190 161
2076A61j79r8j56j1M7J79Q9K11N7m1p9j70j64j24j7J35P3K00P3J09n8o6j68j56
$$ 161 -18 -116 -272 -283 -236 -57 32 243 300 259 180 10 -154 -278 -295 -160 -87 113 186 295 237 171 3 -153
2100a53p6n0M7N9K18J66L5M7j27j68j62q4l7N7J21J17J78N7%q1p4j98j30o1m5
$$ -153 -229 -279 -232 -173 45 211 246 293 166 -2 -164 -248 -285 -228 -107 10 188 245 245 164 90 -108 -238 -299 -344
2125c44J75J93J13J33%r8j29j30j62K7K4M1J33J43N9Q6k9j69j36j53o3L9Q9J62
$$ -344 -169 24 137 270 270 172 43 -87 -249 -222 -198 -157 -24 119 178 264 235 66 -70 -223 -286 -247 -158 4
2149DJ02J12O5k9k12r2j77j7k5O1J83J29J41N2n9j31j81r8j19M2J10Q0J61J15
$$ 4 106 218 283 254 42 -50 -227 -244 -269 -208 -25 104 245 297 238 107 -74 -172 -291 -249 -139 -59 102 217
2173B17M5j04o1r6j71j7o8J21J21R7J69j1j1j37j28j20r7m1J10J04J03J86K7n5
$$ 217 262 158 97 1 -170 -187 -255 -134 -13 84 253 242 231 94 -34 -154 -251 -292 -182 -78 25 211 238 183
2197A83l1j66p3j40k1M5J54J07J78P7m1j37j71q0n1n0MJ18J67J25L6m0n8j02j56
$$ 183 152 -14 -87 -227 -248 -203 -49 58 236 313 272 135 -36 -116 -167 -217 -213 -95 72 197 233 193 135 33 -123
2222a23p7n3M3Q4J94Q6O1O4j64q9r5j65m7N1J22J45J33P3P0j37n1k00j16q2J9
$$ -123 -200 -253 -210 -126 68 154 215 279 115 26 -69 -234 -281 -230 -108 37 170 243 313 176 125 -75 -191 -273 -254
2247b54J44J33J06Q4Q0j35j13j29j35o2qJ38J25J50J21Nl8j02j55j19j18L1R8
$$ -254 -110 23 129 213 293 158 45 -84 -219 -281 -289 -151 -26 124 245 250 212 110 -45 -164 -282 -251 -153
2270a53J51J38Q1L8m2n3j77j25j30J0Q8J22J63J54Mjj51j64j30j14L7Q3J44Q7
$$ -153 -2 136 217 255 213 160 -17 -142 -272 -262 -174 -52 111 265 269 268 117 -47 -177 -291 -254 -171 -27 60
2294F0J43N1p3o9j29j11p6m6Q9J11J38J38%Jq1j86j26m4k8O9J15J40R2P4k3j09
$$ 60 203 254 181 112 -17 -128 -204 -250 -161 -50 88 226 226 227 146 -40 -166 -210 -238 -169 -54 86 178 252 229 120
2320A20o4j72n5k1n4J44J61J13L4L4j06j29j68r2M8L8Q2J64Q0M0O5j15j30j37
$$ 120 56 -116 -171 -192 -246 -102 59 172 206 240 134 5 -163 -255 -207 -169 -87 77 157 197 262 147 17 -120
2344a20o9n7K6J11J22J76M6jn7j32j34j28lL4O8J40Q5J07L4p6q3j96r6p9K8J67
$$ -120 -189 -246 -220 -109 13 189 235 234 177 45 -89 -217 -220 -186 -118 22 107 214 248 172 89 -107 -203 -282 -254 -87
2370h7O4J78Q2Lj12o3j27j25l9RR8O7J66Q1M6l9q3j37j77o2L2J53L4J31J57n2
$$ -87 -23 155 237 240 128 65 -62 -187 -226 -217 -119 -52 114 195 241 202 119 -18 -195 -257 -225 -72 -38 93 250 198
2396A98n7n9q5j73p0lO6R2J51J32K0l7r8r7j15j02j6O4J48J16O0P7o8m3j04j15
$$ 198 141 82 -3 -176 -246 -249 -183 -91 60 192 212 175 77 -20 -135 -237 -253 -189 -41 75 135 212 144 101 -3 -118
2422a18p8k7L6J16N0J97J6Mj29q7j28p6L6OJ00J44P6O5K3r6j43j58l4o5J24M2
$$ -118 -196 -223 -187 -71 -21 176 192 196 67 -20 -148 -224 -188 -182 -82 62 138 203 226 130 -13 -171 -205 -270 -146 -104
2448a04J66P8R0j5j33k0j54p6p9Q3J08J02P1R6Jj15p4j44o8o6O8J34P1R5J09l8
$$ -104 62 140 230 215 82 62 -92 -168 -247 -164 -56 46 117 213 214 99 25 -119 -187 -253 -185 -51 20 115 224 186
2474A86l9j32j38n6o5O2P4J31N8J04K6lj46j55r0o5K9O9J38J21R0n3k6j10o0j27
$$ 186 147 15 -123 -179 -244 -182 -108 23 81 185 211 208 62 -93 -183 -248 -219 -150 -12 109 199 146 120 10 -50 -177
2500a77k2J3R4Q9J25O0J9j24l9j57m5k0L4QJ63P0M3M5n2p1j13p8l3k4R6J12N8
$$ -177 -199 -186 -92 -3 122 182 201 77 38 -119 -164 -184 -150 -142 21 91 134 179 127 56 -57 -135 -168 -192 -96 16 74
2527G4J77l4l0j18j42q0m7oJ07Q5R3R0l3L5r2j01j02l6m1P4N2J66J05l3mj18j47
$$ 74 251 217 187 69 -73 -153 -200 -206 -99 -14 79 169 136 171 79 -22 -124 -160 -201 -127 -75 91 196 163 159 41 -106
2554a06k8r9P5J8J27J13P4nNn9p5j45p9j3K1J59J06L2J02j06o9r4k4j27RM4R8
$$ -106 -134 -233 -158 -140 -13 100 174 169 174 115 40 -105 -184 -197 -176 -17 89 121 223 117 48 -46 -70 -197 -188 -144 -46
2581d6R4J12nL7o2j10j34r7L1J6J36M2J55J2j8q6r3q8p2J8J1P1J27P3L9%q4m4
$$ -46 48 160 155 192 130 20 -114 -211 -180 -164 -28 14 169 181 163 77 -16 -104 -176 -158 -147 -76 51 124 163 163 79 35
2609C5j43o6m3P3O8J35Q1jnn6q1q4o8k4J6Q4Q8J19L9km8j23r7p8j2O5L0J73L1
$$ 35 -108 -174 -217 -144 -76 59 140 139 134 78 -3 -87 -155 -179 -163 -79 9 128 167 165 117 -6 -103 -181 -193 -128 -98 75 106
2638A06M1M1j11l7j30m8n0NQ3Q1J12Q4op1l1j79mp4M1L9J45Q5L0K0j6j12j20j6
$$ 106 147 188 77 40 -90 -138 -188 -183 -100 -19 93 177 171 100 69 -110 -114 -188 -147 -108 37 122 152 172 156 44 -76 -92
2666i2n2j0Q5Q7O0R1M9p1j43k6r9q0L7L6J19J42L3l8K5n4j20o7j04P7J0J25M3
$$ -92 -144 -154 -69 18 78 169 218 147 4 -22 -121 -201 -164 -128 -9 133 166 128 153 99 -21 -88 -192 -115 -105 20 63
2693F3Q6N0r5o6o6j05j5pP6M6R5Q7L1m8j9j35n3p0j8K0J40P6N7N3o3j9j21o7n2
$$ 63 149 199 104 38 -28 -133 -148 -155 -79 -33 62 149 180 132 113 -22 -75 -145 -163 -143 -3 73 130 183 120 101 -20 -87 -139
2722a39k0M7N7J34O4M3k7q1m2j26q8PQ9L3J47P6l9l1j5q3r0p0L5l2Q4J01O0O0
$$ -139 -159 -112 -55 79 143 186 159 78 36 -90 -178 -171 -82 -49 98 174 135 104 89 6 -84 -154 -119 -151 -67 34 94 154
2750A54%n6j20l8j19oQ6L4J21M4N3n4J9j20q4o5j4O0P2M3J04L7K3r6q9o0r7K2
$$ 154 154 98 -22 -60 -179 -185 -99 -65 56 100 153 99 118 -2 -86 -151 -165 -105 -33 10 114 151 174 78 -11 -71 -168 -146
2778a46K1J14L2Q7P3k9o2q7p6m7n1N6K2J19O0Q0k8k0j05o6r8j5L9N7J10N0mP6
$$ -146 -125 -11 21 108 181 152 90 3 -73 -120 -171 -115 -93 26 86 166 138 118 13 -53 -151 -166 -127 -70 40 90 86 162
2806A62o4j1j11j50k4KJ13N9J29K0O9n6r7j30n7j1M6L2R8L2M6j8M9j16n9o8r4
$$ 162 98 87 -24 -174 -198 -196 -83 -24 105 125 194 138 41 -89 -146 -157 -111 -79 19 51 97 79 128 12 -47 -115 -209
2833b09M6N7J38Q7M7Qn8m7j65n9kj0Q6R8N5Q5Rk1p2j08j29K1m8R7J01Q2M2k2K9
$$ -209 -163 -106 32 119 166 174 116 69 -96 -155 -157 -167 -81 17 72 157 166 145 73 -35 -164 -143 -191 -94 7 89 131 109 138
2862A38j12p2n9p1K2J5J27O5J09MMj13j12j21k7QP4J11J25NJ2lo6n4q2r3k0R8
$$ 138 26 -46 -105 -176 -154 -139 -12 53 162 166 170 57 -55 -176 -203 -195 -121 -10 115 120 132 129 63 9 -73 -166 -186 -88
2890h8N0Q7Q3N8j2o8j76q1J7l7L9R4R8P3M0k6n9q3r6j5j06M5J10J03R9M5k2r2
$$ -88 -38 49 132 190 178 110 -66 -147 -130 -167 -128 -34 64 137 177 151 92 9 -87 -102 -208 -163 -53 50 149 194 172 80
2918H0j12n7r2k6J07M2O2R6N4k0Jj01j00n8k6n4J29J18M6R7n6j7j15r5o3l0K4
$$ 80 -32 -89 -181 -207 -100 -58 4 100 154 134 135 34 -66 -124 -150 -204 -75 43 89 186 130 113 -2 -97 -160 -190 -166
2945a66P0Q9J14O6l1qp7j30o6k8L1K3J39P8O7lj04o7r1m9j7QL4M4J30O8N5k5j06
$$ -166 -96 -7 107 173 142 134 57 -73 -139 -167 -136 -113 26 104 171 168 64 -3 -94 -143 -160 -152 -118 -74 56 124 179 154 48
2974D8r0j37k9L6Q5Q6P8M8Q8j04o4q9n6m8N8n0J37R9M3O2n1r4j41p9j7PJ30M1
$$ 48 -42 -179 -208 -172 -87 -1 77 125 213 109 45 -44 -100 -148 -90 -140 -3 96 139 201 150 56 -85 -164 -181 -174 -44 -3
3002cR1M6J9q0lj18l3j07j3P3P9J13P0N4Jj60p9l2j41J07J3Q3N0J24j1J9l2j31
$$ -3 88 134 153 73 70 -48 -81 -188 -201 -128 -49 64 134 188 189 29 -50 -82 -223 -116 -103 -20 30 154 143 162 130 -1
3030an9j07k9L2R1J19J44jk8o1j25o3o5m8Q9O7R5O2Q2j4j04j07q6o0%L0Q0R8J59
$$ -1 -60 -167 -196 -164 -73 46 190 189 161 100 -25 -88 -153 -201 -112 -45 50 112 194 180 76 -31 -117 -177 -177 -147 -67 31 190
3059A90j1pp3j42m8o3j8J0P4J56O1N3Mp5q8j15r0p0R3J08J20J02rj5n7o7m6j11
$$ 190 179 172 99 -43 -91 -154 -172 -162 -88 68 129 182 186 111 23 -92 -182 -252 -159 -51 69 171 162 147 90 23 -23 -134
3087a34n1j0J35PJ67O4M4k1k00q4q6l2O8O8O6J11P0j5k6p6j22l6r0nQ5R5R4R4
$$ -134 -185 -195 -60 -53 114 178 222 201 1 -83 -169 -201 -133 -65 1 112 182 167 141 65 -57 -93 -183 -188 -103 -8 86 180
3115A80O3p2j42j07r3lK8P5R3R0N6N9p3j53l8q4k6JK7J22R9N4M8m0j09r2j31K8
$$ 180 243 171 29 -78 -171 -174 -146 -71 22 112 168 227 154 1 -37 -121 -147 -146 -119 3 102 156 204 164 55 -37 -168 -140
3143a40l5O7P4J39L6P2p7j5j32j17m7qL8J45O9O5L6l4l3j65k7j11K2O4R4Q0M1
$$ -140 -175 -108 -34 105 141 213 136 121 -11 -128 -175 -183 -145 0 69 134 170 136 103 -62 -89 -200 -178 -114 -20 60 101
3170A01R5l5l4j23j18q5K2O1Q7R3M9J09r1Kj35j30Nk7M1L4J56O9N3K0q7j79l4
$$ 101 196 161 127 4 -114 -199 -177 -116 -29 64 113 222 131 133 -2 -132 -127 -154 -113 -79 77 146 199 219 132 -47 -81
3197h1r6l0J20L5R6J13Ror6p1q3r0k0K3R9O3Q9Q2L6n3j42r4j17L6LQ8J17P8M8
$$ -81 -177 -207 -87 -52 44 157 166 160 64 -7 -90 -180 -200 -177 -78 -15 74 156 192 139 -3 -97 -214 -178 -175 -87 30 108 156
3226A56j1j2r5r4j07q0N0J02R5J11N5M9p0j41p3j26n7J05R6L0J05Q1l9j0p3q7
$$ 156 145 133 38 -56 -163 -243 -193 -91 4 115 170 219 149 8 -65 -191 -248 -143 -47 -17 88 169 130 120 47 -40
3252d0m5j17oO5J35O1J87o1l7n2j45o6m9l4J19M2J12L6O8m7p8k6j70m5k0P7P5
$$ -40 -85 -202 -208 -143 -8 53 240 179 142 90 -55 -121 -170 -204 -85 -43 69 105 173 126 48 22 -148 -193 -213 -136 -61
3279f1J36P6L1k4j45l4p9o3K1j1R8N4J40j3L1m0j19r3q9j8K8J63P8O2jL4q0j06
$$ -61 75 151 182 158 13 -21 -100 -163 -142 -153 -55 -1 139 126 157 117 -2 -95 -184 -202 -174 -11 67 129 128 162 82 -24
3307b4n8o6j2L4K0J41R7R1k6j05q7j10q4%M0J08P9Q8K4Pn5q6n9q7r5M3R8J01R0
$$ -24 -82 -148 -160 -126 -106 35 132 223 197 92 5 -105 -189 -189 -149 -41 38 126 150 157 102 16 -43 -130 -225 -182 -84 17 107
3336A07J04rj19j00r6k7k7j9J37J8J69LJ2m9o0j00q8J1l7M1J51R4J4Q9p6j16j03
$$ 107 211 202 83 -17 -113 -140 -167 -186 -49 -31 138 141 153 104 44 -56 -144 -133 -170 -129 22 116 130 219 143 27 -76
3363g6q4JOJ02P0N8J23k8j8j14n5q4j26Q5lJ73R2O3M4j02o5j66J1q4K7J6J22J06
$$ -76 -160 -159 -153 -51 19 77 200 172 154 40 -15 -99 -225 -140 -143 30 122 185 229 127 62 -104 -93 -177 -150 -134 -12 94
3391I4N0P6o4J3k02r3o1nN2J43Q9P9L1Kj55n6j03l8k8N8Q1J02J30J4j9j30m8j06
$$ 94 144 220 156 169 -33 -126 -187 -192 -140 3 92 171 202 204 49 -7 -110 -148 -176 -118 -37 65 195 209 190 60 12 -94
3419i4p1j7O5P8J30L9N0nj13n9j02p7k1N6Q3R8J04P0r9m6m2j63m5n2Q2J17J09
$$ -94 -165 -182 -117 -39 91 130 180 175 62 3 -99 -176 -197 -141 -58 40 144 214 115 69 27 -136 -181 -233 -151 -34 75
3446G5Q5J0j7j9q0j42l3n3J2R7Q4J58N5l0q6j25m2j02m9J03O1Q7P7O1j3m8p2j46
$$ 75 160 170 153 134 54 -88 -121 -174 -162 -65 19 177 232 202 116 -9 -51 -153 -202 -99 -38 49 126 187 174 126 54 -92
3474i2m3m5JQ2L6K20L6j3n9o5j41r7J2LP7R2Q4P7K3k1j06q1q0j00K3N8P8J38N2
$$ -92 -135 -180 -179 -97 -61 159 195 182 123 58 -83 -180 -168 -165 -88 4 88 165 188 167 61 -20 -100 -200 -177 -119 -41 97 149
3503A49N4n8r4j15q3Nj2M1N9J60N8Rl3n8j24j10p7K6L9J29Q7R1L1k3n3j06r5n2
$$ 149 203 145 51 -64 -147 -142 -154 -113 -54 106 164 173 140 82 -42 -152 -229 -203 -164 -35 52 143 174 151 98 -8 -103 -155
3531a55j6L6M9J18J14Q5q1p8r4m2r9j0N4Q5M2R5O5J3l1j17j41m8n9N3J14O5J08
$$ -155 -171 -135 -86 32 146 231 150 72 -22 -64 -163 -173 -119 -34 8 103 168 181 150 33 -108 -156 -215 -162 -48 17 125
3558A25K8L6p3p9j50p2N2K9J07K9R0pK9l5r4o7r4m9L4M7J36J15L9J7m2j39j13
$$ 125 153 189 116 37 -113 -185 -133 -104 3 32 122 115 144 109 15 -52 -146 -195 -161 -114 22 137 176 193 151 12 -101
3585a01o2K9k3O4J22N7P4J2m9r6p2m1r8K4M2J06J06R6m3n9l6j24r1l7Q5PM8N3
$$ -101 -163 -134 -157 -93 29 86 160 172 123 27 -45 -86 -184 -160 -118 -12 94 190 147 88 52 -72 -163 -200 -115 -108 -60 -7
3613gJ23L8m4m1j37n9p3M4K1R4J26O3rro1j15q0m6M5M1K3J08Q6M6J1j11j38j12
$$ -7 116 154 110 69 -68 -127 -200 -156 -135 -41 85 148 139 130 69 -46 -126 -172 -127 -86 -63 45 131 177 188 77 -61 -173
3641a73MjJ4J52O8N9M4m7r4l1m6j27M3nJ17N6Q7O8k8n3p0j58o7mL9Q3J67N7j3
$$ -173 -169 -170 -156 -4 64 123 167 120 26 -5 -51 -178 -135 -140 -23 33 120 188 160 107 37 -121 -188 -192 -153 -70 97 154 141
3670A41Jj01q4m6j20L2K8P3R0J36K3k0q1l8j54m3lP2N4O3Q3OJ9m3n3o7j15o8R8
$$ 141 142 41 -43 -89 -209 -177 -149 -76 14 150 173 153 72 34 -120 -163 -166 -94 -40 23 106 112 131 88 35 -32 -147 -215 -117
3699a17K7P9Q1J12m1n2q2q5r7k4M2J12P7N9K4L3j7j16o0o7q6k1J02J28Q7J00q8
$$ -117 -90 -11 70 182 141 89 7 -78 -175 -199 -157 -45 32 91 115 148 131 15 -45 -112 -198 -219 -117 11 98 198 110
3726A10K0j29q6n6k4M3L6Q4O4Q5K9l0q9j12l0q5L9P7L3R3N4j4k1l5p1q8p3QP8
$$ 110 130 1 -85 -141 -165 -122 -86 -2 62 147 176 146 57 -55 -85 -170 -131 -54 -21 72 126 112 91 56 -15 -103 -176 -168 -90
3755i0M8Q9M5N7Mn8j53Jj69N2R8M4J27M1O8m4j26n0p6k1k0k8J50N2Q6O0l0o6j23
$$ -90 -42 47 92 149 153 95 -58 -57 -226 -174 -76 -32 95 136 204 160 34 -16 -92 -113 -133 -161 -11 41 127 187 157 91 -32
3784c2j27L5o7N9J54K0Q0M4Lo2j33n9p8j9O1R9Q9N6L0N1j01j10r3j6j2N4j6J23
$$ -32 -159 -124 -191 -132 22 42 122 166 169 107 -26 -85 -163 -182 -121 -22 67 123 153 204 103 -7 -100 -116 -128 -74 -90 33
3812C3N4N7m1J1r6q3p6j0J0P1J10OP6Lp5%j16m7j8K0O4P1Q7K1mrp7j26j4n9L0
$$ 33 87 144 103 114 18 -65 -141 -151 -141 -70 40 46 122 125 50 50 -66 -113 -131 -111 -47 24 111 132 128 119 42 -84 -98 -157 -127
3843a27N1R6N1K5N5k6j58j2n1k0l2N2J04N9Q2noj38q3q4MJ8O2Q8P4JO7n2k8r8
$$ -127 -76 20 71 96 151 125 -33 -45 -96 -116 -148 -96 8 67 149 144 138 0 -83 -167 -163 -145 -83 5 79 80 147 95 67 -31
3873c1q5k6lRP4J26O4n2O0l8j21o6m5J0O2J3J10M8K3m3m0q7m5o2MJ4J39N0O8l
$$ -31 -116 -142 -145 -136 -62 64 128 76 136 98 -23 -89 -134 -124 -62 -49 61 109 132 89 49 -38 -83 -145 -141 -127 12 62 130 127
3903A27l1j8r7m9n1l2N7N5P4O5K8no7p7o8kkj7P4J00N2M4l9o1r0o6n5J6J9O5J12
$$ 127 96 78 -19 -68 -119 -151 -94 -39 35 100 128 123 56 -21 -89 -91 -93 -110 -36 64 116 160 121 60 -30 -96 -151 -135 -116 -51 61
3934F1L8Om0P3j18r7j4l8J8O3R8M0O4m3j6j22k1q7M5l6J09QJ21k8jqp4q3m2l7
$$ 61 99 105 65 138 20 -77 -91 -129 -111 -48 50 90 154 111 95 -27 -48 -135 -90 -126 -17 -9 112 84 83 75 1 -82 -124 -161
3964a61J9J23L5J00j5lk3k6j50M4q1mJ15K6J08kK8k3n2j09j12L0J6R6K8R0N6j8
$$ -161 -142 -19 16 116 101 98 75 49 -101 -57 -138 -142 -27 -1 107 105 133 110 58 -51 -163 -133 -117 -21 7 97 153 135
3992A35l9p0j4p3o3M3L2J9Q7N1j5K3p2o9p1o3O3J6R2L8L4PN7j35o3j2p5K5O3L8
$$ 135 96 26 12 -61 -124 -81 -49 -30 57 108 93 116 44 -25 -96 -159 -96 -80 12 50 84 91 148 13 -50 -62 -137 -112 -49 -11
4022a1M8N6L3l8l5n3j02m1OJ05L3L8N3J2J8j03m2n6j7m5J09K0R8N5l8N2j29J4
$$ -11 37 93 126 88 53 0 -102 -143 -137 -32 1 39 92 104 122 19 -23 -79 -96 -141 -32 -12 86 141 103 155 26 40
4050D0r1q0NL1Q0M0K5Q8l1Lj28r8J8l7J9O6Q1J01k7ko7n1o1m6J0L4P4PN4R2n1
$$ 40 -51 -131 -126 -95 -15 25 50 138 107 110 -18 -116 -98 -135 -116 -50 31 132 105 103 36 -15 -76 -122 -112 -78 -4 3 57 149 98
4081I8Nq9o2q0LK6N0J07L3O4o7k6o1p5j2Kl2M9R5J1N1k5L4j02m8n6J8K3N2j2P9
$$ 98 103 14 -48 -128 -125 -99 -49 58 91 155 88 62 1 -74 -86 -84 -116 -67 28 39 90 65 99 -3 -51 -107 -89 -66 -14 -26 53
4112E3N0L6o9n2m8o1j2j5P9P1J6O6rk8o5n7n7j9K0M2J01kP3Ro2l4n5n7j2K9J3
$$ 53 103 139 70 18 -30 -91 -103 -118 -39 32 48 114 105 77 12 -45 -102 -121 -101 -59 42 40 113 122 60 26 -29 -86 -98 -69 -56
4143e6Q3K9L5J3m8j8p8r5L2O2qL3O3K8L3k1n7n8k0o0J2L3M2Q5N0K8l6n8j00l8
$$ -56 27 56 91 104 56 38 -40 -135 -103 -41 -49 -16 47 75 108 87 30 -28 -48 -108 -96 -63 -21 64 114 142 106 48 -52 -90
4173i0j3qK7N5K4R4L5ko6o9q8J5l1M1Q4L6M6J1J7r6l6k3p6O4l0Q3RJ6J06l3o8
$$ -90 -103 -111 -84 -29 -5 89 124 122 56 -13 -101 -86 -117 -76 8 44 90 101 118 22 -14 -37 -113 -49 -79 4 13 29 135 102 34
4204C4m2j0j27J3PJ16N7jJ25j38Om5l9o8oK2L5P4Q1K0j6po0j14k2j4L2R8L6N0
$$ 34 -8 -18 -145 -132 -125 -9 48 47 172 34 40 -5 -44 -112 -118 -96 -61 13 94 114 98 91 31 -83 -105 -119 -87 11 47 97
4234I7N8n8m3k9l0p9Mk5R0L4P4M7k2m0r5n0l2l7J02pO5R7J5m3k8k7j15K0o9K7
$$ 97 155 97 54 25 -5 -84 -80 -105 -15 19 93 140 118 78 -17 -67 -99 -136 -34 -41 24 121 136 93 65 38 -77 -57 -126 -99
4264i9N9R9J7N3j0m9o2o3l5qj6O0R7j7O6j8Qq6l9l3r4M8N3O2J0P9J5q8k2k8o0
$$ -99 -40 59 76 129 119 70 8 -55 -90 -98 -114 -54 43 26 92 74 82 -4 -43 -76 -170 -122 -69 -7 3 82 97 9 -13 -41 -101
4295a01J4j5P0M3L3L9kK0o1n8o6p0QP6N5L8J06m3ro2n1o8m1O1J0J8R8QO9l5n5
$$ -101 -87 -102 -32 11 44 83 81 101 40 -18 -84 -154 -146 -70 -15 23 129 86 77 15 -36 -104 -145 -84 -74 -56 42 50 119 84 29
4326B9n0o2o5JN3P9L1Q2k5k9j9l4o4l8k9N0M7J14K3Ok4o9m6k2j13R5L6N3N2j1
$$ 29 -21 -83 -148 -147 -94 -15 16 98 73 44 25 -9 -73 -111 -140 -90 -43 71 94 100 76 7 -39 -61 -174 -79 -43 10 62 51
4356E1L9j7n9n1Lp2l0N0lN7P4N5J2o2j18l5K1p9J01J8L9M4L4K3n4k0o4m7k3l4
$$ 51 90 73 14 -37 -34 -106 -136 -86 -89 -32 42 97 109 47 -71 -106 -85 -164 -63 -45 -6 38 72 95 41 21 -43 -90 -113 -147
4386a47J09j6J57J1J8m3j08p8J2rJ8P0J6L2K1L5k5l6q5j5l1ML6L3J16K1l8l4n3
$$ -147 -38 -54 103 114 132 89 -19 -97 -85 -94 -76 -6 10 42 63 98 73 37 -48 -63 -94 -90 -54 -21 95 116 78 44 -9
4415io4lj8J8L7K9N8K9N5n7p7j5n2n4M9M9L6R0Mm7K9n5l9p0l1%O7j3R1M2N5o5
$$ -9 -73 -76 -94 -76 -39 -10 48 77 132 75 -2 -17 -69 -123 -74 -25 11 101 105 58 87 32 -7 -77 -108 -108 -41 -54 37 79 134 69
4447F9n2l1j09N9q1Q2P6O9M9j9n7j3m3q8m4L7M4K5Q5L1J0p1K3j06k1m0K8J0R8
$$ 69 17 -14 -123 -64 -145 -63 13 82 131 112 55 42 -1 -89 -133 -96 -52 -27 58 89 99 28 51 -55 -76 -116 -88 -78 20
4476B0KO3K5j5m2n3j14NMK8L8K5J11K9j4j06k9q0L4l8P0J5M6M9k8O3m7r5m7Nk0
$$ 20 22 85 110 95 53 0 -114 -109 -105 -77 -39 -14 97 126 112 6 -23 -103 -69 -107 -37 -22 24 73 45 108 61 -34 -81 -76 -96
4507i6J3M7J2R8P1m1oj03p9L0k2N1JL4O1nL0j2r7l9m2J2PO6M4L4N3l0m3m8o4o
$$ -96 -83 -36 -24 74 145 104 98 -5 -84 -54 -76 -25 -24 10 71 66 96 84 -13 -52 -94 -82 -75 -9 35 69 122 92 49 1 -63 -69
4539f9l9k9J06Q2O1m4K8Jj05rp1n1N6P8N2K7K3Lk5l5o8n9NL5nP3K6RN4l1n5o5
$$ -69 -108 -137 -31 51 112 68 96 97 -8 -17 -88 -139 -83 -5 47 74 97 100 75 40 -28 -87 -82 -47 -52 21 47 56 110 79 24 -41
4571d1l0n4J5N2M1R6J8l0mk4n0p8QK7K4J6J55j2j6k1p2r5%m5l2J20M8%M4O7m8
$$ -41 -71 -125 -110 -58 -17 79 97 67 63 39 -11 -89 -81 -54 -30 -14 141 129 113 92 20 -75 -75 -120 -152 -32 16 16 60 127 79
4602G9m7Jo6l5JL2RJ19J1J4m6k5k6r2k3L0J1j5J32J3K4Mm2o6nj10N9oN2L0N2O8
$$ 79 32 33 -33 -68 -67 -35 -26 93 104 118 72 47 21 -71 -94 -64 -53 -68 64 77 101 105 63 -3 -8 -118 -59 -65 -13 17 69 137
4634A37q3Ko3rk8%k2J8M7L4M6M9n0q2m4j8m9P4JJ11N7l0M4j00n8l7l2k5M2RO2
$$ 137 54 56 -7 -16 -44 -44 -66 -48 -1 33 79 128 78 -4 -48 -66 -115 -41 -40 71 128 98 142 42 -16 -53 -85 -110 -68 -59 3
4665CK9Q5J9q5l1m3m5m4N0M1P5m1O8J0o2L3q4m9m1L7L5L0Q6O1m4j8l1q2m1k1K1
$$ 3 32 117 136 51 20 -23 -68 -112 -62 -21 54 13 81 91 29 62 -22 -71 -112 -75 -40 -10 76 137 93 75 44 -38 -79 -100 -79
4696g9O0N5l2J11k9l4j7n6r7O3j5m3J08O6PN2k5m2j01n1j2L4N3L4J5L7N3l6p5
$$ -79 -19 36 4 115 86 52 35 -21 -118 -55 -70 -113 -5 61 68 120 95 53 -48 -99 -111 -77 -24 10 25 62 115 79 4
4725Dl2po5K6K4k9J13N3k1M7r4n9k0J4n0L5N2M0L1L3j4n1m7n2k4j3M1M4O8P3k
$$ 4 -28 -35 -100 -74 -50 -79 34 87 66 113 19 -40 -60 -46 -96 -61 -9 31 62 95 81 30 -17 -69 -93 -106 -65 -21 47 120 118
4756A18o4Jo4o5m9J3M3K8N5L8Q8Jr8k6q6n8PO8M4M0OO2Qo0k4q0m3J0l5O5N9P1
$$ 118 54 55 -9 -74 -123 -110 -67 -39 16 54 142 143 45 19 -67 -125 -118 -50 -6 34 40 102 110 50 26 -54 -97 -87 -122 -57 2 73
4788G3rO9l8j18o5l9L1JL3R7L1L8n6k9nq6j7m9O7L1K6Q8O1k7nj03k9o9J9J0O1
$$ 73 64 133 95 -23 -88 -127 -96 -95 -62 35 66 104 48 19 14 -72 -89 -138 -71 -40 -14 74 135 108 103 0 -29 -98 -79 -69 -8
4819hJ7O4J6J3J2o2o1o1J1l8N4PR1N0Ok5o7o1o6J3kQ9L4oO9ooMr9l9p4J7M8L2
$$ -8 9 73 89 102 114 52 -9 -70 -59 -97 -43 -36 55 105 111 86 19 -42 -108 -95 -97 -8 26 20 89 83 77 81 -18 -57 -131 -114 -66 -34
4853c4N7J00J8m5r3j4o7n3M4L4N0N3L1N3n4m3m0o2k9k2L4O9L8P5KKlj14l8n1K5
$$ -34 23 123 141 96 3 -11 -78 -131 -87 -53 -3 50 81 134 80 37 -3 -65 -94 -116 -82 -13 25 100 102 104 101 -13 -51 -102 -77
4884g7N9NlJ15Ml7k3j9q5l2qJ3K9J29J5NNL8j34l0o1j9J9L6K8O2J17q5M5p5o3
$$ -77 -18 -13 -16 99 103 66 43 24 -61 -93 -101 -88 -59 70 85 90 95 133 -1 -31 -92 -111 -92 -56 -28 34 151 66 111 36 -27
4915b7p0qM6NQ5L4lL0j5j9j53MLMO7M9L9L2M3q4k2j06k1OMO1pJ01K2l7J8p0j3
$$ -27 -97 -105 -59 -54 31 65 62 92 77 58 -95 -91 -88 -84 -17 32 71 103 146 62 40 -66 -87 -81 -77 -16 -23 78 100 63 81 11 -2
4948bl2q6L1M6M4M8M0j1rLj22l4k8j0P2K7Q8K4k6Q5j25r8%l3l9P2J11L5P6r2K4
$$ -2 -34 -120 -89 -43 1 49 89 78 69 72 -50 -84 -112 -122 -50 -23 65 89 63 148 23 -75 -75 -108 -147 -75 36 71 147 55 79
4979G9q6Po6k6K9n0J31M4k3O9n0nm4r3k3j3K7Q9N9M7%o4mp6l0qK6l1K4L2J08K0
$$ 79 -7 0 -66 -92 -63 -113 18 62 39 108 58 53 9 -84 -107 -120 -93 -4 55 102 102 38 34 -42 -72 -80 -54 -85 -61 -29 79 99
5011I9j6q8kl3o3j0O2K2L7N2KKn4j4o3j0n3P1J9N8J6P3o2qo4Mk5n0M7L3M6L7L2
$$ 99 83 -5 -7 -40 -103 -113 -51 -29 8 60 62 64 10 -4 -67 -77 -130 -59 -40 18 34 107 45 37 -27 -23 -48 -98 -51 -18 28 65 97
5044I7j9l2%j08m6K1l7P9N7J5P7l5Qj08j3k8qk5N1O6M9Rql8L8j00j7m8k8N8J19
$$ 97 78 46 46 -62 -108 -87 -124 -45 12 27 104 69 77 -31 -44 -72 -80 -105 -54 12 61 70 62 24 62 -38 -55 -103 -131 -73 46
5075D6oM3K4q1M9r7o1jK1j1P6R1jOo6j2oj12k0K6J3O5P7N7l1l7l2o0lo5L3m2J35
$$ 46 40 83 107 26 75 -22 -83 -84 -63 -74 2 93 92 98 32 20 14 -98 -118 -92 -79 -14 63 120 89 52 20 -40 -43 -108 -75 -117 18
5108A8K5RL2l3K0j06J1q3L3NN9O3J4J8l6j7p4J9r4M5j5Q1N1P1J7l3j1j00m4m9
$$ 18 43 52 84 51 71 -35 -24 -107 -74 -69 -10 53 67 85 49 32 -42 -23 -117 -72 -87 -6 45 116 133 100 89 -11 -55 -104
5138a04oJ2R9P5L7j2l2jj21K2n1m2RP4O5K3P8m7J3j11l0k6j2nP9K7L0L5L2o9k6
$$ -104 -110 -98 1 76 113 101 69 68 -53 -31 -82 -124 -115 -41 24 47 125 78 91 -20 -50 -76 -88 -93 -14 13 43 78 110 41 15
5169A5o9j2j0k1J03OJ08q8O7qj14l3K4j4m2L6N4J01%J9m6l6p4qq3K7O2N3P9jj1
$$ 15 -54 -66 -76 -97 6 12 120 32 99 91 -23 -56 -32 -46 -88 -52 2 103 103 122 76 40 -34 -42 -125 -98 -36 17 96 95 84
5200H4j5n1n9l9J0k6O3K1O7Q4m4k0j13J8k5m4n1O5P8L4M2qK0p4l5kp6J7N0j2O0
$$ 84 69 18 -41 -80 -70 -96 -33 -12 55 139 95 75 -38 -20 -45 -89 -140 -75 3 37 79 71 91 17 -18 -20 -96 -79 -29 -41 19
5231A9R0j4ml7j08k5m3N6j5P2J2Q6n1J0K3o3l5m9J4k2M2O3Q2J9p0m3J3m4p8K3
$$ 19 109 95 91 54 -54 -79 -122 -66 -81 -9 3 89 38 48 71 8 -27 -76 -62 -84 -42 21 103 122 52 9 22 -22 -100 -77
5261g7LO4O2pO2k9l0m6m8Kk7oN7P9pN2k0j0n5n9jj2J6J0N5P0Om7nk2l4r1jJ7M5
$$ -77 -74 -10 52 45 107 78 48 2 -46 -44 -71 -77 -20 59 52 104 84 74 19 -40 -41 -53 -37 -27 28 98 104 57 52 30 -4 -95 -96 -79 -34
5296c4M3O6%K9l9l1m1l5o2M0N9qN8P9k9j6o6j5m3j9j0M4J1Q5J5lJ2n8n5j3n4P
$$ -34 9 75 75 104 65 34 -7 -42 -104 -64 -5 -13 45 124 95 79 13 -2 -45 -64 -74 -30 -19 66 81 78 90 32 -23 -36 -90 -83
5328h3N4K2R8L5n2M3n3q2l5Rl8J4J07M3l9N2k2p4l6M5o9J5%L2J6N6J4J6n9m4n0
$$ -83 -29 -7 91 126 74 117 64 -18 -53 -44 -82 -68 39 82 43 95 73 -1 -37 8 -61 -46 -46 -14 2 58 72 88 29 -15 -65
5359f5qj1%O4M0P8Kl1j8l0r2J0PK0J1JP2N6J4r6j9n1pj1J3N4N2q%L3o1k4l0p4
$$ -65 -73 -84 -84 -20 20 98 100 69 51 21 -71 -61 -54 -34 -23 -22 50 106 120 24 5 -46 -53 -64 -51 3 55 47 47 80 19 -5 -35 -109
5393a09P2PrQ7rN1J1p8k8n9l9J2J8Q6L3K2K8m1Pl1o4n0j5L1K1O5L9K2Kk6l0m9
$$ -109 -37 -30 -39 48 39 90 101 23 -5 -64 -103 -91 -73 13 46 68 96 55 62 31 -33 -83 -98 -67 -46 19 58 80 82 56 26 -23
5425b3l4o7J15m8N9M3M1K0n0n7l3Mo8J6Q2m9R7M1l1J8o6k6o8K5j1MN4J4P7k3K1
$$ -23 -57 -124 -9 -57 2 45 86 106 56 -1 -34 -30 -98 -82 0 -49 48 89 58 76 10 -16 -84 -59 -70 -66 -12 2 79 56 77
5456G7j07K7q6k2K3L1O8J5O5k8l6j8l2q3O3l9M2K3L4L3N5m3k3l8l3m0j4K7O6N7
$$ 77 -30 -3 -89 -111 -88 -57 11 26 91 63 27 9 -23 -106 -43 -82 -40 -17 17 50 105 62 39 1 -32 -72 -86 -59 7 64
5486F4k4L8rn7J6o9m6K6M2J6K1R4m7j8Nq7m1J3M3J3M5pM6%l0k5j7o0l2p5O5P1
$$ 64 40 78 69 12 28 -41 -87 -61 -19 -3 18 112 65 47 52 -35 -76 -63 -20 -7 38 31 77 77 47 22 5 -55 -87 -162 -97 -26
5518b6M3K6j8N5o2m1k1pl5M6k0K7R3j3o4O5o9j7l3j7J3J4R3M6oj1L4r5l1n0mL5
$$ -26 17 43 25 80 18 -23 -44 -51 -86 -40 -60 -33 60 47 -17 48 -21 -38 -71 -88 -75 -61 32 78 72 61 95 0 -31 -81 -85 -50
5550e0mP1LL0M9l0o4Or8j6K6KN7O9kK6n3J2q0j6kOmL2K6N6L3n5kp7J2l5j8N5P7
$$ -50 -54 17 20 50 99 69 5 11 -87 -103 -77 -75 -18 51 49 75 22 34 -46 -62 -64 -58 -62 -30 -4 52 85 30 28 -49 -37 -72 -90 -35 42
5585D2qK1K7k8n2k9l1pj9P6mk2J00jk8Kn5n8l6M6K1J3O9K0Rl1ol0n2m1J9K1N0
$$ 42 34 55 82 54 2 -27 -58 -65 -84 -8 -12 -34 66 65 37 39 -16 -74 -110 -64 -43 -30 39 59 68 37 31 1 -51 -92 -73 -52 -2
5618bK9O1J7q2Ll9q7%K5L9J1M1K3N6m3Om7n6Qm3N1L2L1N5n4Nm9Jk8m7OM2PM4M8
$$ -2 27 88 105 23 26 -13 -100 -100 -75 -36 -25 16 39 95 52 58 11 -45 -37 -80 -29 3 34 89 35 40 -9 -8 -36 -83 -77 -35 -28 16 64
5653F4J0rJ4p0o8k8Mj6N0Q6L5pk8l5l2j6rqK5pO9oP6o2k9L3n3l9n3L6K1J25K0
$$ 64 74 65 79 9 -59 -87 -83 -99 -49 37 72 65 37 2 -30 -46 -55 -63 -38 -45 24 18 94 32 3 36 -17 -56 -109 -73 -52 73 93
5686I3l8L0j6r5j7j2k5K4j6N9M8J9NQj03k4L1q0R6l1P6J0M2m7K4n5nl5j3J7m1
$$ 93 55 85 69 -26 -43 -55 -80 -56 -72 -13 35 54 59 67 -36 -60 -29 -109 -13 -44 32 42 84 37 61 6 1 -34 -47 -30 -71
5717g1N9J03n1J4L3m7m3q3RkO8J9K7lM0K7r6jl7k2J8J4M9L3Nj9J9r0J3j9l1nj0
$$ -71 -12 91 40 54 87 40 -3 -86 -77 -79 -11 8 35 32 72 99 3 2 -35 -57 -39 -25 24 57 62 43 62 -28 -15 -34 -65 -70 -80
5750h0O5P9%j1ok7L0j19pJ1M4j8J07m5L7MOr9j8J0LnM3N3l2L7Pq0K3n1n5J2K4
$$ -80 -15 64 64 53 47 20 50 -69 -76 -65 -21 -39 68 23 60 64 70 -29 -47 -37 -34 -39 4 57 25 62 69 -11 12 -39 -94 -82 -58
5783e8L0O7K8jj3n7rj6K4m8QN8j3P2k6N4j5j09J9o8J5n1O5O2J5RKKm4m0J5k0K4
$$ -58 -28 39 67 66 53 -4 -13 -29 -5 -53 -45 13 0 72 46 100 85 -24 -5 -73 -58 -109 -44 18 33 42 44 46 2 -38 -23 -43 -19
5816a9k8N4N3KJ5qj2p2l6K1k4mP6M3n2L6l9K8k1m6j2l2qR4M4J4M4r1k1m8j6j8
$$ -19 -47 7 60 62 77 69 57 -15 -51 -30 -54 -58 18 61 9 45 6 34 13 -33 -45 -77 -85 9 53 67 111 20 -1 -49 -65 -83
5848h3M5j6L4Q2n5K4J4ln5j4Rn0L1RO3K6Rk3j3j21J2M1n3Q6k3O4Q0o8l5Rn8om2
$$ -83 -38 -54 -20 62 7 31 45 42 -13 -27 -18 -68 -37 -28 35 61 70 47 34 -87 -75 -34 -87 -1 -24 40 120 52 17 26 -32 -38 -80
5881h0QL5K3k4J00J7j4k0q5j5l2LmR1lQP4j7l8q0pLl8L9MJ24Om3j2J2n5o4P2m0
$$ -80 -72 -37 -14 -38 62 79 65 45 -40 -55 -87 -84 -88 3 0 8 82 65 27 -53 -60 -57 -95 -56 -52 72 78 35 23 35 -20 -84 -12 -52
5915e2K4%O3O8n7K5k5Jq7n4L3k7J5J01K3j4J3ql9o2j2j8LQ2j5R2qM2j6r3m0ll1
$$ -52 -28 -28 35 103 46 71 46 47 -40 -94 -61 -88 -73 28 51 37 50 42 3 -59 -71 -89 -86 -4 -19 73 65 107 91 -2 -42 -45 -76
5948g6K8P9J1J9j1k2k0J0l6L2l9k0J6K6M3J1n7P6m3m1m0k9J2M8N4Q0nm1pmn9r
$$ -76 -48 31 42 61 50 28 8 18 -18 14 -25 -45 -29 -3 40 51 -6 70 27 -14 -54 -83 -71 -23 31 111 106 65 58 54 -5 -14
5980a4l5oL3L4Q5l7kJ4o8p2PN8k7K9MN4k1O5m5k9l0k2o2k0N9O5L6J4k3L6q4k7
$$ -14 -49 -55 -22 12 97 60 58 72 4 -68 -61 -3 -30 -1 3 57 36 101 56 27 -3 -25 -87 -107 -48 17 53 67 44 80 -4 -31
6012c1k2J4nL1pM3K7JN5j8j05m0k0JN8J6M8K8jk3j0j03Rl0J4L5J3K4N4J7l6Qk9
$$ -31 -53 -39 -44 -13 -20 23 50 51 106 88 -17 -57 -77 -76 -18 -2 46 74 73 50 40 -63 -54 -84 -70 -35 -22 2 56 73 37 45 16
6045A6r4M5p3Q4O5j3oN3k4l3n1mn1QK2K4K8O6j5L0p0m6k9J1k0P6qJ6M5m2L7k3
$$ 16 -78 -33 -106 -22 43 30 24 77 53 20 -31 -35 -86 -78 -56 -32 -4 62 47 77 7 -39 -68 -57 -77 -1 -9 7 52 10 47 24
6077B4m1k9j1L3l9P2K2K4RQmq0l3j9K1j0L8O1K9km1pkk6k5n1PM9M7j5Q0j8l9j2
$$ 24 -17 -46 -57 -24 -63 9 31 55 64 72 68 -12 -45 -64 -43 -53 -15 46 75 73 32 25 23 -3 -28 -79 -72 -23 24 9 89 71 32 20
6111B0n9%mlN5l8N1Q6l6k0k7k6l1j0l9N6M8oN3k6m1k0J6m7KNJ4K5N1l0O6m7On1
$$ 20 -39 -39 -43 -46 9 -29 22 108 72 52 25 -1 -32 -42 -81 -25 23 17 70 44 3 -17 -1 -48 -46 -41 -27 -2 49 19 85 38 44 -7
6145gk0m0LL0L3L9M4l3j0j5p6m0J4NP0PQQL1kl4K0o3l4lL0J6j8J02Jo8L5%o8k4
$$ -7 -27 -67 -64 -34 -1 38 82 49 39 24 -52 -92 -78 -73 -3 4 12 20 51 49 15 35 -28 -62 -65 -35 -19 -37 65 66 -2 33 33 -35 -59
6180e9m3L9J0Q3j0M1oq8J1n2NJ5K7K0M8J7m0N3o2j4l7Ml2j0OQ3N0M8j6o7n5k1
$$ -59 -102 -63 -53 30 20 61 55 -33 -22 -74 -69 -54 -27 -7 41 58 18 71 9 -5 -42 -38 -70 -80 -74 9 59 107 91 24 -31 -52
6212e2l9O4j9M0L0K2K7Ql8po6Km7k7M5O2k1O7l4J7j1p0O1p3j7L0N6J2j3N2k9k6
$$ -52 -91 -27 -46 -6 24 46 73 81 43 36 -30 -28 -75 -102 -57 5 -16 51 17 34 23 -47 14 -59 -76 -46 10 22 9 61 32 6
6244Fp8j8j0M6MQ8l6P7m1nn7K4o8k4K3M3K1L2L0K0Qj11J4n8j1k9R8l1Q4J9Kn8
$$ 6 -72 -90 -100 -54 -50 38 2 79 38 33 -24 0 -68 -92 -69 -26 -5 27 57 77 85 -26 -12 -70 -81 -110 -12 -43 41 60 62 4
6276Djom0o7Q0j1L9J8OK0L6o8nn7l2J9M6K1K6J1J0o0k2Rl9L2n5K4lN5L6N4n7J
$$ 4 3 -3 -43 -110 -30 -41 -2 16 22 42 78 10 5 -52 -84 -65 -19 2 28 39 49 -11 -33 -24 -63 -31 -86 -62 -65 -10 26 80 23 24
6310B4l5k7j2j6K6M3k2Q7jl0J9n5o4j9jL1K5L9O2l7k0J0j4p3k4J6N8k2L2J14j06
$$ 24 -11 -38 -50 -66 -40 3 -19 68 67 37 56 1 -63 -82 -83 -52 -27 12 74 37 17 27 13 -60 -84 -68 -10 -32 0 114 8
6341HO9k0o3p0M4l6L1O1L9j9L2np9j6Or4P0qN0l2R1l0M5k1m5Kr5N7j8L0J5M0L7
$$ 8 77 57 -6 -76 -32 -68 -37 24 63 44 76 71 -8 -24 -18 -112 -42 -50 0 -32 59 29 74 53 8 10 -85 -28 -46 -16 -1 39 76
6374G6jo8J8p3K6l7NN3J2L6jR0r4Oj10M2l0m4P9N0pJ6%M3n4k8n9M6k3j8P4K5J9
$$ 76 75 7 25 -48 -22 -59 -54 -1 11 47 46 136 42 48 -62 -20 -50 -94 -15 35 28 44 44 87 33 5 -54 -8 -31 -49 25 50 69
6407F9Mm2j6n2oj5l6Q6J2MM1M4o3rqj3n7qK6L5O3k6N5k2m0n7J5p2N2%L3M7oN3
$$ 69 73 31 15 -37 -43 -58 -94 -8 4 8 49 93 30 21 13 0 -57 -65 -39 -4 59 33 88 66 26 -31 -16 -88 -36 -36 -3 44 38 91
6441I1mp2k3nn4K9L2J2JmJ07r0K1qq1k0J4K5m9J15K9K4k8ll4m0l0k8K2RJ9R1J2
$$ 91 87 15 -8 -13 -67 -38 -6 6 7 3 110 20 41 33 -48 -68 -54 -29 -78 37 66 90 62 59 25 -15 -45 -73 -51 -42 -23 68 80
6474H0J6Pj31Mm4L8j7M1J3L4L9k9K3p2l4m8K1N1QR0k9M0l2m1l3k3m0K1qM6J1P0
$$ 80 96 103 -28 -24 -68 -30 -47 -6 7 41 80 51 74 2 -32 -80 -59 -8 0 90 61 101 69 28 -5 -28 -68 -47 -55 -9 2 72
6506G2m5J4m0L7o9knk5K5J2O2N3k0l2k4n3nk2J0J8M7MN6J8n7Jon0p7N7M3koN6
$$ 72 27 41 1 38 -31 -33 -38 -63 -38 -26 36 89 69 37 13 -40 -45 -67 -57 -39 8 12 68 86 29 30 24 -26 -103 -46 -3 -5 -11 45
6540D5J4Km8%l6Kk6L9K9j8R1Lm3k4m9Nn7K2J5L8MM6M9l1k5o8j7k1M7j1lP7k6P0
$$ 45 59 61 13 13 -23 -21 -47 -8 21 3 94 97 54 30 -19 -14 -71 -49 -34 4 8 54 103 72 47 -21 -38 -59 -12 -23 -26 51 25 95
6574I5m5m3Qm2m2M2j2K9K2K7M2m5j7l9om3j5RO0M1L8K8J3p9j1l4k6jk3K5O7O9
$$ 95 50 7 15 -27 -69 -27 -39 -10 12 39 81 36 19 -20 -26 -69 -84 -75 -15 26 64 92 105 26 15 -19 -45 -46 -69 -44 23 92
6606I2nk2o3k0K3r7J5K7M9K3O0k6jo7Oj0j8k3J1L9L6L7JJ9n9Oo1l2L6L1k0K0J3
$$ 92 87 65 2 -18 5 -92 -77 -50 -1 22 82 56 55 -12 -6 -16 -34 -57 -46 -7 29 66 67 86 27 33 -28 -60 -24 7 -13 7 20
6639B0O4l5n2j7Oj9m8K2L3N6JL4j6K6n8no4l9M6JJ2N3K3k1K6l2p1L6m0m2M6j4
$$ 20 84 49 -3 -20 -14 -33 -81 -59 -26 30 31 65 49 75 17 12 -52 -91 -45 -44 -32 21 44 23 49 17 -54 -18 -58 -100 -54 -68
6671f8Q4M0L2m5m9%r3N2J4k1N2M2M6k4jj1p8lm6j3N3L7K2L8J0o4k4J7p6M3q0J8
$$ -68 16 56 88 43 -6 -6 -99 -47 -33 -54 -2 40 86 62 61 50 -28 -31 -77 -90 -37 0 22 60 70 6 -18 -1 -77 -34 -114 -96
6703i6Q0O1L5m5M5m9j9m7m5j4P1K0K4J4J1j3j4%k9k7k9nRJ08k2K3Rn1l5K4m6M4
$$ -96 -16 45 80 35 80 31 12 -35 -80 -94 -23 -3 21 35 46 33 19 19 -10 -37 -66 -71 -62 46 24 47 56 5 -30 -6 -52 -8
6735hl8oN1L3M8l1m8kl5%k8QJ4N8O4oJ4n6l2j1n4L2K1j2L1oK2K1j5%n6prk7j1
$$ -8 -46 -52 -1 32 80 49 1 -1 -36 -36 -64 -56 -42 16 80 74 88 32 0 -11 -65 -33 -12 -24 7 1 23 44 29 29 -27 -34 -43 -70 -81
6770h1J55n5m7L8j0J2m8jL2o3L9rR5k1M6l4l9Jn3l3J5J2K4K7M6L1o2J3p1j2k2
$$ -81 74 19 -28 10 0 12 -36 -37 -5 -68 -29 -38 57 36 82 48 9 10 -43 -76 -61 -49 -25 2 48 79 17 30 -41 -53 -75
6801g5jM4J9J5K7L1jn2m8j0kQL8JJ8J8K2m9j0k5J7l3m8N0L1J2N8LK6m4K0j07k6
$$ -75 -76 -32 -13 2 29 60 59 7 -41 -51 -53 -45 -7 -6 12 30 52 3 -7 -32 -15 -48 -96 -46 -15 -3 55 58 84 40 60 -47 -73
6834g3K1NL7K6L1M6l5l2o4j5KJ9L2j5L8L1K5k1m9k3oo3J3O0k1K5N5K8j4l3o2j1
$$ -73 -52 -47 -10 16 47 93 58 26 -38 -53 -51 -32 0 -15 23 54 79 58 9 -14 -20 -83 -70 -10 -31 -6 49 77 63 30 -32 -43
6866d3ml3O7OK7L5l8L6o4L1j8q6L4NN3pJ5JK5L3o1m7Kl5J3J1M3M7J2k1j2%m3p2
$$ -43 -47 -80 -13 -7 20 55 17 53 -11 20 2 -84 -50 -45 8 1 16 17 42 75 14 -33 -31 -66 -53 -42 1 48 60 39 27 27 -16 -88
6900h8L4K1kL1NJ2LL2r0M6J9j03kO4L2qMJ3Kj4k4m5k3K4JL0O0J1j6k7P2q2o3m
$$ -88 -54 -33 -35 -4 1 13 16 48 -42 4 23 -80 -82 -18 14 6 10 23 25 11 -13 -58 -81 -57 -56 -26 34 45 29 2 74 -8 -71 -75
6934g5L1K7N2K0qK7p4lk2lj6j6L0K5%R4o4Nl0K1l9q4K8N1O6m4j2NJ4J2j6k7m7
$$ -75 -44 -17 35 55 47 74 0 -3 -25 -28 -44 -60 -30 -5 -5 89 25 30 0 21 -18 -102 -74 -23 43 -1 -13 -8 6 18 2 -25 -72
6967g2k1M5JK6K4M3ll7Lm4l8M3l9N7K1nLK8j5mn6n2K4jN2M3m3J10rm9j01Lk5L8
$$ -72 -93 -48 -47 -21 3 46 43 6 9 -35 -73 -30 -69 -12 9 4 7 35 20 16 -40 -92 -68 -69 -17 26 -17 93 84 35 -66 -63 -88 -50
7001e0Lk1P9L7l8k8J6L2j08M4k9K7J2N1N9p0K1m8nk3J6oNN3lM6k0On0M1j25kO
$$ -50 -47 -68 11 48 10 -18 -2 30 -78 -34 -63 -36 -24 27 86 16 37 -11 -16 -39 -23 -29 -24 29 26 72 52 58 8 49 -76 -78 -72
7034g2M5J0L5L6J7%o9Rl0j6PL5k4J4M7%l5J8l4J1k9n7J6N7K5l2N4L2j4o6pj1j3
$$ -72 -27 -17 18 54 71 71 2 11 -19 -35 -28 7 -17 -3 44 44 9 27 -7 4 -25 -82 -66 -9 16 -16 38 70 56 -10 -17 -28 -41
7067d1j3J3M0K9K8k0Qo5J6o9L5Om7J00JM3k3l8j1l%l0k5N8L3L7l4L6n1j0Pk7q0
$$ -41 -54 -41 -1 28 56 36 44 -21 -5 -74 -39 -33 -80 20 21 64 41 3 -8 -11 -11 -41 -66 -8 25 62 28 64 13 3 10 -17 -97
7100i7P4nK6KO1o0L2l4j7L2o7lj1N5OM4P1o7K2r0rol1O5j4L5pK1Ok9L0l8l9k2
$$ -97 -23 -28 -2 0 61 1 33 -1 -18 14 -53 -56 -67 -12 -6 38 109 42 64 -26 -35 -41 -72 -7 -21 14 7 28 34 5 35 -3 -42 -64
7134f4K5M9RL2L7n4n6L2k8k8k6k5O6J04l9j4J6K6l5l1m0OoK9J7N0rl6K0K6p7l4
$$ -64 -39 10 19 51 88 34 -22 10 -18 -46 -72 -97 -31 73 34 20 36 62 27 -4 -44 -38 -44 -15 2 52 43 7 27 53 -24 -58
7166e8RK4L6kM3Mk8knn0J1po0N0J4M7J2l0J3%Km3Jj7LO3j1K4K6l3Lo0l8%J8J7
$$ -58 -49 -25 11 9 52 56 28 26 21 -29 -18 -25 -85 -35 -21 26 38 8 21 21 23 -20 -19 -36 -33 30 19 43 69 36 39 -21 -59 -59 -41 -24
7202b4J4N7l9lJ8L8l5k2m2LMn5O8J03l1On0J6o0n0M9K4K2NJ3K2kl7Kl4l2PnmP8
$$ -24 -10 47 8 5 23 61 26 4 -38 -35 -31 -86 -18 85 54 60 10 26 -34 -84 -35 -11 11 16 29 51 49 12 14 -20 -52 -45 -50 -54 24
7237B4J9l8K6M7p2m0M2o4L3j1K6J7L5Jk6K0n9%l8M3J2kJ15p7jko8N7r9N4j7L2
$$ 24 43 5 31 78 6 -34 8 -56 -23 -34 -8 9 44 45 19 39 -20 -20 -58 -15 -3 -5 110 33 32 30 -38 19 -80 -26 -43 -11
7269a1%N2K6ql1J5k0q4KJ5M6j3P5j6Rk6j1k1J4p1M4JK7j5L5M2j6o1lm5LJ8K4M5
$$ -11 -11 41 67 59 28 43 23 -61 -59 -44 2 -11 64 48 57 31 20 -1 13 -58 -14 -13 14 -1 34 76 60 -1 -4 -49 -46 -28 -4 41
7303D1K6m4k8N2l5l6l2M0J6k2J3PK2L9k7rl4j2l6M2J0j7J8J2K9l8N8m3o2jJ7m0
$$ 41 67 23 -5 47 12 -24 -56 -16 0 -22 -9 -2 20 59 32 23 -11 -23 -59 -17 -7 -24 -6 6 35 -3 55 12 -50 -51 -34 -74
7335g4O7L3qN5k0k8n5l1M8J9q9Q1L2K6k3k3Ko2K8k0L5k4J9N4j9P1p1j4j8Nm6k3
$$ -74 -7 26 18 73 53 25 -30 -61 -13 6 -83 -2 30 56 33 10 12 -50 -22 -42 -7 -31 -12 42 23 94 23 9 -9 -4 -50 -73
7367g3P8n4L3K9lJ4m4K4j9l1o3M8K8M2Ll4N0l0k8K9o3P1m8K7qN9J8m7J6l2mml3
$$ -73 5 -49 -16 13 10 24 -20 4 -15 -46 -109 -61 -33 9 12 -22 28 -2 -30 -1 -64 7 -41 -14 -22 37 55 8 24 -8 -12 -16 -49
7400d9nK2J25o6K5lk1o7k1L2j8LK8RM3NjK6l3n1j4j6K8mM0K4J9j0k0m4%NLk3J2
$$ -49 -54 -32 93 27 52 49 28 -39 -60 -28 -46 -43 -15 -6 37 42 41 67 34 -17 -31 -47 -19 -23 17 41 60 50 30 -14 -14 -9 -6 -29 -17
7435a7M6k7K2km3j1l1J5J2k8Q6m7N9k9M0r2N1Qr0O8l4J3J9L2j5L6K1j08M5nn4
$$ -17 29 2 24 22 -21 -32 -63 -48 -36 -64 22 -25 34 5 45 -47 4 12 -78 -10 -44 -31 -12 20 5 41 62 -46 -1 -6 -60
7466f0L6l5L6K2M5k0K3l8n0nl1K5L0L7j0K2K4Om3r6J7L7J7J9k1k7O7m2N2l2J1
$$ -60 -24 -59 -23 -1 44 24 47 9 -41 -46 -77 -52 -22 15 5 27 51 57 14 -82 -65 -28 -11 8 -13 -40 27 -15 37 5 16
7497A6o8k8N5l9O9N5j0%n7J3o9JK8o9J33m0O0k0K4l5no5RjKmJ8N0P6m1n7%j0k6
$$ 16 -52 -80 -25 -64 5 60 50 50 -7 6 -63 -62 -34 -103 30 -10 50 30 54 19 14 -51 -42 -43 -41 -45 -27 23 99 58 1 1 -9 -35
7531c5J4m6O8qk2O4n4QN6o3j1m%K9m0O7j4M3k9n4M1kk8l0J7M0J0MO7o7k6Rj00
$$ -35 -21 -67 1 -7 -29 35 -19 -11 45 -18 -29 -33 -33 -4 -44 23 9 52 23 -31 10 8 -20 -50 -33 7 17 21 88 21 -5 4 -96
7564i6Q4j8%M0k6M2Ok2Pk2Lm1l7N4mM0mNL4k4k8Jj2JJ2k7J6J7K6j7K9k3jk4l3
$$ -96 -12 -30 -30 10 -16 26 32 10 17 -5 -2 -43 -80 -26 -30 10 6 11 45 21 -7 -6 -18 -17 -5 -32 -16 1 27 10 39 16 15 -9 -42
7599d2J0oN8J4nM5m5o4Kj3K0k7M4rJ3O7n1pN2o0Mm4l7N8oj7Q5jj7j8j5K2q8L4
$$ -42 -32 -38 20 34 29 74 29 -35 -33 -46 -26 -53 -9 -18 -5 62 11 4 56 -4 0 -44 -81 -23 -29 -46 39 38 21 3 -12 10 -78 -44
7633d4L4J3rM2k1j5J6j2k9RMJ9k4J9J6J6j5l1Om7M1K5l5K6OK3pK3k5k4k6n2P7
$$ -44 -10 3 -6 36 15 0 16 4 -25 -16 -12 7 -17 2 18 34 19 -12 -6 -53 -12 13 -22 4 10 33 26 49 24 0 -26 -78 -1
7666aj2m3P5%O7o7k1m8J4jj8M1k6N0l2O3nPj7l7m8j0P3QMQJ5Lm9j3Jj5PRj0O8
$$ -1 -13 -56 19 19 86 19 -2 -50 -36 -37 -55 -14 -40 10 -22 41 36 43 26 -11 -59 -69 4 12 16 24 39 42 -7 -20 -19 -34 -27 -18 -28 40
7702D0Rl1P2m6l5m4K2l6j4K4JJ10r0Q7m9l6Ol7J6j4K8L5NpN4m2m0pk9lK3L7k4
$$ 40 49 18 90 44 9 -35 -13 -49 -63 -39 -38 72 -18 69 20 -16 -10 -47 -31 -45 -17 18 23 16 70 28 -12 -19 -48 -51 -28 9 -15
7735a5KP2l4%%o5j5Lj9J2N9L0L5l7j9RMj11K6K4K8p2J08J7j9j2k3j7j8m4R5lL
$$ -15 -13 59 25 25 25 -40 -55 -52 -71 -59 0 30 65 28 9 18 22 -89 -63 -39 -11 -83 25 42 23 11 -12 -29 -47 -91 4 1 4
7768Dl0L9L5q2N9n8Lk8N4kJ9J2NMK4k6m7k7j5O1m1J5L5K2Oql2on3K9J2k2K4L7
$$ 4 -26 13 48 -34 25 -33 -30 -58 -4 -6 13 25 30 34 58 32 -15 -42 -57 4 -37 -22 13 35 41 33 1 -5 -58 -29 -17 -39 -15 22
7802B2l3K9J2p3M3m7K%kO3o0J02Nm5J7o8K8j7J6k3KL7L3Rm6jJ0k4rj8K7KmM1j8
$$ 22 -11 18 30 -43 0 -47 -45 -45 -47 16 -44 58 63 18 35 -33 -5 -22 -6 -29 -27 10 43 52 6 5 15 -9 -18 -36 -9 -7 -11 30 12
7837A2lj7M1l9j3l1pL0M1lN9k9j4k6L5p2L2p6J29k9j2L3J1o3kjm8N4Pl7R8m7M8
$$ 12 9 -8 33 -6 -19 -50 -57 -27 14 11 70 41 27 1 36 -36 -4 -80 49 20 8 41 52 -11 -13 -14 -62 -8 -1 -38 60 13 61
7870F1Lk3k7l2lKK6k8K5K9L3J8o2On0j9k9M1j8N1k0O2mK2l8j2j5m7P2q7N9K5J4
$$ 61 64 41 14 -18 -21 -19 7 -21 4 33 66 84 22 28 -22 -41 -70 -29 -47 4 -16 46 42 64 26 14 -1 -48 24 -63 -4 21 35
7903C5N6p1%j4q5L0J4j3O9J8k9K4lJ3n9kMl8N2k1M7l1M2j0l0oJ1Pl6l0Q5k7J8
$$ 35 91 20 20 6 -79 -49 -35 -48 21 39 10 34 31 44 -15 -17 -13 -51 1 -20 27 -4 38 28 -2 -8 3 10 -26 -56 29 2 20
7936B0oPJ7o6N7o0J7K2k1M1J0K6k9k0j0kMo4N8M0l0k2J8LM5qp3J9j3l9Q5j7K4
$$ 20 14 21 38 -28 29 -31 -14 8 -13 28 38 64 35 15 5 3 7 -57 1 41 11 -11 7 10 55 47 -26 -7 -20 -59 26 9 33
7969C3L2l4J9m1k2j2L3n4j2O2OJ2J2m4po5P5l0J1N1j6J1j4J8l9PLJ5m7j3M0J8
$$ 33 65 31 50 9 -13 -25 8 -46 -58 4 10 22 34 -10 -17 -82 -7 -37 -26 25 9 20 6 24 -15 -8 -5 10 -37 -50 -10 8
8001HM5l8M1n8K3n7J8j9nK1J7L1%J6k6K7r4J9J9k6k7MR5J5Lo0%KNJ2l9J2%M9l2
$$ 8 53 15 56 -2 21 -36 -18 -37 -42 -21 -4 27 27 43 17 44 -50 -31 -12 -38 -65 -61 34 49 52 -8 -8 -6 -1 11 -28 -16 -16 33 1
8036AN8o8M0Nk6m0J3QL9q3P3K0Pl9m7%m1J9M9l3P4j3K2Rm6L%Kn9O8m3L7L7k8j5
$$ 1 59 -9 31 36 10 -30 -17 -9 30 -53 20 40 47 8 -39 -39 -80 -61 -12 -45 29 16 38 47 1 4 4 6 -53 15 -28 9 46 18 3
8071CqpK9l4K0N0l0K4l1mQm0%j1J0j2k1J7M4J0qL3Mo0J6l6k9J3O9K0oL5q1NJ5
$$ 3 -5 -12 17 -17 3 53 23 47 16 12 20 -20 -20 -31 -21 -33 -54 -37 7 17 9 42 46 -14 2 -34 -63 -50 19 39 33 68 -13 -8 7
8106Gl7j1j5j9L5lL9k9N3Qm2Oo3L8l9K2mO2K0j1J1l1J2k7j6PK8rk1Q6Nm1lk5n7
$$ 7 -30 -41 -56 -75 -40 -43 -4 -33 20 28 -14 -8 -71 -33 -72 -50 -54 8 28 17 28 -3 9 -18 -34 -27 1 -8 -29 57 62 21 18 -7 -64
8141f4mL6j8pQ4oM0m6k3J4q4N1k6Q0k5J1NjMJ4m7l4J5k0L9%M0j4m2N4k7m0L3n4
$$ -64 -68 -32 -50 -57 27 21 61 15 -8 6 -78 -27 -53 27 2 13 18 17 21 35 -12 -46 -31 -51 -12 -12 28 14 -28 26 -1 -41 -8 -62
8175f2N3Lo5Q5rJ8J5k8%l5l9j8Q9ol0O8K0Qo7J8o9K0J1M0l7L0k2M9J5m2p2K1j1
$$ -62 -9 -6 -71 14 5 23 38 10 10 -25 -64 -82 7 1 -29 39 59 67 0 18 -51 -31 -20 20 -17 13 -9 40 55 13 -59 -38 -49
8208d9OJL1L7Pmj2l2j7K0k7L8l4NK4qM4Lj7k2J0m0l9M4J1K3jN4o1%K5l4l5J0K6
$$ -49 -43 -42 -11 26 33 29 17 -15 -32 -12 -39 -1 -35 -30 -6 -14 30 33 16 -6 4 -36 -75 -31 -20 3 2 56 -5 -5 20 -14 -49 -39 -13
8243a3J6m5O8K3k8Ln4J0m8j7J08q8L4J3M0K2l4j3l5J3k4qlP7pnM0no0K8m4j5m
$$ -13 3 -42 26 49 21 24 -30 -20 -68 -85 23 -65 -31 -18 22 44 10 -3 -38 -25 -49 -57 -60 17 10 5 45 40 -20 8 -36 -51 -55
8276e5NK8M2j5K5j3l7K6m7j4j5N3K9K5rQl4m0J1L1m2L0mL9k2Rjkl4jkJ5l0J4J6
$$ -55 -50 -22 20 5 30 17 -20 6 -41 -55 -70 -17 12 37 28 36 2 -38 -27 4 -38 -8 -12 27 5 14 13 11 -23 -24 -26 -11 -41 -27 -11
8311a1M2Pj3K7n4qOnl0L5nL6K9n3L2J8l7n6L0J8MK6M8o3QnK2j5p4L3l4L1J2k9
$$ -11 31 38 25 52 -2 -10 -4 -9 -39 -4 -9 27 56 3 35 53 16 -40 -10 8 12 38 86 23 31 26 48 33 -41 -8 -42 -11 1 -28
8345b8N8LJ4p1L0K7p8lL4K3K2k1kj1K8j2pl5l4J9N3J6K4k3k2j3Nk0j9M9m0K9L2
$$ -28 30 33 47 -24 6 33 -45 -48 -14 9 31 10 8 -3 25 13 6 -29 -63 -44 9 25 49 26 4 -9 -4 -24 -43 6 -34 -5 27
8378B7n3O8j5j4J0k5j4j7K9j3jL2J8Kj6j4JJ6J2o0Jl0J04Qk8J9n6Oj3qj7%L3M6
$$ 27 -26 42 27 13 23 -2 -16 -33 -4 -17 -18 14 32 34 18 4 5 21 33 -27 -26 -56 48 56 28 47 -9 -3 -16 -24 -41 -41 -8 38
8412C8k0lMn2mK1jJj2qP0Pj6pJl1m2L1j7L4mjO8k8Qk3l2k7mQnJ3N0K3Pk7j6J8
$$ 38 18 15 19 -33 -37 -16 -17 -16 -28 -36 34 41 25 18 19 -12 -54 -23 -40 -6 -10 -11 57 29 37 14 -18 -45 -49 -41 -46 -33 17 40 47 20 4 22
8450B2l8k6mP0k0J1j8K7Onm2rol3L8LJ2J8kJ0NJ2r5O4l7L6l0L2Mj1N1k7k5J9l8
$$ 22 -16 -42 -46 24 4 15 -3 24 30 25 -17 -26 -32 -65 -27 -24 -12 6 4 14 19 31 -64 0 -37 -1 -31 1 5 -6 45 18 -7 12 -26
8485b6Pj4J8L6J8m9N1On5k1nj6K5K8k3M2J1j8kj7k7j0K9%K3j0J1L3Jk1kk0o9J7
$$ -26 -19 -33 -15 21 39 -10 41 47 -8 -29 -34 -50 -25 3 -20 22 33 15 13 -4 -31 -41 -12 -12 11 1 12 45 46 25 23 3 -66 -49
8519d9M7MRm0M8L3k2k0m5Lml0K8lJ7O4j5K7l7j0mk4%MM5L0k9l1N5n2L5l5jJ7l6
$$ -49 -2 2 11 -29 19 52 30 10 -35 -32 -36 -66 -38 -41 -24 40 25 52 15 5 1 -23 -23 -19 26 56 27 -4 51 -1 34 -1 -2 15 -21
8554b1J4M4mk8NL8p1J8J3m8l8Q2J7M4J7p6O9p0j8Lm2L2j2O7Qk1k9N1J5n2rJk0
$$ -21 -7 37 33 5 10 48 -23 -5 8 -40 -78 4 21 65 82 6 75 5 -13 -10 -52 -20 -32 35 43 22 -7 44 59 7 -2 -1 -21
8587b1nJ0J0M8j4mMp2M5j3J9K5J0J4m5J9Nl8K3n2k0L5PMO4n0kM5m4k9j8J4oJ5
$$ -21 -26 -16 -6 42 28 24 28 -44 1 -12 7 32 42 56 11 30 35 -3 20 -32 -52 -17 -10 -6 58 8 6 51 7 -22 -40 -26 -32 -17
8621a7L8k1KP6n6j2l0k9N9n0L6KM4J8q0M1l6K9Ql1m8Q0k4N1o9RK0J2kl0p1R4k
$$ -17 21 0 2 78 22 10 -20 -49 10 -40 -4 -2 42 60 -20 21 -15 14 22 -9 -57 23 -1 50 -19 -10 10 22 20 -10 -81 13 11
8654A1j7K4M8j5qK9q9j0qK0K0k7J7N1m9M3k0n6l5Q0p4J06o8O5l2jM9m9L2n4j4
$$ 11 -6 18 66 51 43 72 -17 -27 -35 -15 5 -22 -5 46 -3 40 20 -36 -71 9 -65 41 -27 38 6 5 54 5 37 -17 -31
8685c1NK0j8J4M3L1j4l5j7j4Ok9L4j3M5K4k2N5q1j5J1j1PjKj2M5m7L8j7KLq8P6
$$ -31 -26 -6 -24 -10 33 64 50 15 -2 -16 -10 -39 -5 -18 27 51 29 84 3 -12 -1 -12 -5 -6 -4 -16 29 -18 20 3 5 8 -80 -4
8719dM4m2J5K0j0QKn6KrL0k3%M2qM4l4j3k9J9Qj6qO8o5P3l9Nj0LJ2m4l0jO4k0
$$ -4 40 -2 13 33 23 31 33 -23 -21 -30 0 -23 -23 19 11 55 21 8 -21 -2 6 -10 -18 50 -15 58 19 24 14 17 29 -15 -45 -46 18 -2
8755bO9j6o4M5l0m0M1j4j4L5k6j6O7ql8nM8p4K9l2J8M6nn5R4l1o2J9M2q1J9P4
$$ -2 67 51 -13 32 2 -38 3 -11 -25 10 -16 -32 35 27 -11 -16 32 -42 -13 -45 -27 19 14 -41 53 22 -40 -21 21 -60 -41 33
8787C3k3oj1K9K9l4Jl9n2M4K4K6J0m7L2K7j9l8l1L0M4n8J3KM2k3J9k8Mj0l9L0
$$ 33 10 4 -7 22 51 17 18 -21 -73 -29 -5 21 31 -16 16 43 24 -14 -45 -15 29 -29 -16 -14 28 5 24 -4 0 -10 -49 -19
8819a9oN8n3J4QJ9j1jj2j4k3J7j7N3L5o4j0Nl9N6Rk0k9K8K4j0O1r1M2k5j1mk8
$$ -19 -25 33 -20 -6 2 21 10 9 -3 -17 -40 -23 -40 13 48 -16 -26 -21 -60 -4 5 -15 -44 -16 8 -2 59 -32 10 -15 -26 -30 -58
8852e8N4oK1l%J9k6k5O0n0Mkj6J5pN2k8%k4MnlJJ1pj8M3n5N5N3p6lm6O6n0L6m
$$ -58 -4 -10 11 8 8 27 1 -24 36 -14 -10 -12 -28 -13 -20 32 4 4 -20 -16 -21 -24 -23 -12 -19 -37 6 -49 6 59 -17 -20 -66 0 -50 -14 -18
8889a8M9j9Kk6k0N5j22L3M8L7J6k2Rm0J7J6o1N0p3L1K8l5N7J1nOm4k5j7N9ok4
$$ -18 31 12 14 -12 -32 23 -99 -66 -18 19 35 13 22 -18 -1 15 -46 4 -69 -38 -10 -45 12 23 18 24 -20 -45 -62 -3 -9 -33
8921c3k9P3kJn9K0k6%P7m6L9PrK3pm0jk7L3j1j7L8k2K4M5m0%l0PkL8l5L5k2K8
$$ -33 -62 11 9 10 -49 -29 -55 -55 22 -24 15 22 13 36 29 -11 -12 -39 -6 -17 -34 4 -18 6 51 11 11 -19 -12 -14 24 -11 24 2 30
8956C0Mj6ll5qJ3K2k0j6O1o8M8NK7k9k9k9M0J6J9l6l3%N9J1l8L2n9K5j5N2o3P2
$$ 30 34 18 15 -20 -28 -15 7 -13 -29 32 -36 12 17 44 15 -14 -43 -3 13 32 -4 -37 -37 22 33 -5 27 -32 -7 -22 30 -33 39
8989C9m8M3l4j2j9QJJ9k8M1k0J5k2N5o6j0N7j3m7k9R1nJ1J0l7L6k0l7lJ4J9RO
$$ 39 -9 34 0 -12 -31 -23 -22 -3 -31 10 -10 5 -17 38 -28 -38 19 6 -41 -70 21 16 27 37 0 36 16 -21 -24 -10 9 18 24
9022B4j4qL2j4n0J1k0J0K0kN7l1mL4l4k9J3m8O2k1L1j1l9N0J1n0K8Kl8L5j5j0
$$ 24 10 2 34 20 -30 -19 -39 -29 -9 -11 46 15 11 45 11 -18 -5 -53 9 -12 19 8 -31 19 30 -20 8 10 -28 7 -8 -18
9054a8M2KpKk4Pl6MJ4k2J6L8kqK2Lj9j0k3J6nLM6k4K3m2K3o5L6l5K3J2K3j5PR2
$$ -18 24 26 19 21 -3 4 -32 -28 -14 -36 -20 18 16 8 30 33 14 4 -19 -3 -8 -5 41 17 40 -2 21 -44 -8 -43 -20 -8 15 0 7 99
9090I9j00j0Oj4pm6L4K6L8Nj6J5m4K0j5Rln3N4j1O3j8J2L9q6L6j8k7j8O3J3o9
$$ 99 -1 -11 -5 -19 -26 -72 -38 -12 26 31 15 30 -14 6 -9 0 -3 -56 -2 -13 50 32 44 83 -3 33 15 -12 -30 33 46 -23
9122b3Q9o7j0ML7n2qL0j2K5MM6j05P5nn5j7L2L3k2N3j5k6OK4m5Q6j18j0M7k1M4
$$ -23 66 -1 -11 -7 30 -22 -30 0 -12 13 17 63 -42 33 28 -27 -44 -12 21 -1 52 37 11 17 41 -4 82 -36 -46 1 -20 24
9154B4j8lo1Q7m3J2j9K8j5j5L1J7m1L1J5Kn3J4l5M4LjJ1PJ8k3jj5Jk6j5K9k3P4
$$ 24 6 3 -58 29 -14 -2 -21 7 -8 -23 8 25 -16 15 30 32 -21 -7 -42 2 5 4 15 22 40 17 16 1 2 -24 -39 -10 -33 41
9188D1k5M7q2oN4o7N7k0J1J8M0m0Mj2J0n6J2k4K8K4n3O1p3Q1m4J4L2o8QJ4J0j3
$$ 41 16 63 -19 -25 29 -38 19 -1 10 28 68 28 32 20 30 -26 -14 -38 -10 14 -39 22 -51 30 -14 0 32 -36 -28 -14 -4 -17
9220a7K1N1p1Nl6P4l3J2k3Oj9P9n9MM7n9LL1l2J1qN2j7poK5k9l7K0pl9K6L%P3
$$ -17 4 55 -16 -11 -47 27 -6 6 -17 -11 -30 49 -10 -6 41 -18 -15 16 -16 -5 -13 39 22 15 9 34 5 -32 -12 -19 -58 -32 -29 -29 44
9255D4q9M8K2k4j4J9q7N6Nj3M9Jl8J1k2lnK4k6K2L5ml1L6Lk0k8K2l2OM9l6J1L2
$$ 44 -45 3 25 1 -13 6 -81 -25 -20 -33 16 17 -21 -10 -32 -35 -40 -16 -42 -20 15 11 -20 16 19 -1 -29 -7 -39 -33 16 -20 -9 23
9289B3j1KJ3j9l7J6n6Q0j2k2J4M1k1o1N2n0K7m9O0lk9L5l4N7k3k5j6J2K8j1N0
$$ 23 12 14 27 8 -29 -13 -69 11 -1 -23 -9 32 11 -50 2 -48 -21 -70 -10 -13 -42 -7 -41 16 -7 -32 -48 -36 -8 -19 31
9320C1j6J4k6k1Qk8OK2k8L2n0L4J8K4J9o4J4Joo1M6L2l2L2K9m3m6L1K2K0k4l5
$$ 31 15 29 3 -18 -10 -38 -32 -10 -38 -6 -56 -22 -4 20 39 -25 -11 -10 -16 -77 -31 1 -31 1 30 -13 -59 -28 -6 14 -10 -45
9352d5j4N8K1J0k3lJm3k3M5j8M7K1mj3K3j05R2n2RJ1J2k3PJ6K4k4k3k9J3j7J5
$$ -45 -59 -1 20 30 7 4 5 -38 -61 -16 -34 13 34 30 17 40 -65 27 -25 -16 -5 7 -16 -9 7 31 7 -16 -45 -32 -49 -34
9384c4K8Rk1K9JQl5J5n2NN1l5N3l6J5L6j3nk8j4l0N1lJ5j6K4JKOl4n7L1QkL2j8
$$ -34 -6 3 -18 11 12 20 -15 0 -52 -47 4 -31 22 -14 1 37 24 19 -9 -23 -53 -2 -5 10 -6 18 19 21 27 -7 -64 -33 -25 -27 5 -13
9420a3J3M0l0jm7O8mm2qQK2j1K1k7j3N2m7%Kj9J9J3P7q3N3m1m7oNK9j5%J3KL3
$$ -13 0 40 10 9 -38 30 26 -16 -24 -16 6 -5 16 -11 -24 28 -19 -19 -17 -36 -17 -4 73 -10 43 2 -45 -51 -46 -17 -32 -32 -19 -17 16
9455A6j6Qj7Lk1m0O8nl3J7N0l4K3k1M6m1n4O9l0J6j9K5J8%m1m1M9l8K2j1O9n3
$$ 16 0 8 -9 -6 -27 -67 1 -4 -37 -20 30 -4 19 -2 44 3 -51 18 -12 4 -15 10 28 28 -13 -54 -5 -43 -21 -32 37 -16
9487a6N0m9M6n1lJ5l3Rq%L0M4J3k7l0k7L5m0M6Kj5K6j0m7N3J2k9Mj2k3J6J7K6
$$ -16 34 -15 31 -20 -23 -8 -41 -32 -40 -40 -10 34 47 20 -10 -37 -2 -42 4 6 -9 17 7 -40 13 25 -4 0 -12 -35 -19 -2 24
9520B4j3k0J9K2j7k0K9k2l3L0J6l7M7j6q%k1k2l0pR9J1l2O1k6j1l3J2l7LrJ9j1
$$ 24 11 -9 10 32 15 -5 24 2 -31 -1 15 -22 25 9 1 1 -20 -42 -72 -79 20 31 -1 60 34 23 -10 2 -35 -32 -41 -22 -33
9553c3J9O7o9N9k6j1m3j2L4k3J2K6j2L4j3K9l1j3k3J3mj5N6J9jk5j3Ol2l3M1j8
$$ -33 -14 53 -16 43 17 6 -37 -49 -15 -38 -26 0 -12 22 9 38 7 -6 -29 -16 -20 -35 21 40 39 14 1 7 -25 -58 -17 -35
9585c5O2n0O9j8k9J4j0mj5nkj9K8OL0mJ0m8KqM0o9L5N2m8MP8p9J1k7rl6J16k3
$$ -35 27 -23 46 28 -1 13 3 -1 -16 -21 -23 -42 -14 -8 22 18 28 -20 -18 -26 14 -55 -20 32 -16 -12 66 -13 -2 -29 -38 -74 42 19
9619A9kPOj6Mj8j5K4p8M9K7K4k2j4M6l8j8ML5o6l0L3M3j6O1j3p0J6m1J6j5Q0m0
$$ 19 17 24 30 14 18 0 -15 9 -69 -20 7 31 9 -5 41 3 -15 -11 24 -42 -72 -39 4 -12 49 36 -34 -18 -59 -43 -58 22 -18
9652a8j0N1o9N7j9qpk0OJL8L5%m7K7l9N4n9JMk3J2P6o6N1m4J3pm0M1k2K7Mk4J0
$$ -18 -28 23 -46 11 -8 -16 -23 -43 -37 -36 2 37 37 -10 17 -22 32 -27 -26 -22 -45 -33 43 -23 28 -16 -3 -10 -50 -9 -31 -4 0 -24 -14
9687a4L1k3JN3q5M1j4LK2j3J9K1oj7%n6J4o5N7J3K6J4Mj9k0j7L0j7M3n0M1m1N2
$$ -14 17 -6 -5 48 -37 4 -10 -7 15 2 21 42 36 19 19 -37 -23 -88 -31 -18 8 22 26 7 -13 -30 0 -17 26 -24 17 -24 28
9720B8JJk8l6P2o8J2j7J0K1J4l5R1j1o0J6m0J0J4p8Q2l2O0j0MN3n3k9k8L6n8Q8
$$ 28 29 30 2 -34 38 -30 -18 -35 -25 -4 10 -25 66 55 -5 11 -29 -19 -5 -83 -1 -33 27 17 21 74 21 -8 -36 0 -58 30
9752C0J0J9n4Rj3JK7m7N2p6M9J3k9J7Q%K4p4M4j7j1OJ9nj7J9K9p4M2J1k7p8J17
$$ 30 40 59 5 14 1 2 29 -18 34 -42 7 20 -9 8 16 16 40 -34 10 -7 -18 -12 7 2 -15 4 33 -41 1 12 -15 -93 24
9785B4M9n4L5km7kpL3Nl6oJ4J2l7N2Jk9j5Jj7RK4j6J7M9o3O5p7L9l7K6j9K2nL0
$$ 24 73 19 54 52 5 3 -4 29 34 -2 -8 6 18 -19 33 34 5 -10 -9 -26 -17 7 -9 8 57 -6 59 -18 21 -16 10 -9 13 8 38
9820C8l7j4L4PJ5m9L4j8j2O1p0P1q4J8pl6Q0q1J9OM6K1j1l1L3Km0j9J0K0L9L2
$$ 38 1 -13 21 28 43 -6 28 10 -2 59 -11 60 -24 -6 -13 -49 31 -50 -31 -25 21 42 31 0 33 35 -5 -24 -14 6 45 77
9852G7q7M7k7mL2o8M6l9N1l7O4m6L4n2jO6m3kp9M4K5j3K2L0%rNJ0l1j1J4k4L1
$$ 77 -10 37 10 6 38 -30 16 -23 28 -9 55 9 43 -9 -10 56 13 11 -68 -24 1 -12 10 40 40 31 36 46 15 4 18 -6 25
9885B5j1K0k9kk5O9n5j0J2m6M2KN5m2M2j5n2k4rjO0J9j9J4j3j5M5o4O6m0J7j8
$$ 25 14 34 5 3 -22 47 -8 -18 -6 -52 -10 -8 47 5 47 32 -20 -44 -53 -54 6 25 6 20 7 -8 37 -27 39 -1 16 -2
9917bl3Q5m3kM9k7j2l8L4k9K0J5lNL3o8j1L8m5N2m4K4J7mPqK1j5pJ6m7jj0L6k2
$$ -2 -35 50 7 5 54 27 15 -23 11 -18 2 17 14 19 52 -16 -27 11 -34 18 -26 -2 15 11 18 10 31 16 9 25 -22 -23 -33 3 -19
9952a9J3j6N4pk5k5l3Nl2R5J1n9N0%j3j5j8J1J5m2K6RL9rMJ8l0Kk0Klj5N6l9J8
$$ -19 -6 -22 32 25 0 -25 -58 -53 -85 10 21 -38 12 12 -1 -16 -34 -23 -8 -50 -24 -15 24 15 19 37 7 9 -11 -9 -12 -27 29 -10 8
9987HM8o6Nm3P4m5QO5p4J7L1m2P0m4j8j9M3m4j2J2L2J6m1J9LJ5k3m8M5k4K2k6
$$ 8 56 -10 -5 -48 26 -19 -11 54 -20 -3 28 -14 56 12 -6 -25 18 -26 -38 -26 6 22 -19 0 3 18 -5 -53 -8 -32 -10 -36
10019c6K2k3M9pm6K0J5K4n4O2m1J4Ok4N0p1M6rl9L3k9M7l8L9mk1L6m5k3qJ5M0
$$ -36 -14 -37 12 5 -41 -21 -6 18 -36 26 -15 -1 5 -19 31 -40 6 -3 -42 -9 -38 9 -29 10 6 -15 21 -24 -47 -55 -40 0
10051@l5K7J5k4J8J3Lk1j0mo3P3kK9j0J4o7L0l3L3j7l7M4J7qJ6K3k1o5K0K2l7
$$ 0 -35 -8 7 -17 1 14 17 -4 -14 -18 -81 -8 -10 19 9 23 -44 -14 -47 -14 -31 -68 -24 -7 -15 1 24 3 -62 -42 -20 -57
10083e7K7L3L8n6MM1K1n2k1k2J8J7M1m0L4l8M7j6mj4o2M4k3Q6o3J8J4m7K7Oj9
$$ -57 -30 3 41 -15 -11 30 51 -1 -22 -44 -26 -9 32 -8 26 -12 35 19 15 1 -61 -17 -40 46 -17 1 15 -32 -5 1 -18
10114a8j6j6K4KK2LQK1n6J9J2J4l1RJNmOm7K5K5Nj9jk5O6m9L4J2j9K3o7L2n8K8
$$ -18 -34 -50 -26 -24 -2 1 9 30 -26 -7 5 19 -12 -3 -2 3 -1 5 -42 -17 8 13 -6 -7 -32 34 -15 19 31 12 35 -32 0 -58 -30
10149c0L1%j8R7n4J9k6J7k9n8L4prK0N7n3ONk1K2ml1j7P1m6N3m2J7kjJ7n8K8j7
$$ -30 1 1 -17 80 26 45 19 36 7 -51 -17 -24 -33 -13 44 -9 -3 2 -19 3 -1 -32 -49 22 -24 29 -13 4 2 1 18 -40 -12 -29
10183b9K1L3j3j5j4J3j6M6m8j6KJ5Q3p3RmJ3kk9j0k5K8j5L6J0j4O8m9j4Kl7K9
$$ -29 -8 25 12 -3 -17 -4 -20 26 -22 -38 -36 -21 62 -11 -2 -6 7 5 -24 -34 -59 -31 -46 -10 0 -14 54 5 -9 -7 -44 -15
10215a5jJk1KO5k4lMj4k8rnL0JL3j2P6q6L1l2J7k9Lk2J5O8om7N0p8N8o1K3L6o3
$$ -15 -16 -15 -36 -34 31 7 4 8 -6 -34 -43 -48 -18 -17 16 4 80 -6 25 -7 10 -19 -16 -38 -23 45 39 -8 42 -36 22 -39 -16 20 -43
10250d3O5L2m2Ql2N0k8J0Np0J4M4j0QpK6k2K0n6rjM7J4QrpLol0%j9M9K5k6m3K8
$$ -43 22 54 12 20 -12 38 10 20 25 -45 -31 13 3 11 4 30 8 28 -28 -37 -38 9 23 31 22 15 18 12 -18 -18 -37 12 37 11 -32 -4
10286dM3L0o3n2L0K6l0K9K0J3J0p8N1L5l7k5j4j0J6j2rN1lL8m5KORl4k1O2l3P
$$ -4 39 69 6 -46 -16 10 -20 9 29 42 52 -26 25 60 23 -2 -16 -26 -10 -22 -31 20 17 55 10 12 18 27 -7 -28 34 1 8
10319HjM6L6p6p9N1Jj0O8p7N2k8k1L2M2m8j2pNm7O6k9l5P8J8o0MJ2Pj2LL5q0J04
$$ 8 7 53 89 13 -66 -15 -14 -24 44 -33 19 -9 -30 2 44 -4 -16 -23 -18 -65 1 -28 -63 15 33 -27 -23 -11 -4 -16 -13 22 -58 46
10353D6l9J2J1k6m1p%L5Kj3J2L1mrk9J1Rkk6ML0RM2q5%O1n3qM3o9Q4m0K1j5k3
$$ 46 7 19 30 4 -37 -44 -44 -9 -7 -20 -8 23 19 10 -19 -8 1 -1 -27 -23 7 16 58 -27 -27 34 -19 -27 16 -53 31 -9 12 -3 -26
10388b6K0Jm5L4K4J4p1O4m7%M1K5m9K0n4NO5m5L6jk8M8nq4P8r4L6M5l4M6qj8J
$$ -26 -6 -5 -50 -16 8 22 -49 15 -32 -32 9 34 -15 5 -49 -44 21 -24 12 11 -17 31 26 -58 20 -74 -38 7 -27 19 11 -7 -6
10421fkRj0rm1O0mj6J6M3j6J2l9jj7k0L5qJ9m8O4N1p3j5M1o9M5n6M1l7M2K5qm
$$ -6 -8 1 -9 -18 -59 1 -3 -19 -3 40 24 36 -3 -4 -21 -41 -6 -14 5 -43 21 72 -1 -16 25 -44 1 -55 -14 -51 -9 16 8 4
10455Dj6j9L0J1k7J8K6j5J0qL7m4JMpj3qK5J8o2L3RpnL1j4n0O8k9K6n4K1j5N8
$$ 4 -12 -31 -1 10 -17 1 27 12 22 14 51 7 8 12 5 -8 -16 9 27 -35 -2 7 0 -5 26 12 -38 30 1 27 -27 -6 -21 37
10489C7m5l9N2J8j1j0KL4j8j3j0j6O3p5K5kK3JJ3k3KKl0j0O3p0M7n4J8O2l8K0
$$ 37 -8 -47 5 23 12 2 4 38 20 7 -3 -19 44 -31 -6 -8 15 16 29 6 8 10 -20 -30 33 -37 10 -44 -26 36 -2 18
10521A8k5K4n3N6n0K1M0l7P3n3j7K6k2pj5l9O0lj0K6j3P2n5k8rL8l9L3qj8J5n
$$ 18 -7 17 -36 20 -30 -9 31 -6 67 14 -3 23 1 -6 -21 -60 0 -3 -13 13 0 72 17 -11 -20 18 -21 12 4 -14 1 -4
10553dK1j9J8k2Ql6JJ5L6K2l6K6k7K7J5m5K4o2R0l5L4k2l2lk0L2o2P9j9k1QK5
$$ -4 17 -2 16 -6 2 -34 -33 -18 18 40 4 30 3 30 45 0 24 -38 52 17 51 29 -3 -6 -26 6 -56 23 4 -17 -9 16
10585A6j4n3J08n9m2K5J5Kk2M7k2M7l4mnn0L2J0l2N7J0l8M2j6ML6p0JPLRm3pN3
$$ 16 2 -51 57 -2 -44 -19 -4 -2 -24 23 1 48 14 10 5 -45 -13 -3 -35 22 32 -6 36 20 24 60 -10 -9 -2 1 10 -33 -40 13
10619A3j0Qj1J3j2mj8J0K2J2m4M2PJ3o4K2k6J0O1o5J3l5Q6m9J0k3L5qj9QK3l6
$$ 13 3 11 0 13 1 -3 -21 -11 11 23 -21 21 28 41 -23 -1 -27 -17 44 -21 -8 -43 43 -6 4 -19 16 8 -11 -3 20 -16
10651a6O7l0j7j3K1k9lLMJ4j2M8m1J7nk6qL2m4K8K2J4j6j6j3L0p4P1Qn1K7jJ6
$$ -16 51 21 4 -9 12 -17 -20 -17 -13 1 -11 37 -4 13 8 -18 -26 6 -38 -10 12 26 10 -6 -19 11 -63 8 16 -35 -8 -9 7
10684GK8j3j8N8o5K0m1l9L2L4J9j4Oj9Mq%qrPoO6m5Lj3J8j7jj0K5rkn3J01k4k5
$$ 7 35 22 4 62 -3 17 -24 -63 -31 3 22 8 14 -5 -1 -9 -9 -17 -26 -19 -25 41 -4 -1 -14 4 -13 -14 -24 1 -8 -10 -63 38 14 -11
10720a1M0qqm8K2J0k4K2K3J1j5jK3kl6k9kJ6M0j6l0m3M1O5o3J3m5L7k9jK8J0O7
$$ -11 29 21 13 -35 -13 -3 -27 -5 18 29 14 13 36 34 -2 -31 -33 -17 23 7 -23 -66 -25 40 -23 -10 -55 -18 -47 -48 -20 -10 57
10753E7n3J2l0l3K7k2L5k3PM7l0L9m5P2q2mrPQj7L4JJ9l2K9n3L2o9N0OOj8j7R
$$ 57 4 16 -14 -47 -20 -42 -7 -30 -23 24 -6 33 -12 60 -22 -26 -35 -28 -20 -37 -3 -2 17 -15 14 -39 -7 -76 -26 -20 -14 -32 -49 -40
10787d0M0K3m8Kl2L5MKl8K4O0p2PLPmj2J3MK1j4%Pn8M1k9j4J4J2K6Joj2M8l9o0
$$ -40 0 23 -25 -23 -55 -20 -16 -14 -52 -28 32 -40 -33 -30 -23 -27 -39 -26 -22 -1 -15 -15 -8 -66 -25 -54 -68 -54 -42 -16 -15 -21 -33 15 -24 -84
10823h4P1m6L1M4lj3nRk1M0m9KJ4o4N4L6n1K3M5n9L2m2MN6l4QJ1n6K7N6l6l7K9
$$ -84 -13 -59 -28 16 13 0 -5 4 -17 23 -26 -24 -10 -74 -20 16 -35 -12 33 -26 6 -36 -32 24 -10 -2 9 -47 -20 36 0 -37 -8
10856hjj8L6m6K0kk9L5J0ko1O3k7NJ6Kj7Mj2K6K8j6Jl6%L7J1k3Kk8K5J8J5l1k1
$$ -8 -9 -27 9 -37 -17 -19 -48 -13 -3 -5 -66 -3 -30 -25 -9 -7 -24 -20 -32 -6 22 6 7 -29 -29 8 19 -4 -2 -30 -5 13 28 -3 -24
10891b4L0k4M9j5kl1MN1m2j7j7JJ5J0K5K1k3j3L1r5L1M9k4n7P0L1o1j1L8k2L8
$$ -24 6 -18 31 16 14 -17 -13 38 -4 -21 -38 -37 -22 -12 13 34 11 -2 29 -66 -35 14 -10 -67 3 34 -27 -38 0 -22 16
10922A6m3M7mKKk9L2pJ4k2m0J6k6J1M0n2J02l8Nl1%NPk0K4m5M9nJ4k0%j9K5n5
$$ 16 -27 20 16 18 20 -9 23 16 30 8 -32 -16 -42 -31 9 -43 59 21 26 -5 -5 0 7 -13 11 -34 15 10 24 4 4 -15 10 -45
10956d5O2j6J5l9J8k5NM4%m3pMj2K0K1mL2J5l2m3N9mk1n9N5M6o1J7M3L4p7j7K
$$ -45 17 1 16 -23 -5 -30 -25 19 19 -24 -31 -27 -39 -19 2 -2 30 45 13 -30 29 25 4 -55 0 46 -15 2 45 79 2 -15 -13
10989a3J9l8k6Q9n5K0lj3KN4m3mJ6Qn9K6L3K2j1m1PK8MK2k4k9J3L1m3L9k4KrK
$$ -13 6 -32 -58 31 -24 -4 -7 -20 -18 36 -7 -11 5 13 -46 -20 13 35 24 -17 -10 18 22 44 20 -9 4 35 -8 31 7 9 0 2
11023Bk7J2pm9P7J4J8lOn0j5NK8K8o4M8j6oK6l5L0k3jk0J1k0j2L9K1K7m7k0J4
$$ 2 -25 -13 -20 -69 8 22 40 37 43 -7 -22 -17 11 39 -25 23 7 1 27 -8 22 -1 -2 -22 -11 -31 -43 -4 17 44 -3 -23 -9
11056im1J6O1K5l3k3K6k0j0J0Ppm5QO3kk2QK4l7j3M0j4jk0k2M7l1jM9k7n3N4l3
$$ -9 -50 -34 27 52 19 -4 22 2 -8 2 9 2 -43 -35 28 26 4 12 36 -1 -14 26 12 11 -9 -31 16 -15 -16 33 6 -47 7 -26
11090b6kL7n4O3l0K1J1k6J9n0O0n2O3n1j1J8j4J4lM1k1n7L7K2mnk7M2JJ6n6J9
$$ -26 -28 9 -45 18 -12 9 20 -6 13 -37 23 -29 34 -17 -28 -10 -24 -10 -13 28 7 -50 -13 9 5 0 -27 15 16 32 -24 -5
11122ej7K0rQn4O5ok6L5nj4pj6N9l1N9r2L8K9J8o1QoL3k2QJK6k3J2k3J4j1n0%
$$ -5 -22 -2 -11 -3 -57 8 2 -24 11 6 -8 -15 -31 28 -3 56 -36 2 31 49 -12 -4 -10 23 1 9 10 36 13 25 2 16 5 -45 -45
11157d5O4k1lkK4k9L1j9k6O4m8j0k0K2j7JL8n3M5k4K9K6l0L0p4N0j6M2Nl4pQL6
$$ -45 19 -2 -5 -7 17 -12 19 0 -26 38 -10 -20 -40 -18 -35 -34 4 -49 -4 -28 1 27 -3 27 -47 3 -13 29 34 0 -7 1 37
11190C7o6lmL4K9k9k8k0M6Ql9L3m5R3m3l4N7m1j0J7L0k0rPJ6l9O1l2K0Lj8pQm2
$$ 37 -29 -32 -36 -2 27 -2 -30 -50 -4 4 -35 -2 -47 46 3 -31 26 -15 -25 -8 22 2 -7 0 16 -23 38 6 26 29 11 4 12 -30
11224c0L8k6j6J3M9m8L2n3M6l7KL0l3K6j8L5Ok7K8k6J1L1l8K5Nl5j3M6Rm3J6m2
$$ -30 8 -18 -34 -21 28 -20 12 -41 5 -32 -30 0 -33 -7 -25 10 16 -11 17 -9 2 33 -5 20 25 -10 -23 23 32 -11 5 -37
11256c7LN8q8M9L1pnk6j2K9pJ4Nj9J5Rk4N3j5qj5l4N8l2j9L3J2J7n7M4l5L3qn0
$$ -37 -34 24 -64 -15 16 9 4 -22 -34 -5 -12 2 7 -12 3 12 -12 41 26 18 3 -31 27 -5 -24 9 21 38 -19 25 -10 23 15 -35
11290c5L7l2ok1O2L2m9qOj0oL8lj5N3n8K5m4NL0j7K1pn5N2M0n6K3J8j5K8n5L7
$$ -35 2 -30 -36 -57 5 37 -12 -20 -14 -24 -30 8 5 -10 43 -15 10 -34 -29 1 -16 5 -2 -57 -5 35 -21 2 20 5 33 -22 15
11323A5m1K8j1K9m2M1L1m4K5l1m7N3j9N0k4K3Pl3K0k9MQk4j4M5o3N4lk0L0qk5
$$ 15 -26 2 -9 20 -22 19 50 6 31 0 -47 6 -13 37 13 36 43 10 30 1 5 13 -11 -25 20 -43 11 8 -12 18 10 -15
11355a5j2rJ7QN0j9K4n0K2KJ2n6N5oj7qmJM0j5l8OMJ0j4J2j5L5Om9O0k3j8Ml9
$$ -15 -27 -36 -19 -11 39 20 44 -6 16 18 30 -26 29 23 6 -2 -6 -5 35 20 -18 -12 -8 2 -12 0 -15 20 26 -23 37 14 -4 0 -39
11390c9j2L4J8N4n8L8k5rOm5N0j7m2M7j2J7K4p3L4n3Q7m9K5m0L7kQ1m6l6j1K8
$$ -39 -51 -17 1 55 -3 35 10 1 7 -38 12 -5 -47 0 -12 5 29 -44 -10 -63 24 -25 0 -40 -3 -5 76 30 -6 -17 11
11421A1pl2pRJ6mJ8J4om9M6j8j4j0N1m0N0l5Kj4Pj7J1Mm3M6Jk0L6j6J9l2lk5L3
$$ 11 4 -28 -35 -26 -10 -14 4 18 12 -37 9 -9 -23 -33 18 -22 28 -7 -5 -19 -12 -29 -18 -14 -57 -11 -10 -30 6 -10 9 -23 -26 -51 -18
11456a8l1M4k9L6lLj9NK7l4L0o9N5l5O2k5Ok1k5K2J3k9J7JK2K6l5J3m5K5j4J0
$$ -18 -49 -5 -34 2 -1 2 -17 -12 15 -19 11 -58 -3 -38 24 -1 5 -16 -41 -19 -6 -35 -18 -17 5 31 -4 9 -36 -11 -25 -15
11488a5J5j5k8M1pL7k7jJ3J3m0J2k8J1lJ3rnpnL1k1l5M7KKm3M2m3L8jj2qK0k6
$$ -15 0 -15 -43 -2 -9 28 1 0 13 26 -14 -2 -30 -19 -22 -9 -18 -23 -30 -35 -4 -25 -60 -13 -11 -9 -52 -10 -53 -15 -16 -28 -36 -16 -42
11523d2J2k0J5K2Nj4K0k1K7Jl1k3N7LmK5m1j0J5l9NJ9l5P3l3K1jrj4K1j3Nl8O1
$$ -42 -30 -50 -35 -13 -8 -22 -2 -23 4 5 -26 -49 8 11 7 32 -9 -19 -4 -43 -38 -19 -54 19 -14 7 6 -3 -17 4 -9 -4 -42 19
11557A9m5N9j12N7L7m5N7o6N9n4Oj8L0mM4m8RK3l0MLm5M4MQk2J3K9j3pj8l2J0
$$ 19 -26 33 -79 -22 15 -30 27 -39 20 -34 -28 -46 -16 -20 24 -24 -15 8 -22 -18 -15 -60 -16 -12 -4 -26 -13 16 3 -4 -22 -54 -44
11590d4K1N0m8J1N5n7K2Oj9k1n7P2L1k5n2N6L3m8pqm8P0k3kJ5l0N4J3J8m2Lj9
$$ -44 -23 27 -21 -10 45 -12 10 16 -3 -24 -81 -9 22 -3 -55 1 34 -14 -21 -29 -77 -7 -30 -32 -17 -47 7 20 38 -4 -1 -20
11622b0Mlj4J7L0j6kNJ9J6n0L3m3K1L9Rk1o1O8l0J0k5J6k4J2L5m3QJ4l6R2p0K8
$$ -20 -16 -19 -33 -16 14 -2 -4 1 20 36 -14 19 -24 -3 36 45 24 -37 31 1 11 -14 2 -22 -10 25 -18 -10 4 -32 60 -10 18
11655A8n7M4n2O2jm1K5k3L9j7m1N7m2M1J1KJ0rl0k2P4j3k1l1N7p9N3rpl0L8l9
$$ 18 -39 5 -47 15 14 -27 -2 -25 14 -3 -44 13 -29 12 23 25 35 26 -4 -26 48 35 14 -17 40 -39 14 5 -2 -32 6 -33
11687c3J3J6RL9p3K2K3k2Nooj5L7k4K3l0k9N7j6KM8n4n0P9l6L5J8k1j7K1j9K7
$$ -33 -20 -4 5 44 -29 -7 16 -6 -1 -7 -13 -28 9 -15 8 -22 -51 6 -10 -8 40 -14 -64 15 -21 14 32 11 -6 15 -4 23
11719B3j3K9n5JN2m5LL3rLk5J2k9L3n8L4lQ3n8QJ0j6k9j3J6j1k4K5N5qnJ9m7N4
$$ 23 10 39 -16 -15 37 -8 -5 28 19 22 -3 9 -20 13 -45 -11 -14 69 11 19 29 13 -16 -29 -13 -24 -48 -23 32 24 19 38 -9 45
11753D5l5lJ0m1M9j0J9j4Kl3K6M5m3j9j9L0J5j0lm1L2M3p1j2K8j5O3m9O0j6Oo
$$ 45 10 7 17 -24 25 15 34 20 22 -11 15 60 17 -2 -21 9 24 14 11 -30 2 45 -26 -38 -10 -25 38 -11 49 33 39 33
11785C3j2j7J4j3jjk7M0L0Kr1P2n2M0%j8Pk4L2pK8j6m1J7L3rj9K6n1Q7n0K5J2
$$ 33 21 4 18 5 4 3 -24 16 46 48 -43 29 -23 17 17 -1 6 -18 14 7 35 19 -22 -5 28 19 0 26 -25 62 12 37 49
11818D9o5N8j3np2O6J1jj5jj6J2L2k3j9J6m7M1k7O0o6M5j4LL6p2K9j7J7klK0j6
$$ 49 -16 42 29 24 -48 18 29 28 13 12 -4 8 40 17 -2 14 -33 8 -19 41 -25 20 6 9 45 -27 2 -15 2 0 -3 17 1
11851AM6j10M2J9k5jL2L0j4j3P3r7Lk6O6j9J3nn6KM9Nj3j2Kl5KN2J1n7K2P7n8
$$ 1 47 -63 -21 -2 -27 -28 4 34 20 7 80 -17 -14 -40 26 7 20 15 -41 -39 10 15 2 -10 -8 -43 -41 11 22 -35 -13 64 6
11884Fj1RJJJ3n7K7rJ0rK9k4j8J9K7qk9KJ7N6m7LjJ9l1j1L3l2LPk9QM0Qk5J3j3
$$ 6 -5 4 5 6 19 -38 -11 -20 -10 -19 10 -14 -32 -13 14 6 -23 -21 -4 52 5 8 7 26 -5 -16 17 -15 -12 -5 -34 -26 14 22 -3 10 -3
11921cpj3J0j7J3Jk1JpJ3K8k4J6K1%Lm5K7Kk1K9l4qL9j6K1l6J7olkk7M9Kk9nJ5
$$ -3 -10 -23 -13 -30 -17 -16 -37 -36 -43 -30 -2 -26 -10 11 11 14 -31 -4 -2 -23 6 -28 -36 3 -13 8 -28 -11 -17 -20 -22 -49 0 2 -27 -32 -17
11958a7l1P3J7m3k3LM1o8L9MLkj6OM8l7K9p7L0Pqj2k4P2On9JJ4O3p6M6m9j4mN0
$$ -17 -48 25 42 -1 -24 -21 20 -48 -9 -5 -2 -4 -20 -14 34 -3 26 -51 -21 -14 -22 -34 -58 14 20 -39 -38 -24 39 -37 9 -40 -54 -58 -8
11993hL8Kl6j3Rk4L5lm5L0OLOKk2K9o1K9pjO5o9K8PKmK3r6R1k5Jl3K4k6N0l2J2
$$ -8 30 32 -4 -17 -8 -32 3 0 -45 -15 -9 -6 0 2 -20 9 -52 -23 -30 -31 34 -35 -7 0 2 -2 21 -75 16 -9 -8 -41 -17 -43 7 -25 -13
12030a3jJ5lj1j0J1K4m1L9m8K1K6J2m1j8J8oPM9k7K4m6MK4j6j4J6Np2P8L4j4j4
$$ -13 -14 1 -2 -13 -23 -12 12 -29 10 -38 -17 9 21 -20 -38 -20 -26 -19 30 3 27 -19 -15 9 -7 -21 -5 0 -72 6 40 26 12
12063A2j5k9L6k2k1NK8NLj1L3k6k3J8K3m8OM3j6Pk7NM5o2K1RJ5l7Mk6jN6rNj7
$$ 12 -3 -32 4 -18 -39 -34 -6 -1 2 -9 24 -2 -25 -7 16 -32 -26 17 1 8 -19 -14 31 -31 -10 -1 14 -23 -19 -45 -46 10 1 6 -11
12098a1j0mJ1j8RN4o3M1k8j2L6rQl6j4K6Oj9M8l1J2No3N3m0j0O6%M1n6k4Qj5R
$$ -11 -21 -25 -14 -32 -23 31 -32 9 -19 -31 5 -4 4 -32 -46 -20 -14 -33 15 -16 -4 1 -62 -9 -49 -59 7 7 48 -8 -32 -24 -39 -30
12132c0J4k5LJ4oL3J4k3K0n1j6O1k9j2L1K7m7J2K6l9K7K3kj5j8OJ4k9K4J0l7J
$$ -30 -16 -41 -38 -24 -30 3 17 -6 14 -37 -53 8 -21 -33 -2 25 -22 -10 16 -23 4 27 25 10 -8 -2 12 -17 7 17 -20 -19
12164a9j9RN0m7M7k8J2K4n9N8k9j2L7k4m4L1K6J2%l5J8k8J4j5K2j0Lj5N8l7k7
$$ -19 -38 -29 21 -26 21 -7 5 29 -30 28 -1 -13 24 0 -44 -13 13 25 25 -10 8 -20 -6 -21 1 -9 -6 -21 37 0 -27
12195b7M6k8J2j9K2K0m1L7j1K4k0k5K1kl4J5P2n2KjkJ9rKn5K4Rpj9K5L2Nk9J6
$$ -27 19 -9 3 -16 6 26 -15 22 11 35 15 -10 11 9 -25 -10 62 10 12 11 9 28 19 21 -34 -10 -1 -8 -27 -2 30 35 6 22
12229B2l5PK9KLn7M8n8qR3k1l5JK2K6p5N3k3L4qk1%m6j1O0k5J4J2k8L1k7M6rN
$$ 22 -13 -6 23 25 28 -29 19 -39 -47 46 25 -10 -9 13 39 -36 17 -6 28 20 -1 -1 -47 -58 2 -23 -9 3 -25 6 -21 25 16 21
12263B1j3l2M2l9J6j2L1m%k9J2m8P1k0l7K4j9L5M1n6rJ9j3K5n9J2O8k2Mk6M3l1
$$ 21 8 -24 18 -21 -5 -17 14 10 10 -19 -7 -55 16 -4 -41 -17 -36 -1 40 -16 -25 -6 -19 6 -53 -41 27 5 9 -17 26 -5
12295el8NL8kl0lJ4jJ6j5O6n3J0k4KJ6K2k4j4J7j8J7Kj2K6l3N4j1j6n2M2K9o7
$$ -5 -43 -38 0 -2 -32 -35 -21 -22 -6 -21 45 -8 2 -22 -20 -4 18 -6 -20 -3 -21 -4 -2 -14 12 -21 33 22 6 -46 -4 25 -42
12328d2JK1J7J2J3K1l8m5R5p0O3m7j1J1j4k2M7j8j1JK4l6J1PM3n7M3J8m3k4K9
$$ -42 -41 -20 -3 9 22 43 5 -40 55 -15 48 1 -10 1 -13 -35 12 -6 -17 -16 8 -28 -17 -10 33 -24 19 37 -6 -30 -1
12359aPl7P1m3l9L1pK2n5N7J4j2m2OM9o6O8k9l0J1oL1nL0j9M6n2%j5NL0l8L4m6
$$ -1 6 -31 40 -3 -42 -11 -18 4 -51 6 20 8 -34 -28 21 -45 23 -6 -36 -25 -31 0 -5 25 6 52 0 0 -15 -10 20 -18 16 -30
12393c0K6m8J9K5m5P5m9K3jK3m9O1j5k7j6M9k9k4M2KMj3qj3K4L0k7j4J3j2Nj2
$$ -30 -4 -52 -33 -8 -53 22 -27 -4 -5 18 -31 30 15 -12 -28 21 -8 -32 10 12 16 3 -5 -18 6 36 9 -5 8 -4 1 -11
12425a1%K8kM1o9Ok4PlL9lrK5n8O8Kn5NJ0J8k3K7k0J4l9L6j6qLk5M4J7J2n2J0
$$ -11 -11 17 15 56 -13 -7 -31 -24 -27 12 9 0 25 -33 35 37 -18 -13 -3 15 -8 19 -1 13 -26 10 -6 -14 -11 -36 8 25 37 -15 -5
12460eL7j3nl4L0J6p2N6pMl3O5m1l1LlQ0o9qJ5J8m9O0k2K4Rk6PRn5M5pOJ3l3N1
$$ -5 32 19 14 -20 10 26 -46 10 3 7 -26 39 -2 -33 -30 -33 47 -22 -30 -15 3 -46 14 -8 16 25 -1 6 15 -40 5 -2 4 17 -16 35
12496C5p9J4M3n0oL3qL6k8J9pRl1l6M4O5o3J0LmJ8kp6P6k2kM8q1M3K3k8J2qoN6
$$ 35 -44 -30 13 -37 -43 -10 -18 18 -10 9 2 11 -20 -56 -12 53 -10 0 3 -1 17 15 -61 15 -7 -9 39 -42 1 24 -4 8 0 -6 50
12531E0m4KJ3k9M3r5Q5m5K6K6j7Nj7N4l8m3P5p0O3o5L4nl9MK4j6J3L6l1l3O4l5
$$ 50 6 8 21 -8 35 -60 25 -20 6 32 15 20 3 57 19 -24 51 -19 44 -21 13 8 -31 -27 -3 -19 -6 30 -1 -34 30 -5
12563enj1N3k5l3L3j0NM2l9Ll9L5Rk6m2L7pLL%J3J7k7L2l9K4kkj2LJ1pj5J9M3
$$ -5 -10 -21 32 7 -26 7 -3 2 44 5 8 -31 4 13 -13 -55 -18 -25 -22 -19 -19 -6 11 -16 16 -23 1 -1 -3 -15 -12 -1 -8 -23 -4 39
12599C9m5K2Rkj2l5NOJ1O6q7K0L0m5M1oJ0qk5Mk4J6J3k0qJ8j8k2O2K0l2k5M0m3
$$ 39 -6 16 25 23 11 -24 -19 -13 -2 64 -23 -3 27 -18 23 17 27 19 -6 -2 -26 -10 3 -17 -25 -7 -25 -47 15 35 3 -22 18 -25
12633b5oM7k0j1J1k3MJM1m2nPnO5l1K3p5O8l5pMoK6n6M1oL7j6n4N5n6M2j6K0J2
$$ -25 -31 16 -4 -15 -4 -27 -23 -22 19 -23 -28 -21 -26 39 8 31 -44 24 -11 -18 -14 -20 6 -50 -9 -15 22 6 -48 7 -49 -7 -23 -3 9
12668Ik1L4n3jM4j1Jm9J6k6N6l0J9J6L9o0mN0p7M6m7P0l8j1OQk6M4l3pj2L5j7
$$ 9 -12 22 -31 -32 12 1 2 -47 -31 -57 -1 -31 -12 4 43 -17 -21 29 -48 -2 -49 21 -17 -28 -22 -14 -40 4 -29 -36 -48 -13 -30
12701c0K8K6n1L6rj7Nj6K8lj1RRkL8k9jl4kL3j7P6n3l5J1k8P0j9l6KL4n4M5m4
$$ -30 -2 24 -27 9 0 -17 -12 -28 0 -3 -14 -5 4 2 40 11 10 -24 -26 7 -10 66 13 -22 -11 -39 31 12 -24 -22 12 -42 3 -41
12735d1L4k4K3Jj7kl9P3j4k2L4Jm8O9l0l3L0l5rL8k6L3k8K0nM8qk5Qn1P3n0K1
$$ -41 -7 -31 -8 -7 -24 -26 -65 8 -6 -28 6 7 -41 28 -2 -35 -5 -40 -49 -11 -37 -4 -32 -12 -17 31 23 -2 6 -45 28 -22 -1
12768am0N7o5QQ4k5lm4%O1n6OJ3k8O0j3lpk9QmK9jj2L7q9M3LJJ4nk8L0l3qM3K3
$$ -1 -41 16 -49 -41 43 18 15 -29 -29 32 -24 -18 -5 -33 27 14 11 4 -25 -17 -21 8 7 -5 32 -57 -14 -11 -10 4 -1 -29 1 -32 -40 3 26
12805B6LJ1n0Kj3M2n4J1KL2k0l9J2Ok5K5KK9mLoJ4rK1k8K3l5J6j5K0J7k0L1n3
$$ 26 29 40 -10 -8 -21 21 -33 -22 -20 12 -8 -47 -35 -29 -54 -29 -27 2 -2 1 -5 9 0 21 -7 16 -19 -3 -18 2 19 -1 30 -23
12839b3L0j3M9l2j8lj1lM0K5n1j8qN4Pk4j7j3O8m0PmN8k9k5J5k3l5J9P1o2j4L9
$$ -23 7 -6 43 11 -7 -10 -21 -24 16 41 -10 -28 -36 18 25 1 -16 -29 39 -1 6 2 60 31 6 21 -2 -37 -18 53 -9 -23 16
12872A6j0p2O1OL1pl4L4k3J2l3K8n7N4pJ5J1k9l2j1N2K5o2N0m6N2m3R%K5p%on3
$$ 16 6 -66 -5 1 32 25 -9 25 2 14 -19 9 -48 6 -1 14 25 -4 -36 -47 5 30 -32 18 -28 24 -19 -10 -10 15 8 8 2 -51
12906e1P3m9Q0k3j6j0pl5M1K4J2l9K8l6mkJ0RrRl1O9n2J0l4JO4qj4L8n0l0L9j0
$$ -51 22 -27 53 30 14 4 -3 -38 3 27 39 0 28 -8 -12 -14 -4 5 -4 5 -26 43 -9 1 -33 -32 32 24 10 48 -2 -32 7 -3
12940ck0mQJ2N3q7nO6nmMk3j2J0L5m0M2o9N9l8j2J4K4N5o8M0n0J2J9K8n4N9p1
$$ -3 -23 -27 -19 -7 46 -41 -46 20 15 11 15 -8 -20 -10 25 -15 27 -42 17 -21 -33 -19 5 60 -8 32 -18 -6 13 41 -13 46 -25
12973b5K3L9l9oj1JL1j7j4N6n0L7j8j5M4m4M9m0mj4M3k9k5J9L5%n1L4J6j6j0K
$$ -25 -2 37 -2 -8 -19 -18 13 -4 -18 38 -12 25 7 -8 36 -8 41 1 -3 -17 26 -3 -28 -9 26 26 -25 9 25 9 -1 1
13005ALnj8L0l7K1J8oL3k7nj3j1N5l7j0J1kl5MJ1P3o7J8l7P2J1o6J2oK0Jk0JK3
$$ 1 4 -1 -19 11 -26 -5 13 7 40 13 8 -5 -16 39 2 -8 3 1 -34 -30 -19 54 -13 5 -32 40 51 -15 -3 -9 11 12 -8 -7 16
13040A6k4j7PJ7j1L7k0j4rJK7m4K8j8L5j0j9L5%k6L1j6rK1k8PJ5j2mL9k7L2m3
$$ 16 -8 -25 -18 -1 -12 25 5 -9 -18 -17 10 -34 -6 -24 11 1 -18 17 17 -9 22 6 -3 18 -10 -3 12 0 -4 35 8 40 -3
13073cN0p6L7J6J0K7r1O0nM1q9L0k9N3pn9N3j1l0O8p9M5Nq0P9n3L7k9J6oN0M8
$$ -3 47 -29 8 24 34 61 -30 30 25 66 -23 7 -22 31 24 -35 18 7 -23 45 -34 11 16 -64 15 -38 -1 -30 -14 -20 30 78
13105G8q7M2J1j8l7j5M4rJ2m1J2j5K6j3rJ1PJ0l9L5K2k2oK5m4L5n7N4m8K9K8k6
$$ 78 -9 33 44 26 -11 -26 18 9 21 -20 -8 -23 3 -10 -19 -8 -1 9 -30 5 27 5 -1 24 -20 15 -42 12 -36 -7 21 -5
13137eJ0M1K2m0qk4k0J5k3O3m8M9l9J2L7j5m7O3j8j0Om5L0J5k1K3j4n0L1l3L3
$$ -5 5 46 68 28 20 -4 -24 -9 -32 31 -17 32 -7 5 42 27 -20 43 25 15 21 -24 6 21 0 23 9 -41 -10 -43 -10
13168a0J8Kkj1K9j2j5Ll0O5k5ML0n9k1N5o1j5O5j7M1lm7P7j04K5okJ6%O9o9J0
$$ -10 8 10 8 -3 26 14 -1 2 -28 37 12 16 46 -13 -34 21 -40 -55 10 -7 34 31 -16 61 -43 -18 -24 -26 -10 -10 59 -10 0
13201@k3L1m2J1J0JK2Lm7M0M0n5j6M7m6K3j6L0nl6j0N2l2L5k8O2m6l8K5%Kn3N2
$$ 0 -23 8 -34 -23 -13 -12 10 13 -34 6 46 -9 -25 22 -24 -1 -17 13 8 -28 -38 14 -18 17 -11 51 5 -33 -8 -8 -6 -59 -7
13234gpO5n0kk2j3K6J4j0nM1pp4R8q2P2l1m5Q7n0lJ8K2m7k5M8J0k3RK1j0k7L1
$$ -7 -14 51 1 -1 -23 -36 -10 4 -6 -11 30 23 -51 47 -35 37 6 -39 48 -2 -5 13 35 -12 -37 11 21 -2 7 28 18 -9 22
13267B2n4R5o2pL2o1Q8j10L0L9m9O6j5Pj2k9K4K2o1J7K6rk8J0O9k6j7l8m%JK8
$$ 22 -32 63 1 -6 26 -35 53 -57 -27 12 -37 29 14 21 9 -20 4 26 -35 -18 8 -1 -29 -19 50 24 7 -31 -35 -35 -34 -6
13299fL1j7J1o0J5mN1n5JN1Jl9j8JJ7PJ8p0k7N0N7l4K8l3K8j2j6J4K2j5L7k6n
$$ -6 25 8 19 -41 -26 -30 21 -34 -33 18 19 -20 -38 -37 -20 -13 5 -65 -92 -42 15 -19 9 -24 4 -8 -24 -10 12 -3 34 8 3
13332CK4L5m4Lj6pN0ll2l1%j8P9l6mOL0m8%oR%Ko1L1LN2o3L2j4M9o3L4%J9rk0
$$ 3 27 62 18 21 5 -2 48 45 13 -18 -18 -36 43 7 3 9 39 -9 -9 -15 -6 -6 -4 -65 -34 -31 21 -42 -10 -24 25 -38 -4 -4 15 6 -14
13369a4jK8l3M5l2QK3k3qL4l0j1NKm7K1N5n7J3K7KRJ7n3k2M7K8j9j7k3K5Qj6k0
$$ -14 -15 13 -20 25 -7 1 24 1 -7 27 -3 -14 -9 -7 -54 -33 22 -35 -22 5 7 16 33 -20 -42 5 33 14 -3 -26 -1 7 -9 -29
13403b9K2j8j2N7n2L7J5j0nKn4PL3J6l2l1K4j4K0j7j2M0J1L2m2j5mj9O7l0J0J5
$$ -29 -7 -25 -37 20 -32 5 20 10 5 7 -47 -40 -7 9 -23 -54 -30 -44 -24 -41 -53 -13 -2 30 -12 -27 -31 -50 17 -13 -3 12
13435A2m5j6N2k9kJ9k0%L8k4j3j2M0K1n0pnL8Kj5Ml5L3K4n3j6MJ7K7l1N0l4l1
$$ 12 -33 -49 3 -26 -28 -9 -29 -29 9 -15 -28 -40 0 21 -29 -36 -41 -3 -1 -16 -12 -47 -14 10 -43 -59 -55 -38 -11 -42 8 -26 -57
13468e7J9pk3M5Nj0jk1N2n5L0j7M3K3n7M4j9j0lKk2KK4L2k5roKPkj8N1l1k1ML4
$$ -57 -38 -45 -68 -23 -18 -28 -29 -50 2 -53 -23 -40 3 26 -31 13 -6 -16 -19 -17 -39 -37 -13 19 -6 -15 -21 -19 -12 -14 -32 19 -12 -33 -29 5
13504Ej3p3J06l0m2L4J8M3n7j2J0jj6qJ6j8M1lM6k5K1lp6O9m9Q5j18M4m7M0K5
$$ 5 -8 -81 25 -5 -47 -13 5 48 -9 -21 -11 -12 -28 -36 -20 -38 3 0 46 21 42 39 -37 32 -17 68 -50 -6 -53 -13 12
13535A2j1L5m0pM9j3k0j5N0q8M9j2K4j5kM1o1J4l6K1K5k0k0pK0K5j7M6n5M3q2
$$ 12 1 36 -4 -11 38 25 5 -10 40 -48 1 -11 13 -2 -4 37 -24 -10 -46 -25 0 -20 -40 -47 -27 -2 -19 27 -28 15 -67
13566f7M1NPKqj7L5nRm4L8loj2J4npN2n1K4L2l3%J3m%rRk3jl7K1M6kOm0J1Ol6
$$ -67 -26 -21 -14 -12 -20 -37 -2 -7 2 -42 -4 -7 -13 -25 -11 -16 -23 29 -22 2 34 1 1 14 10 10 1 10 -13 -14 -51 -30 16 14 20 -20 -9 -3 -39
13605c9O5k2l3J3K9m3N4j6L1rM1n5J0Ok5k5L0k1N1p2M4jmkkK6j5o7N4nj1O5k8
$$ -39 26 4 -29 -16 13 -30 24 8 39 30 71 16 26 32 7 -18 12 -9 42 -30 14 13 9 7 5 31 16 -51 3 -2 -13 52 24
13638B4p4O9j5k2N3n3nP5m7l0L7l2M5k3N6m9kK5l3J7kkML5k9%QK0l6L4p9P6k7
$$ 24 -50 19 4 -18 35 -18 -23 52 5 -25 12 -20 25 2 58 9 7 32 -1 16 14 12 16 51 22 22 30 50 14 48 -31 45 18
13671A8j8K8o3J4JK6oM2%k6l3K7L2m1l6N1p2J19o6QJ8j9J2k9J2ml8P5q6L9J3M2
$$ 18 0 28 -35 -21 -20 6 0 42 42 16 -17 10 42 1 -35 16 -56 63 -3 5 23 4 16 -13 -1 -5 -43 32 -54 -15 -2 40
13703D0nk7PMk6L1Ok2KK7q2R8Or3P0k4j1mnQn2P3j9NRK1n0L8j8j4L4k3L7j2J6
$$ 40 35 8 15 19 -7 24 30 8 10 37 -45 53 59 -34 36 12 1 -3 -8 0 -52 21 2 7 16 37 -13 25 7 -7 27 4 41 29 45
13738D5q4N6pl2M1j0m7O3j0K9k4Oj7l0L9pJ0l3K9L1m6MqRJ9n1N5m2L1j6j4L0k
$$ 45 -39 17 10 -22 19 9 -38 25 15 44 20 26 9 -21 18 11 21 -12 17 48 2 6 -2 7 26 -25 30 -12 19 3 -11 19 17
13771A7m0N1j0k5J0J8o7Q7j11P7k2l0J3ML6k2j1JK1Mk4K9k1K9l8l5P4ol0J3JJ4
$$ 17 -23 28 18 -7 3 21 -46 41 -70 7 -15 -45 -32 -28 8 -14 -25 -24 -3 1 -23 6 -15 14 -24 -59 15 9 -21 -8 -7 7
13803Gj0nJ3K0qk8m5J7O9m2M5m3%J1k3L0l6L7K8p5M7j9l0K2J7Klk3j1K5J0K1l3
$$ 7 -3 -8 5 25 17 -11 -56 -39 30 -12 33 -10 -10 1 -22 8 -28 9 37 -38 9 -10 -40 -18 -1 1 -2 -25 -36 -11 -1 20 -13
13836a3k6M5l6K7l5L3j3K1L1p3N5j8j7j8N1j1l7L4k5M4k9l0P2o8P6o6M0K0m5K
$$ -13 -39 6 -30 -3 -38 -5 -18 3 34 -39 16 -2 -19 -37 14 3 -34 0 -25 19 -10 -40 32 -36 40 -26 14 34 -11 -9
13866iJnM9o7J6j7K8J9l5K9Nkn4M7J7l3k9K9j2j2K6p0J19jq8O3k5ok7N1m8j2O5
$$ -9 -8 -13 36 -31 -15 -32 -4 15 -20 9 14 12 -42 5 22 -11 -40 -11 -23 -35 -9 -79 40 39 -49 14 -11 -17 -44 7 -41 -53 12
13899A2j4LK0K5j1q1R8m9j9pK5l0J8N9o8L6o9J0N8rj5k8J8JK0l9L0QJ1L4p1K5
$$ 12 -2 1 21 46 35 -46 52 3 -16 -23 2 -28 -10 49 -19 17 -52 -42 16 7 -8 -36 -18 -17 3 -36 -6 2 13 47 -24 1
13931An9K7%M4kk5J4M3n6j7PL4J2j7k0K0nK7l6J7J2p4M5j6J9Rnpk0lM3j5K4k4
$$ 1 -58 -31 -31 13 11 -14 0 43 -13 -30 -23 11 23 6 -14 6 1 28 -8 9 21 -53 -8 -24 -5 4 -1 -8 -28 -31 12 -3 21 -3
13965cJ3k0J8K7l6L1n2jM1m3J1ll3R0n6Ro4M7kNO4n5J0j9OK4L8k8l0J7j0J6k5
$$ -3 10 -10 8 35 -1 30 -22 -23 18 -25 -14 -17 -50 40 -16 -7 -71 -24 -26 -21 43 -12 -2 -21 -15 9 47 19 -11 6 -4 12 -13
13998a3K1k6j5oO9K7n4k4M2l0J4L5J5o1J5m6J0L4n5P3Ll2N2p9O6p7Q6k3m6O2m4
$$ -13 8 -18 -33 -39 30 57 3 -21 21 -9 5 40 55 -6 9 -37 -27 7 -48 25 28 -4 48 -31 35 -42 44 21 -25 37 -7
14029gOj0OOJ3n4rJ9L1LNnj6J9L2L2p0k6L8o0M6J1l7L6j9l7NN5j1l5J0Pj7J6Q
$$ -7 -1 -11 -5 1 14 -40 -49 -30 1 4 9 4 -12 7 39 71 1 -25 13 -47 -1 10 -27 9 -10 -47 -42 13 2 -33 -23 -16 -33 -17 -9
14064il1j0L3l3M4j1rorN2m2jN4n4J2J8j6k6L7j7j7J3Mj3rK5L4l4L6j1n1O1m5
$$ -9 -40 -50 -17 -50 -6 -17 -26 -32 -41 11 -31 -32 22 -32 -20 -2 -18 -44 -7 -24 -41 -28 -24 -37 -46 -21 13 -21 15 4 -47 14 -31
14097c1J3j9KM9Km7L8jm2M3k2k1O8m1J3l8L2J7kJ2p0J1J4M2k0k2M1j4J3m7J0J1
$$ -31 -18 -37 -35 14 16 -31 7 6 -36 7 -15 -36 32 -9 4 -34 -2 15 13 25 -45 -34 -20 22 2 -20 21 7 20 -27 -17 -6
14129fK1J8n0j2O0j9j1qJ7rj3Oqk5M9l7jk9P8qj9M0p7J8Lk2N7Rm1nJ0j6J1k4L5
$$ -6 15 33 -17 -29 31 12 1 -7 10 1 -12 -6 -14 -39 10 -27 -28 -57 21 13 -6 34 -43 -25 -22 -44 13 22 -19 -24 -14 -30 -19 -43 -8
14164hJ4k6L0m7L7knJ7k0O0o8O9q8jK1J9nOl7L0rqj8M9p0P7J5m7J3k3J5j5Pj4
$$ -8 6 -20 10 -37 0 -2 -7 10 -10 50 -18 51 -37 -38 -17 2 -3 3 -34 -4 -13 -21 -39 10 -60 17 32 -15 -2 -25 -10 -25 -18 -32
14198c2N2l2Pk5j1M1K0j5j1MK1m7Pnj8M9%J6Nr2N7K0Kj1L0l3l3K9J2m3M0Mo8N3
$$ -32 20 -12 -5 -30 -41 0 20 5 -6 -2 19 -28 -21 -26 -44 5 5 21 26 -66 -9 11 13 2 32 -1 -34 -5 7 -36 4 8 -60 -7
14232gJ1pl6M8J2n2L4j0j5j7J7RL4k2OPm7L5jl5L6mLjk1M7m4jl0M8orO3m7K3j4
$$ -7 4 -3 -39 9 21 -31 3 -7 -22 -39 -22 -13 21 -1 5 12 -35 0 -1 -36 0 -4 -1 -2 -23 24 -20 -21 -51 -3 -9 -18 45 -2 21 7
14268Gj8k4PN7n6J5L3p6K7J7Lj3K5j8k1K4j0P3p2j0L%j3K0L2pKRnj8K0J4j6mk9
$$ 7 -11 -35 -28 29 -27 -12 21 -55 -28 -11 -8 -21 4 -14 -35 -11 -21 52 -20 -30 -27 -27 -40 -20 12 5 7 16 11 -7 13 27 11 7 -22
14303b2KLl4J8KJ0K9k8k6L1JJ3KJ5j9j5KJ0qk9J4L1l0K0PK0kk5l6M3J8k6Q4q0
$$ -22 -20 -17 -51 -33 -31 -21 8 -20 -46 -15 -14 -1 1 16 -3 -18 -16 -6 -14 -43 -29 2 -28 -8 -1 19 17 -8 -44 -1 17 -9 75 -5
14337em4N5n4L5N0o5K4jJ9l2L3k6J2M0l0l5N3mj8M8o8k0M9M3n3l2L8J9l7rK5K8
$$ -5 -49 6 -48 -13 37 -28 -4 -5 14 -18 15 -11 1 41 11 -24 29 25 7 55 -13 -33 16 59 6 -26 12 31 -6 -15 10 38
14369C8m9K8k1rM9o3L3nO6p4J7rNJo2Q5J3l8nJ9m5M0k8Ll1M5Jl8J7L2K2j8N2n2
$$ 38 -11 17 -4 -13 36 -27 6 1 67 -7 10 1 6 7 -55 30 43 5 0 19 -26 14 -14 -11 -42 3 4 -34 -17 15 37 19 71 19
14403A9Nn6K8LoM7q3P6qNk8l8K9lj0K4M9k4J4p2L0j6L3j2k8N9n4L3%k8J2J1lm
$$ 19 24 -32 -4 -1 -7 40 -43 33 25 30 2 -36 -7 -10 -20 4 53 29 43 -29 1 -15 18 6 -22 37 -17 16 16 -12 0 11 8 4
14437DJ7j0j3k3L0QN5p3j6M9K0j01J7J0nO0m1M5j2l0J9k4L3L1m6M9p2L4Lqj4m5
$$ 4 21 11 -2 -25 5 13 68 -5 -21 28 48 -53 -36 -26 -31 29 -12 33 21 -9 10 -14 19 50 4 53 -19 15 18 10 -4 -49
14469d9M8k6K8K3k1j3Lj6L8J3l6L9o0K9pk5NM2j3kk6K7L5m9nP1o9k1K6O4l6l4
$$ -49 -1 -27 1 24 3 -10 -7 -23 15 28 -8 31 -29 0 -7 -32 -27 15 2 0 -26 1 36 -13 -18 53 -16 -37 -11 53 17 -17
14501a7J8j8j0L3lj4Loj5L9Ln1M1K1pp3O2k0j0K1l2L1nqL6m9J8J1Ok1LJ8l7K3
$$ -17 1 -17 -27 6 3 -11 -8 -14 -29 10 13 -38 3 24 17 -56 6 -14 -24 -3 -35 -4 -9 -17 19 -30 -12 -1 5 -16 -13 5 -32 -9
14535iJ4JJ0l7J2j3J9j1l3Q7q9R2n1J1J7j4rpj1K6oRm0M9l3L5k9NQJ4j6J2K2p0
$$ -9 5 6 16 -21 -9 -22 -3 -14 -47 40 -49 43 -8 3 20 6 -3 -10 -21 5 -1 8 -32 17 -16 19 -10 -5 3 17 1 13 35 -35
14569c5J0J0M0l2j8PJ6J6j2mk6L1J5J0n4J6j8K4j1J8l0J8j0l3O1m1Oj7j2K6L8
$$ -35 -25 -15 25 -7 -25 -18 -2 14 2 -2 -28 3 18 28 -26 -10 -28 -4 -15 3 -27 -9 -19 -52 9 -32 -26 -43 -55 -29 9
14600IL9m0l2J4k1L8n8M2oM9j1j8l1jQ5p4K6k9PP8m7K0m4m3N7k4M9l5j8MpjO6
$$ 9 48 8 -24 -10 -31 7 -51 -9 -15 34 23 5 -26 -27 58 -16 10 -19 -12 66 19 39 -5 -48 9 -15 34 -1 -19 -15 -22 -23 43
14633D3Jol0m9L8j2RJ3J2n1N3j3J8n9N2m7M1k1K9pJ2k7J0mk7L1j8RJ3o%lj2o0
$$ 43 44 38 8 -41 -3 -15 -6 7 19 -32 21 8 26 -33 19 -28 13 -8 21 14 26 -1 9 5 -22 9 -9 0 13 7 7 4 -8 -68
14667f8P1j6j5J8K5qj4N0m4Kl6J5O1o3RKk1K8oj%RJ8K7m2%nl4J7j9P0k6PnJ4p5
$$ -68 3 -13 -28 -10 15 7 -7 43 -1 1 -35 -20 41 -22 -13 -11 -32 -4 -10 -11 -11 -2 16 43 1 1 -4 -38 -21 -40 30 4 11 6 20 -55
14703e5P1l6L8Jm5M8p0RMJ7KKk3N2j4J8p7P1n3K3K5j9L2k3K5l5Lj8J2J2K2k5l8
$$ -55 16 -20 18 19 -26 22 -48 -39 -35 -18 -16 -14 -37 15 1 19 -58 13 -40 -17 8 -11 21 -2 23 -12 -9 -27 -15 -3 19 -6 -44
14736d4O8n9L7J8j9J8nK6n9J5j9O6n3qJ9oj4Q5p1M8m8KJ3J3m9JK1M3l9K5%m7J8
$$ -44 24 -35 2 20 1 19 14 40 -19 -4 -23 43 -10 -18 1 -5 -19 66 -5 43 -5 -3 10 23 -26 -25 -4 39 0 25 25 -22 -4
14769dk3M0l3MmN3j2j7M6o9MN1m9jJ0K1nl1L0K0q7N4K0j9J1l8N8k0J5k0K4k9j9
$$ -4 -27 13 -20 -16 -20 33 21 4 50 -19 -15 36 -13 -14 -4 17 12 -19 11 31 -56 -2 18 -1 10 -28 30 10 25 5 29 0 -19
14802a9%K8J9m7K2J7Opj8J5j8%N1o1%PNj0l5L0L2lj0j4k8J5K8l0N0mMn3M2l8M2
$$ -19 -19 9 28 -19 3 20 26 19 1 16 -2 -2 49 -12 -12 -5 0 -10 -45 -15 17 14 4 -10 -38 -23 5 -25 25 21 25 -28 14 -24 18
14837A8ok8J7l4NL2J9k7mP4l3l3joJ4K7k7kj9j3N2np4M9j4N3k7qPLj9rK2j3qL7
$$ 18 12 -16 1 -33 -28 4 23 -4 -8 66 33 0 -1 -7 7 34 7 5 -14 -27 25 20 -54 -5 -19 34 7 -1 6 9 -10 -19 3 -10 -18 19
14873A9K8qj8jK6k2j2l2j5O4l3K3J9q1K2J5N1q8OO4l9JjL1kl6j3O1J1k3Nj4l2
$$ 19 47 39 21 20 46 24 12 -20 -35 29 -4 19 38 -43 -21 -6 45 -43 -37 27 -12 -11 -12 19 17 -19 -32 29 40 17 22 8 -24
14906b4ML1nJ1k1oJ4K0o4J5K3J7j1Kl8K2j3j2M6J0Rp5J7j6j2R4n7L1L5m2L8l8
$$ -24 -20 11 6 17 -4 -10 4 24 -40 -25 -2 15 4 6 -32 -10 -23 -35 11 21 30 -45 -28 -44 -56 38 -19 12 47 5 43 5
14938Eo4K4L9l5L0J7k7L4j7M7n4pJ0j6j2K7j4M2p4M3J3K5J2m3l1JL6l7L0k1L7
$$ 5 -59 -35 4 -31 -1 16 -11 23 6 53 -1 -8 2 -14 -26 1 -13 29 -45 -2 11 36 48 5 -26 -25 11 -26 4 -17 20
14969B0m0L4J1J5o7J8K1j8N3m6L1l9K1n4oK4N2l9J0k1PK3m0K0L0m9M0l4JL0j5
$$ 20 -20 14 25 40 -27 -9 12 -6 47 1 32 -7 14 -40 -46 -22 30 -9 1 -20 -13 10 -30 -10 20 -29 11 -23 -22 8 -7
15000gj8k3O4j0ok4K5m0P9l3K0m8j7L5K2Qlqok5L8k0j1K8q9Q5k2j4j8M7j3K1J1
$$ -7 -25 -48 16 6 0 -24 1 -39 40 7 27 -21 -38 -3 19 27 24 16 10 -15 23 3 -8 20 -69 16 -6 -20 -38 9 -4 17 28
15033B8o5M4J5n3J9j4M8Lj4k3L1k1mmj1K6k2%K2N7o5Rk4K5Jj5lm9Q2k2LnK3Mq
$$ 28 -37 7 22 -31 -12 -26 22 25 11 -12 19 -2 -6 -10 -21 5 -17 -17 5 62 -3 6 -18 7 8 -7 -10 -59 23 1 4 -1 22 26 18
15068A8j1k6N3Jk2l0M3K6p9M0j8L7K7l5j6j7J9k2K7J5p6R1l8rj4Q9k9l6j8L9J0
$$ 18 7 -19 34 35 13 -17 26 52 -27 13 -5 32 59 24 8 -9 10 -12 15 30 -46 45 7 -2 -16 73 44 8 -10 29 39
15099C9l7rRJ9m0J8oJ8J2j4K6j9n7L9L0n5P9m5j0k8L8j8j6K5o3J09n4K1j3N0k6
$$ 39 2 -7 2 21 -19 -1 -7 11 23 9 35 16 -41 -2 28 -27 52 7 -3 -31 7 -11 -27 -2 -65 44 -10 11 -2 48 22
15130B2j2%L3n7k0N2Lrk2Ol1oM3k6J8mN0l9j6J2K8J3o3J5Pj6M6q1L0J8K8m9J8
$$ 22 10 10 43 -14 -34 18 21 12 -10 -4 -35 -41 2 -24 -6 -10 40 1 -15 -3 25 38 -25 -10 -3 -19 27 -54 -24 -6 22 -27 -9
15163iL9oJ7ok7J2j8Rk6O1p3M9Kk8kL2j8J2mnj3LM3m8K4m5J2kl6O6Lk2Oj5JN0
$$ -9 30 24 41 35 8 20 2 11 -15 46 -27 22 24 -4 -6 26 8 20 16 11 -2 1 44 -4 20 -25 -13 -15 -51 15 18 -4 2 -13 -12 38
15199C8l1j3j1J2J8m5N6m4J1L5j7J2pjJ0j7j1k7J9N7o8k6J8M5l8j3N4J5ol3M8
$$ 38 7 -6 -17 -5 13 -32 24 -20 -9 26 9 21 14 13 23 6 -5 -32 -13 44 -24 -50 -32 13 -25 -38 16 31 25 -8 40
15230D0m4K9Ok6jQk8J8lj0jL4l7j2L8J3o3J0M7j0l5N5l4JM3n8NJ7k4P3pn0k1j
$$ 40 -4 25 31 5 4 12 -16 2 -1 -11 -12 22 -15 -27 11 24 -39 -29 18 8 -27 28 -6 -5 38 -20 -15 2 -22 51 44 -6 -27 -28
15264b8K0j0KQ2r2N1l6l7K9KK7q9L8P0j5l2j8L8jl1LO1p4M8NJlm6j2M5J1m4L8
$$ -28 -8 -18 -16 66 -26 25 -11 -48 -19 -17 10 -79 -41 29 14 -18 -36 2 1 -30 -27 34 -40 8 13 14 11 -35 -47 -2 9 -35 3
15297Cj9O9o2K8j3j0j3L3M7j15N6l1N3p2N2m8JjRJ3J8jk2L4Pmr7M2L2J6l5K6j2
$$ 3 -16 53 -9 19 6 -4 -17 16 63 -52 4 -27 26 -46 6 -42 -41 -42 -33 -20 -2 -3 -25 9 16 12 -85 -43 -11 5 -30 -4 -16
15330a6j0NK%Rk5J5J6Jm6L5rK4n6K0Q6n4l6k5M2l3QN2m5K9mN3q4L6Nl1L2j2j3
$$ -16 -26 -21 -19 -19 -10 -35 -20 -4 -3 -49 -14 -23 1 -55 -35 51 -3 -39 -64 -22 -55 -47 5 -40 -11 -15 38 -46 -10 -5 -36 -4 -16 -29
15364b9O9m2J2Pmpk7P0o6L5m6K3J1l8J4NqPj6%K4j5K0J1rJl1J9M1m8K2j8Rkj7
$$ -29 40 -2 10 17 13 6 -21 49 -17 18 -28 -5 6 -32 -18 -13 -21 -14 -30 -30 -6 -21 -1 10 1 2 -29 -10 31 -17 5 -13 -4 -6 -23
15399b3L7ln4Q1n1OJ0J8k5NJ3k4j0J2j7P2o8M0kk7j0J1NMJ3m4R7n4L0p6M8k4K0
$$ -23 14 11 -43 38 -13 -7 3 21 -4 1 14 -10 -20 -8 -25 47 -21 19 17 -10 -20 -9 -4 0 13 -31 66 12 42 -34 14 -10 10
15432A0l0J3K3Llk2j8L2l1M0qpJ0j0K3jqljJ0l5L3k2k2k4O2oMmk7P6q4L1J1l5
$$ 10 -20 -7 16 19 16 -6 -24 8 -23 17 9 2 12 2 25 24 16 13 12 22 -13 20 -2 -24 -48 14 8 12 8 -19 57 -27 4 15 -20
15467b0RK9J0m5M0n7j8O7J7j5j9M8n9K7JL3l0n2M5l7N6K0m5j6RK8Pn8K2Om5M8
$$ -20 -11 18 28 -17 23 -34 -52 15 32 17 -2 46 -13 14 15 48 18 -34 11 -26 30 50 5 -11 -2 26 33 -25 -3 3 -42 6
15499Fj9K6J0k8lj4Pj3N2pK6k3Jl3k7O7m2J6kj0L3j3j5J9JrMn4N2j4lNMoL6n3
$$ 6 -13 13 23 -5 -8 -22 -15 -28 24 17 43 20 21 -12 -39 28 -14 2 0 -10 23 10 -5 14 15 6 10 -44 8 -6 -9 -4 0 -6 30 -23
$$ [...]
16383a9
##END NTUPLES=NMR FID
##END=
