##TITLE=31P_DE-80H_X3
 64 sc D2O
 26.2.2025
##JCAMPDX= 6.0         $$ Bruker NMR JCAMP-DX V2.0
##DATA TYPE= NMR FID
##DATA CLASS= NTUPLES
##ORIGIN= UXNMR, Bruker Analytische Messtechnik GmbH
##OWNER= root
$$ XWIN-NMR		Version 3.5
$$ Wed Feb 11 12:21:47 2026 Russian Standard Time (UT+4h)  Yarkov@DPX200
##.OBSERVE FREQUENCY= 81.013821
##.OBSERVE NUCLEUS= ^31P
##.DELAY= (6, 6)
##.ACQUISITION MODE= SIMULTANEOUS
##.ACQUISITION SCHEME= undefined
##.AVERAGES= 64
##.DIGITISER RES= 17
##SPECTROMETER/DATA SYSTEM= spect
##.PULSE SEQUENCE= zgpg30
##.SOLVENT NAME= CDCl3
##.SHIFT REFERENCE= (INTERNAL, CDCl3, 0, 243.863)
##AUDIT TRAIL= $$ (NUMBER, WHEN, WHO, WHERE, WHAT)
$$ ##TITLE= Audit trail, XWIN-NMR		Version 3.5
$$ ##JCAMPDX= 5.01
$$ ##ORIGIN= Bruker BioSpin GmbH
$$ ##OWNER= Yarkov
$$ C:/Bruker/XWIN-NMR/data/yarkov2/nmr/P31/2/audita.txt
$$ ##AUDIT TRAIL=  $$ (NUMBER, WHEN, WHO, WHERE, WHAT)
(   1,<2026-02-11 12:21:06.53 +0400>,<Yarkov>,<DPX200>,
      <created by zg, POWCHK disabled, PULCHK disabled
       configuration hash MD5:
       00 E9 B6 7A A2 85 ED C7 34 08 36 98 17 FE 4E 26
       data hash MD5: 32K
       00 FD 6D ED 12 E3 F3 64 AC 4E A1 78 A6 41 C6 1E>)
$$ ##END=
$$ 
$$ hash MD5
$$ A1 92 8B C2 0E 62 DF 01 C3 6B FD 57 B2 0F 86 D1
##$RELAX= 
##$RELAX= 
##$RELAX= 
##$RELAX= 
##$RELAX= 
##$RELAX= 
##$RELAX= 
##$RELAX= 
$$ Bruker specific parameters
$$ --------------------------
##$DU= <C:/Bruker/XWIN-NMR>
##$EXPNO= 2
##$NAME= <P31>
##$PROCNO= 1
##$TYPE= <nmr>
##$USER= <yarkov2>
##$AMP= (0..31)
100 100 100 100 100 100 100 100 100 100 100 100 100 100 100 100 100 100 
100 100 100 100 100 100 100 100 100 100 100 100 100 100 
##$AQSEQ= 0
##$AQ_mod= 1
##$AUNM= <au_zg>
##$AUTOPOS= <>
##$BF1= 81.014009
##$BF2= 200.13
##$BF3= 200.13
##$BF4= 200.13
##$BF5= 200.13
##$BF6= 200.13
##$BF7= 200.13
##$BF8= 200.13
##$BYTORDA= 1
##$CFDGTYP= 0
##$CFRGTYP= 5
##$CHEMSTR= <none>
##$CNST= (0..31)
1 1 145 1 1 1 1 1 1 1 1 1 1 1 1 1 1 1 1 1 1 1 1 1 1 1 1 1 1 1 1 1 
##$CPDPRG= <waltz16>
##$CPDPRG1= <>
##$CPDPRG2= <waltz16>
##$CPDPRG3= <>
##$CPDPRG4= <mlev>
##$CPDPRG5= <mlev>
##$CPDPRG6= <mlev>
##$CPDPRG7= <mlev>
##$CPDPRG8= <mlev>
##$CPDPRGB= <>
##$CPDPRGT= <>
##$D= (0..31)
0 1 0 0 0 0 0 0 0 0.06 0 0.03 2e-05 3e-06 0 0 0.0002 0 0 0 0 0 0 0 0 0 
0 0 0 0 0 0 
##$DATE= 1770798065
##$DBL= (0..7)
120 120 120 11 120 120 24 19 
##$DBP= (0..7)
150 150 150 150 150 150 150 150 
##$DBP07= 0
##$DBPNAM0= <>
##$DBPNAM1= <>
##$DBPNAM2= <>
##$DBPNAM3= <>
##$DBPNAM4= <>
##$DBPNAM5= <>
##$DBPNAM6= <>
##$DBPNAM7= <>
##$DBPOAL= (0..7)
0.5 0.5 0.5 0.5 0.5 0.5 0.5 0.5 
##$DBPOFFS= (0..7)
0 0 0 0 0 0 0 0 
##$DE= 6
##$DECBNUC= <off>
##$DECIM= 4
##$DECNUC= <off>
##$DECSTAT= 4
##$DIGMOD= 1
##$DIGTYP= 9
##$DL= (0..7)
0 0 52 120 120 21 21 25 
##$DP= (0..7)
150 150 150 150 150 150 150 150 
##$DP07= 0
##$DPNAME0= <>
##$DPNAME1= <>
##$DPNAME2= <>
##$DPNAME3= <>
##$DPNAME4= <>
##$DPNAME5= <>
##$DPNAME6= <>
##$DPNAME7= <>
##$DPOAL= (0..7)
0.5 0.5 0.5 0.5 0.5 0.5 0.5 0.5 
##$DPOFFS= (0..7)
0 0 0 0 0 0 0 0 
$$ [...]
##$SUBNAM1= <"">
##$SUBNAM2= <"">
##$SUBNAM3= <"">
##$SUBNAM4= <"">
##$SUBNAM5= <"">
##$SUBNAM6= <"">
##$SUBNAM7= <"">
##$SUBNAM8= <"">
##$SUBNAM9= <"">
##$SW= 400.765351723535
##$SWIBOX= (0..15)
0 1 3 0 0 0 0 0 0 0 0 0 0 0 0 0 
##$SW_h= 32467.5324675325
##$TD= 32768
##$TD0= 1
##$TE= 0
##$TE2= 300
##$TE3= 300
##$TEG= 300
##$TL= (0..7)
0 120 53 12 22 120 120 120 
##$TP= (0..7)
150 150 150 150 150 150 150 150 
##$TP07= 0
##$TPNAME0= <>
##$TPNAME1= <>
##$TPNAME2= <>
##$TPNAME3= <>
##$TPNAME4= <>
##$TPNAME5= <>
##$TPNAME6= <>
##$TPNAME7= <>
##$TPOAL= (0..7)
0.5 0.5 0.5 0.5 0.5 0.5 0.5 0.5 
##$TPOFFS= (0..7)
0 0 0 0 0 0 0 0 
##$TUNHIN= 0
##$TUNHOUT= 0
##$TUNXOUT= 0
##$USERA1= <user>
##$USERA2= <user>
##$USERA3= <user>
##$USERA4= <user>
##$USERA5= <user>
##$V9= 5
##$VALIST= <valist>
##$VCLIST= <CCCCCCCCCCCCCCC>
##$VD= 0
##$VDLIST= <DDDDDDDDDDDDDDD>
##$VPLIST= <PPPPPPPPPPPPPPP>
##$VTLIST= <TTTTTTTTTTTTTTT>
##$WBST= 1024
##$WBSW= 4
##$XGAIN= (0..3)
0 0 0 0 
##$XL= 0
##$YL= 0
##$YMAX_a= 459
##$YMIN_a= -435
##$ZGOPTNS= <>
##$ZL1= 120
##$ZL2= 120
##$ZL3= 120
##$ZL4= 120
##$ABSF1= 60
##$ABSF2= -190
##$ABSG= 5
##$ABSL= 3
##$ALPHA= 0
##$AQORDER= 0
##$ASSFAC= 0
##$ASSFACI= 0
##$ASSFACX= 0
##$ASSWID= 0
##$AUNMP= <proc_1d>
##$AZFE= 0.1
##$AZFW= 0.5
##$BCFW= 1
##$BC_mod= 2
##$BYTORDP= 1
##$COROFFS= 0
##$CY= 9.86611175537109
##$DATMOD= 1
##$DC= 1
##$DFILT= <>
##$DTYPP= 0
##$F1P= 182.462994727601
##$F2P= 168.069089081705
##$FCOR= 0.5
##$FTSIZE= 0
##$FT_mod= 0
##$GAMMA= 1
##$GB= 0
##$INTBC= 1
##$INTSCL= 1
##$ISEN= 30
##$LB= 1.5
##$LEV0= 0
##$LPBIN= 0
##$MAXI= 11.51145
##$MC2= 0
##$MEAN= 0
##$ME_mod= 0
##$MI= 1.244541
##$NCOEF= 0
##$NC_proc= 0
##$NLEV= 6
##$NOISF1= 0
##$NOISF2= 0
##$NSP= 1
##$NTH_PI= 0
##$NZP= 1
##$OFFSET= 243.8632
##$PC= 1.4
##$PHC0= 1706.409
##$PHC1= -1.240479
##$PH_mod= 0
##$PKNL= yes
##$PPARMOD= 0
##$PSCAL= 0
##$PSIGN= 0
##$REVERSE= no
##$SF= 81.0140731611343
##$SI= 65536
##$SIGF1= 0
##$SIGF2= 0
##$SINO= 80
##$SIOLD= 65536
##$SREGLST= <31P.CDCl3>
##$SSB= 0
##$STSI= 0
##$STSR= 0
##$SW_p= 25641.0256410257
##$SYMM= 0
##$S_DEV= 0
##$TDeff= 0
##$TDoff= 0
##$TI= <>
##$TILT= no
##$TM1= 0
##$TM2= 0
##$TOPLEV= 0
##$USERP1= <user>
##$USERP2= <user>
##$USERP3= <user>
##$USERP4= <user>
##$USERP5= <user>
##$WDW= 1
##$XDIM= 64
##$YMAX_p= 0
##$YMIN_p= 0
$$ End of Bruker specific parameters
$$ ---------------------------------
##NTUPLES= NMR FID
##VAR_NAME=  TIME,          FID/REAL,        FID/IMAG
##SYMBOL=    X,             R,               I
##VAR_TYPE=  INDEPENDENT,   DEPENDENT,       DEPENDENT
##VAR_FORM=  AFFN,          ASDF,            ASDF
##VAR_DIM=   16384,         16384,           16384
##UNITS=     SECONDS,       ARBITRARY UNITS, ARBITRARY UNITS
##FACTOR=    3.08e-05,      1,               1
##FIRST=     0,             0,               0
##LAST=      0.5045964,     0,               0
##MIN=       0,             -435,            0
##MAX=       0.5045964,     459,             0
$$ Real data points
##PAGE= N=1
##DATA TABLE= (X++(R..R)), XYDATA
$$ [...]
3083 -19 14 57 -5 4 11 -21 -47 23 26 10 24 9 -32 -24 11 -33 -45 -13 -22 13 -32 39 30 -10 26 -28 -19 -30 -22 -31 15 23 -36 -2 28
3118 28 15 -42 -31 -16 -15 -13 -2 11 29 3 -8 35 6 12 6 -23 0 -1 18 35 37 11 23 -1 -16 -2 6 26 -21 19 -9 17 12 0
3152 0 -14 -15 -33 -41 38 -1 6 -6 -12 -6 -19 27 -42 47 -17 -1 41 -12 20 -37 3 -53 -5 19 -40 4 -13 20 3 -11 16 -14 -22 -1
3186 -1 26 -7 -19 -13 1 5 -26 -19 -21 -8 -7 0 -25 8 23 -42 27 -23 0 -19 17 -7 9 -25 -11 36 -4 -13 -14 16 10 -10 -30 16 47
3221 47 15 15 -10 29 -14 -42 -49 -41 -9 -3 -2 15 -30 3 -27 6 12 -32 -1 -17 -12 -6 -14 2 16 -42 3 -27 -49 34 -9 -4 19 5 -56
3256 -56 12 -3 -21 -76 61 -21 32 5 -35 -12 -16 -17 -12 -52 -31 23 4 -9 -18 -5 18 -13 -1 11 25 -53 -3 -34 -1 15 -4 4
3288 4 -15 11 -28 -8 -21 -34 -34 -36 16 0 -15 -21 -1 20 4 0 -26 -13 -31 6 31 4 26 -25 -14 -16 -53 -1 43 -2 -7 -8 -7 -16 -24 25
3324 25 -26 8 11 -4 9 2 37 -16 -35 -11 18 -20 -20 -6 -16 -10 -16 30 7 8 80 -5 40 5 15 25 -12 -31 -21 -5 38 -29 -40
3357 -40 -11 30 12 15 14 -1 -9 -8 40 3 22 8 -17 -2 -28 29 2 41 -9 -4 2 -5 5 16 2 -15 27 -7 -8 1 15 5 22 16 -15
3392 -15 -9 49 7 17 7 7 18 0 56 17 -21 -59 6 11 4 -2 5 -6 -13 24 -17 -36 -10 -11 -1 21 10 14 1 19 10 -7 -27 30 -10
3427 -10 -35 -42 42 37 -14 -20 -39 48 -18 50 19 -16 -7 -29 17 -19 11 -1 -17 10 26 6 48 -29 14 17 -8 -17 26 27 38 19 4 -23
3461 -23 -52 20 -7 -20 -9 9 -4 -35 1 -21 3 -14 -25 9 -18 51 10 -9 20 1 24 12 6 5 -13 1 -3 -48 4 -6 -4 15
3493 15 1 3 -38 -10 -21 19 -7 -41 -81 22 -44 8 -10 -27 9 -75 -14 14 -49 -25 -1 25 -43 21 -50 24 13 -47 0 8 2
3524 2 2 26 -19 -6 0 4 1 -4 0 -29 37 -12 14 29 -4 -18 -22 15 6 -26 -27 34 11 -11 -14 25 2 5 10 -26 53 -14 -16 5 -38 5 28
3561 28 -11 13 4 -12 -34 -4 -6 -20 20 -15 -27 -1 -13 -15 -22 8 -25 -13 24 -2 -21 30 -21 10 -4 8 -22 -21 16 -58 -12 4 -19
3594 -19 -2 -7 36 -5 -1 2 -6 12 16 -9 -37 -46 -1 2 0 37 6 -20 -37 8 -47 35 -19 -16 -1 27 -20 33 19 7 -16 21 31 -34 12
3629 12 -17 -1 -21 -8 -26 -23 1 8 3 4 32 -29 24 -8 4 15 20 -17 24 -30 34 30 -15 -9 -18 -14 -3 -6 -43 12 30 -16 -23 -8 -2 7 -36
3666 -36 11 -25 -12 -18 -13 44 14 18 -12 -12 8 22 22 -1 19 36 -8 -8 13 19 -30 20 -26 6 25 -16 -11 3 -26 24 14 -6 -2 28 6
3701 6 -7 -26 51 -1 -18 49 8 8 -6 11 -15 -13 -8 -22 19 -14 32 -1 -5 31 7 -13 -1 -45 18 -4 4 -17 -12 14 12 -47 -29 24
3735 24 -19 39 16 22 -1 22 5 5 43 30 -7 5 4 41 25 -7 25 32 32 10 -15 11 -3 -14 -12 34 -13 -60 6 13 -2 26 27 10
3769 10 2 -7 -27 -18 3 6 19 -1 -2 -19 44 -18 -4 4 -10 0 15 10 -15 33 -3 -33 7 9 49 -22 8 18 -16 -6 -6 -34 -2 1 21
3804 21 -1 -9 6 12 9 -5 9 9 8 27 -23 -21 -41 -54 14 11 4 17 43 39 9 1 9 23 33 28 -25 -25 -2 20 14 41 8 -30 0 -33 24
3841 24 22 -47 -2 -23 15 7 -4 -9 22 -1 -15 -5 9 15 -7 12 17 40 8 35 -10 8 20 -14 13 16 3 38 25 -4 -2 24 -15 -24
3875 -24 7 -11 12 8 -13 -9 -21 17 6 28 39 -19 -21 -21 -25 -5 2 -33 -44 21 -25 30 -3 32 -4 26 45 5 -37 -42 -28 25 -38 -33
3909 -33 -48 0 -39 -7 16 10 9 -37 -11 13 -11 18 -84 -18 8 1 7 -9 -19 19 9 -19 -14 7 -23 -48 44 -1 -24 -15 12 -27 24
3942 24 -13 9 37 -10 8 -34 0 -30 -4 20 -3 -16 -10 -28 -21 -5 -10 -12 -10 -6 36 -40 -2 -6 -4 -19 -54 34 -59 -3 -22 4 30 -38
3976 -38 -3 -37 -24 14 -20 -37 -7 -21 -6 -10 63 0 -14 -48 6 -4 4 11 8 -7 -27 -2 9 20 -7 8 55 40 26 -35 13 -2
4008 -2 -48 -28 10 -12 21 -1 23 6 17 -16 24 12 2 37 38 -21 -22 22 42 -17 -5 -4 -3 25 -39 3 -4 23 8 -23 35 -29 47
4041 47 37 7 6 -1 -19 -3 -3 -22 25 6 4 -11 -20 49 11 -12 -16 22 42 -12 -39 -21 16 6 31 -12 -18 10 -30 -21 -54 -5 -34 -12
4075 -12 -23 -22 3 -19 22 36 9 -1 -10 -7 5 -48 -19 -21 25 20 -20 -21 -16 -53 9 -18 -6 10 15 17 6 -15 5 -19 16 5 6 -18 4
4110 4 12 -12 1 -1 27 6 -10 2 60 21 5 -14 -18 -21 14 -29 7 32 -57 -6 2 6 20 28 -13 -3 35 -11 18 9 32 -4 1 26 -12
4145 -12 14 -30 -67 19 -43 6 -1 1 -9 -33 3 -19 5 -33 29 -17 -30 16 -36 25 -12 9 -17 -1 16 -40 7 -45 36 -25 -28 20
4177 20 -25 10 -5 25 -25 28 0 0 12 -12 -13 -29 -7 6 17 17 0 -28 3 -2 0 -26 10 24 -9 -7 -8 2 -34 -3 -65 -4 32 26
4211 26 16 -36 3 -9 6 1 -15 26 -7 -9 -9 -12 8 32 15 22 14 -28 -8 49 -24 22 -8 -33 20 -58 -13 -11 62 -26 5 12 38 23
4245 23 -6 -11 -1 -9 4 6 -11 -35 53 -20 -35 46 7 16 -4 -1 4 -1 3 42 22 7 -32 -2 14 11 38 13 -15 11 -26 1 -63 -2 30
4280 30 -4 -15 0 -4 1 45 -14 -35 -2 4 3 -22 -16 7 -27 1 29 16 -42 -33 -27 1 -57 -18 -6 -30 -16 -28 -10 14 0 -32 52 17
4314 17 40 -5 -53 18 -23 -16 27 -11 32 -28 23 -32 -40 9 -6 35 -17 8 -4 4 24 -6 6 17 0 -48 3 -17 -1 -23 -11 18
4346 18 -42 8 -1 18 37 6 -2 -7 23 -4 -3 -1 7 28 -29 6 -46 -5 -11 32 -28 -42 33 -33 26 -6 -3 5 24 2 -5 -32 -17 14 23 -22
4382 -22 -42 -24 -7 36 22 -8 -7 -23 20 -23 26 3 -4 -28 -10 -9 -6 12 -26 -62 -9 -17 -13 15 8 8 12 37 -55 7 -12 33 18 13 21 -2
4418 -2 -9 -16 11 -55 16 -36 -2 38 -26 37 12 -18 -12 12 -26 -31 20 -53 -22 -3 -17 -20 -58 -24 10 -8 28 39 -48 -20 3 -16 29
4451 29 17 -22 -25 19 -12 18 34 -4 24 17 -5 20 -10 19 -3 10 -36 -25 45 34 29 30 -2 -19 12 -20 6 55 -6 -46 32 -12
4483 -12 8 -14 -16 -18 26 4 -4 -24 18 -9 -14 3 -2 -1 -27 7 9 11 -35 4 0 -7 -5 -50 27 -37 29 20 -1 42 -31 23 12 -11 -4 14 47
4520 47 -24 28 3 31 49 20 -13 -14 -7 3 -18 -11 29 94 14 23 -21 -5 -16 -33 10 -2 -14 -7 -9 -10 3 11 5 -26 -38 18 -6 -14 -24
4555 -24 -42 -9 -22 21 -5 48 24 -45 -4 8 -3 0 27 -25 7 26 -12 6 -9 -32 -13 -19 -19 27 27 15 -21 27 -18 -29 46 -48
4587 -48 1 -16 -25 12 -24 2 45 -3 -7 7 -37 -26 40 -3 24 -39 -37 -47 12 -12 7 26 8 0 -3 -17 -14 37 46 -29 11 48 -7 29
4621 29 -46 -20 -12 13 -21 -5 -28 -27 -3 -12 46 1 -21 11 20 19 -38 -9 -6 -18 -13 -18 -60 -13 -41 -36 -22 1 -37 -29 20 -28 -31 -33 25 7
4657 7 -6 0 -34 -34 42 11 21 10 27 -33 3 18 -1 -10 8 -8 11 -12 -44 -31 -27 -17 -12 1 38 -16 -18 12 -32 -33 -26 -24 27 -7 -18
4692 -18 -38 -30 -30 2 2 -11 11 -13 -19 -31 16 12 19 6 4 -19 -48 -29 -6 21 -8 -9 -1 0 -18 -44 1 4 25 -17 13 10 5 18 32 -15 6
4729 6 -27 -8 6 -22 23 3 -31 -24 25 -28 32 4 -34 -2 -59 -9 -17 9 34 -31 -37 -38 25 -14 -11 26 -58 -14 21 -5 11 9 11 -14
4763 -14 20 -10 -26 36 -33 23 -10 2 27 -6 5 13 7 -18 5 -68 -6 39 -61 -8 2 33 -5 11 18 -13 17 -46 3 -46 -45 -22
4795 -22 2 33 -68 12 -43 -48 6 7 10 -35 2 56 2 -20 0 -31 -35 30 17 -35 19 -8 25 23 47 22 -11 30 -51 -43 -40 -5 -7 -44
4829 -44 -6 29 18 -6 -17 -14 -21 7 -15 -6 51 12 -27 10 -12 -19 -23 27 13 -22 -17 15 18 -27 10 -7 17 4 -3 -26 -8 0 47 55 -41
4864 -41 -42 20 -24 -28 -8 47 34 -16 -46 10 15 -41 25 30 46 -34 12 -10 -17 -24 6 -11 15 11 -14 0 32 36 4 21 5 12 10 3 47 -24
4900 -24 -3 6 3 -22 52 -8 -6 -1 -6 -28 8 11 -21 -40 38 -15 2 -13 -23 -5 50 -7 13 6 17 -5 -25 16 1 -2 13 -2 0 73 -17
4935 -17 -10 23 49 16 63 1 13 -1 14 -14 -20 16 20 5 68 -32 -6 16 -34 71 -19 22 -46 22 -33 -34 -6 19 -15 11 14 10
4967 10 -13 24 -33 0 -32 22 -17 -33 -19 -9 -2 17 31 -10 -17 -25 -26 25 -13 31 48 -4 0 25 11 17 4 13 -4 5 -13 10 -7 -7 -20
5002 -20 -27 13 8 -9 -2 5 -41 -3 -24 -2 29 -47 -2 27 -3 26 3 -4 -7 -10 6 -12 -26 -1 -11 10 -35 -3 -6 -14 -40 22 -38 -21 -8
5037 -8 -14 3 -28 1 6 -35 -26 8 -1 17 28 18 -35 0 3 26 13 -33 -9 5 0 -23 18 -23 -40 -30 3 33 12 -24 36 -47 3 -14
5071 -14 -41 5 -2 9 1 5 -20 -14 -28 -27 -23 58 -9 33 -11 -24 -12 -32 -5 55 34 8 -23 -26 3 33 -3 5 -12 47 -6 -23 -2 -9 -20
5106 -20 3 -10 33 35 -19 8 -16 40 13 16 -45 33 -12 -28 -7 13 -22 33 -29 -19 -39 16 -8 -23 -9 -4 -25 -23 -10 17 -16 -6
5138 -6 -9 20 -11 -33 -29 0 -8 7 29 -9 19 -25 61 -11 -64 27 0 -44 2 -3 5 -44 -6 -38 -14 -15 12 43 -8 -16 31 -21 -2 12
5172 12 -23 -5 -14 -31 -51 19 -20 -12 -9 -18 -78 3 -34 -21 -10 5 6 -39 10 3 30 16 -15 -12 -25 10 4 41 -50 30 -25 -25 5 -43 -28
5207 -28 -13 39 14 23 -1 -21 -24 -18 -25 -7 -16 -7 44 29 -20 4 -2 -59 -11 22 -10 -17 1 31 -40 1 -11 -3 -13 24 -58 27 -24 31 -4
5242 -4 -34 -15 12 17 -30 -17 19 -1 12 -32 -15 -33 14 -8 14 -25 -17 -4 -41 7 -46 -15 1 2 12 13 -14 -9 24 -9 -21 -7 -30
5275 -30 23 -19 -5 22 -13 4 -3 27 -2 25 -2 -5 13 16 37 28 23 -8 14 16 -42 -16 -5 -45 26 15 10 -15 8 49 -24 -22 -7 31
5309 31 26 -30 -4 -29 2 -9 -12 -34 -39 7 -37 -4 29 38 -13 -23 3 -26 -12 -37 27 6 -13 -22 10 -13 -29 16 13 7 -9 21 -2 -23
5343 -23 22 15 17 10 19 -5 -21 -48 19 64 -26 -16 14 18 8 -31 -13 -44 -10 18 -13 -4 -9 2 -13 0 23 0 -1 -36 -23 7 -12 -33
5377 -33 -30 -16 -4 -2 6 2 1 5 -20 34 -27 -42 5 -23 -10 11 25 3 8 -29 -2 21 -23 43 -23 -4 2 -43 -13 -67 11 -45 -30 -3
5411 -3 -29 35 -3 -18 -16 -2 -20 3 -7 -45 1 -12 8 -7 -12 -21 -16 2 -49 7 -31 13 35 0 -4 -17 36 -15 -24 -22 -33 11 10 32 -35
5446 -35 8 -35 -25 32 32 43 -1 -48 15 -5 5 -32 5 8 -2 -39 16 -34 23 -44 -48 -33 15 0 -44 -48 -8 19 -17 -45 -43 -28 -4
5479 -4 -9 -37 -10 -21 0 -13 33 16 -3 -58 11 -31 -2 33 -4 -6 -26 15 -20 -34 3 -24 -26 5 19 -9 -11 -3 7 -22 -26 10 -18 -35
5513 -35 -7 -22 -1 -47 15 16 4 20 -11 -6 -57 -17 3 25 -27 -32 -10 -46 26 -46 12 -9 -4 -8 -47 -20 -34 29 -63 14 -13 42 21
5546 21 13 -29 10 -16 43 -23 10 2 -40 13 4 -14 -4 0 -30 -19 -34 17 37 -11 -22 7 37 33 -22 -1 46 7 13 -31 -18 19 -18
5579 -18 12 23 12 -31 12 -4 7 7 -16 34 10 14 -12 7 -4 -24 53 -1 11 -19 -3 -21 25 19 -22 22 -32 -1 -3 -22 41 16
5611 16 4 25 18 -25 9 -14 -6 -19 0 10 -8 -21 49 10 -16 -23 -33 -35 50 63 -20 -2 -31 -15 -15 -3 -6 8 -37 0 34 -6 9
5644 9 2 -1 43 -16 11 16 38 8 -19 -11 10 -11 15 -5 59 53 33 3 33 18 9 31 2 -4 4 0 -10 -1 14 12 37 33 -2 32 -5 33 7
5681 7 -16 17 -38 35 -9 -1 14 2 30 -69 66 -29 14 -21 17 31 -12 2 9 -7 -16 -29 26 -31 25 24 -10 -11 14 15 -19 25 -58
5714 -58 19 10 -32 8 -9 19 48 -40 25 -12 39 -1 8 10 4 -23 26 -29 -9 12 17 23 20 17 37 -43 -5 39 -27 -13 -3 9 14 -13 17
5749 17 -3 4 -38 -17 -23 2 19 -8 14 -72 9 -10 19 49 -35 -5 13 34 20 10 3 -5 -27 16 -13 2 -11 -24 3 -21 11 -15
5781 -15 -28 13 8 -5 -1 -20 28 14 12 40 12 -11 -14 36 -2 -5 -32 -14 20 -11 21 30 26 6 -11 35 21 10 44 -13 -13 53 -4 -11 -10
5816 -10 2 -49 -15 15 -39 -77 28 3 -42 10 -24 40 -19 -16 8 -28 -18 11 35 28 -15 -17 -3 -46 -54 4 -37 8 10 3 39 -30 -5
5849 -5 6 -9 13 27 33 -14 0 8 -66 12 -40 -32 -19 28 4 -39 19 -55 -19 -27 -5 -28 -21 -14 16 42 -9 -59 -12 13 8 20 -25 -1
5883 -1 35 -42 6 22 -45 -18 9 15 -28 -36 -17 -46 -23 -49 19 -30 2 -3 -17 -21 -24 35 21 17 -6 -17 63 -24 -25 -27 -23 -1 -7 -27 -40 18
5919 18 -42 3 -4 -12 -59 20 -12 -5 16 -35 -44 -16 15 3 -43 -29 -35 -23 -3 -9 19 4 27 13 6 -11 15 21 38 -6 -33 13 -24 -5
5953 -5 -19 -65 16 2 -5 -30 41 -2 26 35 -16 39 -35 -37 -37 20 -14 34 -8 8 -24 -19 9 4 -31 15 -48 -7 -10 31 -13 8 -25 -5
5987 -5 1 -20 -20 -32 -34 -16 0 -39 -46 -31 -39 -1 -23 14 20 -13 34 -2 -16 -31 13 -15 25 -50 9 -31 24 -47 -35 -30 -15 22 -20 -17 -35
6022 -35 8 46 -10 -6 12 49 -6 -28 -43 -3 -16 -1 -17 -1 52 11 13 6 5 12 -24 15 43 -59 2 15 41 -34 -15 31 -1 7 -49
6055 -49 -23 -13 3 12 -37 -14 5 -14 5 -44 -31 -19 14 8 -4 -29 -41 14 15 -6 -20 11 -45 21 8 -2 -27 -9 26 16 -21 30
6087 30 28 -21 -9 -51 1 -17 -48 14 7 -23 2 -3 14 -26 -7 23 26 -27 42 10 11 25 -42 -29 17 10 -4 -33 -24 -47 45 2 -40 36
6121 36 4 -31 9 7 -24 -23 -23 -28 -34 -8 -45 -52 12 -95 -11 -42 -19 -41 -39 1 -52 -8 23 -30 16 6 0 -26 12 -11 33 -21 -5 5
6155 5 -45 -45 -15 17 -15 -47 7 -2 -8 -30 -30 -18 -18 40 -2 -2 -24 -5 -7 11 0 17 -8 8 -31 15 16 10 -9 -40 -26 -48 -6 21 3
6190 3 -23 -45 -8 15 0 -3 16 5 -69 -12 -3 24 -9 -16 -4 -22 -15 -42 12 34 8 -30 -33 6 9 13 -6 -28 -12 -17 12 2 5 -18 25
6225 25 -9 4 6 -19 -27 -26 -13 -23 0 -2 -29 0 6 26 14 37 0 -10 9 -18 -36 32 25 -11 43 13 0 -4 12 -38 0 22 29 -48
6259 -48 11 16 12 -26 -29 13 -10 -15 -21 -34 6 -27 64 -46 -15 -29 3 2 25 0 -23 20 -26 34 -25 3 4 -18 -26 5 15 -18 13 -13
6293 -13 35 -9 14 -17 41 -3 30 -20 -14 46 7 42 -7 -25 15 63 -6 -29 10 23 -2 13 -12 27 -17 24 -57 -57 -8 -17 31 -31
6325 -31 -15 -7 -43 18 -15 3 -12 40 -32 -43 49 -29 66 3 16 9 12 -9 6 -5 16 -43 -34 26 -53 16 15 14 8 23 -1 3 12 9 -13
6360 -13 -23 -9 -42 17 8 11 24 10 20 -14 0 17 -44 7 15 27 25 30 -19 19 50 -4 -10 -24 26 6 -5 3 28 -7 -27 36 8 22
6394 22 15 -13 12 6 -4 0 -21 9 4 6 -1 -8 -18 3 16 0 19 -27 47 -23 47 4 20 50 -18 -25 7 -16 -9 40 38 -7 -23 19 -3
6429 -3 31 30 32 -11 42 -27 -46 -17 -13 25 10 22 -13 -9 13 2 -29 10 54 42 -8 30 -6 1 26 5 11 67 9 6 22 -6 53 -21
6463 -21 48 -33 1 12 -19 6 22 12 -7 31 8 13 -49 -48 -35 -40 6 -32 -38 -29 29 -38 13 -1 -16 23 -32 45 -28 30 12 10 -8
6496 -8 -2 1 -21 26 -51 -31 23 -20 19 -26 12 51 -17 9 -45 -25 -5 -8 -12 6 11 11 -4 1 19 -12 -25 -50 26 -39 -43 50 16 55 -24
6531 -24 -9 -29 -28 -2 22 -1 12 -27 8 -13 -28 -6 19 -23 -32 28 11 -21 20 12 -9 -39 -13 -20 7 -6 -44 -12 -27 25 -10 -14 8
6564 8 -7 7 25 -2 -38 4 9 -16 -11 -29 7 -27 -21 -12 -40 -31 -15 -12 26 -20 27 -22 3 -9 -51 33 -15 12 -45 -23 -24 -14 6 -21
6598 -21 80 14 1 -39 0 47 7 -8 -14 -36 -27 -12 -77 1 -21 -7 8 -26 20 37 -35 12 -46 16 -27 7 11 24 -24 -12 4
6629 4 8 15 -6 7 27 -26 12 17 -25 48 -21 -7 29 -16 22 -61 34 -37 -31 25 -22 -40 -18 1 -65 -25 30 -39 15 -51 -42 -16 -29
6662 -29 19 -25 22 -10 6 -28 -48 -26 0 -12 12 -2 -47 -37 20 -24 8 -17 5 13 25 -44 25 18 0 -6 28 33 -44 -12 19 -43
6694 -43 11 4 -4 -8 -4 15 -34 10 28 15 5 -11 32 9 21 -1 18 5 2 -2 -2 42 -28 17 -16 -17 -1 34 -10 21 -37 -10 15 42
6728 42 33 37 -37 18 21 -8 28 3 -9 35 15 -11 39 -17 -17 30 25 -30 15 1 2 -41 9 44 -17 -49 -32 -16 -18 13 71 -14 14 -1
6762 -1 2 -49 -15 -18 -23 14 3 -35 -6 25 11 0 14 -24 -53 45 29 31 -6 18 46 13 -33 54 12 -13 8 31 -14 14 -19 21 11
6795 11 12 -2 -19 5 20 17 -24 -47 9 -13 -21 6 32 -50 -13 3 30 -7 8 8 -31 7 2 17 16 49 -38 -35 4 26 -11 6 -26 5
6829 5 -4 14 -4 -29 3 58 9 24 -4 1 9 15 44 57 -24 26 19 -28 -5 -26 -12 16 29 42 -6 38 -21 -12 -32 -28 16 -12 6 -32
6863 -32 -3 -3 24 7 56 17 -65 20 -6 -35 9 -49 8 -14 -1 15 -7 10 -18 40 -21 3 -4 -12 13 3 -16 -46 12 17 29 26 -2
6896 -2 -12 -4 -26 7 -17 -44 -19 11 2 -3 30 15 3 -65 -39 4 12 -25 -2 -86 6 -10 -41 9 -1 12 19 -10 -1 14 -21 18 -27 -18
6930 -18 -22 -2 28 3 -28 -14 -30 -23 -28 -22 -27 -8 -11 -27 -12 1 5 -27 14 -35 -6 -36 -33 3 -12 -22 -7 42 42 -56 -18 -8 8 -4 10
6965 10 -17 -13 -40 -15 27 17 -10 3 -22 -25 44 25 0 15 3 -4 36 -25 -2 -37 23 5 19 6 11 -17 3 -8 12 12 0 -13 5
6998 5 -20 13 5 4 2 -23 -13 -14 -30 7 -18 -16 -7 20 -4 19 20 -18 -6 -9 23 -33 -21 38 -25 -34 14 -6 36 11 35 -30 40 21 -21
7033 -21 -10 2 -2 -19 -4 -21 -15 13 -33 12 -31 26 -60 -21 22 -8 49 -25 12 -3 13 30 -38 27 -7 53 -6 -37 18 -39 51
7064 51 -28 -32 -39 30 -31 -1 -20 17 -10 -3 11 10 -31 -8 -6 3 17 -13 -49 22 -19 -53 34 31 -48 -29 -18 -4 7 18 -5 -26 -23 -74
7098 -74 3 8 -27 44 8 18 20 -13 -21 -39 -15 -20 10 20 -8 13 -15 -7 28 25 -33 0 12 -19 30 -51 -31 -92 18 -21 12 -10 -13
7131 -13 29 -27 -30 -32 -33 47 -28 -39 2 -14 -51 -6 -11 -29 -14 43 5 -40 -16 -3 -13 3 -7 49 33 4 18 1 -4 1 5 4 26 17 -28
7166 -28 -12 -7 -8 -32 -3 4 -35 51 4 -28 19 -11 -11 7 -17 -35 -25 -17 -32 -26 -6 -30 12 60 0 31 5 -12 0 18 -18 9 -12
7199 -12 -15 49 36 -26 -41 14 -3 -34 -19 -54 32 -29 -41 -29 10 9 5 23 -9 62 -28 -40 6 -34 -16 -13 16 9 -38 17 -14 41 -6
7232 -6 -7 2 3 18 4 -30 -14 -25 -30 6 -4 10 11 3 -22 5 -57 12 -12 -52 10 -14 10 -23 -30 9 9 -23 -3 -19 -41 -51 2 21 -47
7267 -47 26 12 28 -24 -11 -21 10 37 8 -39 -28 11 -25 21 8 8 -13 -16 17 23 -27 -21 -4 -56 -51 -21 -4 63 5 -1 -9 -21 41 28
7301 28 -13 -22 -2 -12 -15 -14 -12 -39 7 5 -4 -14 27 -35 22 -31 28 -34 -23 -58 -25 -10 -46 13 14 9 -49 -20 -39 -16 -14 -18 -35 -24 -35
7336 -35 22 -17 -14 -1 19 -14 17 -20 11 2 4 6 -18 -34 -35 -23 -17 -5 -10 -29 -84 -9 -25 -27 -29 5 -1 -25 8 -33 -6 6 -7 -2 -22 -37
7372 -37 -1 -21 -65 -7 -20 1 -22 4 -14 11 0 16 1 -30 -10 -34 -9 -17 -47 -56 38 -6 15 -33 -9 -37 -51 10 -46 -19 -16 -45
7404 -45 6 -20 25 -24 -16 -48 17 -6 -50 -12 -7 -33 -33 -1 1 52 -3 -47 9 -48 -51 -38 8 16 -58 -12 -4 -40 -14 -18 -37 -19 -40 21
7438 21 -27 -59 32 17 -48 -13 -27 8 -22 -31 48 -3 3 11 11 -52 55 -13 -27 3 43 17 -2 1 9 -14 20 8 -2 36 -13 -18 -3
7471 -3 9 -58 -6 -28 -3 -9 2 1 12 -28 36 -33 24 -1 30 -10 -12 19 -8 -24 18 -14 -24 -2 -14 -32 34 50 39 -33 31 9
7503 9 -21 -23 37 -59 38 -1 22 42 -15 -1 -33 -8 -18 -9 -57 28 -23 -2 16 -15 10 41 37 46 -4 0 11 -13 -34 18 34 6 -30
7536 -30 -3 13 -1 -5 -7 53 0 30 -2 -4 -9 15 -8 -8 -23 -19 -32 -28 24 -7 31 -5 -35 -32 25 -2 -25 -6 -9 -33 -22 24 -31 -2 -33
7571 -33 20 0 12 10 16 -52 12 36 -3 -4 -2 -25 -21 -23 -12 -53 7 -29 -13 -38 -1 16 -2 -20 -25 12 -18 -12 -14 -33 -8 -25 -10 -20 -30
7606 -30 11 -7 35 -14 -16 -1 21 -33 -13 -29 25 -9 -16 -23 6 -42 22 -1 35 -26 -32 26 3 9 6 -16 3 23 -52 -17 31 11 -18
7639 -18 -31 -21 -18 25 12 -18 -26 8 -8 -25 2 -33 -3 -3 19 -12 13 -14 -9 -8 -1 27 -34 0 -7 10 14 -18 20 -20 -26 0 8 -8 -30
7674 -30 -22 -29 9 -34 -2 17 5 8 -25 0 -29 -33 23 -36 8 -18 28 -73 -46 -41 -19 15 0 -2 12 70 -21 -23 10 38 21 13 -7 15
7708 15 -14 -32 11 32 -29 20 -18 2 5 -39 -42 -36 -28 -28 46 14 2 25 8 34 -13 -6 -6 -20 -17 19 -21 18 39 -6 28 40 10 -24
7742 -24 5 0 31 -27 8 8 -24 34 -52 -12 -32 -9 40 -23 6 -1 2 -30 -34 18 -36 -17 -13 -3 -36 12 -37 -45 7 1 17 16 23 -22 -11
7777 -11 -12 -63 17 -24 -30 15 -49 -13 -19 -19 45 22 -48 -20 6 -35 -38 2 9 32 -24 21 -36 -35 20 -16 16 -31 -7 -13 4 -5 -1 -4 -8 15
7813 15 -41 12 -8 -50 12 45 -10 -16 -44 44 44 15 5 3 -37 40 -41 0 -3 -18 -30 67 -21 4 6 20 -9 -37 -23 38 19 -8 51
7846 51 -8 -7 -25 -27 12 5 -45 21 -24 -25 12 30 -23 -5 9 -57 -17 -20 28 -57 48 -17 -12 24 -27 42 6 -18 -29 -14 8 -8 -25
7879 -25 7 15 42 -23 4 37 -16 23 39 9 -5 4 37 27 29 8 10 -29 -29 26 -18 -20 -8 -16 4 -10 -12 -20 -27 1 -1 -20 7 13 -13 -23
7915 -23 15 1 -6 -39 8 12 10 20 17 41 -2 17 -51 19 4 -14 30 -30 10 -3 -4 34 30 21 51 -2 -29 5 -42 21 34 -27 -11 -42
7949 -42 34 -46 -19 -34 -10 5 -52 -8 -11 18 -1 -4 -33 -24 -41 -5 2 -15 8 -15 28 -8 9 45 -24 25 6 3 -27 17 21 5 -14
7982 -14 -30 5 -19 9 -7 23 -29 20 -8 1 -3 28 -48 -2 -26 23 -10 13 -8 5 -7 -41 19 -17 8 40 -16 -15 19 -68 -33 -7
8014 -7 -20 17 -20 -33 11 42 -2 14 20 -16 6 -12 -1 -13 2 8 -8 -19 -15 15 27 4 -22 -16 -6 1 20 35 -28 -11 -12 10 -28 2
8048 2 23 -6 22 -26 -22 19 -16 1 -7 -12 10 -26 -46 -7 -45 17 9 -9 -28 -33 18 -15 -15 37 1 4 -29 -50 -22 -5 -35 -14 -45 7
8082 7 -19 -35 -23 8 -2 -1 5 -38 -14 29 2 -10 -28 -9 25 -19 -2 -22 7 -27 -6 -36 -4 2 -65 9 47 -23 12 -11 -29 -28 48
8115 48 -65 -4 -23 6 -30 33 -4 -28 2 -13 45 11 20 -14 -5 56 -13 13 -1 24 -32 -5 71 -61 8 -29 -25 5 -14 -5 -18
8146 -18 38 -15 25 -29 32 18 -1 25 -53 -12 -62 3 7 16 7 -3 -15 -21 -9 -5 -3 -28 -18 -3 13 49 -39 40 -4 11 23 -3 12
8179 12 20 -23 2 -1 6 -9 23 -27 17 7 -19 44 1 -41 -21 38 39 30 -24 -8 2 31 -40 0 13 -6 -26 -35 13 -21 -21 18 -8 -46
8213 -46 13 17 -26 7 17 -15 44 9 2 -23 7 -26 -24 0 -29 3 -9 18 21 -5 14 4 1 11 -3 63 -38 -11 18 21 -44 63
8245 63 0 2 -10 17 19 -4 33 -21 6 57 19 -19 -6 1 -31 -13 33 13 2 -11 3 9 14 26 32 9 -34 16 -30 14 -3 -25 27
8278 27 16 7 -34 -21 15 12 54 -35 -18 -14 2 11 -29 25 26 -13 5 26 -48 10 21 16 4 -12 -9 -27 -5 -10 34 -50 16 -32 8 64
8312 64 -16 49 -4 4 22 23 15 -1 5 -5 5 20 -38 7 7 -6 -24 63 16 -8 21 -6 -31 -27 -5 35 70 41 19 -22 -12 39 18
8345 18 20 -26 22 7 28 -7 -24 0 -28 25 25 -16 11 -18 2 8 11 -8 7 27 -12 15 25 -10 6 0 -12 -36 -2 -34 10 -17 15
8378 15 21 5 -15 27 -31 -23 12 7 -6 2 6 -5 -57 -22 1 12 -20 18 -20 -8 8 -19 47 -1 7 -31 3 -12 5 -38 -22 -18 -29 -9
8412 -9 10 -8 -24 -4 21 -50 9 -2 4 -43 -62 -5 15 -4 -25 1 1 24 27 4 -12 -6 -36 -48 -31 5 -7 16 -24 10 -33 -43 2
8445 2 -45 0 -24 1 25 -6 -14 1 -9 -2 -33 -30 -10 -20 -31 -26 -63 -13 7 -43 -18 -21 18 -11 -31 13 -7 -14 -35 -16 14 6 11 -34 3
8480 3 -1 -15 -11 16 -33 -19 -56 45 -7 11 -5 26 0 -33 2 -61 -14 -5 10 -5 36 -27 -74 29 -27 -2 -33 -19 -16 -37 6 2
8512 2 18 19 -45 -26 21 42 0 52 2 -8 -27 14 10 8 23 10 -16 39 -19 -5 -62 -12 0 -13 15 10 18 -7 -5 -22 -22 -40 35 -30
8546 -30 1 -23 17 -20 9 -17 19 -14 -9 -16 33 -4 20 -31 31 11 -18 -44 -14 6 0 13 -21 31 5 20 -24 -15 -7 -13 10 -18 -11 -36
8580 -36 23 -1 -31 38 13 -24 -18 -56 -24 4 -6 -11 47 -69 19 -13 17 20 -50 -3 19 1 -3 0 -12 -33 16 -15 54 -21 -13 35 -16
8613 -16 0 -31 -35 -28 24 -3 -20 -1 -33 8 29 -29 0 6 -2 14 -3 -29 4 -30 19 44 -1 23 -28 -42 -5 1 -31 -4 -27 10 -13
8646 -13 36 0 3 22 21 19 -24 7 30 -2 -49 -68 4 -39 -6 7 1 -24 -16 23 2 5 -13 -38 3 -21 -41 34 -17 -25 -21 -15 -31 31 13
8681 13 -25 16 -17 -4 -21 0 -13 28 -3 -42 -16 -23 5 6 3 -13 -24 -10 -17 10 -12 3 -5 17 -11 -46 20 -35 -33 3 -2 -23 -15 6
8715 6 -8 -47 5 -29 -8 -17 -15 25 -39 -16 19 19 23 -25 -29 -18 -47 -9 7 5 -18 25 -18 15 9 -52 17 10 -36 -38 -7 -3 37 -18 -22 -10
8751 -10 -6 -1 51 24 -8 -9 -32 24 -2 47 -23 31 -41 38 -3 -26 -40 -65 30 -28 -7 -16 31 21 -20 9 -10 35 -46 2 -9 -21
8783 -21 -38 -40 20 -28 -19 -26 -36 2 -46 -1 -3 2 -37 11 -32 9 18 -12 -14 -27 -24 34 7 13 4 -9 -11 -31 -10 4 24 -26 24 -29 -13 26
8819 26 14 15 -32 -31 -10 -58 20 -18 -2 -20 -36 35 -65 -7 19 27 -24 -29 32 -6 32 -19 -16 13 -23 14 -25 48 -12 17 -10 -7 -31
8852 -31 35 -14 -20 -14 18 -11 28 -31 -18 -25 -23 -25 -16 7 6 -9 -20 8 11 7 -22 -35 34 -17 14 43 -4 3 -29 39 -32 22 1 -21 -11
8887 -11 -28 -20 -25 -9 -15 8 2 -10 34 -13 4 -1 -15 20 13 35 -29 16 -9 10 -3 -3 -13 28 -15 13 24 -4 5 10 55 5 2 -2 -1 24
8923 24 3 27 -1 -22 49 -29 -24 -20 0 10 22 11 39 -25 -18 1 -28 -29 34 -13 -5 -8 16 -28 35 -39 -15 38 8 61 -17 26 -30
8956 -30 25 11 38 4 39 34 -25 57 26 24 -8 -64 1 47 2 -20 32 13 38 -28 -4 37 -18 2 5 -50 -7 -4 2 -24 25 12 22
8989 22 40 -45 -21 -6 -33 -40 28 -12 51 10 60 18 4 38 -19 -31 58 -10 1 -8 5 -31 7 28 3 15 -9 -9 7 -6 13 5
9021 5 18 19 7 -13 9 6 -6 46 52 10 -5 43 -18 33 43 -5 46 12 -47 -29 34 -20 -10 -4 13 -12 38 42 -19 -15 -32 -24 -38 -42 4
9056 4 6 16 -17 16 45 14 -29 41 28 26 10 -13 -12 17 -27 -12 15 -9 11 -15 25 2 17 -14 8 -10 1 21 -22 -15 -25 13 -10
9089 -10 -16 9 51 17 -9 -3 10 -57 -6 -13 7 -22 -8 3 4 0 41 -22 -4 12 -10 1 -17 18 -48 -19 -44 3 -17 7 4 -26 -21 -12
9123 -12 12 33 -9 11 -15 -5 14 32 49 3 -7 -1 48 5 29 -19 53 -24 -51 -7 -34 20 4 18 -23 -53 -10 -7 16 24 -2 0
9155 0 -18 -15 5 -7 22 47 34 23 44 -14 5 20 -25 -34 23 -17 2 -30 -13 7 -5 16 -7 -8 0 -9 -40 -10 -34 11 10 11 -30 15
9189 15 -36 -21 -21 2 -22 -4 -20 23 -28 -9 -22 5 21 -26 13 8 -17 -2 -24 -24 9 3 -9 0 10 -35 42 -47 16 6 18 -7 -16
9222 -16 10 -50 -7 -46 -33 19 -4 22 2 -43 -19 35 -12 -14 1 -33 -5 14 -3 2 -19 8 -24 8 5 10 3 0 10 -20 11 -23 -10
9255 -10 10 -10 -49 -40 32 28 5 29 -36 -8 -25 -30 -26 -42 -38 -24 -10 -3 -19 -5 18 -29 16 -15 4 18 24 -18 2 -30 -3 21 -7 25
9289 25 -2 19 -13 -19 17 -3 -23 -28 45 -12 -14 -3 -36 -14 32 4 -57 -22 -22 27 13 -9 -8 -52 -34 10 -3 11 8 -34 -35 10 19 -18
9323 -18 33 -29 62 -58 5 31 -1 10 -40 34 -28 0 25 -47 17 14 -32 -12 22 -39 -26 19 -33 31 9 45 18 15 -7 11 -34
9354 -34 28 50 -12 10 -22 -23 -5 -25 -7 -10 -7 -11 -13 -36 -26 23 4 -16 -33 -8 0 5 14 -1 6 -19 12 -28 -5 -11 -1 -3 -34 -2 28 -3
9390 -3 39 -9 -21 -5 -47 -50 16 -19 4 -7 -3 13 -45 -21 11 -17 1 6 23 -36 14 4 10 -5 -32 4 3 36 26 16 13 -5 5 -7
9424 -7 40 51 7 28 -6 -11 11 34 -5 8 8 42 -17 -19 7 -2 22 6 36 26 -7 11 10 20 -55 51 2 25 11 -2 21 10 -36
9457 -36 -47 -45 -24 30 -27 -5 27 7 31 40 -21 -26 0 -38 -7 -3 23 -34 34 46 -67 29 28 57 -3 -6 1 5 24 -28 31 3 3 15
9491 15 6 13 -5 16 -18 -25 1 5 -1 -41 22 -3 5 19 -28 37 -8 -3 8 25 26 1 47 10 -42 -58 -6 -11 -37 26 3 -9 25 10 43
9526 43 -16 15 9 27 31 6 -3 36 46 -21 -29 50 32 54 4 -37 30 3 22 -3 19 25 14 2 10 41 3 -19 17 1 -29 60 -18
9559 -18 -8 35 12 19 7 25 8 -15 3 -8 7 -9 6 6 23 36 -7 -37 -5 12 25 23 -7 21 -18 17 -39 -9 12 -25 34 5
9591 5 -13 -20 35 -1 -23 -20 7 -9 33 -8 -34 23 -8 -31 13 -19 -27 -3 19 -15 3 19 -70 4 25 -6 -15 -37 4 2 -9 -24 27
9624 27 38 -32 8 -7 -31 -31 6 35 24 -18 -20 -20 -16 2 32 16 -6 34 1 21 -20 -16 -21 69 -5 -22 -20 15 34 -10 45 -17 7 48
9658 48 13 -36 9 37 11 -14 -7 11 21 43 -17 16 -13 21 -64 4 -33 2 22 4 0 -1 27 15 30 24 -9 22 50 3 -14 -16 -9
9691 -9 -13 14 -16 -2 -13 -1 33 -48 5 -4 15 -16 47 42 23 -5 20 -37 2 -41 -18 40 27 -16 54 -5 -16 19 -12 7 -38 17
9723 17 -14 40 59 21 18 -5 34 -6 0 -17 -6 28 40 62 -6 -7 40 -35 -31 37 -27 9 -28 3 -8 13 4 -19 9 19 53 -6 -38
9756 -38 38 -28 8 24 2 -1 -30 53 -12 47 -45 54 -13 1 2 -37 -30 2 -3 -34 -7 -19 -10 39 -25 1 -10 35 -13 3 18 -19 -34
9789 -34 22 -16 -25 39 -28 -2 -24 -50 18 5 -21 23 -10 12 -6 9 -14 36 -6 12 6 -13 -20 14 12 -18 6 32 32 28 14 -34 15
9822 15 1 -1 -27 -19 -24 18 -9 48 -18 17 3 -12 7 31 -7 -4 -27 40 -8 2 -20 8 -14 -12 -15 18 -5 -52 11 -27 12 7 -4 -2
9856 -2 18 -14 16 -3 -15 16 -4 5 2 -31 20 4 19 -36 37 -35 -30 -4 -5 -6 -40 24 16 -7 10 -33 -40 -2 -42 35 -10 30 -13 -19 24
9891 24 -20 8 61 -24 1 36 -13 -13 -58 13 -17 -10 -36 -42 -26 70 -6 6 -7 -10 -23 -31 15 -22 16 -21 -17 -12 -4 33 -7 -6 -21 -42 49
9926 49 -20 28 -23 5 26 -16 12 -18 19 -7 21 -7 -2 -22 -13 17 -47 -1 -5 6 -9 -54 -25 -55 46 -30 -29 -20 -34 26 -4 27
9958 27 -33 1 40 -12 -21 -15 -11 -55 15 -14 -16 -11 -31 15 -4 51 -25 23 -14 -46 9 16 -25 -17 -37 -19 20 -2 -23 9 3 -19 -1 10
9992 10 10 -43 -12 -12 15 -29 -44 -23 -12 8 -38 16 6 -32 -25 22 -29 -44 -5 -26 -24 -19 -27 -30 13 6 -61 -37 -39 -26 3 8 30 -14 24
10027 24 -15 15 -49 31 1 41 -4 -29 9 -36 -20 3 -2 -42 18 -15 6 -13 13 23 10 -42 24 -17 8 -20 5 4 12 9 -24 22
10059 22 -46 18 -23 21 -29 -16 -14 -6 39 19 3 -8 -5 -6 -26 9 -28 0 -38 4 10 -9 1 -1 -31 -24 19 14 23 -11 32 -43 -20 -4
10093 -4 24 21 -37 -4 20 -46 14 -23 41 21 26 -24 -18 10 -33 30 -5 -9 -8 28 26 -25 -31 15 42 20 33 2 -27 25 -27 -4 -38 24
10127 24 -15 28 43 3 21 2 3 -19 1 23 -7 -12 12 -2 -15 -27 18 -18 33 -39 -3 18 28 -18 19 21 7 4 -21 -1 14 7
10159 7 56 5 7 -29 -62 11 -8 -36 -5 -34 -35 24 76 -2 40 -18 -44 -34 -31 6 -19 8 -5 0 39 -4 10 -17 -43 84 22 -25
10191 -25 -11 18 12 4 29 0 7 -27 27 -21 0 -1 -20 42 -9 -10 -30 15 8 0 18 -25 -3 5 -18 32 -20 19 -6 52 32 -5 33 -26
10225 -26 50 -24 -2 12 -4 23 1 14 -2 37 -54 -34 -41 -9 -3 -22 16 -6 23 35 2 2 -19 3 -19 -1 -15 -36 2 -2 22 -22
10257 -22 -29 -9 -6 -7 -25 27 -16 13 -23 -32 -26 11 32 -29 56 0 2 3 -28 -13 -3 17 -24 -4 14 9 13 30 10 50 19 58 50 29 1
10292 1 -15 19 14 -3 2 19 34 4 18 -12 19 15 -11 18 -13 32 -14 35 11 -39 26 -18 -12 41 1 -42 15 -12 -18 39 -15 24 44
10325 44 -8 1 -40 3 3 15 22 13 16 -13 -26 -4 26 -21 -2 21 6 13 17 36 -10 4 19 -2 40 -13 -30 25 11 -1 3 51 34 58
10359 58 8 9 -43 -7 11 -17 0 12 -7 1 17 -12 5 -31 -24 20 -47 46 6 10 3 -38 -26 -14 -9 -23 11 -22 -11 -4 -26 23 24 -15
10393 -15 -46 9 -34 -18 4 -15 -10 9 -12 -47 -13 -39 -22 -36 37 -1 -36 33 6 21 -47 -52 25 5 10 24 -39 -14 -42 -15 10
10424 10 12 -29 9 16 4 14 -9 43 -5 15 -27 -21 56 11 -31 23 -24 -49 6 -13 -36 14 -25 -28 -39 7 9 -14 8 19 7 -12
10456 -12 10 -34 11 -16 -3 48 -30 -10 29 22 16 -26 37 -5 -3 -46 2 -28 5 0 -15 37 11 -14 -40 -12 -26 -15 3 -14 30 -36
10488 -36 -10 11 -2 2 8 7 -36 50 -28 33 -17 -61 -1 -47 -1 4 15 -50 -25 -6 6 15 0 23 15 9 6 -7 4 -5 -2 9 -20 -57 -34
10523 -34 37 -3 -56 -19 -42 -25 33 17 -25 -13 24 38 1 9 32 32 -7 40 -20 -2 -16 -12 21 -20 18 9 7 -18 -14 -23 7 -5 -12 36
10557 36 21 -5 14 -49 -11 -30 6 30 -24 0 24 12 -10 -4 -43 -53 51 -2 13 -30 28 -20 -13 -67 -23 31 -27 -21 25 -29 -43
10588 -43 7 -7 -7 -7 12 10 31 14 11 -3 -33 -32 0 42 -15 41 -28 13 7 -3 27 -39 2 -19 -6 -13 -14 -9 -49 -15 -34 36 15 -20
10622 -20 9 0 2 -4 20 -11 -26 -60 36 18 -15 5 18 6 53 -63 -49 -6 -35 -30 -5 21 3 -13 11 -1 24 23 -28 6 13 33
10654 33 32 19 -16 9 -24 -14 11 -50 27 -50 -27 -1 -53 57 -36 28 -6 -14 9 -22 14 5 9 6 15 -19 -60 -18 3 50 -64 -31
10686 -31 -54 -19 -8 -22 -31 2 28 -5 53 -9 -21 -13 2 2 -11 21 27 -21 7 9 -55 3 6 -25 -7 15 12 -30 31 12 19 -20 -23 18
10720 18 -33 -7 36 1 11 -42 -38 -19 8 15 27 3 -8 10 -17 5 -65 21 -20 -35 -35 -19 -39 -25 16 -8 -15 31 39 -12 5 6 -25
10753 -25 12 68 -2 27 -46 -16 23 0 66 -27 20 -34 -22 11 7 2 42 19 -41 8 -25 6 3 -25 -2 -57 11 26 13 17 -12 43
10785 43 -24 2 16 8 1 -17 34 -23 38 -11 -20 4 -31 -19 9 20 -8 -18 -11 -21 -33 -12 -7 -29 21 51 18 -15 -8 8 -54 -6 -17
10818 -17 -7 6 -2 10 36 -2 -17 6 -28 12 -14 -5 3 1 -14 0 -9 18 26 -19 17 -5 -1 3 -33 18 51 9 -12 13 -30 -35 31 36 21
10853 21 16 9 -11 12 25 -22 11 -13 24 53 -17 11 23 28 -4 31 -10 -29 -17 19 -26 -32 1 14 4 12 -19 40 -5 27 2 1 32
10886 32 -34 27 13 -24 40 -6 8 -14 17 35 -2 -23 -24 23 -31 29 -22 31 -11 42 32 -27 -23 13 -8 13 -29 -40 27 13 -7
10917 -7 -9 14 1 -21 42 -4 28 27 5 42 2 17 6 -6 9 13 -1 42 24 3 2 -22 -15 15 4 12 14 -24 -16 -22 3 45 10 51 -12
10952 -12 -21 -25 17 7 25 -7 22 -10 39 8 45 6 -31 41 -25 22 19 17 -9 -41 -30 28 -9 -71 27 27 4 -16 -20 2 18 -10 -7
10985 -7 32 -12 0 1 11 -17 -1 -16 -33 -12 -13 34 10 29 33 -3 22 16 -34 -22 57 26 22 -24 -27 3 -27 -6 -1 -9 7 -1 -19 21 -5
11020 -5 -60 -5 -11 -1 -2 -23 26 -15 -4 12 13 -11 -31 -22 -31 -44 5 -5 37 27 8 -31 12 -7 -20 -15 -32 -17 -25 -45 -55 -22 -25 -77
11054 -77 -5 -36 35 -27 1 -26 -31 -7 -20 -3 -5 -5 35 0 33 1 -19 26 45 37 26 -6 -5 -27 -17 -16 -8 -22 -1 -8 19 -25 -43 -5
11088 -5 -29 -2 -24 2 2 -24 -5 3 -12 40 1 11 9 -32 19 -4 2 -33 -38 -14 24 24 -23 -11 4 -14 -14 3 -5 -37 1 -16 24 -36
11122 -36 -20 -19 -9 31 -45 -6 24 71 -17 9 -36 -5 -12 -25 37 -34 -42 5 26 -47 -56 9 26 7 13 -18 -11 11 9 -30 -37 14 -30 9
11156 9 -40 -9 -36 61 -19 -20 25 -5 -34 -55 -2 -16 -20 -14 -26 -8 16 -9 0 6 -2 21 33 17 -9 4 19 7 -6 -16 -14 14 15 -38
11190 -38 -12 4 -2 22 9 24 28 27 32 8 8 7 -31 -25 -22 -20 -12 16 -2 25 3 -49 -18 -24 -21 -30 21 -30 17 10 -43 48 -52 -12 -37 -14
11226 -14 44 3 17 -6 -14 -39 17 17 9 1 -44 -24 -31 1 3 19 34 -4 -30 -27 -6 0 -29 11 15 7 12 26 15 -1 42 6 -19 0 7 30
11262 30 -27 -9 1 -6 -7 -30 -25 -16 -25 16 4 17 -3 8 1 -9 -4 -17 7 15 -3 40 -43 1 -31 -23 14 6 -24 -24 24 -2 -18 -32 -18
11297 -18 -12 -28 55 -45 57 10 16 -4 27 31 -17 47 -23 -20 -8 -9 46 -6 11 -38 -33 -6 4 17 -17 -21 -46 -4 -31 12 16 -37 -35
11330 -35 -50 -4 5 -1 0 20 -1 -21 9 -17 6 16 -4 4 40 6 -31 -27 16 -8 -1 -4 -46 -46 0 1 1 30 0 -3 -4 -22 32 0 -18 25
11366 25 0 23 26 40 13 18 13 -14 0 -2 28 -2 18 11 14 46 -33 5 -60 -27 42 -44 -6 -2 23 -17 45 24 -16 8 19 2 9 11
11400 11 31 -23 17 -26 -25 4 -35 13 -36 -14 -42 -32 -10 19 -11 24 1 -23 11 23 11 0 20 -11 4 27 3 31 -13 35
11430 35 -8 11 15 -32 1 -12 -15 1 -3 -4 -5 -5 -44 41 -12 -3 2 -3 -7 18 -16 14 -10 2 11 -26 13 -31 16 -37 -20 -9 -35 -26 -17 10
11466 10 65 -24 48 15 -26 -19 26 13 -53 52 6 -22 2 38 -22 8 2 -18 39 -1 -49 18 -2 -11 -36 -1 -28 0 7 -26 4
11497 4 -24 -32 -37 -17 -9 -22 -30 -53 -18 7 7 2 0 -17 14 29 -19 28 4 -2 -7 -3 -34 25 17 14 -3 27 -4 8 -25 9 -17 -36 -3 -24
11533 -24 -19 14 -21 -27 -11 36 -26 -14 -13 4 23 -47 16 10 10 11 25 28 -32 -1 15 44 37 32 14 -11 -16 -9 -5 -22 -15 32 20 0 33 8
11569 8 60 19 7 -29 23 28 -18 15 34 -7 10 36 17 23 13 -39 -26 22 20 28 -29 2 -2 1 40 -8 -19 15 3 -49 35 2 17
11602 17 8 17 -13 17 11 8 -25 -24 -32 6 37 3 20 -19 8 16 23 -6 19 35 6 -14 24 21 -10 33 26 27 9 -3 -12 10 -7 20 2 -38
11638 -38 11 -22 0 0 -3 -1 27 -16 -10 37 16 -6 4 46 26 -14 48 -5 59 14 16 -25 2 -14 24 -8 -3 26 -55 -27 35 -23 -11
11671 -11 -1 36 -1 -6 -15 -19 23 -8 -10 -4 15 -6 0 25 -34 6 -19 -3 19 -30 -11 -13 -11 -18 -7 -68 -4 34 3 -1 23 32 23 58 34 -23
11707 -23 20 -4 -17 -12 16 -18 -33 -11 1 -23 -8 15 19 -37 25 -14 -10 31 -3 -10 4 2 33 -6 -15 4 -18 -21 -4 2 11 4 22 36 -15
11742 -15 -13 0 23 -6 -38 36 53 29 11 -3 -6 -20 -29 13 8 4 -40 -27 -23 6 19 -25 -7 -3 22 -27 9 -12 27 35 30 -5 -17 5
11776 5 -30 -1 4 6 1 -42 -11 21 -7 29 -23 37 -13 -28 11 -2 9 22 -35 -20 0 -36 33 34 -19 -1 -5 -49 31 -17 0 -8 20
11809 20 -25 -8 -14 6 15 5 -8 -19 -33 -27 -6 -6 15 4 -40 -8 -46 -39 31 -11 -7 9 -20 -2 -50 21 25 -42 8 -4 -34 2 -3 10
11843 10 -15 32 10 25 9 -11 21 25 43 -50 -8 -61 -9 -5 -63 16 -27 42 2 -3 -30 -4 -3 -45 -34 -13 19 1 23 16 0 14
11875 14 -21 -10 -35 -48 -25 16 18 -20 -36 -27 0 -17 59 -13 -8 -38 8 -14 11 -2 15 -23 -18 -11 -17 -3 -4 -25 -29 -6 -24 -9 -31 5
11909 5 9 -6 18 -8 14 17 -51 12 10 -5 6 -14 -12 -18 -5 28 3 13 35 7 -4 -9 -28 -4 21 -39 -4 -23 4 -42 -35 -11 -29 8
11943 8 -1 4 20 -26 9 -25 46 -27 -45 -5 1 7 8 11 -5 -2 -19 -19 9 -7 15 -36 -21 2 -73 -28 32 -13 -2 27 -22 9 -2 -6 46
11978 46 -41 -35 -34 -5 14 0 -35 15 -23 -25 -24 2 -14 1 -13 -25 9 16 25 19 -66 -3 9 16 39 33 10 -16 34 -4 -14 -53 -8 -38
12012 -38 16 -27 -18 -33 51 -40 -26 -8 26 -40 -17 16 14 -17 -39 20 10 31 21 38 -24 -26 40 -59 15 -1 -6 -12 27 39 -57 -19
12044 -19 17 16 3 7 8 1 -18 7 5 -3 58 -4 7 -18 -40 29 8 42 15 -11 -3 32 -31 16 15 25 30 5 -22 67 12 24 5 38
12078 38 2 20 0 10 4 -1 32 40 20 -8 -19 27 29 -11 -25 3 -8 -2 -23 -45 -9 29 -8 26 -38 -36 12 -11 -14 -19 7 9 38 -25
12112 -25 -9 -29 -43 -16 21 23 -6 -11 -20 13 -17 -17 -7 13 19 -31 6 -4 8 14 -16 -30 0 -59 -8 14 3 6 -21 19 39 -20 2
12145 2 2 -3 -3 -13 10 0 13 -6 9 -3 34 8 -12 -18 -28 17 -43 -37 28 -34 38 -39 -3 -32 -17 -30 38 8 -10 1 -13 -14 -24
12178 -24 12 -6 27 -46 -6 -34 15 -23 -15 7 -65 9 16 9 13 -39 2 -61 3 13 21 19 30 -14 1 68 12 -10 -7 25 3 18 2
12211 2 -35 -24 14 1 -6 -28 41 -6 -6 -7 -10 -21 -5 -12 -22 -10 -18 -1 13 -9 55 13 9 -5 -5 -7 -41 -9 -32 3 -45 5 -17 12 -21
12246 -21 -30 -24 5 26 -31 -46 -21 -21 -61 -27 -31 16 -9 -17 -4 -26 -24 16 6 6 -27 -16 1 -33 8 6 22 10 -12 -40 -16 20 -42 -44
12280 -44 26 18 -5 18 11 14 33 -1 7 -11 16 -14 11 16 6 39 -16 16 38 3 -9 10 14 -49 24 -14 -7 -24 4 -2 -17 4 -54 -34
12314 -34 -23 -29 50 -35 85 -25 4 24 15 -4 -26 38 -15 38 25 -22 2 -18 -22 2 15 0 -24 9 4 -15 7 -6 20 -8 -30
12345 -30 -25 25 -28 9 -9 -35 -10 17 -35 15 8 -55 -7 -14 13 23 16 -25 -23 2 -24 26 6 19 21 -2 -18 -21 11 -49 -24 -26 24 8
12379 8 -12 -8 9 18 55 -2 3 44 11 -21 14 -47 19 12 34 -31 34 14 -53 -24 -24 16 -34 41 29 -56 28 -17 -5 -57 -17 6 10
12412 10 26 -4 -1 13 -43 -10 -32 28 -44 10 -5 10 -2 -58 -2 -4 -10 -44 -1 -24 -14 -36 -19 -28 -10 -33 13 21 -6 -5 -33 -13 8
12445 8 -47 -17 -69 -22 4 -8 -9 13 -13 12 52 -51 28 -15 25 0 8 0 3 -20 -44 -59 16 85 25 -5 48 -11 30 10 29 -3
12477 -3 -45 -15 -2 33 -3 33 33 -16 37 -25 -22 8 12 6 -15 5 -22 21 -37 3 4 13 4 -17 -21 0 7 1 -25 -29 -20 -12 -29 -53 -7 -4 -3 16
12515 16 36 -11 61 -2 -4 -31 6 18 12 -34 27 -38 7 -15 -4 -18 0 17 10 30 -39 39 -25 14 -21 19 -27 -29 -36 -31 33 8 -3
12548 -3 -35 -31 -12 6 -49 33 28 -13 58 -34 -2 -57 -11 -16 -19 -41 -42 5 -17 12 -47 -87 -2 0 14 -52 7 -5 19 -10 -58 35 -32
12581 -32 28 12 38 -36 -33 -33 -44 -3 13 16 21 -28 -4 -25 1 11 -38 -12 -37 -6 -12 -38 5 0 -12 -56 -3 -28 13 7 -29 54 -16
12614 -16 11 -8 25 -5 11 -1 -35 14 -50 -37 10 -20 -31 7 3 0 3 -30 -17 8 -38 -27 -9 2 -17 7 -17 -25 -33 -10 0 -17
12646 -17 -11 1 2 -10 18 18 -2 -13 3 5 25 -4 -41 19 11 -23 15 10 -37 -2 -21 -28 23 -32 -2 -11 -15 26 -24 5 -36 -6 14 21 -15
12681 -15 -31 48 -34 1 -31 -53 2 10 -17 -28 13 9 16 -20 14 32 23 -15 14 18 -28 6 11 -9 -17 -13 -10 50 -4 58 -18 15 20 11 0
12716 0 66 -21 -37 -6 -5 -3 -14 36 -78 -31 7 14 -3 -32 45 -41 2 12 -16 2 0 24 -26 49 -32 11 7 25 -2 -48 -6 36
12748 36 29 -23 35 29 -17 -13 10 11 -36 -10 8 0 22 -22 17 -44 23 54 -24 10 14 33 -12 21 34 45 31 -25 6 -8 24 -6 20
12781 20 38 -7 20 4 -32 27 21 -7 11 17 -40 -20 -4 27 -3 14 -6 -5 -23 40 13 53 40 -10 -2 26 -10 -32 16 -8 30 48
12813 48 -26 -15 8 41 -2 -15 -9 -6 -12 -10 -31 0 -11 5 -17 -12 2 -6 7 -5 42 -44 -1 -15 -9 19 43 -20 -5 61 -19 23 5
12846 5 -9 -23 -27 7 -12 25 -41 -45 7 -12 41 -25 24 -5 10 -30 -4 -6 -22 33 -10 -6 -34 10 0 -20 -25 -13 5 2 -32 -6 -15 22
12880 22 11 -16 19 -57 -17 -16 -11 -49 5 -24 24 -41 -17 -9 -17 40 36 -22 -4 43 -10 -30 6 -15 13 16 1 7 -5 -34 -20 -20 5 -16
12914 -16 5 4 -12 -12 -18 21 -40 -24 -25 -15 15 5 -5 6 -5 28 -19 14 45 -42 -1 -51 -10 30 -17 -2 -14 3 -6 18 -30 -4
12946 -4 -27 4 62 -17 -41 31 2 -8 37 8 -4 9 -11 18 0 11 16 -24 -13 -5 20 -18 -12 -25 -13 6 5 2 -42 -38 -8 6 -55
12979 -55 -11 6 31 -7 -52 11 16 -24 -17 38 -18 -64 -24 -8 -6 -3 6 -56 -18 3 -7 3 -17 -3 -8 -16 -15 9 35 7 3 18 31 -6
13013 -6 -13 36 19 -24 -5 32 5 -46 -22 -2 -27 3 -15 -7 -9 -5 6 10 -43 -56 -23 -9 -41 -12 17 -2 -6 -16 3 -14 -29 -7 -7 1
13047 1 -23 11 7 2 -21 -3 -15 2 15 4 15 -37 -8 19 -5 19 -15 -4 -24 -12 21 0 -8 -31 -42 18 -35 -31 1 3 23 -17 -3
13080 -3 -45 -1 10 14 0 -11 -36 35 -8 1 -55 -6 -23 -22 45 -8 16 -18 -25 -2 15 3 11 26 37 -15 -16 -8 -11 -52 -1 -9 -6 -18 -9 1
13116 1 -5 -14 -35 25 -3 -5 -15 0 48 8 8 -12 24 -11 -13 29 -4 17 -7 51 -34 -20 25 -8 -38 -19 14 -7 4 33 -43 7 11
13149 11 -24 5 -21 15 -31 19 -6 -4 10 11 1 -25 -7 -20 42 -41 -19 7 34 22 -6 17 -24 -47 -6 4 -1 -13 -2 7 48 26
13181 26 16 -32 1 0 -4 -11 23 4 4 -23 -13 -37 11 -21 31 18 10 -16 -10 -29 -12 -9 -23 -1 -16 5 -21 24 -4 -31 12 -3 -5 10
13215 10 -13 -20 2 25 7 -15 -69 5 -3 -22 -15 -45 19 -9 -6 -22 -12 -8 -21 2 -50 -2 -12 -17 -16 48 14 -37 -30 8 -25 -1 -8 20
13249 20 -36 1 -16 -22 37 -13 20 -33 -21 6 -15 -59 -23 -45 5 34 -15 -16 -28 -47 7 -5 -22 -80 -45 -12 34 -14 30 -43 4
13280 4 -11 22 -13 2 17 4 -22 26 3 8 12 3 -54 10 -1 -15 -14 3 -30 -61 36 -24 -11 -37 -26 12 27 -15 -21 11 27 34 -8
13313 -8 -14 -15 -26 17 -27 -54 -19 -11 8 -19 -2 10 -49 -17 -21 56 20 11 2 -32 11 -25 8 27 -3 14 -3 -65 0 -13 -21 9 -3 14
13347 14 -21 20 7 32 -23 -51 -39 -29 -20 -20 -33 11 -11 -17 0 27 -22 -20 -9 -40 -3 -31 -2 -44 -33 -18 -6 5 -33 -26 7 -37
13379 -37 5 -47 -37 33 -6 -22 1 -15 -20 -44 10 -62 -23 -6 -59 7 -3 -8 7 -7 -4 -26 8 -26 -10 -23 -20 -9 41 -18 -19 -13 -43
13412 -43 -2 29 -13 3 21 7 -6 -13 -29 20 -20 1 4 -18 24 -11 -8 5 54 30 13 39 36 37 -17 -31 5 -24 12 -19 -9 -30
13444 -30 29 1 10 -25 -6 -28 56 52 11 -47 4 -6 -14 -11 18 17 24 11 -39 8 21 26 19 -15 -16 -20 9 -1 5 2 41 -17 25 10 26 -8
13480 -8 -28 2 -53 24 0 31 -37 14 -18 -38 57 18 3 -31 -14 40 -8 19 -23 16 20 9 -55 -17 -1 -21 8 16 -25 -4 -73
13511 -73 43 5 -11 -10 -1 32 0 17 10 16 -23 -8 -12 -11 -9 -13 -28 -9 35 -6 -17 -22 9 -10 -31 5 -34 -10 -39 -2 31 -43 0 2
13545 2 22 -1 7 16 30 26 -33 6 2 1 16 -11 13 -3 -9 16 28 -8 -18 66 -30 33 -9 -13 -13 6 -23 8 -37 10 9 -30 28 -3 6
13580 6 58 -13 -32 -22 -3 0 -11 52 5 -1 -28 10 0 -15 13 -5 5 -9 6 2 -10 36 -22 -41 -4 -7 -20 22 -8 3 -2 37 24
13613 24 -26 -14 -20 -8 -17 -43 29 8 9 32 10 22 -2 -20 -27 -10 19 -52 20 14 5 2 21 24 -45 -32 -26 -50 11 -18 -14 -25 -36 8 19
13648 19 -43 3 -14 -26 17 2 -46 -15 -23 -13 -16 -18 -29 -52 -44 -13 14 -12 1 2 18 -2 -22 -26 9 -6 34 -37 -32 -33 38 -4 18 -4
13682 -4 29 68 16 25 -12 -15 -10 -23 -17 -48 15 5 35 -16 -21 -20 1 -9 -79 3 34 -35 19 -42 -11 -25 1 -18 -23 -59 -38 -44 22 -15
13716 -15 -9 -36 -23 25 -19 28 -14 15 14 -37 -7 -62 -14 -35 15 -33 -24 1 16 -22 -24 -10 12 -16 18 -21 36 -23 15 10 14 1 -30
13749 -30 42 -17 1 -8 -20 9 -23 15 -28 -33 -16 14 16 -43 20 -21 -34 -6 -8 13 -10 19 -47 -29 7 8 -2 -18 -13 -6 -36 -46 25
13782 25 19 30 -12 -13 -1 -31 -12 -56 -11 -5 -13 -5 -37 -7 -12 -1 -7 -51 15 -6 32 -21 -22 24 -2 3 14 -31 -14 -6 -36 11 24 -30 -9
13817 -9 11 27 -8 -15 13 -6 15 -27 3 -1 -28 -37 -18 -22 -23 48 -23 -38 -50 -28 -24 30 -5 -6 16 -1 -21 -18 8 -8 38 -42 -19 43
13851 43 -2 8 -9 -16 -34 -14 17 -22 -7 -14 -6 9 -7 -45 -19 -2 -27 -3 -40 -20 -31 0 4 12 22 -3 -22 -4 -4 -14 15 -65 -18
13884 -18 42 -2 6 13 -15 12 -30 -15 -4 -2 35 -32 18 -23 -38 -16 2 -7 -24 -38 8 -29 4 -3 -14 -8 -23 -21 -1 -24 11 -32 -9
13917 -9 -29 34 -25 -31 -26 -19 -24 11 26 -23 1 29 -40 1 5 -29 -21 46 -13 -35 6 0 8 -4 22 -39 -61 -2 -15 2 6 -6 20 -14 12
13952 12 -9 -9 -58 2 9 -12 21 19 48 -8 12 -26 -30 -23 -10 -11 6 25 -30 18 -54 -22 -11 -21 -24 11 36 -5 8 -64 6 6 -5 -18
13986 -18 -26 -11 -85 -10 -13 -4 -20 17 -10 0 -27 1 -36 -95 -1 -26 1 21 0 25 11 1 17 -4 17 -34 0 26 43 -14 40
14017 40 1 -13 -24 -7 -9 9 17 -21 -23 20 4 -31 -11 -17 -28 -13 -15 -2 37 26 -4 -34 -25 -36 -30 -29 -17 -32 0 -12 -8 0 3 11 38 -49
14053 -49 -56 -31 22 20 -2 -27 -22 -30 -6 19 -13 0 -24 6 39 -29 -27 -19 -63 24 -14 -6 -3 -22 0 13 -34 -15 18 16 17 10 -36 2 13
14088 13 19 -4 -30 -26 10 -9 -1 25 -25 38 -59 -11 -13 -1 -31 -10 3 -61 -2 -18 -9 -19 14 3 -13 27 -41 -9 -44 2 18 26 2
14121 2 -36 6 -49 -21 2 13 -6 -20 -23 -56 -25 -15 -37 -15 -7 14 -8 21 11 -36 -19 -1 -19 -9 -46 -19 25 -54 0 1 6 -28
14153 -28 -13 -15 1 -32 52 -15 54 13 -21 -9 -9 -4 15 0 -14 -6 -4 5 -2 -9 -2 -2 36 7 24 -28 13 -8 -4 23 25 55 -14 7 -16 -4
14189 -4 1 19 38 -23 -12 -22 30 6 -15 -9 -27 17 -26 34 -18 26 10 -15 -26 -12 50 -18 -15 3 -23 -1 -31 6 -11 -1 10 -24
14221 -24 -20 -24 -8 -47 -25 8 -73 -26 7 -46 6 -2 0 -32 42 -15 14 -59 21 -25 20 -1 -40 13 -37 -21 -20 40 -1 1 27 -2 -26
14254 -26 28 29 21 -11 -12 14 5 30 -18 2 -47 3 27 -35 6 1 37 -15 -23 13 31 0 18 39 -27 -9 57 -47 3 -54 -4 2 -33
14287 -33 -17 -22 46 -26 5 -21 -10 26 -29 27 13 22 -3 -16 -26 -21 4 -47 5 21 -43 16 -6 -1 -34 -12 11 -49 -2 -24 -7 -46
14319 -46 26 15 -27 -2 -2 25 -6 -17 -8 -12 10 -24 27 -14 -29 -27 10 6 -46 29 10 -4 -1 12 28 24 49 23 24 -12 -16 -11 2 26 -8
14354 -8 -15 -6 -46 -18 48 -12 -9 -27 -11 -78 -13 10 19 12 -42 -3 -22 44 4 -40 -28 46 21 27 -18 -18 -31 -32 -26 22 27 -11 -8 6 -22 -39
14390 -39 18 -34 -35 0 -30 29 6 -14 -21 -5 -12 -17 45 -8 11 34 37 4 -9 -28 -56 -18 -58 4 -39 -5 -18 13 13 -30 38 9 17
14423 17 7 17 34 38 -29 -40 -12 -35 -24 -26 -15 15 -52 -32 0 -26 -1 -28 -2 -23 3 -28 -7 -19 19 -14 -8 -31 -28 16 2 12
14455 12 -18 23 27 -14 2 48 -18 -9 -12 -43 44 22 -34 12 -27 39 -5 -14 -6 15 19 -33 12 -10 38 9 -41 18 -6 9 -37 13 -26
14488 -26 1 11 -5 -25 -3 -4 -29 24 35 15 19 11 40 -15 -30 21 -13 -10 -40 17 -21 -12 -3 -3 11 -2 -10 -43 17 20 9 4 -31 1 -8
14523 -8 -40 -56 86 23 57 14 8 9 29 13 -32 2 4 -13 1 2 -5 6 8 3 -44 20 -5 17 -43 -12 -36 -28 -21 -50 -29 -3 -26 21
14557 21 29 -6 10 -33 5 0 -17 4 -2 43 -20 -19 -22 0 21 -57 18 -16 -22 -24 -20 -21 -8 -15 -33 -1 -20 -2 -21 -46 57 -7 34 -35
14591 -35 -30 12 -54 -14 -17 24 15 -27 -21 35 12 -5 32 10 -54 18 -6 -44 -39 -32 25 11 -22 -26 0 -2 8 -8 0 23 2 -34 5 30
14625 30 12 -5 19 2 40 26 39 16 14 73 24 7 -58 -8 12 6 18 16 -16 8 8 9 -16 16 4 18 16 0 -17 1 -33 11 -28
14658 -28 17 14 -17 -10 11 35 17 12 26 -3 17 5 7 -40 4 29 19 -9 8 -3 -32 12 -8 49 -21 7 -7 8 -18 -17 -1 14
14690 14 19 7 -13 -2 22 30 73 14 -21 39 36 -4 12 -59 -24 -10 20 4 -29 -23 -8 -31 9 -1 -27 0 38 4 36 -16 -29 -23
14722 -23 -4 19 -15 9 -9 -16 10 -31 3 31 -32 -20 8 24 -2 -16 25 -14 32 -19 33 20 8 1 -13 -12 -19 -12 -32 -60 17 -12
14754 -12 -22 -20 35 28 6 15 15 0 0 10 -21 -15 44 10 5 -31 -10 -37 -3 -16 -24 42 -12 -10 -20 5 -11 -30 -1 -29 -31 -6 -5 5 -12
14789 -12 22 -48 -28 -25 10 3 1 -21 9 5 2 -7 2 1 22 -11 23 -15 -18 -10 40 0 -19 -22 -6 40 -29 -23 36 3 -32 -16 -59 -28 19 28
14825 28 18 -52 13 -46 10 2 -26 19 11 -25 28 -10 -4 7 -29 -11 -12 9 6 37 -1 19 11 -24 -22 -18 26 -15 5 13 -17 32 13 -10
14859 -10 11 18 -22 47 -12 -18 -17 23 25 27 -16 -31 -11 19 3 -21 -16 11 -24 -1 19 25 -21 28 -2 1 -2 -21 -29 -2 11 52 9 -28 64
14894 64 -24 -19 -9 6 54 37 -15 4 -22 5 2 -11 -39 31 -2 -20 10 3 54 -39 43 21 -38 22 2 -56 -24 14 -46 20 -16
14925 -16 0 34 -23 -57 3 -12 -4 9 18 -22 22 30 14 -2 -7 -23 -14 -15 -10 21 11 -23 -26 -11 9 7 15 -10 2 16 5 -30 -36 4 -10
14960 -10 33 -19 -11 30 2 -9 -56 -26 26 -17 17 1 -31 -46 11 28 -4 36 3 -1 6 28 22 -24 -22 47 -3 13 31 5 29 41
14992 41 6 -17 32 14 -27 -7 10 15 -28 41 7 2 21 43 10 -9 -9 21 11 14 38 -12 11 33 -12 -6 24 27 -1 20 -34 -53 8
15025 8 -17 6 -3 -16 -7 -9 -22 -1 -17 10 -11 -2 -5 -12 2 17 25 16 23 -22 15 -17 59 -3 -42 35 30 14 -35 -2 -42 33 29 -22 5 -35
15061 -35 -7 -5 -25 -3 18 35 -2 19 13 -12 -54 -10 17 -29 -27 12 24 -41 20 12 -4 2 33 -4 -56 42 -4 -16 -25 -56 -19 -28 20
15094 20 -12 -30 -4 7 17 -6 28 -30 13 -7 50 8 12 -8 7 8 16 56 -61 6 -1 -27 38 -44 -15 -12 -10 -6 29 14 -38 35 -18
15127 -18 -1 3 -34 -70 -54 -27 -83 35 -40 6 -17 -45 25 -12 3 19 -34 37 -29 6 -26 13 -56 -11 -40 -6 -2 -93 22 5
15157 5 -23 -26 -45 -17 -20 -42 -6 -18 11 -24 4 -39 12 -11 19 31 14 -24 -40 -14 1 -35 -23 -20 1 -38 31 -3 -43 -5 -44 -39
15189 -39 -35 -27 -48 -19 -9 24 -32 -17 0 -13 -34 2 37 -35 0 -36 -5 19 -33 -32 -4 31 -26 -24 -2 -9 29 -33 -9 -16 -41 -22 -29
15222 -29 -43 27 14 -1 -12 -39 13 19 -30 -1 -45 -12 -19 -16 -37 -32 23 9 0 22 -8 -24 20 40 -27 -35 13 10 -4 -13 -38 -23 -35 -9
15256 -9 28 -27 -3 -46 -22 13 -13 -18 -35 5 33 33 34 -6 -26 -21 21 -7 -45 -22 -13 -27 -10 10 -36 0 38 10 0 9 7 16 -11 -5 -5
15291 -5 -43 42 -37 -44 -20 -13 -35 3 54 -12 58 -13 34 25 -20 -5 -11 21 17 6 1 13 -16 -45 4 -2 31 -3 4 -5 -28 -6 47 3 1
15326 1 3 6 -22 -13 -18 -20 10 -36 -11 19 22 21 -23 -6 52 24 -7 28 -2 4 -20 -31 12 14 8 -15 24 -13 15 -8 1 15 48 34 -20 -15
15362 -15 42 -6 48 1 -16 -31 -14 -1 -36 -3 11 4 42 -18 -24 18 -11 47 8 43 -34 15 -6 -10 -3 2 21 -26 -21 -9 -5 21 -1
15395 -1 -28 12 0 13 -41 28 -19 -8 24 31 0 -25 13 -26 17 -12 33 10 -9 -23 -18 54 -1 -22 28 -43 40 -6 -11 -4 19 50
15427 50 -15 -29 -26 -25 -45 -16 18 5 -7 5 74 -47 -24 15 -31 26 42 33 -10 23 9 11 12 19 4 -23 3 -4 44 -9 45 -20 31
15460 31 -23 -17 -22 19 26 13 -44 51 0 22 9 10 -6 5 -30 -7 17 38 -7 -20 11 3 38 -28 -1 24 17 23 -25 13 -30 8 1 -11
15494 -11 32 -14 -7 24 -5 -27 -7 -19 -2 2 -9 37 11 11 70 -7 25 -7 4 22 -27 52 26 -12 8 30 10 6 15 -16 36 -4
15526 -4 -25 5 -32 -24 -51 35 6 -21 -1 14 -15 3 1 -11 -7 31 -32 -20 18 1 -10 8 32 -81 -21 47 -31 2 14 17 2 12
15558 12 -21 -32 19 -35 29 -30 -39 -8 2 -19 -24 12 -18 32 8 -49 0 -2 -23 -6 10 9 -31 -48 -19 -12 -37 28 26 31 3 -45 56
15591 56 -21 -3 -19 -26 40 0 -29 -5 -10 -24 -49 -21 -52 -10 -3 -37 11 -5 -18 -59 1 1 -7 -14 -10 -40 6 19 -35 -53 2 -9 -40
15624 -40 -13 -11 23 46 6 -30 4 -10 -47 -21 5 -50 -5 -37 -4 -16 11 -7 -24 -3 10 -23 12 32 -5 -2 -18 40 5 -28 -42
15655 -42 -66 -20 3 -29 -34 -45 -22 -22 14 -11 32 -2 12 16 2 -6 -12 -10 5 3 -5 5 7 27 -56 18 8 -7 -24 13 -14 -4 8 -32
15689 -32 -19 45 46 11 -57 -9 -17 -63 16 29 -16 -36 -6 -54 -39 17 4 -32 29 23 18 -33 8 2 9 -28 36 -23 18 7 8 19 2
15722 2 20 -30 23 -83 -8 -15 -9 102 -19 10 9 44 23 11 -44 -65 -5 -4 -29 15 -9 8 -29 -24 -19 -2 -24 17 22 -29 26 -25
15754 -25 -8 -1 -64 4 -42 -6 6 15 7 -16 -50 -41 -19 37 34 21 3 -26 -30 4 -6 -19 -7 5 31 -37 22 17 -2 7 -23 -13 -36 10
15788 10 0 -52 5 -16 19 -9 -10 14 15 7 -19 -53 35 -10 20 12 11 -30 19 -18 -21 -24 -15 -15 8 2 7 12 -11 27 12 -11 -25 14 -25 -34
15824 -34 -21 17 0 5 -8 -17 -9 -29 13 6 -11 13 -34 6 20 -16 -5 -13 -21 19 45 -6 -29 -32 -20 -29 -63 15 0 -36 -20 -9 4 -57
15858 -57 -8 -23 -57 5 -7 7 -22 -14 -31 -34 -18 15 19 -34 14 -25 19 -15 -19 -14 -40 -9 -7 16 -17 -43 -3 -4 -42 -3 -47 -8 -19
15891 -19 -57 -20 -47 -6 -10 17 -56 -7 16 -3 -32 -30 27 -40 -2 40 -20 7 -24 -25 -16 -29 33 -45 -5 -19 42 64 -10 6 -40 -33
15923 -33 -7 -39 -20 17 -4 -10 30 23 10 -42 -31 -4 3 21 -15 29 -52 -25 -28 -24 0 -27 35 -21 -5 14 -8 -6 15 10 -50 -1 -12
15956 -12 0 2 32 30 -23 -42 21 9 10 -34 5 44 -5 7 49 0 0 -8 -21 -22 -6 17 27 16 15 4 7 -3 32 2 13 -4 17 -54
15990 -54 12 -58 -39 7 -22 -1 -35 -11 -16 -3 -2 18 8 -11 -6 -11 -30 20 25 -10 -26 -1 -19 -43 -13 -26 36 -3 -11 -41 14 2 -14
16023 -14 -9 -29 7 -38 -3 -14 -10 4 17 -4 49 22 30 -9 14 40 12 -11 -22 -3 10 7 57 23 3 -8 -35 -24 -30 -4 13 -10
16055 -10 -1 -19 -26 33 -22 10 -15 12 21 -34 -28 27 -31 6 -14 10 -22 -9 3 6 -21 -14 28 -4 -12 -22 0 17 5 -10 -10 29 -9 -16
16089 -16 -19 3 -11 25 7 37 32 47 -31 6 2 -19 15 -17 10 -21 -28 -43 -21 -29 21 3 40 17 -50 26 11 -31 28 -21 64 4
16121 4 -22 -70 -27 36 -30 29 -47 27 -5 7 4 -35 31 19 43 -49 -13 3 -30 -46 9 16 -12 4 -16 0 14 -2 -62 -26 21
16152 21 10 23 18 -35 -17 2 27 -22 17 7 -5 9 0 16 -11 -42 35 12 -6 -17 -16 2 6 1 40 2 -9 -18 4 -14 -4 -42 -22
16185 -22 21 -17 21 -26 -17 26 30 31 -21 7 -16 -3 20 -23 13 -27 8 -5 -20 8 -3 51 21 39 -39 -37 14 26 18 29 -13 28
16217 28 -5 -18 -21 -11 13 -8 8 -46 19 -5 -9 -15 -10 -54 -20 -11 -30 3 -65 1 -33 -20 -31 -28 -9 -65 2 -26 -18 1 19 5 -21
16250 -21 -30 -10 -59 -24 -13 -7 -6 -28 1 10 -34 15 -5 -2 -26 -18 -37 -10 19 -33 2 -19 -28 -43 -4 -15 -6 15 -1 5 -1 60 22 -40 12
16285 12 -50 -19 -25 -53 -19 8 -42 -25 -16 41 10 -35 11 -27 -17 8 -34 -23 -28 -6 -10 -61 8 -27 -12 -29 -33 -14 8 30 -17 23
16317 23 -44 -29 -21 -20 17 -6 16 2 -15 -49 -22 -5 -16 3 0 -8 -7 -4 22 -25 -7 -35 4 -14 -24 25 -23 4 -26 -40 18 -2 25
16350 25 -60 -43 -43 -34 -26 -22 -29 -3 -70 0 -55 -21 -29 -42 45 -17 -39 -31 0 12 34 -30 -39 9 -34 -39 -30 6 -4 -20 3 -45 -1
16383a
$$ Imaginary data points
##PAGE= N=2
##DATA TABLE= (X++(I..I)), XYDATA
0 0 0 0 0 0 0 0 0 0 0 0 0 0 0 0 0 0 0 0 0 0 0 0 0 0 0 0 0 0 0 0 0 0 0 0 0 0 0 0 0 0 0 0 0 0 0 0 0 0 0 0 0 0 0 0 3 -3 4 -5 8 -11 14
61 14 -14 22 -25 39 -70 -435 426 349 459 348 230 80 -54 -197 -282 -353 -288 -234 -101 41 186 300 359 345 303
86 303 155 35 -47 -142 -262 -263 -187 -141 -52 25 185 263 239 253 136 66 30 -50 -162 -205 -154 -139 -129 -16 30 93 143 121
114 121 151 35 67 -13 -58 -67 -130 -94 -84 -71 -2 -28 19 25 63 10 29 4 -24 -28 -57 -47 -41 -75 -31 -24 -7 -7 18 -5 -19 1 34
147 34 27 -16 13 -25 23 28 -20 34 -62 2 17 -17 -14 -38 -8 3 12 -20 10 16 10 3 -22 -19 -27 0 9 26 28 7 18 -4 -15 -17 -19 5 -41
184 -41 25 38 14 43 40 15 33 -26 -15 -45 -97 -81 -49 -53 -43 33 106 104 99 97 100 45 -3 -100 -120 -145 -151 -89 -61 -49 80 142 163 161
218 161 180 90 24 -52 -154 -172 -169 -166 -87 -17 33 131 172 218 175 149 152 -9 -26 -83 -134 -169 -127 -111 -73 46 146 167 196 204
248 204 183 135 -7 -36 -147 -175 -120 -122 -57 -8 61 133 167 199 125 89 93 39 -35 -98 -95 -126 -95 -6 14 42 79 125 112 55 53
279 53 26 -36 -47 -56 -48 -42 -65 -11 -16 -49 -3 11 -22 -13 6 8 24 -48 29 33 17 12 51 -11 -9 -37 -73 -34 -7 -42 -7 17 81 46 98
314 98 78 54 56 -23 -22 -63 -89 -99 -150 -52 -15 34 84 76 142 68 75 0 -3 -53 -96 -111 -93 -78 -46 -4 86 104 116 123 108 67 26 -36
348 -36 -72 -52 -65 -93 -83 -16 30 40 60 95 61 23 7 4 -34 -16 -71 -69 -22 -8 -63 -6 0 -24 10 26 -9 -4 8 -18 34 18 -14
381 -14 -3 -19 -22 -45 -32 -38 -24 -18 -48 -23 7 -10 32 16 31 72 -3 1 -49 -52 -1 -61 -35 -52 -19 32 10 -2 51 49 27 53 -4 -73
415 -73 -86 -52 -64 -79 8 -27 16 71 37 26 45 74 3 -5 49 -62 -26 -46 -8 15 5 31 16 40 33 15 -33 -17 2 -21 -4
446 -4 27 6 32 21 -17 -10 -9 -8 -76 -11 -50 -33 3 28 33 60 41 66 28 -6 -13 -100 -73 -108 -82 -46 -17 45 67 95 112 89 70 34
480 34 -36 -66 -98 -85 -103 -132 -58 -14 25 100 147 133 136 74 29 -21 -96 -149 -130 -104 -105 -54 0 67 135 106 176 79 68 82 -53
511 -53 -132 -184 -111 -124 -72 -2 35 115 79 145 152 130 49 -29 -64 -96 -109 -98 -134 -77 -10 41 36 112 101 103 44 13 -7 -77 -59 -112
543 -112 -43 -117 22 -1 11 35 98 41 52 -14 39 8 15 -1 -23 -70 -57 3 28 34 37 27 20 20 17 -7 16 2 -8 5 -13 -24 1
576 1 -22 60 -25 29 -13 31 25 2 13 6 -4 -12 7 -4 -1 23 12 32 18 28 0 -17 -5 -23 -52 -16 -21 -13 5 3 19 -33 -2 23 -12
611 -12 5 10 -38 36 -48 31 -24 -25 -16 -15 44 41 54 -6 33 18 18 9 -29 5 -74 -82 -46 -60 -45 27 35 67 63 70 3 7 -23 -51 -99 -94 -81
648 -81 -17 -15 38 71 59 62 125 97 25 44 -55 -61 -109 -83 -111 -68 -57 -18 57 78 71 94 86 33 -7 -30 -83 -121 -121 -123 -50 -72 26 62
682 62 123 119 99 123 7 -6 -22 -47 -112 -123 -63 -75 -11 22 27 83 111 50 77 66 -29 -31 -63 -82 -89 -48 -44 5 68 35 51 -1 27
715 27 -11 -69 43 -27 -27 -62 -50 -35 -64 -9 30 37 3 26 25 -12 -20 -13 -26 -25 4 3 -29 -1 -15 49 -3 -28 -14 -6 16 -3 29 35 -6
750 -6 17 31 -9 -17 -44 27 3 9 -7 -39 -22 -44 29 27 34 -11 -20 23 1 24 -3 -35 -28 -41 -9 -58 3 -53 19 9 -4 39 -30 18
784 18 4 10 -24 -31 -14 14 -2 -20 30 5 -35 -32 -24 -11 17 12 19 4 -11 -19 -29 31 -1 -9 -13 -59 -54 -80 22 -48 24 28 15 37 24 10
820 10 -11 -14 -18 -52 23 -21 -15 -5 12 9 114 62 -8 68 6 -2 -42 6 -19 -45 -48 -50 12 -4 37 21 7 68 27 8 -17 -17 -18 -17 -37
855 -37 -80 -19 -22 1 -5 16 55 7 50 -30 -24 -20 -29 -28 -6 -17 6 23 30 -28 72 19 64 -12 -28 10 -1 14 -3 21 8 11 -4 -25
889 -25 36 -54 18 15 0 -44 -4 8 8 13 23 -2 34 -28 6 -6 6 23 18 22 -41 20 -15 46 31 33 -6 62 -40 -8 21 -29 13
922 13 6 15 -30 20 59 46 56 -16 -17 13 1 -23 -2 -21 12 -5 12 9 28 5 47 7 35 35 -2 22 35 -36 -18 -51 30 11 -31
955 -31 29 23 27 -3 21 14 -16 59 -6 -3 -63 -8 -4 -34 -23 25 24 50 -29 12 -30 24 9 9 14 33 28 -14 39 -14 45 19 17 32 -2 -2
991 -2 -18 -14 3 7 -1 15 26 28 11 17 -5 -7 28 4 -28 17 10 -54 -19 -47 4 -10 0 -38 6 2 -44 -10 12 -4 -24 13 24 57 17
1026 17 -10 24 34 -21 -15 3 -6 17 -16 10 6 7 -25 74 1 -22 -14 0 7 18 -15 -36 9 14 -29 23 -28 -18 -8 -35 33 -6 23 13
1060 13 27 -4 74 30 4 -5 -56 -15 0 -34 -13 -29 9 2 -7 18 4 -22 -5 -52 -4 16 -46 -61 32 -33 12 16 25 19 22 13 10 -20 -38
1095 -38 -23 -17 -19 -26 -42 0 -8 -45 -48 -50 40 11 20 4 -8 -29 -62 -4 5 -9 33 -40 19 -6 38 10 26 -6 -26 29 -38 -35 -10 -19 11
1130 11 -37 -15 2 30 -1 0 19 11 51 8 1 -40 -24 12 7 -21 -2 -10 5 -11 22 -6 -1 6 -20 -3 28 16 -9 26 -7 29 -13 30
1164 30 39 -62 -12 -8 -11 -16 -43 -11 20 5 43 5 1 7 43 44 29 -39 36 2 1 -5 -2 -3 30 -37 -15 12 15 -34 4 25 -16 -11 2 7 46
1201 46 40 15 -6 -1 -24 -37 34 20 -15 0 20 35 -6 1 -7 25 20 15 18 -3 2 -5 1 -40 -22 -5 -20 8 0 27 -40 43 40 2 25 -5
1237 -5 -10 9 0 -29 18 -9 -19 -9 0 45 25 7 -15 23 29 36 -3 16 -4 -5 59 18 -15 3 -26 -6 -11 23 7 1 -17 -35 -10 16 -39
1272 -39 40 22 34 40 12 58 25 3 23 8 -20 13 11 -21 -8 15 17 9 0 -13 23 13 -35 -1 2 2 -11 8 -30 -30 5 2 8 21 -20
1307 -20 5 12 -8 -16 -8 -2 27 27 -2 -8 2 30 -6 -15 12 -3 5 31 -20 -2 14 10 -20 -38 47 -34 27 -16 26 -27 32 22 20 10 6 -17
1343 -17 -8 51 15 -23 14 -27 9 29 38 46 13 16 -27 56 -23 17 21 1 29 -43 -6 -7 -59 43 12 18 -20 -15 -18 -2 2 26 -3 3 27
1378 27 -11 -16 8 -11 -19 10 -27 -21 12 14 -4 -25 42 -9 -29 9 -27 16 35 49 -13 31 11 19 16 12 39 -16 42 28 22 -5 31 -4
1412 -4 8 7 39 -16 8 39 20 6 -3 -21 36 14 14 15 1 26 -38 34 -71 -14 -24 5 18 15 -44 16 32 22 -49 -13 -12 -52 -25
1445 -25 31 16 -31 -19 -21 36 45 31 23 33 12 -29 5 -46 -13 -21 -48 -1 17 -17 -28 -5 30 -5 40 3 -8 -29 -47 -3 15 -19
1477 -19 -6 -44 -18 -20 -1 11 -36 -15 -5 13 17 -2 -47 4 21 -17 4 -1 -24 -92 21 26 11 8 -77 -4 -14 1 6 -9 7 4 -15
1510 -15 30 16 -9 -18 27 2 6 -5 16 29 -25 38 -3 16 13 9 3 50 -17 -3 -7 32 -6 -28 32 3 15 70 15 -28 -17 -5 -37
1543 -37 -24 -8 -18 6 14 13 18 15 13 -20 19 -22 -23 3 -42 -50 -32 -12 -1 6 27 34 40 49 5 -11 20 22 -21 -4 25 -32 -30 12 -4 17 -9
1580 -9 14 -13 -27 -15 -29 9 -17 18 31 -20 -1 -30 -16 24 -7 -9 -33 18 19 3 -19 7 -51 17 7 -9 -22 11 -4 -12 6 7 -33
1613 -33 -1 50 -11 -11 -19 32 28 -59 -9 20 20 18 -14 36 16 4 10 38 -37 39 3 3 2 16 -21 3 18 11 11 -10 23 62 38 -15 1
1648 1 -12 5 42 -23 51 32 -22 28 2 25 -14 -1 -24 -8 16 16 4 19 -26 35 40 -5 -22 8 11 -6 0 -66 -47 15 -17 30 4
1681 4 44 15 34 33 57 37 -24 0 9 -24 13 10 2 7 31 37 15 15 20 15 -2 -7 -5 7 -45 47 3 -6 30 -55 70 66 -1 58 37 14 4
1718 4 -14 -20 -8 1 -35 20 24 19 44 7 25 41 24 16 45 -14 12 32 -19 -5 15 17 62 -8 22 38 -1 19 9 -21 18 -35 -24 -2
1752 -2 7 -6 46 -29 0 20 -11 14 -5 5 -7 45 20 49 21 -35 -5 34 15 46 30 -32 22 -9 5 36 14 -37 15 -34 4
1783 4 29 31 -7 5 19 -2 36 -24 47 24 14 -3 -34 3 92 25 -6 24 30 -6 20 2 -11 -5 42 23 14 10 -3 2 13 -31 32 -31
1817 -31 7 -18 10 5 6 39 -20 2 -48 -40 -5 2 -8 4 22 19 -1 -2 -13 3 -27 15 -2 -11 -15 -19 2 -22 -10 -14 26 20 -11 14 8 -43
1853 -43 -9 -7 -32 -2 18 21 18 27 24 -7 -30 23 -12 1 -10 -22 -16 -29 22 -26 -9 -30 20 3 -1 -9 9 60 -46 8 -38 7 9 -8
1887 -8 -4 15 48 -48 8 -37 -27 42 -5 7 1 8 37 -3 -6 -12 10 11 33 3 10 23 -5 -28 -4 -18 31 -39 3 -11 6 9 16 17 7 -6
1923 -6 8 17 5 20 15 -47 -5 0 -13 -33 -11 -33 27 0 53 -29 -15 0 3 -1 -24 43 -35 14 10 14 -51 -44 -9 -36 16 1 33 39 23
1958 23 23 -32 23 37 26 -27 -16 5 -43 42 22 -41 8 20 70 -18 39 36 38 1 -11 2 -23 -14 -25 8 1 -23 -40 -13 17 12 9 45
1992 45 2 -19 -23 23 -25 2 -3 22 -14 -59 -20 -36 -8 -25 3 0 13 6 41 1 7 -6 27 -3 -34 11 -36 13 28 27 -27 27 43
2025 43 -3 22 -12 -16 0 -32 -14 7 -30 18 11 9 47 8 -48 15 13 -27 21 17 5 21 -1 2 -10 -7 21 -13 -5 8 33 15 28 -12
2059 -12 18 -20 -11 -1 6 20 8 50 -17 13 -7 -30 18 10 -50 -26 -9 -47 -22 -22 -1 -20 9 -3 -17 20 17 -41 34 23 24 17 15 -7
2093 -7 19 -5 5 -24 -39 25 21 12 4 6 -19 19 -10 -22 5 16 -20 0 57 8 22 6 -42 53 7 -5 13 -15 6 23 27 -5 -11 1
2127 1 -20 24 -9 9 -32 13 -3 22 -1 41 12 31 -17 -21 -12 -47 -40 27 -7 39 -47 8 44 -6 32 -14 0 -27 -34 -18 -16 -3 6 24
2161 24 -29 -34 18 24 26 -40 4 -30 7 -35 17 36 34 -25 -29 39 16 10 -15 29 -11 -2 -52 -2 24 2 10 3 5 63 -34 -21 32 -21 14
2196 14 -10 -26 -20 -3 -17 0 -12 -22 -2 -21 -26 -14 14 -16 28 -2 -38 9 -23 -8 -33 14 2 -43 -18 11 3 43 7 -1 27 -20
2228 -20 -17 -5 -14 -3 -29 6 10 -11 -31 -22 28 -25 1 -8 -10 -11 43 -27 -10 15 -20 49 -26 8 25 -18 11 -26 32 -37 -14 -16 30 -16
2262 -16 -49 -27 -36 -7 10 9 -1 9 -11 -7 7 -3 1 -27 -5 -25 7 -25 7 36 -18 -52 11 -15 24 7 -31 50 6 -13 -8 -27 -9
2295 -9 -6 -5 -30 21 -12 -11 34 23 8 28 -31 -20 -45 -23 -27 56 -9 7 -14 -3 24 -32 -50 -20 50 -4 19 -10 -5 21 0 -21 12
2328 12 -31 20 -19 8 -12 -2 33 -23 -30 22 18 2 -30 -17 9 -30 -16 16 7 -36 -8 4 6 -23 -15 -26 -46 15 2 -8 11 6 5 33
2362 33 -21 31 3 -32 12 -24 -33 11 11 -9 1 1 5 -6 -10 -19 1 22 35 -12 -11 48 23 -7 -36 0 -4 10 20 10 9 32 -4 13 8
2397 8 -29 8 -1 21 -7 15 -15 -47 -25 4 0 -37 27 10 -25 -28 -30 1 -14 -34 -42 34 -20 6 -8 -18 27 25 35 31 47 27 -14 -17 62
2432 62 0 10 39 13 22 11 7 31 45 -21 -11 -4 37 -34 50 26 10 -29 10 -26 -4 -14 16 -8 -2 -58 7 4 -19 25 -8 6 35
2465 35 21 49 31 6 -2 -3 10 -16 -9 11 15 -29 -21 -15 -2 -1 8 35 7 -9 7 21 -22 6 -12 23 10 0 2 12 -6 51 24 -27 23
2500 23 16 19 -42 16 -19 4 13 35 33 51 -10 5 10 -33 0 29 -4 23 13 51 11 25 -2 -19 -26 -58 40 -10 -32 -24 11 5 1 21 11
2535 11 -10 -60 20 -2 21 -4 10 -69 9 -54 25 30 6 -11 -5 30 19 25 -24 -19 -33 6 -15 6 21 20 -36 42 -9 -9 -14 -17 -3 -15
2569 -15 -20 20 10 4 -29 4 39 -6 -34 -30 -3 19 -2 -12 -26 1 21 2 -7 43 -26 33 -5 22 16 -35 17 -10 36 -11 23 38 6
2602 6 -3 -56 21 37 -56 25 9 -12 -44 -3 8 26 -25 -7 69 -11 -10 -4 11 -17 -41 -30 -44 -28 2 -16 -4 5 3 8 19 -30 14 -23
2636 -23 -34 46 -12 -23 -38 -16 -33 10 7 -32 45 19 32 -13 7 -16 -72 21 -33 -3 1 8 13 -24 -47 19 2 26 -3 -7 -25 42 -18
2669 -18 -14 -8 -24 -19 -21 14 6 0 -1 19 -21 28 -18 -2 -16 -13 -22 -13 -52 4 -18 8 55 -2 40 4 48 -3 5 47 -67 5 -23 16 18 6
2705 6 42 7 10 -7 12 19 -41 30 -3 -37 27 -3 30 -22 23 -19 28 0 1 10 -63 36 -8 -16 -15 -8 17 9 36 19 46 3 -32 -21 11
2740 11 -31 11 -16 13 33 -16 -7 8 9 -30 -29 14 28 16 -12 -7 39 -32 24 5 -13 -22 9 5 4 -23 43 0 23 12 4 37 -29 30
2774 30 8 -15 27 4 52 22 30 -35 13 12 65 20 -51 18 -2 41 26 -2 2 30 2 26 28 -10 -30 3 4 21 2 -12 -31 -3 -2
2807 -2 24 42 -4 -9 36 -32 37 42 6 -2 14 34 16 32 -5 8 -32 -23 -4 11 -10 25 18 -26 11 -6 19 22 -36 20 -10 18 41 -67
2841 -67 15 5 4 22 18 -24 5 35 -1 -28 29 -32 -42 -3 33 -14 -22 -15 -19 -33 11 26 -13 -37 29 -33 8 40 -5 27 -48 20 -39
2874 -39 16 10 41 10 -21 18 -25 -15 -12 -32 13 16 -10 -5 67 14 -44 -11 -14 -21 -48 7 -16 -26 -19 20 -5 0 26 -33 44 40 -10 -10 30
2909 30 -22 0 -24 -2 15 -4 -7 30 60 3 -7 -26 13 8 23 3 -5 34 -77 20 16 -1 -1 46 9 -31 -15 -28 -8 23 -12 -11 -17
2942 -17 -4 12 6 39 28 25 -5 -1 -14 -2 12 -37 11 -27 7 35 -25 13 0 -2 28 60 -40 16 -5 -17 -6 31 18 16 -60 12
2974 12 -11 11 -50 -26 -14 24 -15 10 17 -24 -19 -22 29 -36 -13 31 -8 1 -29 12 5 6 25 -17 -22 -3 35 7 -15 8 -11 -5 19 -4
3008 -4 23 -9 -52 -8 -12 9 34 12 5 -21 -2 27 -22 16 -30 -39 29 8 -10 -11 1 -30 -26 -52 -2 -43 -7 -51 -25 -16 13 15 -29 -33 -18
3043 -18 18 -26 -1 34 -42 -22 -41 16 -39 -1 10 -50 -11 -29 36 3 7 -9 -11 24 -14 49 0 -18 25 -40 28 20 -4 4 -16 9
3075 9 -16 17 -9 27 1 -27 14 -7 18 -20 -8 2 28 -29 -4 15 6 -17 -40 12 2 -26 -12 -49 -11 -5 6 -4 -18 32 -11 9
3107 9 -8 -11 15 -11 -26 -11 -43 8 -2 49 -23 10 -32 34 -21 -31 -11 -13 18 -13 3 -34 -6 -30 13 -19 40 4 21 -40 8 9
3139 9 -41 18 16 28 -1 12 14 -19 -6 -3 17 -2 29 1 2 -6 -30 54 14 15 -5 0 17 -17 27 11 37 37 -14 -30 -34 62 26 15 -1
3174 -1 -12 6 13 6 26 -2 29 0 -11 20 21 7 24 -25 -1 15 23 25 -13 32 22 -3 26 -1 -10 -43 63 -16 -17 -1 4 -16 -28 25
3208 25 46 43 25 1 24 -11 8 -30 -12 74 21 20 31 -21 4 -7 -1 -3 12 28 -8 12 33 11 -41 -13 40 -4 32 -40 43 12
3240 12 1 16 10 47 -34 0 23 -6 9 21 6 -2 19 21 18 15 13 1 -32 18 17 20 -4 -21 2 -26 2 1 -2 -37 -10 2 20 44 -54
3275 -54 -7 15 8 37 33 -11 44 -4 10 11 -12 -45 -18 6 -9 -13 -1 5 74 2 27 -8 -29 -20 -16 -30 -10 7 -30 -53 -9 12 28 -13
3309 -13 42 23 44 30 8 15 -8 4 -20 22 -9 -4 48 -25 10 -28 30 -21 -11 36 -5 21 0 -15 26 14 -12 -3 -24 3 1 25
3341 25 0 26 -16 -39 -1 -10 -23 5 -28 -26 19 -3 48 -17 10 1 13 33 20 -4 -23 51 18 10 24 17 18 22 14 34 17 3 -6 -17 28
3376 28 -22 14 8 20 19 2 5 4 54 24 -8 11 19 3 -21 7 28 41 -23 8 36 -60 18 -27 -11 -7 24 -44 -56 -4 3 -10 16 31
3410 31 51 -25 18 -20 26 41 14 20 -52 -27 -35 -11 2 16 -20 -37 -1 -34 -5 -17 -4 -34 17 2 3 56 7 -23 44 5 33 5
3442 5 29 -28 -13 16 -12 -3 5 80 -16 16 -29 -18 20 -16 -39 2 4 20 12 -24 -43 -5 28 -10 -35 3 1 44 -15 11 8 -14 -2 12
3476 12 -3 27 6 3 46 -22 -8 19 -17 36 -31 -11 5 24 -1 0 21 -37 33 19 36 -6 -22 19 38 -32 6 -14 10 8 -24 0
3508 0 -7 -27 3 44 34 37 18 25 -25 15 11 23 7 11 -4 -2 40 -25 -1 48 -24 26 16 7 5 -5 14 -15 -3 14 -41 -26 8 -30 -9
3543 -9 18 20 28 9 12 26 12 14 58 23 43 -18 20 -4 -20 25 -15 -6 3 -2 -14 -47 26 17 33 40 17 39 9 30 19 31 -10 12 13 11
3579 11 6 -23 23 -20 4 -33 12 30 5 20 -17 31 12 25 39 -25 38 -1 -37 50 -12 31 -20 71 10 6 -6 16 57 38 7
3610 7 -5 -14 39 -14 1 -4 1 7 -15 -8 -21 55 16 20 -25 -9 -9 9 38 57 25 2 -15 6 13 -42 -16 -20 -5 40 -3 -13 2 4 44 16
3646 16 14 -19 -17 32 -27 4 19 20 -25 -2 -14 10 11 -13 -32 21 6 -7 18 41 28 12 45 24 38 27 0 -24 -12 40 14 9 -1
3679 -1 11 43 2 -4 -18 10 29 -32 -6 17 18 6 -12 -19 -19 -6 -16 -23 -17 9 4 -17 16 7 -3 9 7 -22 18 34 -49 15 6 22 -37 -16
3715 -16 19 38 -42 -24 -8 -37 -21 -38 -9 -37 -28 -15 -10 36 -10 13 11 -13 -62 -2 -7 31 -40 29 0 2 8 -8 18 35 -16 -17 4 -2
3749 -2 -15 -1 37 -17 43 -42 19 -14 -19 -18 -17 -36 1 8 -32 -11 -4 -25 -1 3 28 -42 -17 -10 -39 21 -20 2 -25 -5 -52 -10 52 16
3783 16 -2 -14 -20 41 6 11 -33 -4 -9 27 -3 -46 -26 -24 -10 4 29 -22 6 -19 1 4 3 -4 -6 -42 -3 21 31 -31 6 -38 -10 1
3817 1 -43 2 5 10 -7 -34 35 4 2 9 1 22 -4 47 -1 11 10 16 10 14 -11 -9 43 7 -5 17 -12 -25 -5 -5 58 -12 -3 16 -26 -20 4
3854 4 12 26 41 24 17 10 31 8 -44 25 -9 5 -36 -19 20 -27 -8 -6 6 31 -6 0 -27 3 -56 31 17 17 -19 -3 30 23 48 21
3888 21 46 -25 -4 27 -22 8 -8 25 27 -3 18 -26 15 7 3 20 -28 33 20 -4 -20 -7 32 0 22 1 -15 2 8 43 24 -15
3920 -15 3 2 -18 23 33 -2 19 14 13 -9 11 3 13 -22 44 -7 25 13 -3 32 -5 70 16 -48 -1 -3 59 15 33 0 14 24 15
3953 15 -6 13 12 -20 -6 12 -36 28 -14 52 -9 -23 12 -4 4 0 -7 -28 -20 -24 8 17 41 -3 18 -20 12 -4 11 -36 35 -60 7 -6
3987 -6 -10 26 -18 -6 25 -3 26 20 -16 2 22 1 11 52 25 -31 20 -15 29 25 22 28 26 12 20 9 -27 -19 -40 41 -14 5 -9 -23 19
4022 19 -4 48 -18 16 45 -1 -48 22 6 10 1 13 5 7 -6 47 21 24 21 -5 5 -38 5 -4 11 -30 6 5 -5 -10 -35 -35 -41 6 -16 -30
4058 -30 -3 -1 13 46 11 9 -8 27 -1 -22 4 43 -38 23 15 11 -7 -30 3 4 -21 -48 -40 -9 -22 2 -16 28 -19 -19 6 -10 8 43
4092 43 8 -28 -9 -26 -12 -18 15 -50 -2 -5 -46 3 -16 -28 -3 19 20 -62 45 -45 -16 2 14 -3 5 -34 -30 40 -30 6 -17 2
4124 2 11 -37 7 12 -22 9 11 -1 39 23 3 7 -16 22 19 2 22 30 -13 23 -2 -5 -27 -27 19 -5 13 -1 7 -15 21 -9 13 14 -33 -46
4160 -46 -6 15 14 -15 19 -46 60 33 -16 -22 2 -5 -19 2 1 27 -19 16 18 10 0 30 -25 -17 14 -3 -32 -15 -8 -45 14 -19 1 3
4194 3 -47 13 -33 21 -44 -34 48 20 -33 -9 12 -4 27 12 5 -14 -31 -3 -4 22 -34 -5 -22 22 25 -38 -14 -7 10 -20 -9 1 57
4227 57 29 24 -33 0 -16 -1 24 -5 38 28 -17 -28 7 -35 51 -41 37 -5 -10 18 6 6 -27 -45 44 39 4 -27 9 13 -65 -23 22
4260 22 -1 -29 11 -5 16 18 -12 23 39 -2 42 -8 5 -20 21 -16 1 -41 -23 0 6 61 -4 18 9 15 11 -14 43 -4 15 22 -27
4293 -27 -9 5 1 -6 49 -12 -31 12 7 -20 4 22 40 14 17 1 3 -12 -2 14 -23 8 -35 -14 -27 42 36 -32 25 13 20 35 -9 54
4327 54 -6 19 6 4 35 1 26 -25 -11 -50 2 -30 -17 -3 4 -11 11 24 15 32 -30 10 12 -55 -21 -19 26 -19 -3 43 21 -2 1
4360 1 31 -11 10 26 -4 -29 4 18 28 -5 25 11 -14 33 27 15 12 6 -32 0 4 18 18 38 -14 20 36 -25 -1 13 28 -13 21
4393 21 20 65 -44 64 24 5 39 -17 4 23 23 8 -11 33 7 51 -21 -22 -1 4 14 -44 69 12 6 17 16 -25 2 4 36 24
4425 24 9 -9 17 -30 27 30 42 36 -42 24 -25 5 -27 -10 -15 29 17 -9 37 2 25 13 11 33 27 -11 -31 -30 44 -22 -23 4 37 -6
4459 -6 15 -15 13 33 14 -2 4 9 22 -13 20 16 1 -38 2 -6 -2 18 -33 8 -44 -2 -50 -20 16 -35 3 -2 -36 33 -55 -15 -19 14
4493 14 -33 -10 -17 23 8 -29 32 -9 -9 28 -27 1 19 -35 29 -13 -16 -33 -27 -39 -1 25 -2 10 12 2 -4 -39 13 -29 24 -13 14
4526 14 5 -14 -1 -27 34 4 -10 22 -44 -56 25 -13 3 -14 -17 -29 -16 -15 22 7 -30 -44 37 17 -7 28 7 7 4 -15 -23 -21 -23 12
4560 12 -29 -13 -34 -4 32 8 -22 19 25 11 -20 -25 -17 2 -41 -10 -37 3 12 -23 7 27 -13 15 4 -21 50 -9 -20 18 -28 19
4592 19 10 10 20 -29 -25 36 -32 6 50 31 -41 23 -43 21 -5 -32 -2 -69 38 -29 23 30 -36 21 -77 -6 4 -20 6 -16 -5 -31
4624 -31 -15 -13 -30 1 20 -17 -17 15 -11 -11 -5 1 31 12 4 22 -32 4 -4 17 6 -19 -9 -37 0 18 21 -19 -7 0 0 38 6 2 22 -48
4660 -48 6 -12 24 -46 -8 -20 -63 21 -47 31 -32 -15 21 -12 -9 -15 13 2 26 42 -35 -3 -34 9 -30 1 33 -8 -5 -36 22 10
4692 10 -12 -16 0 -7 -1 21 18 -6 -12 -12 -7 8 0 -12 2 -42 29 -9 -48 55 10 5 14 45 -1 44 -59 -33 18 -10 -32 -3 -2 -1 -6 -16
4728 -16 -37 -19 2 40 44 -2 1 23 -30 21 -52 5 -20 15 54 -7 77 -23 -23 -17 -32 38 3 34 9 30 4 57 27 12 4 -6
4760 -6 6 -6 10 -20 -12 -19 -22 33 63 2 30 -38 15 -51 38 -13 -21 11 -18 0 -17 62 22 10 25 10 17 -28 -21 12 -29 49 -1 34
4794 34 -9 7 -23 4 10 -9 -3 -14 8 -53 -10 -10 16 22 -1 15 19 -23 2 -21 1 -22 23 11 -35 12 -2 15 -28 -15 -8 -4 -42 -2
4828 -2 -3 -4 15 35 1 -19 34 -26 29 34 9 10 7 58 -24 6 -4 -10 -24 4 -12 -20 34 38 21 -36 22 26 3 15 6 12 8 -10 13 -50 11
4865 11 -32 3 -4 0 40 34 15 10 -9 -33 -9 -19 -19 24 -27 34 -27 -11 -10 17 -5 11 9 23 28 -7 20 15 -47 -10 -40 -30 -29 -16 16
4900 16 11 18 2 -9 -3 -19 -4 13 -22 37 -27 3 -4 -25 -46 -14 -54 -5 -50 -25 -15 -21 -26 8 -7 -20 50 -7 19 1 48 -36 4
4933 4 7 -2 -24 -21 14 -17 -36 16 10 6 18 8 -6 16 24 -16 -9 -23 30 -26 -15 7 7 -4 -15 -12 -34 24 -3 17 26 -18 -8 -17 -34 -59
4969 -59 11 26 -5 15 -16 -14 -16 9 -7 -25 3 -44 1 -6 -23 -6 -16 14 -22 20 -19 -19 -14 -7 -30 -12 -20 -12 -47 -3 -19 -2 -17 22
5003 22 1 -16 -2 -4 -21 20 -57 12 17 30 -11 14 28 -2 -41 -18 -26 6 34 0 37 35 -48 -4 -38 -1 -14 -40 15 -52 46 -46
5035 -46 5 12 -27 -10 -2 5 6 -18 -4 16 36 -8 19 -38 -1 -12 -33 -13 -5 45 -23 57 10 13 31 26 4 11 -11 -36 -22 14 -7 32
5069 32 -3 -3 -8 29 -17 8 -15 -15 -43 -10 21 4 -10 -33 -17 -17 8 -14 -19 0 27 -32 18 -48 -12 47 23 0 23 -36 -9 -8 -5 -26
5103 -26 29 10 -32 53 15 -41 32 14 60 -20 -17 -13 -36 -4 -4 36 8 26 -47 6 8 -17 -11 -51 13 13 39 -6 -34 -3 15 -14 -17 -5
5137 -5 6 33 -18 -17 -12 -10 18 32 7 -23 -31 -11 -17 -2 -36 -3 4 -1 7 2 31 8 -5 -16 24 -5 -4 61 37 -12 35 24 -1 -8 -3 -12 16
5174 16 25 -16 27 51 14 13 -6 31 47 -11 -8 -20 33 27 20 21 51 48 11 -5 6 -24 -17 -12 22 22 7 -49 44 -1 -9 17 -3 15 -6 2
5210 2 -36 8 -10 -24 28 18 -7 29 21 -8 -14 -28 11 6 -9 -12 -14 -25 43 -33 -3 -35 -9 11 -12 6 -51 17 -41 -20 14 29 31 3
5244 3 1 12 4 -14 -16 15 7 1 40 17 10 -48 7 -24 26 22 24 8 17 -9 -51 -24 0 0 -38 -12 38 -15 -41 4 -25 27 -19 -11 -63 43
5280 43 10 -15 9 -5 3 -21 -18 28 -2 -6 -19 2 33 -30 -5 28 9 -25 7 -13 -10 32 -19 -30 17 -13 6 -17 7 -12 23 -48
5312 -48 16 -9 -66 -24 -42 18 43 47 6 -4 0 6 12 -26 -19 -4 2 17 -28 46 6 11 -7 13 26 14 26 -17 7 0 -39 -14 -17 -30 -53
5347 -53 -16 -34 -20 -27 -13 13 -21 -1 27 -33 33 -29 14 3 -35 14 -26 4 -2 13 30 12 48 -1 -16 -9 12 5 -1 -16 39 -3 26
5380 26 -17 8 -24 21 51 -13 -30 -12 12 4 -46 -17 23 -34 -51 9 4 24 25 15 -16 -15 35 -3 0 -49 27 30 -1 -4 -15 -13 16 3
5414 3 40 22 18 0 45 18 21 -13 61 40 -22 18 -30 9 -30 -36 12 -14 55 29 6 22 16 17 24 -10 27 -33 1 -21 -24 25 -11 -3 7
5449 7 -4 15 17 -4 20 39 12 8 19 -6 4 33 41 -11 -6 27 34 -18 -18 7 -10 28 -7 25 -4 14 35 -9 -6 -3 -10 -19 -44 62 21
5484 21 21 36 -30 -11 -16 52 -5 15 -3 8 5 13 3 -32 6 -15 -47 -34 14 -29 -53 30 46 -5 20 -22 -19 16 16 -54 36 59 -5
5517 -5 26 -42 52 -20 59 6 47 16 -10 -13 1 11 -5 -19 22 -18 27 33 25 14 4 -14 17 42 -6 38 26 -12 -16 12 -33 15 -6
5550 -6 32 -14 61 2 -20 31 -10 34 18 14 -15 1 -6 -4 -35 -62 -7 -15 -20 -30 -6 7 -10 -4 -27 -16 -3 26 -16 -13 0 12 -35 30
5584 30 4 -14 -7 15 -5 3 36 -40 -7 19 -16 -1 -5 -5 -14 11 40 7 0 19 -40 -15 4 -61 -30 -23 -8 32 -48 30 -21 -20 -19 -3 5
5619 5 -27 22 -73 37 4 -5 18 21 28 -21 7 -21 2 -13 29 -12 -16 -15 17 -39 6 10 -9 8 -6 -24 15 18 -18 -21 25 2 21 -24
5653 -24 62 -44 10 -12 -3 -5 4 19 -10 -37 19 20 10 26 -14 14 1 13 -48 -1 41 -2 -31 -12 6 -62 -5 7 -28 -13 9 5
5685 5 -15 27 2 34 5 -37 -16 16 9 13 5 24 -31 15 -11 9 28 -1 24 15 -36 -9 16 12 -27 -24 46 29 -29 -10 -4 -23 12 23
5719 23 -19 -15 0 -22 -1 -41 6 46 49 2 14 16 -36 34 15 -17 41 -4 -10 -1 27 9 -28 35 28 7 -4 8 43 12 1 -2 2 -34
5753 -34 -22 -29 27 -26 15 -71 -26 44 41 -10 5 8 7 -12 -2 -11 5 -7 28 6 -8 -17 -16 -19 -1 -5 25 33 -46 23 12 29 -58 -55 7 -24
5789 -24 16 -13 -17 -23 -45 9 -34 10 -22 10 -14 -6 13 -5 -7 -7 4 19 -3 2 -20 22 15 37 9 -28 -36 17 -15 30 70 -15 15 10 45
5824 45 26 -1 33 -10 -17 -3 1 -7 14 -26 12 35 5 52 -10 38 20 -22 0 24 50 -12 29 7 -29 -7 12 -23 -31 17 -36 20
5856 20 28 1 -22 -22 -6 21 11 -43 19 26 11 11 34 -30 -1 -21 -16 -19 21 -28 15 10 64 7 -34 36 20 31 -8 -6 -4 21 64 -28 -6
5891 -6 4 -9 -7 53 7 29 12 -9 4 21 45 -33 47 13 10 2 3 -25 -35 -24 -15 -52 11 2 50 9 -24 -12 13 -34 1 -8 13 -1
5925 -1 -26 14 39 67 -38 2 14 24 43 2 41 -21 7 1 -42 34 -22 18 -9 12 -37 -26 -33 1 29 -51 -6 -27 -2 25 -20
5956 -20 38 37 -4 18 -24 7 14 18 -5 0 1 -7 4 7 38 -32 6 0 -15 1 -2 10 -59 5 -4 0 -8 -2 -3 18 32 -2 -14 -37 20 -14 -26
5993 -26 4 -6 -13 -30 1 -22 9 -7 26 2 18 -12 2 -30 -15 -2 17 48 -4 8 -2 -3 30 -38 9 27 -14 8 7 -28 -23 -12
6025 -12 -18 -13 16 -32 -5 -24 27 3 -6 6 -34 -43 -22 21 -33 20 14 20 16 8 -9 -4 8 -6 -16 -22 19 27 -2 -22 -17 -4 44 31 -26 18
6061 18 -8 5 2 -9 -2 17 9 2 -28 -4 9 -33 -8 -20 9 -34 -10 47 20 -1 7 14 50 10 -4 19 18 -20 -25 -3 -5 14 -10 -22 -6
6096 -6 13 37 3 13 0 -33 69 21 52 22 21 21 -15 21 1 -26 -22 -35 8 -11 -16 6 -4 18 3 25 19 -4 15 9 0 3 -3 -27 -7
6131 -7 2 -15 -12 -31 17 -2 61 4 -45 44 4 16 -8 -7 -28 25 -10 -21 25 -1 -2 -11 17 -4 -19 20 33 1 36 -35 8 40 -28
6164 -28 -10 13 -27 -12 36 14 6 16 17 10 -6 1 -21 9 0 5 -26 -4 -38 8 20 -10 -8 30 17 1 -7 12 -34 3 18 2 -1 3 6 3
6200 3 15 -20 -9 -13 1 -37 -8 -26 17 -3 42 -5 -43 30 -17 -4 23 -10 -23 46 4 -11 29 -25 36 -28 -27 -12 23 37 -7 56
6232 56 -30 29 -8 -28 37 24 12 44 21 -34 35 -3 7 -21 -65 33 -1 5 -14 -9 -4 31 13 36 -9 -2 -20 1 1 12 15 -8 44
6265 44 -21 52 39 6 17 -26 14 22 7 40 15 28 -18 -9 0 -4 2 -6 15 11 -24 -56 9 -1 -30 30 24 11 -2 -26 -24 9 27 -38 0
6300 0 -39 -7 11 13 53 15 17 23 23 -14 -7 -11 3 15 12 18 -2 -39 8 -10 33 -2 -18 14 -38 39 -4 -31 -6 -21 34 -11 49 -16 41
6335 41 -15 -25 19 7 16 20 -25 27 7 -21 24 -22 -24 32 7 -15 8 -14 -5 -30 1 -3 -13 1 35 2 0 8 -26 -41 -10 -4 3 -21 -20
6370 -20 32 1 28 6 -5 27 -24 -13 -32 9 -11 -18 32 -16 -7 -6 17 12 -7 12 -37 -9 7 25 9 -1 -22 -21 -9 -25 0 -3 22
6403 22 11 31 46 -49 22 7 5 -32 -41 49 11 43 -34 -19 14 -40 4 -8 -9 13 52 -23 -4 26 -5 8 -2 54 -1 26 -19 -4
6435 -4 -13 -12 -3 -2 -24 -17 -6 -8 -21 48 16 -18 5 -16 10 -4 5 -23 32 -17 -5 17 10 -18 9 4 16 -24 34 11 6 11 -35 21 6 16
6471 16 7 -36 -9 -5 8 -16 14 -35 -12 7 -13 -7 -11 -19 10 5 7 29 32 5 -11 30 -44 22 -33 61 7 -28 -23 -6 6 -1 40 24 38
6506 38 13 -7 48 1 42 11 46 58 5 18 -32 -58 3 -15 0 2 8 -9 -12 14 -5 5 11 -11 -54 40 11 38 42 14 34 -4 0
6539 0 -41 1 -14 11 -3 -17 -26 24 -12 13 1 -24 2 21 -3 18 49 25 -10 46 49 34 7 -5 24 1 31 19 23 14 -15 -39 -20
6572 -20 -15 17 28 -2 -26 54 -66 30 17 22 0 -1 -6 0 0 -25 17 -13 -42 9 17 28 -28 -18 -2 0 -13 -26 15 -32 13 -26 32 -19
6606 -19 -6 13 -20 0 -34 51 -27 62 -33 -54 -15 45 -22 1 2 -27 4 43 65 -6 -25 12 17 -10 4 -31 39 1 -16 27 -19
6637 -19 20 -36 2 45 36 30 11 18 33 22 -18 -41 50 5 -5 47 6 18 4 -51 7 -17 14 -31 -15 -10 29 20 -1 -17 3 25 -12
6670 -12 6 -14 -30 -30 6 -21 -19 36 -7 35 52 4 53 13 -25 1 34 28 -19 -6 7 -9 -34 -42 -55 -29 27 -19 18 -26 -30 4 -43
6703 -43 29 -25 -9 58 17 15 28 -26 -59 17 4 -5 14 17 24 -15 -1 26 -3 -4 16 -15 14 53 -22 -41 -10 -25 -3 -16 -42 -42 0
6736 0 35 33 6 52 -4 -13 -13 15 -30 -3 8 3 -27 -37 -1 -15 27 -49 -28 25 -29 -17 9 -17 12 6 22 -6 42 -16 -13 54 -2 13
6770 13 -14 23 -11 -11 17 -43 -12 21 14 -18 0 41 16 -19 19 4 46 20 40 3 78 -7 18 -21 44 -18 -45 19 -28 9 -37
6801 -37 -24 18 1 -3 -14 16 11 26 -26 -32 43 22 52 -10 -9 -23 19 -17 -19 -35 -5 4 -53 -7 -43 43 -44 -26 0 4 -37 -43 7 -14
6835 -14 18 30 46 6 12 -4 -11 25 3 36 37 0 14 -23 -9 -53 13 -12 17 -16 -2 3 37 22 26 30 -9 -40 33 4 2 -10 -22 -36
6869 -36 -20 33 -18 31 -1 -11 12 32 2 -17 -8 26 -4 -9 -1 -17 -15 30 -1 18 2 41 37 12 -33 -11 26 -9 11 16 25 3 47 -50
6903 -50 20 10 24 -60 -34 -23 -9 27 49 11 -21 -18 -12 -26 -13 8 -18 -13 18 -17 -56 13 27 25 26 1 -1 -18 9 -4 50 13 -16
6936 -16 -13 -5 8 -22 -9 5 -28 46 5 12 -22 -8 8 -8 5 12 11 4 -3 -27 -13 35 -13 6 -5 37 3 -9 17 17 26 -6 -9 -2 -2 29
6972 29 6 3 -2 44 -7 18 9 -29 6 -12 10 29 22 -6 39 6 20 -10 25 10 3 13 12 -7 -1 28 33 -10 -12 -20 9 13 -7 -1 -11 8
7008 8 -12 26 -1 7 2 -1 15 -8 11 -8 8 -23 -29 7 -17 -32 -41 29 17 7 36 45 35 5 5 3 14 71 21 29 4 8 4 -16 9 -29
7044 -29 33 -13 39 23 -31 10 18 1 -27 40 5 -40 19 -11 -6 -2 -33 23 15 -14 -3 32 -14 24 18 19 -31 5 -3 -28 -1 24 22 -9
7078 -9 65 18 -20 18 -19 10 -39 -2 -8 -14 9 -24 8 -17 -12 -17 26 9 -15 -12 -40 21 -32 73 -28 1 -12 0 -22 11 -3 6 -20
7111 -20 13 -32 -6 7 -20 -27 18 25 -17 -49 -24 -2 -33 14 5 16 -11 20 12 -25 12 -7 -25 -7 43 16 -63 -7 -41 -6 24 14
7143 14 6 6 26 -15 -1 -4 -23 12 -32 -6 -17 30 -28 -15 7 20 34 -27 32 5 3 25 -13 18 -2 3 13 -35 -75 -1 -9 -16 -10 -24
7177 -24 14 -9 -26 -26 32 -24 29 -3 -21 -9 -8 32 -34 43 -3 35 -1 -54 -26 0 43 -14 -37 -3 -2 20 -24 9 -5 33 3 3
7209 3 -5 20 32 2 45 12 -25 -39 7 33 -13 -33 -14 -32 22 16 -26 27 -5 -40 35 -46 -9 -8 -8 -18 -9 -6 -2 8 18 -7 41 -5
7243 -5 -9 13 17 38 -10 -42 18 50 -37 8 -11 -28 -10 -10 6 29 -30 -2 -1 -26 -3 35 -15 2 18 1 30 -33 27 -5 13 -20 -21
7276 -21 27 -12 0 15 -13 0 -25 -26 24 -8 -10 12 -29 20 -15 -18 2 -15 -18 4 -7 -2 78 -24 30 -17 57 -26 12 3 -20 13 15
7309 15 15 -13 -67 8 16 -5 -53 18 16 -30 -3 -28 -8 -9 7 31 -11 3 9 -24 -5 20 19 -4 -1 -43 25 -3 24 -6 -35 17 0 -25
7343 -25 27 11 -7 -10 -9 22 -7 30 -40 3 11 3 10 -19 18 18 -21 -4 14 15 20 -37 30 -16 8 -13 29 -55 -21 4 23 27 11 24 -45
7378 -45 -1 16 11 -7 -24 -32 -5 -1 -13 23 -19 -6 -6 18 0 0 -7 -7 -3 -15 -11 -4 -10 22 -5 -12 51 39 -6 22 35 6 14 0 -12 27 3
7415 3 20 -16 22 0 -2 -5 -24 42 -6 2 -4 41 28 -1 18 -11 26 12 -75 -17 30 8 0 33 36 -4 22 17 34 -15 0 -14 -3 -36
7449 -36 12 -23 7 -7 6 -3 3 17 30 47 17 20 -31 13 -3 -33 -14 -8 -23 -8 -23 -36 -31 34 -24 57 48 -15 -1 -9 5 39 13 -18
7483 -18 49 -4 -8 -37 -7 -11 -13 0 6 -15 -71 -46 -13 -46 13 -37 -2 49 -40 54 26 -17 -31 -50 4 -13 17 -9 22 -54 6 -13
7515 -13 2 10 29 26 -1 12 2 35 16 -7 -11 -4 24 -11 -8 16 10 -42 -23 -37 -27 -1 -2 20 -6 15 -15 -63 30 -37 -2 -14 40 30
7549 30 2 22 -29 -6 -3 -24 5 18 -12 -1 -10 -45 7 -29 -27 40 -46 -14 31 4 -11 20 1 -10 30 1 10 -26 13 -32 -45 -40 12
7582 12 0 -24 8 -5 -22 12 -32 37 5 -16 -39 -18 2 -4 -30 -14 6 -5 -7 0 -18 -10 1 11 27 44 -7 -46 42 -39 -24 -11
7614 -11 -53 -17 -22 -1 55 19 0 14 -11 -44 7 -26 -3 -13 8 -10 29 3 31 -1 20 2 -21 7 21 26 -11 3 41 -12 27
7645 27 -11 -19 5 -9 -1 27 -13 -27 38 30 22 14 -2 -36 13 -33 46 16 -11 17 25 -14 -54 55 34 -5 51 -15 35 -2 5 14 -51 -2
7679 -2 19 17 -8 9 9 8 16 38 68 -19 30 17 2 15 12 18 -24 16 -17 4 15 -11 -33 29 20 -23 23 10 -26 7 60 13 10 5 -34
7714 -34 1 9 15 2 -18 19 27 1 11 9 -4 2 20 2 -15 14 -25 -34 13 46 12 21 -11 -35 -29 9 -19 4 15 -3 -9 41 -8 2 12
7749 12 -6 3 -14 -16 -10 -7 -7 16 39 14 -63 -14 35 -15 25 30 27 6 73 46 10 19 -21 47 -45 17 30 12 31 -13 4 33 39 -1 24
7784 24 -11 15 8 13 -5 -24 32 -31 -7 15 14 -11 -21 -16 -1 14 17 -27 -15 -9 14 9 17 37 37 3 26 -26 -14 25 -34 -1 -9 22 6
7819 6 6 10 -27 -28 18 7 13 3 -5 -6 -37 -70 0 47 -46 31 12 -4 12 20 -29 -8 23 2 7 41 31 23 17 -26 -43 -11 -29 8 -8 11
7855 11 24 1 -8 -20 48 -17 -9 -49 -12 9 -22 -32 18 -28 -10 -7 -1 -23 8 -32 -56 19 16 -19 -51 -9 -38 35 -17 9 -10 -5 22
7888 22 -64 -21 -15 -8 -14 13 14 -3 65 -27 24 -37 13 5 -26 20 -4 2 -2 -5 -28 -32 -8 3 13 -1 -51 7 -31 9 14 -10 20 -18 1
7923 1 1 18 -11 1 -8 2 -25 -32 -34 8 -36 -39 -3 -7 -14 -7 21 -39 -3 -14 -30 0 -27 -10 18 42 -25 -39 -39 -19 -7 11 21 -11 -6 -6
7959 -6 37 22 52 9 3 -38 -31 -33 15 9 15 -55 10 -38 -12 -4 -12 -71 -47 35 7 -8 -6 0 -14 -44 10 35 -8 -34 -6 41 -7 -14 -3 28
7995 28 10 -7 -35 1 -7 19 7 -24 51 6 -3 -10 -8 16 11 -14 10 -9 3 15 -20 -12 39 -23 22 -13 -17 -2 8 -34 3 0 -64 13
8029 13 10 -36 -7 47 9 -20 19 5 23 43 7 8 37 -23 3 -5 22 -10 25 -17 41 3 27 15 -31 45 -26 18 27 7 17 1
8061 1 -21 -22 13 -26 44 6 -16 43 -8 -5 -29 37 -9 -7 5 0 57 2 -26 33 4 14 27 -38 11 -20 -16 4 12 -13 -19 -12 6 -6 33
8096 33 30 23 -35 -27 -5 -11 0 5 9 17 2 -45 21 -3 -4 6 -25 9 -25 41 19 11 0 -46 -14 30 -4 -15 0 6 -28 -10 16 12 -27 19
8132 19 -5 -17 26 27 48 -11 -12 14 -5 -10 -33 8 -2 34 -13 4 14 -1 -41 5 13 -10 6 34 -1 -18 -6 -11 9 -23 -34 18 -4
8165 -4 32 -13 -2 0 -19 5 11 -13 -8 22 -2 -42 1 -21 -41 -23 2 -4 -3 -23 -6 12 22 13 -21 8 7 7 12 -19 -28 13 -4 -56 -57 -18
8201 -18 25 10 10 34 3 -32 11 -5 12 8 -22 35 -14 37 1 20 36 -29 -71 3 42 -6 18 6 0 14 24 1 -52 -6 20 -1
8233 -1 28 -1 2 6 -20 -72 -17 -39 -5 50 -11 -33 -18 14 -20 -40 -26 -59 -11 31 10 -57 -2 -3 9 7 -23 11 -33 32 -18 -16 39
8266 39 -31 -5 3 -10 -23 -9 -3 -12 -5 22 -26 -2 -18 22 27 -12 -12 -11 10 21 -20 33 -7 11 -28 -3 4 -13 8 -34 23 -16 13 -40
8300 -40 3 21 -9 -27 -3 -33 14 3 17 -59 43 5 -1 -32 -5 12 -44 16 -46 -13 -80 -1 -37 -29 3 -48 9 2 -7 12 51 23
8332 23 -3 12 0 44 -18 -3 5 7 49 -18 -35 20 -26 -22 -10 6 4 41 3 -30 -18 -45 19 -27 -9 -28 32 22 30 -20 6 14 -5
8365 -5 -17 -24 2 -6 29 -36 25 -2 -26 12 -22 4 -17 -27 -9 -23 -8 -4 -1 -12 26 -4 4 30 -1 9 23 -19 -19 21 33 -18 6 -29
8399 -29 -5 -7 37 -19 -12 0 -28 17 -8 25 16 -44 31 -17 5 24 -27 -1 -1 23 19 -5 -27 20 -49 3 23 -9 1 26 20 60 60 28
8433 28 -9 5 11 -11 10 -5 6 -22 2 -28 0 23 23 -1 39 -2 17 5 26 -45 -60 21 -7 -24 -22 9 -13 13 1 26 19 -5
8465 -5 -6 -2 1 -23 -4 17 -16 -11 -6 -2 10 -19 -4 -29 -23 7 -47 28 15 21 -44 -17 -13 11 47 2 -13 -16 -4 30 -3 -10 9 -16 -16 23 -45
8502 -45 -13 11 -45 72 -6 2 10 20 25 -5 32 -30 -8 17 8 -7 -4 -35 -4 -9 -24 17 -32 23 -45 -4 -1 -46 -22 21 10 -29 0
8535 0 21 43 9 0 0 21 -51 28 -60 -39 -9 -2 -1 -25 -30 9 5 25 27 13 -40 -33 0 -33 18 23 23 32 -26 -4 29 -23 9 7 19 5 47
8572 47 8 -12 -17 -7 24 -36 33 8 -2 -1 -17 10 -31 -6 35 7 -36 -42 -8 -3 34 16 -23 -28 -24 -35 -37 7 -26 -16 7 13 -3 -26
8606 -26 -13 -36 66 -26 0 -6 12 -9 -32 -8 -16 22 18 2 -29 18 48 -25 -56 -1 9 23 -26 4 -3 5 -11 -22 -34 -14 11 13 18
8639 18 -33 -19 -17 39 9 18 -23 1 20 -8 -7 -10 39 -40 -51 -43 -19 17 -29 41 42 22 18 14 -48 -25 -14 -33 23 23 -16 0 -14 -17 -25 5
8675 5 6 -30 -11 -14 -24 -10 14 2 -29 -6 -1 37 -16 -11 -14 -25 9 -28 -16 -44 15 -7 -18 12 -1 -19 -16 20 17 -24 -76 -16 -46 -45 -23
8710 -23 23 18 -3 1 -39 -32 4 -7 -50 -15 -11 -13 27 5 -15 9 12 10 -10 7 -26 34 10 -11 -13 16 4 20 17 -14 -2 13 9 -31 -34 10
8746 10 -2 9 -23 6 -5 -9 18 6 -18 20 37 -46 -35 -29 -6 24 29 33 -9 5 -4 -51 2 7 14 6 -23 54 12 -10 -27 -5 9 10 -26
8781 -26 -11 11 -45 -20 7 25 42 28 -8 -20 18 -23 2 6 -6 2 9 25 -19 37 1 -14 -1 4 -8 3 -2 -29 -16 26 -1 25 1
8814 1 -5 -48 -9 28 1 46 -37 10 -6 -17 -12 23 -19 3 7 -35 -54 -14 30 19 46 -12 16 -10 33 15 4 -4 43 -9 33 -34 -22
8847 -22 -9 38 -7 0 -60 -34 33 -46 -6 -15 2 -35 20 -23 -18 39 22 -27 2 -54 -34 -15 8 -8 4 -55 -9 -1 -54 13 -7 5
8879 5 -11 67 10 -15 -48 4 16 -15 9 19 -55 -36 16 -7 1 -19 2 -7 -9 -14 -30 -5 -35 -10 -20 9 -25 42 29 -45 2 -4 13
8912 13 7 8 -31 -17 -4 32 -8 -24 -26 15 -28 -1 -4 7 23 -13 47 -1 9 20 -30 31 -8 -4 -15 -44 -17 -38 12 -41 4 -12 4
8945 4 -54 -10 -23 -34 15 3 -4 -1 9 -51 63 -15 -46 -7 -4 28 -23 -17 -26 16 -41 18 21 21 -68 -47 -14 29 29 -16 -21 -42 -5 -22 -9
8980 -9 -65 5 12 -22 12 -14 -15 14 -4 22 -39 12 -67 -6 29 35 -28 0 15 29 -45 0 0 8 -46 16 43 13 0 1 33 10 14 15 -22
9015 -22 47 -14 -9 -20 -40 -5 16 24 -1 -10 -45 -15 -6 6 7 -9 2 -19 13 17 -29 -10 5 31 -18 10 -4 -5 -10 -7 -18 -23 8 25 6
9050 6 1 -120 -26 15 16 -96 -42 -21 11 44 -23 -28 -18 5 2 -20 -31 -11 13 -38 -11 -34 -37 -20 -48 -5 -4 18 39 52 39 14 3
9083 3 -25 -14 11 -28 -8 -12 -16 -8 -13 -42 26 4 -8 13 1 -27 41 32 32 35 32 -7 -34 40 11 -32 39 -26 -22 6 -1 1 -21 33 -14 11
9119 11 -7 9 -11 -17 38 25 1 -28 13 14 -47 6 -44 39 13 2 -13 -20 5 -26 23 -1 -25 -29 0 -27 -30 7 -23 14 -48 -29 -18
9152 -18 -5 -17 -42 -22 -1 25 43 12 20 17 21 -13 -40 6 -7 6 -14 13 12 -8 -6 5 29 27 9 -14 -36 43 -3 29 24 -14 32 -33
9186 -33 56 21 1 45 -18 15 2 36 6 -9 27 5 -2 0 38 17 -20 -27 -35 31 24 -44 26 -25 -16 -19 11 -11 -5 29 -10 14 18 5 -54
9221 -54 5 -39 -18 19 6 65 33 9 25 -4 14 -12 32 -28 18 -7 17 39 -5 11 -33 -5 5 27 31 -21 -11 11 38 34 -19
9252 -19 -29 -2 -9 4 -5 -36 27 -2 -22 15 -2 -16 3 28 -20 -16 30 -39 29 3 48 -10 -14 -5 -7 -5 31 -2 -18 4 -28 17 31 -36
9286 -36 4 56 5 -14 29 1 -13 -10 -32 31 -49 -21 -20 -10 -10 -8 45 8 -27 48 -3 44 -40 -41 1 -28 -48 31 3 -9 6 -32 31
9319 31 42 6 -27 19 48 -27 -7 -35 12 -71 41 57 5 -30 -23 7 -53 1 17 29 9 -12 2 33 5 -3 2 13 -5 1 -35 -9
9351 -9 -15 -14 35 -32 7 30 -20 24 -2 4 27 8 -7 6 -1 22 -24 -18 -4 -24 -10 9 -40 31 -1 19 39 -16 17 -3 -27 -4 -2 23
9385 23 -43 -11 -48 15 -22 2 6 -44 20 5 21 -48 -24 -1 -32 17 -12 -33 26 -7 -27 2 -6 -38 14 7 -11 16 28 -2 1 -8 -5
9418 -5 5 20 -45 23 1 24 -22 -67 7 4 31 -38 -22 -39 -43 -12 -33 -15 13 26 4 -14 -39 -13 -13 -20 -30 -11 -4 14 -10 -22 -24 1
9452 1 -22 -44 -16 -17 -15 55 -20 23 -1 -9 -17 4 -20 3 15 -23 -18 2 18 19 -9 40 3 -12 21 -25 11 7 65 -13 15 22 -52 18 -32
9487 -32 9 23 29 21 -29 16 -48 14 -18 27 4 -3 0 45 -30 -48 36 12 45 50 -24 -8 -17 -13 -52 -7 -19 -30 27 -17 -3 -43 4 0
9521 0 13 54 -29 9 14 -4 27 1 6 -55 21 -71 20 8 -4 44 -4 -30 4 43 -13 10 42 -34 3 47 -3 -8 -26 -5 -7 -21 17
9554 17 -41 -8 2 -15 34 -26 3 11 -7 -40 -30 -8 -7 -29 4 42 -13 31 3 -36 28 -30 -36 47 -17 -2 -18 30 34 7 -33 2
9586 2 -20 -13 -8 -39 -19 -20 52 -21 23 -9 -30 -21 -49 -15 56 21 14 -22 1 -28 -12 -11 -29 20 -6 -7 -17 -18 -40 -6 3 15 -11 -13 9 9
9622 9 -43 1 -27 -13 9 3 -25 22 2 -5 8 -42 -40 -22 35 -13 -44 27 -8 -2 -25 26 -18 -9 1 -1 -48 3 2 2 39 9 -18 41 18
9657 18 7 -9 19 -14 -41 -12 -16 26 -17 -37 -38 16 -4 -42 6 29 21 -46 18 -25 24 -35 -13 -33 -77 -5 -33 -24 -40 -18 13 -20
9689 -20 23 1 -4 -10 -21 5 -13 28 11 23 -29 -17 -17 -23 33 -28 -20 -50 47 0 32 -7 -9 17 -35 62 -31 -18 -12 -10 -10 17 -16 44 17
9724 17 -29 -18 -35 2 10 3 52 -36 -9 13 12 -4 -15 -34 -17 -2 22 -9 -23 23 -48 -22 -6 -26 2 -66 1 3 -7 -22 -59 21
9756 21 -6 -18 -49 48 -26 10 -31 -63 35 -57 -36 -39 20 -27 -12 -7 2 24 15 1 13 -40 -31 -4 -29 -17 18 5 -44 -26 -1 -26 -19
9789 -19 -76 35 13 27 13 -7 13 -33 -12 23 30 -40 -3 21 -14 -40 8 -18 3 12 40 -18 13 -15 0 -56 -30 -12 -41 37 4
9820 4 -26 -32 -35 22 12 -1 -40 -5 -69 -21 42 -12 -48 0 -22 3 -11 -7 7 -37 -28 -50 -13 -64 5 -42 14 -15 -17 -2 -26 47 42 3
9854 3 -14 -6 27 -2 44 -16 2 36 30 -13 8 52 -19 18 -28 4 23 -35 -2 -11 1 -52 21 -57 -42 -20 10 -1 24 -10 -31 60
9886 60 18 -39 -6 -1 -22 -6 8 14 16 -63 31 -11 -17 20 12 30 14 4 -40 51 -30 -6 -1 -34 20 6 28 -15 -14 -3 -51 -7 32 31
9920 31 -28 -31 2 -8 12 25 25 -18 18 16 -49 -19 -17 11 -1 -30 4 -13 -54 -43 20 19 15 5 -57 10 4 -29 -38 42 35 26 3 13 18 -12
9956 -12 -14 19 1 49 -24 7 13 -26 36 -41 40 31 29 -10 -33 36 -38 28 12 -8 -8 -16 30 15 40 -13 -7 -7 -27 57 -9 17 8 -2 10
9991 10 9 -16 12 12 21 7 24 47 1 22 -9 -10 17 22 -7 25 9 -50 -14 -10 6 -27 50 -11 -20 9 -29 22 -10 1 -17 12 29 -2
10025 -2 4 -35 9 22 -4 -14 -9 28 -15 -9 -10 53 -22 -7 16 -1 -13 -41 -48 21 -27 -18 0 16 11 12 -18 8 -21 10 38 6 -44 11
10059 11 -1 12 4 13 -1 -5 13 -2 2 -25 5 -45 26 -6 -43 -5 -16 16 -29 -10 -27 -25 36 -10 4 -10 7 34 -2 -25 -5 -43
10091 -43 1 -38 -61 20 -27 2 15 -10 12 -5 11 -24 -37 16 9 17 27 22 -26 28 -2 -4 16 -17 -1 -25 -11 9 34 3 18 28
10123 28 25 -28 -18 -16 21 19 -13 4 -32 -4 -39 -17 4 -17 13 -15 4 7 -52 -4 41 31 -3 -29 -13 -20 -1 29 -30 -12 2 -15
10155 -15 -63 -8 -43 26 -59 6 1 -9 28 -5 -5 -1 -9 -20 1 -19 -66 0 -13 -18 -20 -12 -45 -6 0 10 4 -32 9 -29 -15 23 -13 -21 -10
10190 -10 -2 -32 -21 -44 -7 1 26 -31 -39 25 -22 0 -2 0 -12 -31 -44 -36 -5 -24 -11 40 -7 21 -36 -14 -21 55 -20 11 -8 25 9
10223 9 26 35 -20 -13 19 -21 12 -21 -23 5 34 41 -1 6 -24 43 19 0 15 -59 19 -18 7 4 -24 -22 -25 15 -16 -2 22 1 -11 -34
10257 -34 -7 -5 3 -12 -23 -23 -28 -27 -40 -5 12 9 10 -11 -36 -22 -21 43 4 -2 -6 -33 -13 -55 15 -37 -43 23 -36 36 -40 -22 -9 5 24
10292 24 -4 6 1 -16 -8 17 12 26 4 4 3 -29 -12 27 -28 14 -39 23 0 18 -13 8 24 -31 32 -20 -1 6 24 40 -12 -3 -53
10325 -53 -3 -14 -26 20 -2 29 -12 7 27 -19 36 25 -9 -26 5 19 31 -22 -43 2 -3 -27 -5 -3 -9 -13 -27 18 17 15 12 -5 -20
10358 -20 -38 -27 -28 -25 40 21 55 -19 -17 -52 0 -33 13 23 -3 -2 -20 -17 -34 -14 3 6 -39 9 5 12 29 -16 -20 -1 -3 26 -14 -15 -27
10393 -27 25 38 -36 14 -12 -27 -17 -19 12 -9 -7 -11 10 -20 -5 -34 -32 48 6 26 -43 -18 -1 -35 47 -37 58 4 -10 4 -24 20
10425 20 -35 -9 3 -20 41 10 -9 17 12 -35 23 -5 -31 -33 18 0 -16 -22 1 6 -29 18 11 13 -1 -19 -31 -1 13 -49 -9 -13 -17 11
10459 11 23 18 -34 23 -38 -40 -31 -18 50 4 8 -33 -14 0 -1 -12 -22 37 -29 -36 -41 6 2 -64 -4 -5 2 14 -22 6 -8 10 -21 32 -21
10494 -21 3 19 -12 -25 -11 -25 -3 -26 -2 -26 -9 -15 -53 -24 3 -34 -4 33 -5 -1 -48 32 -65 -31 -6 13 9 -27 -36 0 -7 13
10526 13 19 -15 -32 10 -31 9 -45 3 -57 -20 12 1 -38 -18 -22 2 -12 -30 -31 19 -9 -9 8 31 -33 -54 -3 -45 -24 15 -6 12
10558 12 38 -38 -19 11 -18 20 -13 4 0 10 1 2 -1 -17 10 -37 19 9 -20 -7 -29 -19 22 -21 5 -56 23 -13 38 9 -29 -1
10590 -1 -50 34 -12 -30 1 4 -18 3 22 9 -8 -18 -9 11 7 12 14 -14 26 4 24 8 -34 9 -11 -15 35 1 -35 -40 -23 -21 26 -17
10624 -17 -25 5 23 -6 -32 -6 -12 -14 22 9 -5 -16 5 -1 -3 15 1 4 -27 0 -7 3 22 -30 8 16 -5 29 -38 24 1 -14 0 44
10658 44 4 -40 -17 15 -25 1 46 18 9 12 -24 11 27 37 -5 28 10 37 33 -17 27 -23 -9 5 -30 18 19 24 -6 16 14 15 -6
10691 -6 -46 25 -2 25 -28 -55 29 16 -4 10 30 5 18 29 12 3 -1 -10 -3 -6 -12 -34 -54 -31 -14 -50 17 -36 -41 63 -29 -19 34
10724 34 -25 15 -10 -30 35 -4 -3 -20 12 7 16 -54 -5 19 3 -19 -18 -16 6 22 32 -30 -36 -30 -42 -12 10 -27 -31 36 -4 8 -12 -41
10758 -41 -31 -19 34 -21 5 -31 -12 -60 -65 29 30 -7 -11 -11 -26 -3 -18 26 15 -13 -2 -24 11 24 1 19 -35 13 42 -27 21 14
10790 14 15 -18 42 -22 1 31 38 -12 -44 7 21 -11 16 -27 3 -67 -7 19 -66 -9 -3 -7 31 1 -8 -21 -7 -55 -15 4 -8 -36
10822 -36 -18 -5 -20 -24 22 -4 12 -14 -10 6 -14 -22 -33 -42 20 -19 56 -14 -1 1 -26 -18 -29 9 -1 27 -38 0 9 -1 -18 -37 6
10855 6 25 -2 8 -26 -13 19 8 -32 53 -9 -5 27 19 42 -2 7 47 37 32 -32 5 -11 -14 6 -33 -35 -5 1 8 -17 -17 -8 22 -5 -4 -27
10891 -27 -2 -42 23 21 45 9 -27 -7 -26 5 -2 -1 1 -9 22 -9 2 28 -6 5 -11 -23 -29 -15 -9 16 -11 -29 -13 1 -57 12 -14
10924 -14 9 33 -24 11 -7 9 -9 -11 22 -8 10 -20 -15 -10 -28 12 -12 3 -3 28 -4 -34 -15 -43 -31 -25 44 -26 -5 -17 -11 -17 -12 13
10958 13 -27 -6 -14 -16 -18 -11 55 -28 -42 9 -25 35 -32 -23 -33 16 16 14 -24 30 3 23 -22 0 -17 -8 10 3 -24 -21 31 -18 9 9 5 -24
10994 -24 1 1 -34 14 8 -25 3 -29 4 -3 42 17 13 32 25 -3 25 12 -13 -5 28 1 32 -1 -47 -9 -12 23 -6 2 -3 -16 40 -9
11028 -9 25 -12 18 10 -19 1 -63 11 13 8 5 38 36 -12 -19 -17 10 -5 -2 -1 37 47 -17 27 20 10 -14 -3 51 3 -10 24 -18 -34 -22
11063 -22 -22 -63 12 23 35 71 -2 37 -28 4 1 18 47 -18 -6 -3 3 -5 -25 -23 -2 5 28 8 -22 28 -40 7 -3 55 2 -10 23
11096 23 -21 29 -31 -13 -29 19 -9 10 -9 13 9 -16 10 -16 24 40 -15 11 -14 52 63 26 4 40 23 26 -4 -44 10 37 -51
11127 -51 22 -3 19 23 -17 -6 -3 28 9 -4 -42 -26 2 30 9 4 2 -23 24 -7 -15 -45 21 -38 -27 52 -18 -28 5 0 2 -20 14
11160 14 -2 -1 -10 -2 4 34 -19 -15 2 -46 19 -19 -2 0 -8 12 21 30 -14 15 25 -18 -12 -13 -29 49 -18 14 25 0 9 10 45 -13 12 -26
11196 -26 -6 8 1 -2 10 48 41 6 15 -3 2 -16 3 9 -27 8 -9 9 11 -25 2 24 30 -32 -15 -19 14 -20 -32 -21 17 11 -27 -12 -1
11231 -1 -9 24 -13 -8 -19 -32 39 -8 -24 -43 16 9 10 40 -37 -2 -3 -37 15 31 9 -68 15 36 -10 0 14 -25 14 23 -1 -16 -40
11264 -40 -9 -16 8 18 -43 3 -26 6 -13 25 4 -22 -33 -22 18 11 37 18 -2 -20 -24 -48 21 -5 -32 1 -30 -9 -3 3 -2 -22 20
11297 20 17 -12 11 14 -1 -21 -5 -12 9 -5 7 1 17 57 -28 32 -43 65 6 2 21 -1 12 -19 -20 26 -13 18 -18 -5 29 -42
11329 -42 35 37 -9 -16 -17 -13 3 -28 6 -29 4 39 -44 1 5 -16 2 -7 -13 -14 8 16 -18 21 -10 5 -53 33 -7 -2 -9 16 -48 15 -8
11364 -8 0 16 -18 26 -34 -26 -34 8 -3 1 37 -17 -18 -7 17 21 -50 -8 -14 11 -53 -10 28 3 -12 -26 -8 -43 -33 7 0 14 -3 -2 -30
11399 -30 -17 14 -44 7 -11 34 32 18 54 -15 -19 15 24 4 32 5 -23 23 17 15 -14 -1 -8 -11 -27 26 -22 13 68 34 -39 -16 -12 -4
11433 -4 6 -25 8 11 3 40 0 6 3 44 -9 6 2 21 50 27 -3 17 8 -18 41 2 -1 -46 -1 40 3 39 29 -51 65 13 14 18
11467 18 -12 27 34 -25 -3 -7 30 19 16 -17 -1 -16 -33 17 26 -21 -16 10 19 8 -7 14 -4 1 23 8 16 -12 15 -4 27 17 24 -3
11501 -3 0 4 17 4 62 1 -22 13 -28 5 -16 13 -18 34 -16 13 -21 5 6 -14 20 -16 25 0 4 16 8 -5 31 11 -11 7 -15
11534 -15 28 -27 -1 -23 -35 -12 -40 13 -38 13 8 -25 -48 -30 -7 -21 9 14 7 19 31 -49 27 27 -42 10 4 27 8 -9 76 -38
11566 -38 12 -9 -9 -6 1 7 -25 24 22 19 22 44 10 -8 -8 0 -1 -17 8 44 -19 -17 -58 0 -5 17 -16 -43 9 -16 39 6 -13 2 -8 13
11602 13 -10 16 -4 -9 15 -12 11 13 58 -6 -28 19 -33 25 35 -12 -12 2 -11 5 -6 33 31 -26 24 -12 14 -16 -25 -50 5 -9
11634 -9 -27 -3 13 -6 6 26 5 -16 -15 -22 33 -1 6 43 11 47 2 5 18 44 7 20 -5 -35 -13 -25 -10 2 -5 -4 -22 41 -12
11667 -12 15 9 62 -22 36 21 -35 2 -25 33 -32 9 25 18 0 3 14 -23 19 14 24 -18 -2 -25 -41 57 4 5 6 -30 -33 -13 43
11700 43 34 45 29 -25 -26 19 1 -3 -14 -29 -7 1 19 36 -35 2 26 5 11 -14 -20 -34 -7 3 -12 14 5 -1 -1 -11 -37 -3 -2 -21 -17
11735 -17 35 43 -9 15 -20 6 -34 7 -17 15 28 -11 -16 14 33 -5 24 22 5 18 -6 -15 21 13 -3 15 -28 10 -3 0 -13 -10 -23
11768 -23 -6 30 2 17 -53 2 -30 21 -43 36 -13 -18 31 17 4 -16 25 -32 18 49 6 14 14 30 -41 16 -22 1 24 7 20
11799 20 5 54 -9 -2 -19 -23 -43 22 46 -21 49 -4 3 -38 29 20 21 9 -32 46 -17 1 -13 15 -25 -29 57 -6 21 7 6 -7 21
11832 21 -9 -1 15 7 20 16 19 -17 37 4 22 8 21 16 -26 -29 9 -24 7 21 -41 -10 -6 23 -28 18 -31 -9 -20 -6 14 17 52 38
11866 38 32 20 36 27 47 53 -26 41 -3 18 25 -5 32 38 44 3 -14 28 11 -6 2 -19 0 -49 44 22 2 -10 -11 42 2 49 -3 16
11900 16 4 43 -16 -15 28 -3 13 33 -27 -4 -18 30 10 -1 63 -31 33 -37 -17 17 -1 27 28 23 -22 -5 8 25 28 -3 20 -10
11932 -10 -13 10 9 21 12 21 -42 25 19 -23 -4 -2 17 -22 21 9 -2 41 -36 15 16 31 -7 23 5 -30 22 -30 6 -9 -22 -19 -23 29
11966 29 7 -4 -6 -5 40 -40 7 -15 -35 -26 7 27 16 23 49 5 -6 9 3 -1 7 3 30 -6 -22 -35 -32 -26 21 59 5 -21 28 -32 -39
12001 -39 -7 14 53 20 28 12 -20 -39 3 -20 -11 19 7 -13 35 -40 -9 -21 25 -1 -33 -9 -33 50 -12 15 31 6 1 -40 37
12032 37 -5 3 14 -44 8 8 19 -33 -11 -21 -7 12 32 -17 -5 1 8 -17 3 -28 -15 -27 -14 26 28 -18 -10 -26 -12 6 11 35 -17
12065 -17 6 31 -4 1 -17 -28 -22 -3 -5 -19 -25 -23 23 5 37 -23 21 31 -16 -58 -6 18 12 30 11 27 9 -16 8 -26 -43 -43 -1
12098 -1 -58 43 -18 -14 39 -13 23 -47 27 -15 -16 28 -3 -13 -21 21 7 -9 2 -27 -20 -37 40 -39 7 44 -28 25 -52 22 14 -29
12130 -29 8 40 20 -31 36 -48 -9 -13 -20 -17 -39 -4 -41 13 20 -26 10 3 13 -2 9 66 -19 4 10 -40 -11 20 -25 10 -27 -20 10
12163 10 0 -9 37 11 46 -4 6 26 -24 -6 11 8 2 -30 -16 -55 13 36 -11 -26 -18 -1 -25 -9 19 -30 0 -12 33 -17 15 3
12195 3 4 15 -13 19 -22 4 1 30 -12 -11 37 -25 31 -3 21 35 -49 2 -7 22 -10 -31 -21 -13 33 -20 4 -3 -20 9 -29 -22 -44 9
12229 9 -28 -14 37 -14 -9 15 -43 -9 10 -16 11 1 12 21 51 22 -16 13 19 -40 27 19 -15 -11 20 19 2 1 34 5 60 12 -12 48
12263 48 -18 -2 -12 -35 -15 -27 -2 -38 -3 -28 -24 -14 -4 13 -4 31 -38 41 10 -8 -15 -42 29 36 -9 -24 2 23 -13 24 -4
12294 -4 -21 -16 34 17 -18 16 16 31 -58 26 24 5 25 -12 51 -23 34 10 9 -3 25 14 51 26 41 37 27 -35 27 16 -4 -46 -1
12327 -1 -4 -9 17 -11 -25 1 1 28 5 18 -9 0 60 -26 10 36 10 -57 -45 -42 -16 -4 -40 -45 -34 -55 -4 -4 -27 -20 8 10 1 -5 -28 5
12363 5 27 -48 -26 -29 42 -8 24 22 -17 -48 -6 -22 24 18 24 -21 -52 -24 -31 44 3 7 -60 -18 -39 45 -38 -2 -19 39 -5 1 49 6
12397 6 1 27 30 17 -16 -11 -14 -4 -1 -54 -3 -23 2 20 -21 -5 31 1 -60 -5 -20 32 -13 2 5 -24 -16 1 -21 -43 0 -7 -24 58
12431 58 31 -12 -19 -2 45 8 -9 0 -11 -17 16 5 12 26 -40 8 12 12 -6 -1 -4 -14 -16 31 -7 -45 29 -23 -5 -10 -8 -10 -41 -16 -25 15
12467 15 -3 33 -7 -26 -4 22 2 -33 13 -25 2 -7 -16 12 -23 -18 -16 15 11 -58 -54 4 -3 -4 10 -11 6 7 4 -4 -12 -1 -6 -24 8 -42
12503 -42 -19 9 14 -40 0 27 8 40 -48 2 -21 10 24 -7 -4 3 -6 7 -8 -8 -51 -45 -22 -16 -43 6 -6 21 -27 46 10 -8 35
12536 35 23 -14 -17 10 -3 2 10 10 10 31 59 7 -10 13 -54 -12 -36 45 -2 38 11 -64 -24 -17 33 -31 49 53 -15 0 30 12 18 17
12570 17 37 20 -21 -36 -17 -30 -28 21 35 18 -33 -2 -32 -18 26 27 40 4 34 -24 11 -26 4 37 5 1 28 32 -5 41 4 13
12602 13 17 6 -12 -48 38 -30 -7 -16 -32 17 80 -5 8 -25 14 -3 59 -17 -18 12 13 29 12 -23 -13 19 29 -18 -7 -3 8 28
12634 28 -4 -25 -6 -3 7 19 -13 -11 -33 -7 8 18 -16 -12 -4 35 -7 17 32 -34 1 9 5 26 43 -20 40 33 -38 -10 29 3 -24
12667 -24 33 6 -55 -13 0 0 1 -25 41 -2 9 -29 9 -30 -33 25 -11 23 -18 18 -27 37 19 -5 -26 -34 -17 -9 57 -16 -26 7
12699 7 -10 -17 -4 -2 -22 20 -27 -12 10 28 18 -21 -11 -46 -14 -10 -30 -17 -5 -18 0 -43 31 3 17 -40 -5 -47 -5 38 -4 -19
12731 -19 -47 -23 15 -14 -47 26 29 13 -28 2 -1 -23 -39 -34 6 -16 -17 -6 -1 37 -18 30 -33 14 -30 -26 -31 -22 -5 -32 -19 4 -3 18
12765 18 18 -25 -10 6 -41 26 -15 -54 -30 -35 11 -22 21 12 -29 -1 -33 -34 -30 -21 44 -37 10 -13 16 -6 -9 -36 -37 6 -37 2 -24 13
12799 13 -12 -9 -2 24 -13 -5 -24 17 -26 -20 3 -19 8 -21 -43 9 -35 -6 4 -13 4 42 55 33 18 -32 1 10 -32 28 -21 -10
12831 -10 -36 -3 -52 10 8 -9 -1 5 32 13 -34 -49 35 -6 -29 -7 -53 11 5 -24 34 -27 30 -1 15 32 7 24 -7 -1 -15 -59
12863 -59 -14 -4 -29 -8 6 6 10 30 0 6 15 18 14 28 -7 6 27 -23 -15 24 -19 20 -2 6 -27 -36 -23 55 45 -28 -19 18 -21 1 -21
12898 -21 -32 4 54 -4 -21 37 2 -34 9 4 9 0 24 2 -9 -5 16 -4 -10 21 -58 1 -12 -37 -24 39 10 -9 0 -5 29 -9 12
12931 12 20 11 35 -11 31 -4 -32 33 -6 4 -16 31 -29 -36 -22 -17 -31 -12 -27 -30 25 22 1 -12 22 24 11 20 -18 8 42 -32 -20 -29
12965 -29 4 -4 0 -10 -26 26 37 24 18 4 -39 14 16 -18 39 -8 -12 13 9 -2 51 -10 28 37 8 25 -17 37 12 -33 -11 22 23 -9
12999 -9 -1 11 15 -4 -22 40 -17 25 -29 -31 -14 18 -41 56 20 -23 26 7 35 13 -3 46 -33 -2 11 -8 -21 -53 0 28 -24 -6
13031 -6 -1 25 -36 38 -7 8 25 -28 27 -33 -14 17 -11 -7 -7 -17 3 36 -3 -8 23 14 16 -22 29 19 0 20 -7 1 -18 2 -26 -7
13065 -7 -27 -4 14 5 -2 -8 17 2 49 12 -30 9 -29 3 8 34 19 -6 57 7 -5 -18 -26 -11 22 19 -24 18 -11 -6 33 32 -35 6
13099 6 -14 31 -18 -3 7 -50 1 11 16 1 7 -6 -21 42 0 15 -44 -11 -2 -24 34 1 13 -69 -27 1 21 -23 -16 6 -17 -1
13131 -1 47 24 0 11 27 -41 20 6 3 -26 19 19 -71 -33 -21 12 -9 11 31 -9 55 -8 17 40 -6 -18 -35 -24 -14 -5 -57 17
13163 17 -13 6 -1 -34 -33 -20 -6 39 -14 -37 -22 10 7 -28 30 -4 -23 -25 -23 -39 -12 -24 39 -19 23 -13 5 10 -33 1 5 -9 -11 -20
13197 -20 13 5 -13 -32 -3 -51 -26 -11 -29 -36 16 11 -13 42 -24 -32 10 -25 30 -46 -6 23 -35 12 10 -6 26 39 -32 7 31 26 33
13230 33 -32 5 13 18 19 -17 -1 10 24 -5 -16 -19 -3 37 -1 29 11 41 14 -7 -12 11 -39 6 -24 -3 20 -12 5 -18 22 -18
13262 -18 10 33 22 1 42 -47 26 16 12 -12 14 -10 -23 18 11 -67 -48 7 -11 8 43 -21 41 2 -23 -40 51 -20 34 13 10
13293 10 -36 -30 22 -51 48 -27 -28 -32 -29 -2 -5 -3 25 -20 -1 -11 -6 21 -12 37 36 -35 -39 53 -6 -4 13 -8 -18 -41 18 14 52 11 25
13328 25 5 -3 34 20 0 16 -6 11 26 15 4 1 17 -9 11 36 2 -10 -36 11 -24 -16 -2 0 -16 -3 -33 -29 -15 -30 7 4 -53
13361 -53 21 8 -10 -11 -28 -54 -26 25 -34 13 -34 -25 12 -12 -22 52 -2 -71 9 -13 -37 10 -25 15 0 6 -12 -3 36 -1 37 27
13393 27 3 -8 -27 4 -1 -1 -6 -57 3 9 -20 -21 -2 10 19 -35 10 -9 -7 49 -30 -33 -37 20 -14 -33 8 -2 0 7 -4 -22 -15 7 -27 -33
13429 -33 7 -28 0 -5 41 31 -1 -12 -20 -10 43 -1 -44 -4 -36 -2 42 5 9 16 -35 -36 -7 -47 13 23 4 11 2 -54 -3 -4 -2 -11 -5
13464 -5 24 18 19 25 -14 40 14 -31 26 14 -10 -31 12 -48 -3 -12 -16 41 -8 -4 -26 -2 20 4 -13 -50 -11 0 -9 -32 26 -12 34 23
13498 23 -75 0 5 18 -45 -12 38 -1 41 37 14 9 -19 46 -23 -16 39 -3 -3 -10 13 -12 -27 -28 37 -5 17 -13 1 9 6 -1 -8 -35 -46
13533 -46 15 20 -11 35 -22 6 28 -35 -31 24 21 -21 -39 -39 -21 -40 45 -27 13 -3 3 28 36 22 -6 18 -31 11 -13 -22 -1 1 29 0
13567 0 -16 21 7 -5 -58 -13 -33 7 15 -5 44 -2 -32 -26 -18 -35 7 7 -20 30 -28 -27 15 -7 -15 0 52 3 1 -1 -25 -31 6 -37 5
13602 5 26 -1 -13 6 -29 19 8 3 27 -13 0 29 -11 12 -19 23 -19 5 -18 13 -16 38 23 -8 41 19 -43 -18 38 2 5
13633 5 -17 54 25 8 10 24 15 0 14 12 5 -27 57 -3 35 41 33 27 19 3 -24 -3 16 23 -5 -4 -5 -8 45 -3 -3 -4 -20 16 -49 -8 43
13670 43 -11 24 10 8 11 2 34 8 -3 -9 31 10 11 -8 32 8 -38 23 12 37 -2 -7 -2 -14 -41 31 4 5 5 -26 -6 39 7 -17
$$ [...]
16383C1
##END NTUPLES=NMR FID
##END=
