##TITLE=31P_DE-80H_X3
 64 sc D2O
 26.2.2025
##JCAMPDX= 6.0         $$ Bruker NMR JCAMP-DX V2.0
##DATA TYPE= NMR FID
##DATA CLASS= NTUPLES
##ORIGIN= UXNMR, Bruker Analytische Messtechnik GmbH
##OWNER= root
$$ XWIN-NMR		Version 3.5
$$ Wed Feb 11 12:27:44 2026 Russian Standard Time (UT+4h)  Yarkov@DPX200
##.OBSERVE FREQUENCY= 81.013821
##.OBSERVE NUCLEUS= ^31P
##.DELAY= (6, 6)
##.ACQUISITION MODE= SIMULTANEOUS
##.ACQUISITION SCHEME= undefined
##.AVERAGES= 64
##.DIGITISER RES= 17
##SPECTROMETER/DATA SYSTEM= spect
##.PULSE SEQUENCE= zgpg30
##.SOLVENT NAME= CDCl3
##.SHIFT REFERENCE= (INTERNAL, CDCl3, 0, 243.863)
##AUDIT TRAIL= $$ (NUMBER, WHEN, WHO, WHERE, WHAT)
$$ ##TITLE= Audit trail, XWIN-NMR		Version 3.5
$$ ##JCAMPDX= 5.01
$$ ##ORIGIN= Bruker BioSpin GmbH
$$ ##OWNER= Yarkov
$$ C:/Bruker/XWIN-NMR/data/yarkov2/nmr/P31/2/audita.txt
$$ ##AUDIT TRAIL=  $$ (NUMBER, WHEN, WHO, WHERE, WHAT)
(   1,<2026-02-11 12:27:00.06 +0400>,<Yarkov>,<DPX200>,
      <created by zg, POWCHK disabled, PULCHK disabled
       configuration hash MD5:
       00 E9 B6 7A A2 85 ED C7 34 08 36 98 17 FE 4E 26
       data hash MD5: 32K
       82 F8 11 90 22 7A 98 47 2C CE D9 9D F3 28 6C 1F>)
$$ ##END=
$$ 
$$ hash MD5
$$ B1 43 47 F5 99 9F 7A A8 B7 B6 BB F5 78 CF BA A3
##$RELAX= 
##$RELAX= 
##$RELAX= 
##$RELAX= 
##$RELAX= 
##$RELAX= 
##$RELAX= 
##$RELAX= 
$$ Bruker specific parameters
$$ --------------------------
##$DU= <C:/Bruker/XWIN-NMR>
##$EXPNO= 2
##$NAME= <P31>
##$PROCNO= 1
##$TYPE= <nmr>
##$USER= <yarkov2>
##$AMP= (0..31)
100 100 100 100 100 100 100 100 100 100 100 100 100 100 100 100 100 100 
100 100 100 100 100 100 100 100 100 100 100 100 100 100 
##$AQSEQ= 0
##$AQ_mod= 1
##$AUNM= <au_zg>
##$AUTOPOS= <>
##$BF1= 81.014009
##$BF2= 200.13
##$BF3= 200.13
##$BF4= 200.13
##$BF5= 200.13
##$BF6= 200.13
##$BF7= 200.13
##$BF8= 200.13
##$BYTORDA= 1
##$CFDGTYP= 0
##$CFRGTYP= 5
##$CHEMSTR= <none>
##$CNST= (0..31)
1 1 145 1 1 1 1 1 1 1 1 1 1 1 1 1 1 1 1 1 1 1 1 1 1 1 1 1 1 1 1 1 
##$CPDPRG= <waltz16>
##$CPDPRG1= <>
##$CPDPRG2= <waltz16>
##$CPDPRG3= <>
##$CPDPRG4= <mlev>
##$CPDPRG5= <mlev>
##$CPDPRG6= <mlev>
##$CPDPRG7= <mlev>
##$CPDPRG8= <mlev>
##$CPDPRGB= <>
##$CPDPRGT= <>
##$D= (0..31)
0 1 0 0 0 0 0 0 0 0.06 0 0.03 2e-05 3e-06 0 0 0.0002 0 0 0 0 0 0 0 0 0 
0 0 0 0 0 0 
##$DATE= 1770798419
##$DBL= (0..7)
120 120 120 11 120 120 24 19 
##$DBP= (0..7)
150 150 150 150 150 150 150 150 
##$DBP07= 0
##$DBPNAM0= <>
##$DBPNAM1= <>
##$DBPNAM2= <>
##$DBPNAM3= <>
##$DBPNAM4= <>
##$DBPNAM5= <>
##$DBPNAM6= <>
##$DBPNAM7= <>
##$DBPOAL= (0..7)
0.5 0.5 0.5 0.5 0.5 0.5 0.5 0.5 
##$DBPOFFS= (0..7)
0 0 0 0 0 0 0 0 
##$DE= 6
##$DECBNUC= <off>
##$DECIM= 4
##$DECNUC= <off>
##$DECSTAT= 4
##$DIGMOD= 1
##$DIGTYP= 9
##$DL= (0..7)
0 0 52 120 120 21 21 25 
##$DP= (0..7)
150 150 150 150 150 150 150 150 
##$DP07= 0
##$DPNAME0= <>
##$DPNAME1= <>
##$DPNAME2= <>
##$DPNAME3= <>
##$DPNAME4= <>
##$DPNAME5= <>
##$DPNAME6= <>
##$DPNAME7= <>
##$DPOAL= (0..7)
0.5 0.5 0.5 0.5 0.5 0.5 0.5 0.5 
##$DPOFFS= (0..7)
0 0 0 0 0 0 0 0 
$$ [...]
##$SUBNAM1= <"">
##$SUBNAM2= <"">
##$SUBNAM3= <"">
##$SUBNAM4= <"">
##$SUBNAM5= <"">
##$SUBNAM6= <"">
##$SUBNAM7= <"">
##$SUBNAM8= <"">
##$SUBNAM9= <"">
##$SW= 400.765351723535
##$SWIBOX= (0..15)
0 1 3 0 0 0 0 0 0 0 0 0 0 0 0 0 
##$SW_h= 32467.5324675325
##$TD= 32768
##$TD0= 1
##$TE= 0
##$TE2= 300
##$TE3= 300
##$TEG= 300
##$TL= (0..7)
0 120 53 12 22 120 120 120 
##$TP= (0..7)
150 150 150 150 150 150 150 150 
##$TP07= 0
##$TPNAME0= <>
##$TPNAME1= <>
##$TPNAME2= <>
##$TPNAME3= <>
##$TPNAME4= <>
##$TPNAME5= <>
##$TPNAME6= <>
##$TPNAME7= <>
##$TPOAL= (0..7)
0.5 0.5 0.5 0.5 0.5 0.5 0.5 0.5 
##$TPOFFS= (0..7)
0 0 0 0 0 0 0 0 
##$TUNHIN= 0
##$TUNHOUT= 0
##$TUNXOUT= 0
##$USERA1= <user>
##$USERA2= <user>
##$USERA3= <user>
##$USERA4= <user>
##$USERA5= <user>
##$V9= 5
##$VALIST= <valist>
##$VCLIST= <CCCCCCCCCCCCCCC>
##$VD= 0
##$VDLIST= <DDDDDDDDDDDDDDD>
##$VPLIST= <PPPPPPPPPPPPPPP>
##$VTLIST= <TTTTTTTTTTTTTTT>
##$WBST= 1024
##$WBSW= 4
##$XGAIN= (0..3)
0 0 0 0 
##$XL= 0
##$YL= 0
##$YMAX_a= 4220
##$YMIN_a= -3900
##$ZGOPTNS= <>
##$ZL1= 120
##$ZL2= 120
##$ZL3= 120
##$ZL4= 120
##$ABSF1= 60
##$ABSF2= -190
##$ABSG= 5
##$ABSL= 3
##$ALPHA= 0
##$AQORDER= 0
##$ASSFAC= 0
##$ASSFACI= 0
##$ASSFACX= 0
##$ASSWID= 0
##$AUNMP= <proc_1d>
##$AZFE= 0.1
##$AZFW= 0.5
##$BCFW= 1
##$BC_mod= 2
##$BYTORDP= 1
##$COROFFS= 0
##$CY= 9.86611175537109
##$DATMOD= 1
##$DC= 1
##$DFILT= <>
##$DTYPP= 0
##$F1P= 182.462994727601
##$F2P= 168.069089081705
##$FCOR= 0.5
##$FTSIZE= 0
##$FT_mod= 0
##$GAMMA= 1
##$GB= 0
##$INTBC= 1
##$INTSCL= 1
##$ISEN= 30
##$LB= 1.5
##$LEV0= 0
##$LPBIN= 0
##$MAXI= 11.51145
##$MC2= 0
##$MEAN= 0
##$ME_mod= 0
##$MI= 1.244541
##$NCOEF= 0
##$NC_proc= 0
##$NLEV= 6
##$NOISF1= 0
##$NOISF2= 0
##$NSP= 1
##$NTH_PI= 0
##$NZP= 1
##$OFFSET= 243.8632
##$PC= 1.4
##$PHC0= 1702.609
##$PHC1= -1.240479
##$PH_mod= 0
##$PKNL= yes
##$PPARMOD= 0
##$PSCAL= 0
##$PSIGN= 0
##$REVERSE= no
##$SF= 81.0140731611343
##$SI= 65536
##$SIGF1= 0
##$SIGF2= 0
##$SINO= 80
##$SIOLD= 65536
##$SREGLST= <31P.CDCl3>
##$SSB= 0
##$STSI= 0
##$STSR= 0
##$SW_p= 25641.0256410257
##$SYMM= 0
##$S_DEV= 0
##$TDeff= 0
##$TDoff= 0
##$TI= <>
##$TILT= no
##$TM1= 0
##$TM2= 0
##$TOPLEV= 0
##$USERP1= <user>
##$USERP2= <user>
##$USERP3= <user>
##$USERP4= <user>
##$USERP5= <user>
##$WDW= 1
##$XDIM= 64
##$YMAX_p= 0
##$YMIN_p= 0
$$ End of Bruker specific parameters
$$ ---------------------------------
##NTUPLES= NMR FID
##VAR_NAME=  TIME,          FID/REAL,        FID/IMAG
##SYMBOL=    X,             R,               I
##VAR_TYPE=  INDEPENDENT,   DEPENDENT,       DEPENDENT
##VAR_FORM=  AFFN,          ASDF,            ASDF
##VAR_DIM=   16384,         16384,           16384
##UNITS=     SECONDS,       ARBITRARY UNITS, ARBITRARY UNITS
##FACTOR=    3.08e-05,      1,               1
##FIRST=     0,             0,               0
##LAST=      0.5045964,     0,               0
##MIN=       0,             -3900,           0
##MAX=       0.5045964,     4220,            0
$$ Real data points
##PAGE= N=1
##DATA TABLE= (X++(R..R)), XYDATA
$$ plain form
0 0 0 0 0 0 0 0 0 0 0 0 0 0 0 0 0 0 0 0 0 0 0 0 0 0 0 0 0 0 0 0 0 0 0 0 0 0 0 0 0 0 0 0 0 0 0 0 0 0 0 -1 5 -9 16 -21 28 -34 38 -43
58 -43 47 -52 64 -79 100 -132 191 -353 1454 2956 308 -1471 -3384 -3900 -3753 -2427 -701 1275 2794
77 2794 3634 3464 2591 970 -834 -2437 -3339 -3390 -2505 -1161 480 1938 2775 2867 2191 1033 -325 -1453
95 -1453 -2216 -2428 -2025 -1155 16 1062 1843 2040 1779 1001 100 -795 -1345 -1527 -1329 -796 -144 509 950 1088
115 1088 1002 693 153 -293 -679 -844 -696 -429 -119 183 357 455 447 299 98 -74 -162 -193 -138 -67 3 40 76 59
139 59 46 -59 -38 -53 62 52 55 89 -35 5 66 44 -11 23 -58 -35 -26 -134 -118 -187 -135 -17 117 249 328 298 258 36
167 36 -172 -505 -599 -697 -528 -224 182 657 932 1083 901 489 -179 -807 -1363 -1541 -1300 -720 107 930 1580
188 1580 1807 1571 974 -7 -965 -1762 -2103 -1963 -1318 -238 965 1966 2513 2352 1659 422 -914 -2051
$$ packed form
0@%%%%%%%%%%%%%%%%%%%%%%%%%%%%%%%%%%%%%%%%%%%%%%%%%jOj4K5l7M9o2P2q1
58d3R0r9J16j43J79k32L23n44J807J502k648j779j913n16J47J326J726J976J519
77B794Q40j70q73j621j804j603r02n1Q85J344J641J458Q37R2o76j158j358j128
95a453p63k12M03Q70J171J046P81J97k61p78r01q95n50j82J98N33O52O53M41J38
115A088q6l09n40m46l86j65J48K67L10L02J74R8qj48k01j72q8l1N5P1P0L7L6j7
139E9j3j05K1j5J15j0LL4j24M0O1k2n5L4q1K3Rj08J6o9N2J18J34J32P9l0m0k22
167C6k08l33r4r8J69L04M06M75K75J51j82m12o68o28n56j78K41N80Q27Q23O50
188A580K27k36n97r81r58p97l41J40O45J080J203J001N47j61o93j237j336j137
$$ plain form
206 -2051 -2717 -2567 -1828 -608 816 1998 2755 2790 2119 973 -531 -1931 -2890 -3033 -2459 -1220 304 1767
224 1767 2731 2956 2391 1216 -200 -1615 -2543 -2821 -2466 -1468 -199 1249 2192 2689 2444 1585 334 -986
242 -986 -1900 -2392 -2164 -1391 -340 812 1709 2077 1966 1360 525 -438 -1250 -1671 -1655 -1273 -556 304 951 1351
262 1351 1334 1024 432 -192 -687 -985 -955 -742 -378 23 404 594 673 536 280 5 -283 -371 -367 -270 -103 14
284 14 120 188 149 102 -9 -52 -108 -81 -24 -6 115 47 10 -66 -133 -236 -126 -77 -44 46 68 107 149 76 -27 -41 -108 -125
312 -125 -121 -102 -21 -60 -26 -29 29 3 79 143 171 222 166 117 -69 -195 -311 -471 -427 -300 -87 224 523 740 711 544
338 544 156 -291 -733 -1022 -1075 -746 -274 297 878 1229 1321 1023 512 -182 -954 -1491 -1620 -1398 -776 89 1008
359 1008 1598 1769 1497 872 -80 -988 -1791 -2061 -1815 -1198 -216 729 1637 2065 2014 1434 407 -702 -1677 -2159
$$ packed form
206b051o66J50P39J220J424J182P57L5o71j146j504j400r59j43N74J239J524J463
224A767R64K25n65j175j416j415r28k78L55R98J269J448R43M97k45q59j251j320
242i86r14m92K28P73J051J152Q97L68j11o06q35r63q12m21J6L82P17Q60O47M00
262A351j7l10n92o24m95k98L0K13L64M01L81J90P9j37k56k75k88q8MR7J67J17
284A4J06O8l9m7j11m3n6K7N7J8J21o8l7p6o7j03J10M9L3R0K2L9M2p3j03j4o7j7
312a25MJ9Q1l9L4lN8k6P6O4K8N1n6m9j86j26j16j60M4J27K13L11K99K17k9j67
338E44l88m47m42k89n3L29M72N71N81L51R2k98n11o94p72n37j29K22O22Q65R19
359A008N90J71k72o25r52r08q03k70K46O17R82R45R08M28n1n80j027j109r75m82
$$ plain form
379 -2159 -2087 -1449 -452 603 1537 2010 2022 1580 721 -272 -1206 -1803 -1934 -1545 -798 239 1140 1698 1771 1471
399 1471 800 -101 -917 -1387 -1537 -1300 -785 -83 586 1071 1265 1104 738 134 -456 -921 -1083 -921 -585 -62
419 -62 328 633 786 677 421 143 -174 -390 -511 -439 -302 -58 117 256 266 177 166 17 -81 -92 -90 -50 65 29
443 29 35 -37 -120 -156 -177 -120 -31 26 200 281 320 255 45 -69 -258 -257 -317 -239 -100 65 195 312 311 241 168 -44 -103 -188
471 -188 -216 -217 -110 -27 86 119 195 81 134 86 39 30 39 18 6 -80 -120 -209 -285 -254 -169 3 216 396 458 427 340 -2
499 -2 -279 -541 -690 -654 -439 -85 316 612 817 881 632 232 -282 -761 -1076 -1060 -776 -296 304 815 1151 1237
521 1237 962 461 -129 -730 -1179 -1346 -1104 -594 86 749 1248 1447 1257 704 60 -675 -1223 -1458 -1252 -781
541 -781 -109 573 1001 1265 1197 839 253 -408 -938 -1241 -1220 -798 -296 339 821 1034 1002 682 289 -211 -598
$$ packed form
379b159P2O38R97J055R34M73J2m42q59r93r34n97j31L89P47J037R01N58P3l00
399A471o71r01q16m70j50K37N15P02O69M85J94j61l66o04n90m65j62J62L36N23
419f2L90L05J53j09k56k78l17k16j21P2J37K44J75J39J0q9j1j49r8j1KM0J15l6
443B9Op2q3l6k1N7Q9N7J74Q1L9o5k10j14j89Jo0P8J39J65J30J17jp0p3k12n9q5
471a88k8jJ07Q3J13L3P6j14N3m8m7rRk1j2q6m0q9p6L1Q5J72K13J80O2l1q7l42
499bk77k62j49L6K15L54M01K96K05O4k49m00n14m79l15J6K84M80O00N11L36Q6
521A237k75n01n90o01m49j67K42N10O80O63M99J99j90n53o44p35n48k35K06M71
541g81O72O82M28K64o8l58n86o61n30l03K1M22N02O35M82K13l2l20l93n00l87
$$ plain form
562 -598 -861 -864 -674 -300 128 449 704 708 563 252 -48 -345 -445 -465 -336 -168 15 143 265 282 234 133 -11
585 -11 -125 -87 -101 -90 -24 51 28 16 -82 -108 -91 -37 18 126 218 196 280 135 -23 -170 -255 -331 -267 -126 19 223 333
612 333 414 344 197 6 -242 -310 -386 -382 -284 -50 204 321 361 350 264 85 -89 -257 -341 -292 -201 -76 38 185 204
637 204 232 165 36 4 -49 -74 -53 -44 -42 -27 -75 -112 -81 -92 15 70 159 219 268 244 104 -60 -247 -368 -429 -399 -174 -35
665 -35 259 432 553 519 345 -17 -330 -591 -672 -638 -408 -68 296 590 720 704 559 186 -227 -552 -852 -786
687 -786 -629 -244 137 594 856 847 619 247 -142 -520 -723 -783 -676 -347 49 382 696 753 635 400 8 -337
709 -337 -592 -686 -591 -354 -83 327 458 559 459 325 74 -119 -375 -437 -387 -309 -94 88 243 282 252 150 57
732 57 -59 -132 -189 -121 -93 -44 22 15 -18 -6 -81 -50 -8 54 140 184 145 98 23 -138 -191 -280 -258 -153 -78 162 285 345 317
$$ packed form
562e98k63lJ90L74M28L21K55Mj45l11l00k97j00k0J29J68J83J28J22J7m8j01j44
585a1j14L8j4J1O6P5k3j2r8k6J7N4N5J08R2k2Q4j45j58j47q5p6O4J41J45K04J10
612C33Q1p0j47j91k48o8p6MR8K34K54J17M0j1q6j79j74j68q4M9R1J25J14J47J9
637B04K8o7j29l2n3k5K1RKJ5m8l7L1j1J07N5Q9O0M9k4j40j64j87j21o1L0K25J39
665c5K94J73J21l4j74l62l13k61q1L4K30L40L64K94J30j6j45l73m13l25l00O6
687g86J57L85L81M57K62rk28l72l89l78k03o0J07L29L96L33L14N7j18k35l92l45
709c37k55r4R5K37K71M10J31J01j00j34k51j93k56o2N0P8K15J82J55L9l0j02r3
732E7j16p3n7O8K8M9O6pl3J2p5L1M2O2Q6M4l9m7p5j61n3q9K2J05P5K40J23O0k8
$$ plain form
761 317 251 47 -77 -311 -408 -415 -294 -105 39 306 420 358 318 121 -69 -265 -395 -394 -366 -153 11 193 305
784 305 377 315 190 36 -128 -252 -282 -272 -150 4 88 153 154 160 62 89 -16 -66 -69 -98 -4 -64 -56 -37 -29 -75 -6 2 39 148
814 148 116 144 85 37 -109 -200 -256 -256 -224 -96 50 226 308 328 237 100 -94 -236 -407 -472 -336 -244 11 249 388
839 388 450 408 266 24 -256 -389 -525 -498 -288 1 205 378 474 400 263 106 -132 -320 -445 -421 -322 -131 121
862 121 302 424 395 314 146 -55 -237 -329 -373 -231 -97 20 179 229 258 214 124 -29 -82 -118 -111 -160 -39 -43 32 68
888 68 27 41 -11 77 4 40 6 75 -8 27 -45 -97 -154 -155 -133 -71 38 152 214 209 177 134 -81 -161 -271 -283 -206 -129 28
917 28 164 278 333 310 192 -23 -209 -276 -348 -256 -195 2 124 296 320 309 243 58 -91 -228 -318 -273 -175 -98 65
942 65 157 266 266 190 98 -32 -125 -139 -196 -194 -120 -40 31 108 94 116 88 8 -40 1 -37 -19 -37 3 -30 -48 -56 -7 -15 40 39 78
$$ packed form
761C17o6k04j24k34r7pJ21J89J44K67J14o2m0j97j90j96j30JK8K13J64J82J12
784C05P2o2j25j54j64j24l0J0J22J54Q4O5JOr8K7j05n0lk9R4o0QJ9Qm6O9QL7J09
814A48l2K8n9m8j46r1n6%L2J28J46J76Q2K0r1j37j94j42j71o5J36R2K55K38J39
839C88O2m2j42k42k80j33j36K7K10K89K04J73R6p4j37j57k38j88j25K4R9J91K52
862A21J81J22k9q1j68k01j82r2m4J42J34J17J59N0K9m4r0j53n3l6Pm9J21mP5L6
888F8m1J4n2Q8p3L6l4O9q3L5p2n2n7jK2O2J09J14O2nl2m3k15q0j10j2P7P7J57
917B8J36J14N5k3j18k15j86o7p2R2O1J97J22J72K4j1o6j85j49j37r0M5R8P7J63
942F5R2J09%p6r2j30r3j4n7KP4Q0P1P7j4K2k8q0m8M1l8J8j8M0l3j8qM9qN5jL9
$$ plain form
974 78 104 89 43 13 -90 -177 -147 -187 -111 -61 91 185 187 243 167 -20 -70 -210 -231 -263 -200 -82 60 192 259 264 196 101
1002 101 -74 -182 -286 -308 -230 -128 0 122 231 240 198 96 -18 -95 -241 -244 -226 -95 -24 67 116 160 164 84 41 -19
1028 -19 -106 -116 -117 -105 -46 10 40 63 127 52 40 32 45 -18 -27 -14 16 -39 -51 -63 -36 -44 61 26 82 81 140 91 48 -6 -120 -174
1060 -174 -214 -181 -36 -20 99 188 226 236 114 50 -86 -179 -230 -196 -174 -111 72 175 220 281 176 109 -11 -162 -211
1085 -211 -267 -218 -114 9 117 223 229 170 124 6 -106 -198 -163 -168 -121 -26 33 114 135 131 83 29 -40 -50 -66 -52 -60 -45 -10
1114 -10 -8 45 76 26 1 2 10 29 -7 2 -60 -22 -99 -59 -82 -58 -41 35 70 132 103 78 62 -64 -106 -126 -140 -133 -87 -15 84 187
1146 187 193 134 34 -45 -77 -143 -220 -198 -111 10 100 180 190 146 112 8 -75 -180 -191 -121 -103 -77 32 94 127 139 150 39
1174 39 -22 -65 -115 -132 -156 -70 -35 49 62 69 75 42 38 11 -27 -42 -33 -42 -5 12 7 -32 -28 8 -8 -26 22 37 42 28 -21 -63 -72 -88 -119
$$ packed form
974G8K6j5m6l0j03q7L0m0P6N0J52R4KN6p6j87n0j40k1l2O3J18J42J32O7No8r5
1002A01j75j08j04k2P8J02J28J22J09Rm2j02j14p7j46lJ8J31P1R1M9M4Mq0m3o0
1028a9q7j0jJ2N9N6L0K3O4p5j2qJ3o3rJ3L0n5j2j2K7qJ05l5N6jN9m9m3n4j14n4
1060a74m0L3J45J6J19Q9L8J0j22o4j36r3n1L4K2O3J83J03M5O1j05o7j20j51m9
1085b11n6M9J04J23J08J06On9m6j18j12r2L5nM7R5N9Q1K1mm8n4o9j0j6J4qJ5L5
1114a0KN3L1n0k5JQJ9l6Ro2L8p7M0k3K4J7P6L5O2k9k5j6j26m2k0j4PM6P2R9J03
1146A87On9j00p9l2o6p7K2Q7J21R0Q0J0m4l4j04q3j05j1P0J8K6J09O2L3J2J1j11
1174C9o1m3n0j7k4Q6L5Q4J3POl3mk7l8j5RrL7J7nl9ML6j6j8M8J5Nj4m9m2rj6l1
$$ plain form
1209 -119 -54 -28 26 123 100 122 93 34 -60 -83 -120 -148 -96 -50 -15 104 95 169 135 103 33 -65 -118 -176 -162 -145 -31 54 109
1238 109 156 146 103 0 -70 -52 -141 -169 -131 -41 -15 1 112 91 63 61 22 -48 -65 -58 -42 -24 -30 -20 35 43 19 34 21 31 29
1269 29 -17 -35 11 -15 -54 -52 -41 -19 -11 57 35 91 69 69 -1 -48 -72 -94 -102 -89 -60 3 80 95 168 140 88 -42 -32 -118 -117 -164
1301 -164 -65 -40 68 107 143 179 75 71 -32 -104 -136 -118 -88 -59 23 78 76 150 100 84 -14 -15 -116 -156 -129 -68 -9 15 71
1330 71 89 84 79 50 -28 -31 -100 -29 -20 -17 0 17 18 37 11 36 -24 -19 2 -23 24 -21 -15 -43 -46 -68 -17 -2 32 29 9 11 70 21 -24 -55
1366 -55 -107 -77 -100 -47 -6 44 24 70 73 -12 -37 -53 -88 -74 -99 -28 -2 43 54 65 105 33 17 23 -88 -43 -92 -69 -49 -21 37
1397 37 50 55 20 58 -12 4 -58 -29 -29 -27 9 -4 -25 -1 15 19 1 56 29 12 1 -12 -3 -39 -25 -43 37 -20 -7 54 79 72 88
1430 88 38 3 -62 -62 -80 -65 -63 -49 22 52 109 136 62 13 -71 -107 -158 -156 -123 -23 65 61 135 124 114 52 3 -29 -122 -82 -140 -73
$$ packed form
1209a19O5K6N4R7k3K2k9n9r4k3l7k8N2M6L5J19rP4l4l2p0r8n3n8J4J7J14Q5N5
1238A09M7j0m3j03p0J8q9k8L8R0K6J6J11k1k8kl9p0j7PJ6J8oJ0N5Qk4J5j3J0k
1269B9m6j8M6k6l9KJ1K2QO8k2N6k2%p0m7k4k2qJ3K9O3P7J5P3k8n2j30J0q6Jm7
1301a64R9K5J08L9L6L6j04mj03p2l2J8L0K9Q2N5kP4n0j6r8jj01m0K7O1N9K4N6
1330G1J8nnk9p8lo9P1RLJ7J7JJ9k6K5o0NK1k5M7m5Ok8lk2N1J5L4lk0KN9m9m5l1
1366e5n2L0k3N3M1N0k0M6Lq5k5j6l5J4k5P1K6M5J1J1M0p2j6Oj11M5m9K3K0K8N8
1397C7J3Nl5L8p0J6o2K9%KL6j3k1K4J6Mj8N5k7j7j1j3Rl6J4j8Q0n7J3O1K5pJ6
1430H8n0l5o5%j8J5KJ4P1L0N7K7p4m9q4l6n1KL3J00Q8mP4j1j0o2m9l2r3M0n8O7
$$ plain form
1462 -73 -10 68 95 112 137 67 13 -69 -95 -83 -86 -20 -17 41 76 47 85 13 48 -46 -45 -68 -78 -107 -12 6 -26 18 47 -5 55 -51
1494 -51 -18 -19 -16 -54 -8 -22 -55 -47 -25 38 -5 12 6 5 -5 0 13 -25 -31 -53 -33 -10 -4 1 34 16 96 -1 34 30 -55 -30 -53 -36 -64
1529 -64 31 -32 49 32 29 43 11 -4 -19 -42 -71 -60 -99 -34 6 9 24 55 6 52 -30 -20 12 -19 -7 -29 -12 33 51 18 4
1560 4 9 -15 1 8 -12 -15 16 -53 -31 -31 -62 -53 6 34 77 55 18 42 -17 3 -54 -51 -89 -77 -59 33 40 49 134 81 19 -2 -51 -106 -118
1595 -118 -93 -45 -31 27 100 107 142 112 -12 -43 -98 -124 -105 -74 -11 37 107 99 101 81 30 9 -84 -133 -88 -96 -1 13 66 82 111
1626 111 81 22 1 -73 -90 -89 -85 -47 -40 64 69 53 75 41 54 -34 -14 -60 -49 18 15 26 4 53 4 -8 -27 -1 14 -10 -15 14
1658 14 2 0 36 0 2 -22 1 -3 11 3 7 39 7 -48 -38 -26 -65 8 6 12 5 27 51 23 37 -2 -4 -35 -52 -71 -41 -24 -16 24 21 8
1694 8 39 4 3 2 -20 -67 12 17 9 -18 3 13 -10 28 -22 6 45 9 13 29 4 -18 -50 -39 -43 5 -6 11 74 -54 79 40 -14
$$ packed form
1462g3O3P8K7J7K5p0n4q2k6J2lO6LN8L5k9L8p2L5r4Jk3j0k9R5J8l2M4K9n2O0j06
1494e1L3jLl8M6j4l3QK2O3m3J7ojj0NJ3l8ok2K0K3ONL3j8Q0r7L5mq5K5k3J7k8
1529f4R5o3Q1j7lJ4l2j5j5k3k9J1l9O5M0LJ5L1m9M6q2J0L2l1J2k2J7M5J8l3j4
1560DNk4J6Pk0lL1o9K2%l1RN9K8M3k2l7K4n9K0n7Ll8J2J8R2PRQ5n3o2k1m9n5j2
1595a18K5M8J4N8P3PL5l0j24l1n5k6J9L1O3M8P0qKk0n1k1r3m9M5qR5J4N3J6K9
1626A11l0n9k1p4j7JML8PJ04Nj6K2l4J3q8K0m6J1O7lJ1k2M9m9j2j9K6J5k4nK9
1658A4j2kL6l6Kk4K3mJ4qML2l2n5J0J2l9P3kOpK2K4k8J4l9kl1j7j9L0J7QM0lj3
1694HL1l5jjk2m7P9Nqk7K1J0k3L8n0K8L9l6MJ6k5k2l2J1mM8j1J7O3j28J33l9n4
$$ plain form
1727 -14 -15 -58 -43 -71 -50 -7 9 98 109 110 47 25 -32 -67 -113 -138 -50 -47 16 80 114 136 98 41 -20 -63 -125 -110 -47 -94 17
1758 17 90 118 86 86 75 -5 -78 -106 -101 -85 -57 26 54 71 107 57 51 17 -21 -89 -82 -99 -72 -19 41 34 23 98 29 -26 -21 -44 -32
1791 -32 -36 -25 -41 -36 -3 20 -11 24 19 26 -22 -9 -6 -34 -9 -17 6 -34 12 -16 8 -16 49 29 11 32 -24 26 -43 -42 -31 -18 -65 -6
1825 -6 16 38 28 27 22 10 0 -33 -61 -20 -18 3 22 20 28 46 32 7 33 -11 -35 -18 -45 -19 50 -2 29 -8 17 -23 -10 -15 -24 46
1859 46 -31 -2 23 11 -27 -65 -11 -11 -15 55 37 -5 0 20 -8 -40 -8 -59 -43 -51 -10 -9 28 53 103 41 15 -28 -92 -142 -128 -60 -38
1892 -38 36 52 77 92 108 30 63 -66 -108 -104 -94 -85 -24 22 30 81 87 46 35 -41 -53 -97 -97 -81 -18 -5 34 78 48 61 60 -9 -80
1925 -80 -69 -70 -78 -59 67 68 54 59 36 -9 -12 -2 -78 9 -32 -7 28 -32 16 -17 41 20 -10 20 -29 32 -6 -54 2 23 -9 -1 18
1958 18 -24 -16 -7 56 -30 -7 22 -15 -21 27 -33 -23 -43 -17 -32 11 6 26 28 32 -43 -32 -42 -14 -47 7 21 22 31 52 37 14 -11 -45
$$ packed form
1727a4jm3J5k8K1M3J6Q9J1Jo3k2n7l5m6k5Q8LO3O4L4K2l8n7o1m3o2J5O3m7J11
1758A7P3K8l2%j1q0p3k8NJ6K8Q3K8J7L6n0ol4l8o8Pj7K7N3O0pj1P5o9n5Nk3J2
1791c2mJ1j6NL3K3l1L5nPm8J3Lk8K5qK3m0M6k8K4k4O5k0j8K1n6N0o9JJ1J3m7N9
1825fK2K2j0jnj2j0l3k8M1KK1J9kQJ8j4k5K6m4k4J7k7K6O9n2L1l7K5m0J3nrP0
1859D6p7K9K5j2l8l8N4%mP0j8m2NK0k8l2L2n1J6qM1JL7K5N0o2k6m3o4n0J4O8K2
1892c8P4J6K5J5J6p8L3j29m2MJ0RO1M6QN1Om1j1p6j2m4%J6O3J3L9M4l0J3jo9p1
1925h0J1jqJ9J26Jj4Nk3m5lJ0p6Q7m1K5L5o0M8l3N8k1l0L0m9O1l8m8N6K1l2QJ9
1958A8m2QRO3q6K3K9l7oM8o0J0k0K6j5M3nK0KMp5J1j0K8l3N4J4JRK1j5k3k5l4
$$ plain form
1992 -45 -87 -55 13 -40 0 3 -19 27 -1 5 -5 -43 -48 -77 1 -41 -7 0 -6 24 20 -15 -31 -22 -41 -14 15 5 25 30 0 -8 -11 19 9
2027 9 -61 29 -8 36 39 44 26 -34 20 -44 -53 -40 -12 39 63 93 53 55 35 1 -10 -97 -84 -68 -45 -27 47 27 81 45 58 -31 -87
2060 -87 -68 -123 -37 -24 -64 27 78 9 23 25 -6 -94 -38 -74 -74 -49 -29 24 50 61 12 60 -1 14 -40 -28 -47 -30 20 -39 19
2091 19 60 35 63 -20 -41 -30 -12 -29 -11 -1 -40 -12 -2 -44 32 -23 -11 3 17 4 -41 27 -28 -4 -18 -34 -16 -16 -54 -32 32
2122 32 31 -5 28 -17 39 -57 -22 15 -21 16 5 6 21 27 14 9 1 -36 -47 -77 -7 1 39 21 5 88 50 -10 22 -46 -42 -19 -15 -34
2156 -34 9 -5 18 24 16 9 -13 11 1 -68 1 26 22 38 -14 5 8 -28 7 42 -3 -5 14 20 -46 -44 10 -34 -36 -35 -7 38 -8 59 12
2191 12 55 30 -8 -9 -58 -55 -45 -10 -21 17 -4 -5 -8 9 0 -28 -58 -68 -79 -26 -65 10 73 33 39 34 2 -13 9 -34 -58 -28 -33 4
2225 4 19 38 96 -5 23 38 -15 -64 -91 -18 -38 3 -5 13 52 3 30 19 -11 -1 -50 15 -20 7 -12 24 -12 -36 10 -8 11
$$ packed form
1992d5m2L2O8n3M0Lk2M6k8Oj0l8nk9P8m2L4PoL0ml5j6Rj9K7K9j0K0Nl0qlL0j0
2027Ip0R0l7M4LNj8o0N4o4rJ3K8N1K4L0m0Kk0l4j1q7J3J6K3J8P4k0N4l6J3q9n6
2060h7J9n5Q6J3m0R1N1o9J4Kl1q8N6l6%K5K0N3K6J1m9M8o1J5n4J2j9J7N0n9N8
2091A9M1k5K8q3k1J1J8j7J8J0l9K8J0m2P6n5J2J4J4j3m5O8n5K4j4j6J8%l8K2O4
2122C2jl6L3m5N6r6L5L7l6L7j1JJ5Oj3nql7j1l0P0QL8j8j6Q3l8o0L2o8MK3Mj9
2156c4M3j4K3Oqpk2K4j0o9O9K5mJ6n2J9Ll6L5L5m5kJ9Oo6KN4m4kJK8M5m6O7m7
2191A2M3k5l8jm9LJ0L5j1L8k1jlJ7rk8l0j0j1N3l9P5O3m0Onl2j5K2m3k4L0nL7
2225DJ5J9N8j01K8J5n3m9k7P3k0M1qJ8L9m9K7j1l0J0m9O5l5K7j9L6l6k4M6j8J9
$$ plain form
2256 11 5 -66 19 -85 34 3 8 -34 -30 -4 -16 15 -2 35 27 -16 48 -22 0 -84 -42 -17 -31 -14 1 70 6 99 26 4 -46
2287 -46 1 -59 -64 -57 -32 -20 26 42 68 21 47 -46 -88 -25 -38 -36 -37 31 13 29 37 33 -29 26 -51 -48 -64 -54 -5 18 26 24 1 15 26
2322 26 -22 7 -8 -13 75 41 21 41 23 45 -46 3 9 -17 -30 -16 70 -32 20 37 -28 20 -12 3 -48 11 3 32 54 58 30 17
2354 17 25 -42 -53 -48 -41 -14 -30 33 -21 28 26 -35 -18 -21 -37 -14 5 -23 30 36 38 39 0 -1 -19 -21 -80 -34 -39 4 -17 8 73 51 21 2
2390 2 18 -36 -38 -29 -5 -41 1 -5 -35 14 67 -6 16 -7 18 15 32 48 -12 -13 -48 -24 11 7 -14 14 19 5 0 10 15 5 -29 -29 -20 -46
2426 -46 -3 29 29 36 62 23 37 20 -5 -37 -45 -27 11 19 -15 51 -22 48 37 -20 -60 7 -45 -72 -6 -6 -5 28 46 27 24 -41 -35 -18
2460 -18 -13 -38 -77 4 23 -2 9 27 39 -38 -46 -59 -28 -56 28 -29 -23 -26 -4 44 2 45 -23 -21 -10 -22 -33 -1 -19 -32 -8 -18 16
2493 16 4 -13 47 -25 -16 46 -14 12 -50 -7 0 -10 -20 -14 18 14 61 38 80 15 -4 -14 -29 -43 -60 -24 -23 42 48 38 36 19 15 -33
$$ packed form
2256A1op1Q5j04J19l1Nm2MK6j2L1j7L7qm3O4p0K2q4M2K5j4J7J5O9o4R3p3k2n0
2287d6M7o0nPK5J2M6J6K6m7K6r3m2O3j3KjO8j8J6Qmo2N5p7Lj6J0M9K3Qkk3J4J1
2322B6m8K9j5nQ8l4k0K0j8K2r1M9Ok6j3J4Q6j02N2J7o5M8l2J5n1N9qK9K2Mk8j3
2354A7Qo7j1NPK7j6O3n4M9ko1J7lj6K3J9k8N3OKJl9jj8kn9M6nM3k1K5O5k2l0j9
2390BJ6n4kRK4l6M2ol0M9N3p3K2k3K5lJ7J6o0jl5K4L5mk1K8Nj4nJ0Nj0l4%Rk6
2426d6M3L2%PK6l9J4j7k5l2qJ8L8Ql4O6p3P0j1n7m0O7n2k7O6%JL3J8j9lo5OJ7
2460a8Nk5l9Q1J9k5J1J8J2p7qj3L1k8Q4n7OlK2M8m2M3o8KJ1j2j1L2j8j3K4j0L4
2493A6j2j7O0p2RO2o0K6o2M3Pj0j0OL2mM7k3M2o5j9j0j5j4j7L6JO5Oj0kj7mm8
$$ plain form
2527 -33 -22 -63 -47 2 -25 49 24 20 44 -20 18 -4 -41 22 14 -32 -4 -33 10 41 -12 -11 34 24 -25 -29 -26 -8 -7 -17 16 40 22
2560 22 27 -39 -11 -13 -55 9 -3 -19 -4 49 -60 -39 1 -24 -4 -16 29 9 25 20 21 -19 20 -8 -19 -72 14 71 57 18 -12 2
2592 2 -3 -67 -45 -49 -34 -57 -3 20 -8 76 38 18 -13 -7 -21 -72 -19 -52 6 5 35 20 26 45 1 -54 -75 -33 -45 -93 -4 -16 31
2625 31 7 23 -4 4 15 2 -20 -58 -50 -7 -6 -16 2 54 -24 24 -32 -40 -10 -19 -16 -36 0 5 28 -1 1 -18 -24 -36 -16 -26 -15 -47 17
2660 17 -27 -44 -12 -34 -32 -11 3 -24 23 21 15 -18 -20 -27 13 -43 -34 -31 -5 15 -14 14 28 -4 18 -13 -17 -62 -30 -66 -6 -12 -21 17 28
2695 28 -15 0 15 3 22 -2 -40 -20 -5 -31 -32 -19 31 3 11 29 16 -23 -26 40 45 83 3 -22 29 -8 -34 9 4 -27 36 -31 21
2728 21 -1 -12 -55 -25 -24 -21 61 -21 -22 30 28 27 -29 -20 -32 -68 -49 5 7 51 7 8 24 14 26 -20 -11 -80 -48 -60 14 3 67 30 59
2763 59 46 9 -17 -48 -9 -29 -65 -24 47 -4 -25 4 44 3 -20 -27 -43 -34 -62 -36 -40 9 15 12 21 -7 11 25 19 -46 -20 8 34 5
$$ packed form
2527c3J1m1J6M9k7P4k5mK4o4L8k2l7O3qm6K8k9M3L1n3JM5j0m9mLJ8Jj0L3K4j8
2560B2No6K8km2O4j2j6J5N3j09K1M0k5K0j2M5k0J6nJm0L9k8j1n3Q6N7j4l9l0J4
2592Bno4K2mJ5k3N4K3k8Q4l8k0l1Oj4n1N3l3N8jL0j5OJ9m4n5k1M2j2m8Q9j2M7
2625C1k4J6k7QJ1j3k2l8QM3Jj0J8N2p8M8n6qL0rLk0L6NK3k9Kj9oj2K0j0J1l2O4
2660A7m4j7L2k2KK1J4k7M7kol3kpM0n6RLK6K0k9K8J4l2K2l1mm5L2l6O0orL8J1
2695B8m3J5J5j2J9k4l8K0J5k6jJ3N0k8QJ8j3l9lO6NL8q0k5N1l7k6M3nl1O3o7N2
2728B1k2j1m3L0JLQ2q2jN2kjn6Rj2l6J9N4KM4m4JJ6j0J2m6Ro9L2j2P4j1O4l7K9
2763E9j3l7k6l1L9k0l6M1P1n1k1K9M0m1k3pj6Rk8K6mM9OlRk8J8J4oo5K6K8K6k9
$$ plain form
2797 5 -20 28 2 -10 -36 -3 3 -22 34 -6 -10 31 0 -5 -67 -1 28 -41 -1 -16 39 -21 30 46 0 -31 -28 -20 20 41 -13 23 35
2830 35 -24 40 36 -26 -6 -40 -44 -16 22 -9 -18 25 24 -7 -10 8 14 -8 -21 -42 40 41 -11 22 8 73 10 8 6 -23 10 -4 15 20 -27
2865 -27 27 44 35 -21 1 -36 -29 2 31 -10 -33 -42 -45 -19 14 -20 12 -9 -16 37 40 -2 -4 7 -27 -22 -58 -7 -66 -20 4 -15 34 44
2899 44 18 0 -5 -76 -4 -21 -9 4 7 37 -8 45 15 -11 -32 -47 -36 -75 -17 -20 17 57 10 45 16 -40 -29 -11 0 -48 -8 -47
2931 -47 -24 -20 12 55 8 -29 -39 13 -44 -21 -17 -12 -22 -27 24 37 -10 17 -10 -32 -10 24 -7 31 -10 -15 -16 -22 33 13 37 -17 34 28
2965 28 21 -20 -9 4 1 32 -60 24 -10 22 13 32 3 39 -11 -20 -32 -29 -5 2 13 28 35 30 48 22 14 40 5 -54 -3 -16 4 19 -6
3000 -6 52 -38 14 -1 8 -35 -68 4 -51 -3 -18 15 33 26 25 -37 24 29 -46 -50 34 41 -30 -16 -5 -3 -8 4 -16 -29 27 -10 15 6 -44
3035 -44 -46 -3 3 -35 -8 -13 10 24 15 -14 -35 6 30 -3 -18 -40 12 -30 15 11 43 67 9 -6 13 -10 32 -54 -29 1 -13 39 47
$$ packed form
2797Ek5M8k6j2k6L3Ok5N6m0mM1l1no2O6K9o9M0j5N5o0N1J6m6l1LQM0K1n4L6J2
2830C5n9O4mo2K0l4mK8L8l1rM3jl1lJ8Ok2j3k1Q2Jn2L3j4O5o3kkk9L3j4J9Nm7
2865b7N4J7rn6K2l7PL1K9m1k3rlK6L3l4L2k1pN3Lm2kJ1l4Nl6N1n9M6K4j9M9J0
2899D4k6j8np1P2j7J2J3LL0m5N3l0k6k1j5J1l9N8lL7M0m7L5k9n6J1J8J1m8M0l9
2931d7K3ML2M3m7l7j0N2n7K3MNj0nN1J3m7K7k7k2K2L4l1L8m1njoN5k0K4n4N1o
2965B8pm1J1J3lL1r2Q4l4L2rJ9k9L6n0rj2LK4PJ1J5PnJ8k6qK6l5n9N1j3K0J5k5
3000fN8r0N2j5Rm3l3P2n5M8j5L3J8pjo2O1Np5mQ4Pp1J4J1KnJ2k0j3N6l7K5rn0
3035d4kM3Ol8K7nK3J4rk9k1M1K4l3j5k2N2m2M5mL2K4n8j5J9k3M2q6K5L0j4N2Q
$$ plain form
3068 47 20 16 58 9 -20 14 -24 -11 -16 29 25 38 -8 3 22 -4 17 -7 -14 32 1 -59 36 1 36 37 -19 -27 0 -29 20 -17 25
3101 25 10 -20 1 3 -9 -19 11 31 14 -4 -40 90 -15 13 21 -5 23 4 58 -19 25 11 -19 -32 -10 7 62 -10 7 -34
3131 -34 -2 -25 -15 -23 -17 -14 33 -21 11 -23 -32 0 -28 -9 -10 -5 -2 22 23 -26 -20 -3 -23 -12 -37 -29 15 32 15 32 -4 19 37 -20 1
3166 1 23 -14 36 21 16 37 20 29 -1 -33 32 0 -19 52 -44 26 -15 33 -5 -22 25 -1 -18 -36 60 24 2 20 31 -12 -37 7
3198 7 -41 -53 -22 5 32 45 5 -10 -26 28 -10 -37 -3 12 -39 3 64 -40 62 17 -19 -9 39 1 -38 -32 23 -1 21 33
3228 33 49 67 -15 -1 -43 -4 -46 4 -20 -11 10 43 17 -6 24 16 33 -31 -22 -14 11 31 -1 -4 28 34 5 -31 27 -11 -9 -34 -11 30
3262 30 -5 50 -18 -16 -21 3 -18 -20 -26 -26 21 43 0 12 -71 16 -34 7 15 -17 20 -28 6 -22 24 -15 1 -13 -37 16 -45 56 4
3295 4 -14 13 23 9 2 33 -22 -23 0 -8 46 -18 17 -20 -12 6 -22 -37 2 -32 4 28 0 10 -16 -16 28 -24 12 18 -9 -11 -11 27 -27
$$ packed form
3068D7k7mM2m9k9L4l8J3nM5mJ3m6J1J9k6K1k4pM6l1o0R5l5L5Jn6qK7k9M9l7M2
3101B5j5l0K1Kj2j0L0K0j7j8l6J30j05K8Qk6K8j9N4p7M4j4l0j3K2J7N5p2J7m1
3131c4L2k3J0qOLM7n4L2l4rL2k8J9jNLK4Jm9OJ7k0J1k5QM4J7j7J7l6K3J8n7K1
3166AK2l7N0j5nK1j7Rl0l2O5l2j9P1r6P0m1M8l8j7M7k6j7j8R6l6k2J8J1m3k5M4
3198Gm8j2L1K7K7J3m0j5j6N4l8k7L4J5n1M2O1j04J02m5l6J0M8l8l9ON5k4K2J2
3228C3J6J8q2J4m2L9m2N0k4RK1L3k6k3L0qJ7o4RQK5K0l2lL2Ok9l6N8l8Kk5K3M1
3262C0l5N5o8KnK4k1ko%M7K2m3J2q3Q7n0M1Ql2L7m8L4k8M6l9J6j4k4N3o1J01n2
3295Dj8K7J0j4pL1n5jK3qN4o4L5l7QJ8k8j5L9l4L6K4k8J0k6%M4n2L6Ok7k%L8n4
$$ plain form
3330 -27 -23 -36 40 -10 56 34 -10 9 33 2 -20 0 18 23 25 -3 -39 -19 58 -15 -1 32 -2 5 5 4 -25 0 -10 -6 -18 -22 -3 -1 30
3365 30 -3 -7 -16 -10 12 -8 -5 30 -3 -36 -11 8 10 26 -9 48 -51 -15 0 2 8 -28 33 -1 23 -4 -31 -27 -39 -25 43 -7 -37 -32 -1
3400 -1 12 -7 18 14 44 -22 27 2 -11 37 18 23 -24 -18 7 -3 12 -55 1 -37 -12 16 -12 0 37 -44 -3 44 -55 15 13 7 13 25
3434 25 -4 34 -9 14 -57 -37 -5 -43 35 1 38 8 -34 -28 -19 4 -36 14 10 12 30 0 26 23 46 -16 -23 -49 -42 5 -39 26 11 24
3468 24 -8 13 30 15 1 -75 17 -57 -18 25 11 5 5 9 -7 -58 3 18 -3 25 -38 -6 20 -6 18 -17 -17 -29 -12 -22 -7 4
3500 4 18 19 -32 -17 -23 -9 22 13 28 -10 -31 -26 50 -15 0 2 0 -12 -13 -38 -6 39 -27 58 23 -4 18 -39 28 17 -13 -3 26 -2
3534 -2 -49 16 27 2 16 -36 83 23 28 32 -18 24 -15 -18 14 22 0 22 2 -13 27 -11 -10 -15 -5 52 29 -43 -3 2 -7 -5 7 -49 -10
3569 -10 -24 -25 17 14 -6 -1 26 7 29 0 -8 19 9 -10 10 -4 -25 -8 -7 -25 -28 15 -12 35 10 -30 -20 -32 -8 -12 -6 16 -43 30
$$ packed form
3330b7Mj3P6n0O6k2m4J9K4l1k2K0J8NKk8l6K0P7p3J4L3l4P%jk9K5j0Mj2mJ9KL1
3365C0l3mrOK2k0LL5l3l3K5J9KJ6l5N7r9L6J5KOl6O1l4K4k7k7Mj2J4O8n0l0NL1
3400aJ3j9K5mL0o6M9k5j3M8j9Nm7OK5j0J5o7N6l8K5K8k8J2L7q1M1M7r9P0koOJ2
3434B5k9L8m3K3p1K0L2l8P8l4L7l0m2ORK3m0N0mKJ8l0K6lK3o2pk6PM7m4O5j5J3
3468B4l2K1J7j5j4p6R2p4L9M3j4o%Mj6n1O1J5k1K8o3L2K6k6K4l5%j2J7j0J5J1
3500DJ4Jn1J5oJ4L1rJ5l8k1NP6o5J5Kkj2jk5L2M5o6Q5l5k7K2n7O7j1l0J0K9k8
3534bm7O5J1k5J4n2J19o0NMn0M2l9lL2Qk2K2k0j5M0l8JnJ0N7k3p2M0NrKJ2n6L9
3569a0j4jM2lk0NK7j9K2k9qK7j0j9K0j4k1J7Jj8lM3k7M7k5m0J0j2K4mOK2n9P3
$$ plain form
3603 30 2 35 7 3 -44 -8 3 11 50 -24 21 -15 -36 24 -10 25 -48 -24 20 3 0 -67 -31 -36 34 -16 -7 49 27 7 -11 12 -34
3636 -34 -12 14 14 0 -4 19 -2 45 34 -14 2 -40 6 -11 16 28 46 -12 34 -32 -3 31 -28 7 73 17 -26 -1 -10 10 -11 14
3668 14 -11 31 -9 8 18 4 42 -2 30 16 -37 5 32 4 -3 -15 23 18 20 -45 -6 -13 -7 -42 -40 19 3 -10 23 -15 46 0 13
3701 13 -41 43 33 -4 -23 -21 34 35 42 -31 -27 41 26 -24 -20 40 -32 -13 20 6 -14 -3 -30 4 14 23 41 -23 -16 -28 -7 0 14 -31
3735 -31 -17 14 55 14 4 -6 -25 -21 -72 -7 -3 -21 42 -18 13 -7 10 21 9 -8 -33 0 -14 -41 29 31 51 -27 39 13 -13 53
3767 53 -7 -12 10 -40 23 29 16 16 43 -15 -26 14 -4 14 -7 24 5 18 29 5 51 -9 4 27 13 2 7 23 24 28 1 37 34 31
3801 31 16 -32 -4 19 5 -30 -14 21 9 -17 -32 11 11 16 -10 -54 7 21 -20 42 18 39 6 31 -27 -6 36 3 42 -25 31
3832 31 -6 24 -9 -75 -31 -12 9 -11 -2 -8 -13 -8 -4 30 16 -27 12 0 14 1 2 19 -31 -9 26 10 -38 -31 -26 -7 49 -19 59 10
$$ packed form
3603C0k8L3k8mm7L6J1QL9p4M5l6k1O0l4L5p3K4M4j7lo7L6nP0n0RN6k2k0j8K3m6
3636c4K2K6%j4mK3k1M7j1m8J6m2M6j7K7J2J8n8M6o6K9L4n9L5O6n6m3K5rK0k1K5
3668A4k5M2m0J7J0j4L8m4L2j4n3M2K7k8pj2L8nKo5L9pOl5KN9j6j3L3l8O1m6J3
3701A3n4Q4j0l7j9KN5JPp3MO8j5n0MO0p2J9L3j4k0J1k7L4J0RJ8o4Pj2K1PJ4m5
3735c1J4L1M1m1j0j0j9Mn1O5Mj8O3o0L1k0J7J1j2j7k5L3j4k7P0KK0p8O6k6k6O6
3767E3o0nK2n0O3Oj3%K7n8j1M0j8J8k1L1j9J3J1k4M6o0J3K3j4j1NJ6JMk7L6ll
3801C1j5m8K8K3j4l5J6L5j2k6j5M3%Nk6m4O1J4m1O2k4K1l3K5n8K1M2l3L9o7N6
3832C1l7L0l3o6M4J9K1k0RonNML4j4m3L9j2J4j3JJ7n0K2L5j6m8PNJ9N6o8P8m9
$$ plain form
3866 10 -4 -2 10 61 41 -4 32 -13 16 -6 4 13 -37 11 -1 24 29 49 30 24 0 -3 -21 -12 43 -12 -23 7 25 -13 8 35 4
3899 4 -10 37 -12 -4 3 18 -20 -2 30 -40 13 -2 -6 19 -14 29 -4 -25 -12 35 12 37 13 38 -6 -19 -13 -19 -5 -22 -44 -18 10
3932 10 1 20 -23 18 4 6 17 22 6 -28 -11 -12 -25 -27 -1 30 -3 3 -5 21 9 -5 10 13 -15 16 -12 -13 3 28 -16 33 41 -12 10
3967 10 -23 -5 -9 15 3 20 -21 -66 -2 -45 9 -7 -2 45 7 1 -17 -1 -5 5 -11 11 14 2 -12 23 13 -13 -2 -5 -17 0 -1 -23
4001 -23 -6 -19 8 -34 25 42 7 -3 -5 -49 28 -6 -16 19 -1 23 -21 -21 50 -56 -25 1 -25 36 -31 2 -17 17 82 19 6
4032 6 2 52 -24 -17 50 -16 -27 15 24 8 26 -33 -18 -17 28 10 -31 50 9 -28 -3 -11 -43 15 5 -6 -4 1 -5 11 32 11 8 -3 -24
4067 -24 -8 -51 41 24 -30 -22 -22 19 10 -28 -21 -1 -4 -40 10 0 18 20 31 -10 1 3 15 -7 -4 15 39 -16 27 -16 27 -9 -19 -6
4101 -6 -15 -24 -32 57 -40 30 11 -6 -6 -3 10 21 -13 -50 16 -5 20 -7 -10 -15 0 20 -12 -3 -33 -30 20 -2 -33 6 -40 -44 -13 -23 26 0
$$ packed form
3866A0j4KJ2N1k0m5L6m5K9k2J0Rn0M8j2K5NK0j9ok4lj8RN5n5j1L0J8l8K1K7l1
3899Dj4M7m9QPJ5l8J8L2p0N3j5mK5l3M3l3k1J3M7k3K5k4K5m4j3OoJ4j7k2K6K8
3932A0rJ9m3M1j4KJ1Nj6l4J7jj3kK6L1l3OqK6j2j4J5Lk8L1k8jJ6K5m4M9Qn3K2
3967A0l3J8mK4j2J7m1m5O4m3N4j6NM7l8oj8J6mJ0j6K2Lj2j4L5j0k6J1lj2J7jk2
4001b3J7j3K7m2N9J7l5j0km4P7l4j0L5k0K4m4%P1j06L1K6k6O1o7L3j9L4O5o3j3
4032FmN0p6PO7o6j1M2Rj6J8n9J5JM5j8m1Q1m1l7K5ql2N8j0j1KNoJ6K1k1lj1k1
4067b4J6m3R2j7n4Q%M1rl8PK0ll6N0j0J8KJ1m1J1KJ2k2LJ9K4n5M3m3M3l6j0J3
4101frrqQ9r7P0j9j7%LJ3J1l4l7O6k1K5k7lnJ5K0l2Rl0LN0k2l1L9m6mL1j0M9k6
$$ plain form
4137 0 13 22 8 0 -34 -31 -15 -35 -1 19 29 26 7 -17 -11 -53 -27 -25 -30 49 -11 -10 -35 5 -27 -23 -38 -38 21 -1 19 -38 -37 -66 -16 -10 -9
4174 -9 24 5 3 32 -17 10 -28 15 -38 18 -1 -47 22 -8 5 10 -25 5 31 40 15 -29 18 -24 47 -14 16 33 -2 1 5 -27 -13
4207 -13 17 -21 -4 5 0 24 10 32 20 -31 35 21 8 -2 24 -33 -12 -11 12 -12 -53 3 13 -17 -2 -6 11 -15 -25 13 15 12 -21
4240 -21 -13 26 14 -13 23 36 -11 6 15 -19 10 -19 4 18 4 -3 38 14 26 -2 9 -13 16 -21 11 38 4 -18 43 49 -23 43
4272 43 -11 -20 -13 30 -13 2 -32 -63 -51 -20 -1 -25 -9 37 -5 0 10 10 29 -35 3 -8 25 1 -17 6 -33 38 6 2 -10 -10 -12 -3
4306 -3 54 7 2 -17 -20 -7 23 33 0 -1 21 11 9 43 13 -10 32 18 -7 15 -28 31 7 -8 38 -12 6 -31 6 -2 -18 22 -31
4339 -31 1 38 -25 6 -34 12 2 1 -36 11 7 -11 -9 -22 9 9 0 23 29 -17 -25 51 -5 -10 -2 -25 6 -38 9 -25 27 -1 -8 -26 -33 38
4375 38 -6 -13 8 27 5 -12 13 -20 -11 19 29 14 18 -8 4 -29 12 9 -51 -10 -13 0 9 8 8 55 26 5 -18 6 19 9 -22 -19 -11
$$ packed form
4137@J3Rj4ql4LJ6k0L4K0J0lj9k4Om2K6KnP9o0Jk5M0l2Mj5%N9k2K0n7Jk9N0OJ
4174iL3j9kK9m9K7l8M3n3N6j9m6O9l0J3Nl5L0K6Rk5m4M7m2P1o1L0J7l5LMl2J4
4207a3L0l8J7RnK4j4K2j2n1O6j4j3j0K6n7K1JK3k4m1N6J0l0J5mJ7k6j0L8Kll3
4240b1QL9j2k7L6J3m7J7Rl4K9k9K3J4j4pM1k4J2k8J1k2K9l7L2K7l4k2O1Op2O6
4272D3n4rPM3m3J5l4l1J2L1J9k4J6M6m2NJ0%J9o4L8j1L3k4j8K3l9P1l2mj2%kR
4306cN7m7nj9lJ3L0J0l3jK2j0kL4l0k3M2j4k5K2m3N9k4j5M6n0J8l7L7qj6M0n3
4339c1L2L7o3L1m0M6j0jl7M7mj8Kj3L1%rK3Om6qP6n6nQk3L1m4M7l4N2k8pj8pP1
4375C8m4pK1J9k2j7K5l3RL0J0j5Mk6J2l3M1lo0M1lJ3Rj%M7k9k1k3K4J3j0l1LQ
$$ plain form
4410 -11 12 20 10 -3 -2 13 50 30 -12 -7 -15 9 -55 -1 15 5 -6 23 -11 16 17 -12 -14 5 -35 -31 -33 -1 12 11 2 -2 4 10 28 18 1
4447 1 1 -29 -21 8 -3 -5 -19 -31 21 28 -28 12 19 14 -3 6 12 -26 -37 8 -27 27 5 17 -5 -3 45 30 -51 13 39 -17 51 34 53
4482 53 12 6 18 33 9 -62 -29 -3 6 27 -2 25 -2 -40 58 18 35 17 -2 -6 -14 33 21 31 20 18 -1 8 34 29 7 12 -29 -20 -5
4517 -5 -15 9 -23 6 -53 18 31 -29 16 -36 -3 1 18 37 9 -9 -24 31 -19 2 -22 19 29 -3 -2 -8 37 -7 -12 7 -42 26 -21
4550 -21 8 25 -8 4 9 34 -23 -16 7 -12 9 19 32 -14 10 -33 -27 -1 -19 12 5 27 -12 -64 5 7 13 -40 29 17 29 20 26 5
4584 5 -30 3 32 7 8 -25 40 36 -27 40 8 57 2 -1 5 -11 16 -21 -14 18 -25 -14 -39 55 -12 7 2 -32 35 -5 15 -22 -2 -27
4618 -27 -23 28 9 23 1 98 -14 0 1 -14 54 18 -36 3 24 -15 -22 8 -3 8 20 -7 11 -24 -18 -16 43 33 -12 11 32 -4
4650 -4 5 21 -8 22 1 -13 30 -28 2 4 4 13 -7 -9 -6 39 -29 8 32 21 62 11 17 22 17 1 -15 3 4 16 21 -7 -35 29 -1 24
$$ packed form
4410a1K3Qj0j3JJ5L7k0m2NqK4o4N4J6j0j1K9l4K7Jk9kJ9m0MkL2J3jrmOOJ8j0j7
4447A%l0QK9j1kj4j2N2Pn6M0Pnj7ROl8j1M5l5N4k2J2k2KM8j5q1O4K6n6O8j7J9
4482E3m1oJ2J5k4p1L3K6RK1k9K7k7l8R8m0J7j8j9mqM7j2J0j1kj9RK6nk2Nm1RJ5
4517ej0K4l2K9n9P1J3o0M5n2L3MJ7J9k8j8j5N5n0K1k4M1J0l2JoM5m4nJ9m9O8m7
4550b1K9J7l3J2NK5n7PK3j9K1J0J3m6K4m3OK6j8L1pK2l9n2O9KOn3O9j2J2rOk1
4584El5L3K9k5Jl3O5mo3O7l2M9n5lOj6K7l7PL2m3J1k5R4o7J9nl4O7m0K0l7K0k5
4618b7MN1j9J4k2R7j12J4Jj5O8l6n4L9K1l9pL0j1J1J2k7J8l5OKN9j0m5K3K1l6
4650dRJ6k9L0k1j4M3n8L0K%Rk0kLM5o8L7K4j1M1n1ONnj6j6J8JJ2Nk8k8O4l0K5
$$ plain form
4686 24 -45 -4 5 -22 20 34 -5 20 16 -13 -21 42 10 7 3 2 -15 57 5 17 11 11 -6 -8 22 14 -11 -2 4 -5 -47 -41 -6 -20 6 2 19 -38
4724 -38 24 7 -52 1 0 -29 -19 30 -10 -14 -2 -39 -7 0 -18 -38 6 -3 24 5 -18 30 -18 30 12 -17 -9 5 -3 4 17 -6 -3 -6 -5
4759 -5 -6 0 -13 -11 47 15 -24 -4 29 5 28 9 -35 22 2 -2 -20 57 -9 13 -9 -22 28 8 26 18 35 4 59 4 -2 -23 -8 25
4793 25 25 -28 -21 -43 14 -16 35 33 -31 -30 -5 -19 -19 -11 -21 -28 6 -10 -21 20 8 12 -4 7 34 -15 -1 36 -22 19 14 53 4 -1 32
4828 32 -42 -16 -14 -20 1 -2 32 8 -23 2 23 47 52 -9 13 5 -9 -29 9 13 -8 -23 -7 6 3 -13 24 12 -8 -27 -8 40 -15 15
4862 15 -63 4 4 -29 9 -28 -10 -7 -12 -10 26 -3 -39 4 5 48 15 -10 -16 -8 -21 -22 9 17 10 -25 -3 -9 -12 52 12 11 -24 47 43 10 18 27
4900 27 22 -23 35 14 -46 -15 -16 -24 -3 15 11 17 12 21 18 -15 -21 19 25 14 3 -11 10 -11 31 20 25 -41 3 58 -21 38 -27 -31 12 -12
4936 -12 7 16 21 -26 -32 -6 -12 -16 -16 17 31 -3 5 14 20 11 -17 -10 7 32 8 -29 11 -3 13 -5 -28 49 -1 -31 2 8 30 33 -23 -19 -27 -20
$$ packed form
4686B4o9M1Rk7M2J4l9K5mk9qO3l2lmjj7P2n2J2o%j7kL0qk5ROrm2OL5j4K6mJ7n7
4724c8O2j7n9N3jk9J0M9m0mJ2l7L2Pj8k0M4rK7j9k3M8m8M8j8k9QJ4qPJ3k3LlJ
4759ejOj3KN8l2l9K0L3k4K3j9m4N7k0mj8P7o6K2k2j3N0k0J8qJ7l1N5n5ok1J5L3
4793B5%n3Pk2N7l0N1ko4JK5j4%Qj0pL4j6j1M1j2Mj6J1K7m9J4L7n8M1nL9m9nL3
4828C2p4K6KoK1lL4k4l1K5K1K4No1K2qj4k0L8Mk1j5J6J3lj6L7j2k0j9J9M8n5L0
4862A5p8O7%l3L8l7J8LnKL6k9l6M3JM3l3k5oQj3jL1Qpl5K2olO4m0jl5P1ml3QR
4900B7nm5N8k1o0L1jqK1J8mOnRll3oM0Oj1j1j4K1k1M2j1No6M4N5p9N9o5mM3k4
4936a2J9RNm7oK6om%L3J4l4QROrk8PJ7K5k4l7M0j4J6j8k3P7n0l0L3OK2Ln6MqP
$$ plain form
4974 -20 5 4 -29 -26 22 -45 2 10 26 24 -2 4 4 -6 14 -13 22 -11 22 6 25 -6 -85 70 -14 14 -21 25 -43 -9 23 -21 -12
5007 -12 1 40 -22 6 48 7 -19 -58 34 23 15 10 -29 -30 -5 26 -16 36 33 34 -20 17 -28 -23 1 -23 24 -42 0 -6 8 7 -26 8
5041 8 20 18 -9 -35 65 66 -19 4 49 -19 -27 -1 41 -1 4 18 13 8 -36 25 4 34 36 -13 15 6 -43 -26 6 16 -48 15 8 -11 -3
5076 -3 18 27 -25 28 17 29 21 -8 -8 -12 14 -2 18 -27 -21 -47 -37 1 -53 25 15 -10 48 20 -10 -24 7 -7 23 -33 -27 2 -25 6
5110 6 -24 -17 -21 -33 -8 -41 17 -20 16 18 -17 -19 -14 8 -1 -37 -24 5 -9 39 36 2 5 31 17 -10 -20 -5 33 -14 25 9 -13 -18 -50
5145 -50 4 -9 15 16 -38 14 -3 43 -14 -18 32 15 3 4 -43 -43 42 -28 7 37 -5 30 -23 19 11 36 16 15 25 -24 33 30 -12 -1
5179 -1 -25 -31 -62 -2 -10 39 39 42 17 -30 -13 -49 9 13 5 40 -29 3 -4 -27 -30 -15 -24 -37 -9 -40 -20 10 -89 8 4 6 -33 -21 -40 -8
5215 -8 -15 -24 4 13 11 -15 -25 31 -68 -23 1 45 14 24 14 -3 -2 33 -5 31 -6 -20 -17 26 -36 -15 -1 -18 4 0 17 7 -2 -12 50
$$ packed form
4974b0K5jl3LM8o7M7QJ6kk6O%j0K0k7L5l3L3j6J9l1p9J55q4K8l5M6o8L4L2m4R
5007a2J3L9o2K8M2m1k6l9R2j1qnl9jK5L1m2N2lJn4L7m5NK4k4M7o6M2oJ4jl3L4
5041HJ2kk7k6J00Jq5K3M5o8qK6M2m2NJ4nnm4O1k1L0Km9K8rm9J7L2J0o4O3pj9Q
5076cK1Rn2N3j1J2qk9%mK6j6K0m5Ok6J0L8n4P8j0k5N8k8l0j4L1j4L0n6OK9k7L1
5110Fl0Pmj2K5l3N8l7L6Kl5kNK2rl6J3K9j4M8ll4LK6j4k7j0J5L8m7L9j6k2nl2
5145e0N4j3K4Jn4N2j7M6n7mN0j7j2Jm7%Q5p0L5L0m2L5n3M2qK5k0jJ0m9N7lm2J1
5179ak4ol1O0qM9%Lk5m7J7l6N8MqL5o9L2pk3lJ5rj3K8l1K0L0r9R7mKl9J2j9L2
5215hprK8Rkk6j0N6r9M5K4M4l1J0j0j7JL5l8L6l7j4LM3o2K1J4j7K2mJ7j0rj0O2
$$ plain form
5250 50 5 4 15 -14 -1 52 6 0 -16 -16 15 -33 -43 -20 -9 -15 -6 2 -27 20 -5 9 -8 -43 7 -4 0 -2 8 -32 -19 22 -16 -12 -15
5285 -15 29 -10 -2 27 15 8 -13 -7 -23 -7 -14 -24 21 -13 -1 13 10 13 -51 -21 -5 15 -28 23 -2 -2 41 -2 5 -26 -7 2 -18 12 4
5320 4 -16 35 -1 13 34 -7 43 -27 -34 8 32 4 -27 26 -21 -29 23 3 0 8 -12 -2 -20 -23 -10 -7 -17 22 20 -16 -23 -3 38 7 -32
5355 -32 -58 -41 0 -24 -5 29 50 16 23 13 25 -7 -5 -13 -3 -8 -19 16 -49 14 -21 -28 -14 8 -5 24 -9 -64 -2 -4 -26 -28 12 -52
5389 -52 -25 6 21 -7 16 -51 -24 25 16 -19 0 37 44 -38 14 14 -17 -24 -11 -11 15 -37 40 -40 35 19 4 17 0 -35 0 15 -12
5422 -12 12 -19 6 -25 -15 -31 1 -23 2 24 20 -45 -5 10 -21 0 24 11 36 23 -10 -7 8 -19 -36 -52 0 -30 21 -3 -37
5453 -37 -25 -26 2 -26 12 6 4 -66 16 -20 12 -1 1 -42 12 -37 17 4 -2 11 -1 7 -26 -2 -19 14 -15 8 20 -23 -8 -10 -22 -2
5487 -2 20 29 -45 -3 -6 -18 14 3 7 -5 -12 -27 -45 10 7 37 -64 59 -27 0 -36 12 -4 -30 -23 -13 -37 -7 -30 34 -58 30 48
$$ packed form
5250E0m5jJ1k9J3N3m6oj6%L1m8j0K3J1oRQk9M7k5J4j7l5N0j1MkJ0m0J3M1l8Ml
5285a5M4l9QK9j2pk1Oj6J6pj0M5l4J2J4lLo4L0J6K0m3N1k5%M3m3Pl1J9Rk0L0q
5320Dk0N1l6J4K1m1N0p0pM2K4k8l1N3m7qN2k0lQk0J0j8lJ3Lj0L9kl6pK0M1l1l9
5355c2k6J7M1k4J9L4K1l4Pj0J2l2KqJ0nj1L5o5O3l5pJ4K2j3K9l3n5O2kk2kM0o4
5389e2K7L1J5k8K3o7K7M9rl5J9L7Pq2N2%l1pJ3%K6n2P7q0P5j6j5J3j7l5L5J5k7
5422a2K4l1K5l1J0j6L2k4K5K2mo5M0J5l1K1K4j3K5j3l3LJ5k7j7j6N2l0N1k4l4
5453c7J2jK8k8L8okp0Q2l6L2j3Km3N4m9N4j3oJ3j2Ql3K4j7L3k9K3J2m3J5kj2K0
5487bK2Rp4M2lj2L2j1Mj2pj5j8N5lL0j01J23q6K7l6M8j6k6PJ0k4L0k3O4r2Q8J8
$$ plain form
5520 48 8 -8 -48 40 -23 10 39 31 -15 -9 5 -7 -24 -8 -48 -9 -12 -23 -4 4 -28 -32 16 -55 -7 -50 16 -18 -38 0 -4 45 -62
5553 -62 25 -38 10 -28 15 15 36 5 -12 5 -32 14 10 -28 -19 20 46 40 11 -8 -32 41 12 -38 -5 30 -40 10 18 -10 -37 22 -9
5586 -9 4 -18 15 -22 -26 23 38 20 1 30 -2 -5 2 22 -21 -37 27 26 -34 3 4 -39 -12 -16 -3 -41 -3 -5 -19 28 -37 23 10 36
5620 36 -10 14 24 15 -8 -6 20 -35 -34 -6 -29 33 -2 -14 -8 -22 5 -10 -9 -23 -10 41 -28 9 32 -1 2 -32 -5 12 0 -9 9 -24
5654 -24 22 -36 -5 28 1 -29 11 21 -7 19 26 39 4 -6 77 -1 9 4 6 -24 -11 1 6 7 9 40 -12 5 40 15 -2 7 -5 26
5688 26 33 16 30 10 17 -16 0 20 3 -24 6 -21 6 -23 42 -27 11 15 7 7 45 -21 0 27 16 61 -22 -35 17 26 25 27 27 3 5
5723 5 -4 -4 14 -15 -18 10 1 30 11 -3 -52 -15 38 -2 13 -27 29 26 44 11 -27 -19 -20 -38 47 -29 16 -4 18 -38 -4 -25 21 -20
5757 -20 -67 14 -12 5 29 12 -11 -17 17 39 34 6 -15 71 0 30 -25 2 -8 -18 3 3 30 -65 9 39 2 10 9 -21 7 -19 -9
$$ packed form
5520D8m0j6m0Q8o3L3K9qm6OJ4j2j7J6m0L9lj1J9Ql2mM8p1M8m3O6l4k0L8mM9j07
5553f2Q7o3M8l8M3%K1l1j7J7l7M6ml8RL9K6ok9j9k4P3k9n0L3L5p0N0Qk8k7N9l1
5586iJ3k2L3l7mM9J5j8j9K9l2lPK0m3j6O4jo0L7Jm3K7mJ3l8L8kj4M7o5O0j3K6
5620C6m6K4J0rk3KK6n5JK8k3O2l5j2Oj4K7j5Jj4J3N1o9L7K3l3Ll4K7J7j2rJ8l3
5654b4M6n8L1L3k7l0M0J0k8K6PJ3l5j0Q3p8J0nKl0J3J2NJKL1n2J7L5k5j7Rj2L1
5688B6Pj7J4k0Pl3J6K0j7k7L0k7K7k9O5o9L8Mq%L8o6K1K7j1M5q3j3N2RjK%k4K
5723Er%J8k9lK8rK9j9j4m9L7N3m0J5m0N6lJ8l3l8Qjj8Q5p6M5k0K2n6L4k1M6m1
5757b0m7Q1k6J7K4j7k3oL4K2nk8k1Q6p1L0n5K7j0j0K1%K7r5P4L0l7Qjl0K8k6J0
$$ plain form
5790 -9 -8 7 7 17 -9 -19 7 -25 14 23 14 -6 -4 -6 -1 35 26 14 12 35 1 -5 -9 -21 -1 -14 36 -17 24 33 3 40 -8 6 -17 46 28
5827 28 -31 -11 -1 6 -27 3 27 -23 25 13 32 -14 -5 1 14 5 -6 17 -32 13 -11 14 -1 12 -8 -6 29 -16 11 22 14 12 -16 16
5861 16 -45 -9 41 30 -13 -14 -26 -23 19 -1 15 -29 -9 -37 -5 42 25 -22 -28 16 19 9 -19 -49 -14 6 35 28 9 -14 -4 14 29
5894 29 -16 10 -2 23 34 14 -6 36 -19 27 44 -9 51 11 14 55 -42 22 -22 26 -14 -19 -45 10 -25 -13 18 9 11 -39 2 9 53
5927 53 27 5 -5 11 20 -36 -16 -10 23 18 -17 44 5 36 -9 1 -4 27 28 -15 -39 -26 32 22 -32 15 36 -2 38 -15 -16 6 14 36
5961 36 -13 -18 -3 -17 12 19 -2 6 -2 -45 -29 15 -7 -27 -25 -32 -47 22 1 -14 2 -21 -5 -33 7 -4 -31 19 1 4 9 14 9 -20 -20 -8
5997 -8 16 -14 9 1 -19 -33 -23 -10 4 -6 -1 -4 -16 -25 -19 -30 -3 12 7 27 -20 -7 0 -25 29 -10 -15 8 -6 -46 -19 -37 -11 23 -24
6032 -24 22 8 30 28 -7 50 -39 -10 1 -18 -38 -28 1 -17 9 40 10 -21 21 -18 15 -49 8 -19 -41 -33 15 29 -34 18 22 17
$$ packed form
5790iJJ5%J0k6j0K6l2L9Rrk0KkNL6rj2kK3l4omj2K0j3N0n3M1Rl0L7m8J4k3O3j8
5827B8n9K0J0Pl3L0K4n0M8j2J9m6ROJ3rj1K3m9M5k4K5j5J3k0KL5m5K7J1qkk8L2
5861A6o1L6N0j1m3jj2LM2k0J6m4K0k8L2M7j7m7oM4Lj0k8l0L5K0K9pj9k3J0J8J5
5894B9m5K6j2K5J1k0k0M2n5M6J7n3O0m0LM1r7O4m4M8m0nk6N5l5J2L1rKn0M1PM4
5927E3k6k2j0J6Rn6K0OL3nl5O1l9L1m5J0nL1Jm3k4J3N8j0n4M7K1l8M0n3jK2QK2
5961C6m9nJ5j4K9Pk1Qqm3J6M4k2k0Kpj5O9k1j5J6k3J6k8M0j1k7N0j8LNNnk9%J2
5997hK4l0K3qk0j4J0J3J4j0Nlj2rOj1K7J5nK0m7J3Pk5N4l9nK3j4m0K7j8K6L4m7
6032b4M6j4K2kl5N7q9K9J1j9k0J0K9j8K6L1l0l1M2l9L3o4N7k7k2QM8J4o3N2Mn
$$ plain form
6064 17 -11 15 3 9 16 37 -12 2 21 -9 -11 -11 15 19 -4 -44 -12 -46 -11 -72 15 -13 0 -21 -39 -8 -15 2 26 -9 -3 12 37 -41
6098 -41 -20 10 7 -31 -8 -25 -16 45 6 21 5 -19 31 7 2 -46 -16 -25 7 17 -16 2 10 25 -20 -38 -21 -37 14 5 26 -31 30
6131 30 -21 15 -6 -14 -4 -38 -11 5 14 -37 0 -7 -12 -11 -37 -7 11 15 -34 -13 38 24 -30 -17 10 0 17 32 28 -33 -25 4 22 21 -16
6166 -16 15 23 -1 20 -7 5 6 1 -4 -83 -8 -12 4 -30 -21 -15 -32 -12 -5 -17 -58 -20 5 25 0 22 7 -27 -3 35 4 20 -11 -12 14
6201 14 7 0 3 -3 -23 29 -14 0 14 -27 18 4 6 15 1 4 14 -52 -13 -4 19 -27 26 18 -6 -12 -15 -9 -17 -12 -15 8 2 28 48 -6 9 -19
6239 -19 1 29 -17 45 12 -34 7 6 -6 -3 -30 31 -14 -38 -11 -29 -25 19 -42 -4 -20 -5 13 8 18 0 50 32 33 5 7 -27 -30 28
6273 28 40 -15 11 -37 53 -28 10 9 15 -53 -3 -5 -29 18 -20 -3 2 44 39 -32 -3 0 -32 -17 -35 34 53 31 -31 12 22 18 5 28
6307 28 13 -18 8 6 26 31 -26 26 1 14 21 -1 28 -6 -43 12 -40 -22 -30 -45 -20 -18 17 11 22 16 -8 -43 -11 1 -2 -38 18 -12
$$ packed form
6064A7k8K6j2OPK1m9J4J9l0k%K6Mk3m0L2l4L5o1Q7k8J3k1j8L1pJ7K4l5OJ5K5p8
6098d1K1L0ll8K3j7RO1l9J5j6k4N0k4nm8L0rL2J0l3J8QJ5m5j8J7j6N1rK1n7O1
6131C0n1L6k1qJ0l4K7J6Rn1L7pnJk6L0J8Mm9K1N1j4n4J3K7j0J7J5mo1QK9J8jl7
6166a6L1Qk4K1k7J2Jnnp9P5mJ6l4ROj7K0Pj2m1L8K5K0k5K2j5l4K4L8l1J6l1jK6
6201A4ppLok0N2m3J4J4m1M5j4KRj4LJ0o6L9RK3m6N3qk4olOqNlK3oK6K0n4J5k8
6239a9K0K8m6O2l3m6M1jj2Lk7O1m5k4K7j8MM4o1L8j6J5J8nJ0j8N0j8Jk8Kl4lN8
6273B8J2n5K6m8R0q1L8jOo8N0kk4M7l8J7NM2np1K9Ll2J5j8O9J9k2o2M3J0mj3K3
6307B8j5l1K6kK0Nn7N2k5J3Pk2K9l4l7N5n2J8qj5K5KL5oJ1ok4l5L2J2ll6N6l0
$$ plain form
6341 -12 -24 11 49 7 -8 29 18 10 13 -25 -1 25 28 -30 24 -2 46 51 -3 13 13 6 -14 1 29 7 6 1 7 -22 -53 2 22 16 44
6376 44 31 21 -33 17 -18 5 36 7 -16 -14 -27 -10 6 2 -28 1 -6 -15 -14 1 -27 58 -13 36 26 -4 -47 -16 23 -45 -18 -15 10
6409 10 -2 -12 31 -17 -14 -1 12 -2 -38 -1 22 8 -36 -2 -5 24 28 -18 10 5 -40 -14 -14 18 -6 -24 49 53 20 -41 4 4 -14 9
6443 9 6 -19 -38 29 -24 -10 -40 3 7 11 65 -7 19 -35 -17 14 -28 20 23 20 -15 8 -20 -10 15 12 24 -25 14 13 -31 -19 -3 46
6477 46 19 -16 10 -40 7 35 13 10 -48 10 -26 18 32 37 27 31 -7 -40 11 -18 13 8 68 12 32 14 7 9 5 14 27 59 -36 -1
6511 -1 20 -17 -17 37 15 -11 46 -30 21 -9 27 6 2 3 -14 2 7 -26 -30 -5 13 -8 43 -35 -1 25 0 3 19 11 7 11 -39 4 -23
6546 -23 -56 -14 10 17 -3 -12 35 -29 2 -37 43 -2 -16 18 3 1 -12 -3 11 -16 -4 -11 20 -33 -23 -11 -4 10 -3 29 -37 12 -27
6579 -27 44 38 33 -17 -11 4 -29 28 59 -2 14 5 6 -6 33 -24 12 11 25 -2 47 -5 -12 25 18 28 -32 23 43 36 35 -23 -12 -28 24
$$ packed form
6341a2j2L5L8m2j5L7j1qLl8K4K6Ln8N4k6M8Nn4J6%pk0J5K8k2jnOk9l1N5K0oK8
6376D4j3j0n4N0l5K3L1k9k3Kj3J7J6ml0K9prJJ5k8Q5p1M9j0l0m3L1L9o8K7LK5
6409A0j2j0M3m8LJ3J3j4l6L7K3j4m4L4lK9Mm6K8nm5K6%L2k4j8P3Ml3o1M5%j8K3
6443Ilk5j9O7n3J4l0M3MMN4p2K6n4J8L1m2M8Lll5K3k8J0K5lJ2m9L9jm4J2J6M9
6477D6k7l5K6n0M7K8k2ln8N8l6M4J4Nj0Ml8l3N1k9L1nO0n6K0j8pKmRJ3L2r5L5
6511aK1l7%N4k2k6N7p6N1l0L6k1mJj7J6Nl3mK5J8k1N1p8L4K6k5LJ6qmMn0M3k7
6546b3l3M2K4Pk0rM7o4L1l9Q0m5j4L4j5kj3RJ4k7J2pL1n3J0J2PJ4j3L2o6M9l9
6579b7P1onn0OJ5l3N7L1o1J6rJj2L9n7L6jJ4k7M9n2pL7pJ0o0N5K0pjn8J1j6N2
$$ plain form
6614 24 -11 -8 -9 -6 -43 -16 -6 -1 54 -18 -7 12 9 -2 -10 46 20 -8 0 -8 27 -25 -6 -55 -31 11 -6 -12 -13 -23 19 -15 -21 -43 -18 12
6650 12 -8 10 5 6 -9 3 3 2 27 14 26 1 8 20 18 23 6 -13 -11 -32 -41 24 9 4 -24 5 3 10 15 11 38 35 -12 7 -9 3 -22 -57
6688 -57 8 -35 -12 10 9 25 0 52 27 -32 18 -1 6 -34 36 24 -20 18 -24 22 25 24 -3 11 34 3 -18 -42 -33 -46 -7 -30 0
6721 0 -9 -12 -25 -8 -23 -14 15 62 -11 20 -28 5 -16 13 -22 -39 29 -37 -25 -17 -19 -8 -40 21 -42 -19 29 6 1 -17 37 -51 16 -7
6755 -7 -24 -3 -44 -18 11 -3 -37 -28 -16 -17 10 18 40 -8 -31 0 -9 -15 18 10 -45 -9 30 -39 2 -24 -13 29 0 -17 -25 -43 15 9 2
6790 2 39 -31 -32 1 -1 2 -8 -23 -21 10 -28 -30 -33 -17 -15 7 10 -11 30 -20 7 11 11 33 -31 32 22 -48 -15 10 -30 -22 18 -5 -13 7 18
6827 18 -20 5 -35 -4 9 -24 -2 10 -11 37 8 21 -35 53 3 10 55 10 -3 15 -13 34 -4 14 12 1 -6 -11 36 -23 58 6
6859 6 -3 33 15 19 23 -25 -13 14 11 58 4 -24 15 -6 -38 16 -6 24 33 -15 25 -18 8 17 -7 4 26 35 -2 38 -29 -12 6 -2 16
$$ packed form
6614B4l5LjLl7K7J0NN5p2J1J9lj1qN6k6k8QqL5n2J9m9K4M2j7ojj0M2l4ok2K5L0
6650A2k0J8nJj5J2%jK5j3J2k5PJ2kNj7j9Kk1rO5j5nk8K9kPNmK7lm7J9j6J2k5l5
6688e7O5m3K3K2jJ6k5N2k5n9N0j9Pm0P0j2m4L8m2M6Ljk7J4K3l1k1k4Rj3L9k3L0
6721@rlj3J7j5RK9M7p3L1m8L3k1K9l5j7O8o6J2QkJ1l2O1o3K3M8k3nj8N4q8O7k3
6755gj7K1m1K6K9j4l4RJ2jK7QK2m8k3L1roL3qn5L6L9o9M1k6J1M2k9j7qj8N8op
6790BL7p0jL3kLj0j5KL1l8klJ6KK2Lk1M1n0K7M%K2o4O3j0p0L3K5m0QM0k3qK0J1
6827A8l8K5m0L1J3l3K2J2k1M8k9J3n6Q8n0PM5m5j3J8k8M7l8J8kj1pnM7n9Q1n2
6859FrL6j8MMm8J2K7lM7n4k8L9k1l2N4k2L0Rm8M0m3K6Rk4J1K2Rl7M0o7J7J8qJ8
$$ plain form
6894 16 -14 -15 -21 -34 -11 26 2 5 52 -21 -7 -38 9 -3 28 -13 28 10 -35 20 -1 -15 7 -12 7 19 -8 22 -35 15 -23 -4
6926 -4 -53 -34 -4 -43 1 -39 2 30 -10 -11 -29 -15 -30 -8 -14 -6 17 15 8 4 0 -9 -1 32 -8 16 10 -17 -7 -13 -27 -8 12 -12 17 6
6962 6 -10 18 -1 -7 17 -7 -11 -48 9 7 6 12 -8 10 -25 -17 -32 7 -12 -11 -32 -24 25 -30 -15 11 -6 42 -28 7 -2 52 15 28 -1
6997 -1 -28 22 27 -26 3 -4 -20 -59 -41 -37 -15 13 10 2 -29 -38 -22 12 -7 -1 37 -9 16 -27 -8 26 -37 -50 -31 -13 28 -13 35 -1
7031 -1 2 -8 -12 0 -20 9 10 11 -12 -7 -17 -21 -10 42 -3 -32 -32 27 -3 -44 -38 30 6 23 28 -3 20 35 12 -22 5 -9 0 21 3 21
7067 21 -26 7 20 -3 -11 -45 20 19 -42 9 -19 -9 27 46 48 12 -7 27 7 3 16 -15 -3 -3 -16 34 -2 4 -21 8 9 24 9 -33
7101 -33 -1 6 23 21 2 -23 -21 8 -47 -6 4 -6 -11 -18 3 -4 -43 31 -8 0 12 -23 4 3 9 13 -9 -40 27 -8 -44 1 -21 -24 17 17
7137 17 -2 26 23 -10 -25 33 -12 -5 -3 -13 -1 29 33 -31 31 -20 -17 44 31 2 -25 6 -25 45 16 12 -7 -8 -7 -58 1 -23 -45 -35
$$ packed form
6894A6l0joj3K3L7k4LM7p3J4l1M7j2L1m1M1j8m5N5k1j4K2j9J9J2k7L0n7N0l8J9
6926dm9J9L0l9M4m0M1K8m0jj8J4j5K2oQK3kpmmrQL3m0K4ok7J0oj4J9K0k4K9j1
6962Fj6K8j9oK4k4ml7N7kjOk0J8l5Qj5L9j9Jk1QM9n5J5K6j7M8p0L5rN4l7J3k9
6997ak7N0Nn3K9pj6l9J8MK2K8lql1rJ6L4j9OL8m6K5m3J9L4o3j3J9J8M1m1M8l6
7031aLj0mJ2k0K9JJk3Nj0mJ1N2m5k9%N9l0m1OO8k4J7Nl1K3J5k3l4K7j4RK1j8J8
7067B1m7L3J3k3ql4O5jo1N1k8J0L6J9Kl6j9L4k0mJ3l1J2%j3N0l6Ok5K9JJ5j5m2
7101c3L2PJ7kj9k5KK9n5M1J0j0npK1pl9P4l9QJ2l5K7jOMk2l1O7l5l6M5k2lM1%
7137A7j9K8ll3j5N8m5PKj0J2L0Mo4O2n1LO1j3k9k7L1l1P0k9mj9jJn1N9k4k2J0
$$ plain form
7171 -35 -66 14 27 -3 16 -26 35 12 2 -24 35 -26 43 -28 -15 -28 -4 23 -3 4 -16 -25 1 18 26 -32 18 30 -58 33 -45 9
7203 9 10 8 -3 -30 17 1 8 2 11 -8 24 12 15 24 -15 -6 32 1 -14 -8 -13 -22 27 13 -1 -4 -4 0 -8 -30 43 -44 13 -23 12 35 23 -16
7241 -16 -25 7 20 5 -14 -32 -36 15 23 17 -27 4 -60 -8 -16 -9 -6 14 7 28 4 -16 -41 10 -12 -12 -51 -39 21 51 29 -28 20 -24 -3
7276 -3 4 1 -1 -45 28 -5 -34 11 20 47 8 2 10 10 -25 -7 14 2 12 18 -26 -23 14 -3 -33 -27 -1 -20 47 -5 44 -13 -13 1 27 -14
7312 -14 -10 -37 8 22 21 -6 35 -4 32 8 11 -26 31 0 -30 10 14 14 -18 -18 -7 1 -2 -38 -15 -8 -2 -13 16 6 -54 6 6 -5 -13 44
7348 44 -13 -7 -26 -28 -34 11 -11 -27 3 30 -11 23 22 12 -16 20 -4 -17 -30 7 -8 -33 -1 -28 30 12 19 -18 -14 -47 -13 -15 -12 -41
7382 -41 -48 -21 -3 -4 -3 7 -2 24 -40 -52 -23 17 -5 -42 -39 3 -5 -26 12 20 15 10 -19 70 -23 31 11 -7 3 -28 55 -8 2 -41 -18
7417 -18 -57 -1 -2 4 4 -19 63 8 -43 14 -1 25 -51 19 50 -25 27 -29 -33 20 3 -15 -9 -32 -23 -19 -25 5 -24 39 -15 -8 0 8 -22 4
$$ packed form
7171c5l1Q0J3l0J9m2O1k3j0k6N9o1O9p1J3j3K4K7k6Pk0rK6J7Qn8N0J2q8R1p8N4
7203IJkj1k7M7j6PoRj9L2j2LRl9RL8l1j5OnrM9j4j4l%Mqk2P3q7N7l6L5K3j2l9
7241a6rL2J3j5j9j8mN1Qom4L1o4N2qPLK0pK1k4k0k5N1k2%l9J2O0L0k2n7M8m4K1
7276cPlkm4P3l3k9M5RK7l9oQ%l5J8K1j2J0Om4LL7j7l0OK6j9O7n2M9n7%J4K6m1
7312a4Mk7M5J4jk7M1l9L6k4Ll7N7l1l0M0M%l2%J1Qll6K3POj1K9j0o0O0%j1qN7
7348D4n7Oj9koM5k2j6L0K7m1L4jj0k8L6k4j3j3L7j5k5L2k7N8j8Pl7Ml3L4kLk9
7382d1pK7J8jJJ0rK6o4j2K9M0k2l7LM2qk1L8Qnnk9Q9r3N4k0j8J0l1Q3o3J0m3K3
7417a8l9N6jO%k3Q2n5n1N7j5K6p6P0L1p5N2n6mN3j7j8Ok3RMoL0k9O3n4PQQl0K6
$$ plain form
7453 4 -23 1 26 33 -10 -33 0 10 24 -9 30 -9 -6 -14 -5 -9 -36 -5 -24 30 -15 -19 -5 -3 32 -28 -37 24 -16 7 -14 -46 8 -28 -4
7488 -4 18 22 10 -14 -11 -8 -44 49 -16 -5 -13 3 14 3 -22 10 11 19 28 23 23 27 13 8 -13 -19 1 -4 -13 -40 -9 11 3 -19 22 -33 23 24 -5
7527 -5 35 -21 16 -9 26 -18 -9 19 -48 12 -32 7 -29 -7 15 -19 -52 -24 54 3 17 17 17 49 -48 10 25 18 5 -18 19 26 9
7560 9 34 -7 -14 -3 47 36 -8 8 9 -28 4 17 2 47 1 -36 9 -41 7 0 10 -41 -20 38 12 -8 -22 -39 4 -16 13 -15
7592 -15 -26 5 -12 30 24 25 -52 -56 6 -9 -6 20 32 -48 -4 10 25 -11 -51 -8 -19 -42 -6 -21 31 -4 7 27 -1 -23 -60 25
7624 25 -60 -45 18 13 33 -12 -28 -24 -5 -5 -8 22 13 36 -39 -24 34 -25 9 -34 3 -12 17 -4 12 3 -17 34 -35 16 5 4 -13 -27
7658 -27 -11 8 26 -37 -21 23 2 -1 -2 15 18 -28 -2 2 42 -27 17 24 -8 -28 9 9 -1 2 25 26 -27 10 2 29 -36 32 20 -7 28
7693 28 -23 15 -14 20 -14 -4 -3 -18 13 -33 54 -11 -35 19 -5 -16 -10 -18 -5 20 8 -24 -2 -27 -13 7 -6 -3 66 46 13 7 -47
$$ packed form
7453Dk7K4K5Pm3k3L3J0J4l3L9l9LqRmk7L1j9N4m5mJ4KL5o0rO1m0K3k1l2N4l6K4
7488dK2Mj2k4LLl6R3o5J1qJ6J1j1k5L2JQRn%Mj4nk1oK0nrk7L1K0qk2M1n5N6Jk9
7527eM0n6L7k5L5m4RK8o7O0m4L9l6K2K2l4l3K8P8n1J4%%L2r7N8J5pj3k3L7Pj7
7560IK5m1pJ1N0j1m4J6Jl7L2J3j5M5m6l7M5n0M8pJ0n1K1N8k6k0j4j7M3k0K9k8
7592a5j1L1j7M2oJp7mO2j5LK6J2q0M4J4J5l6m0M3j1k3L6j5N2l5J1K0k8k2l7Q5
7624B5q5J5O3nK0m5j6MJ9%lL0rK3p5J5N8n9L4m3L7j5K9k1J6rk0N1o9N1j1jj7j4
7658b7J6J9J8o3J6M4k1ljJ7Lm6K6MM0o9M4Pl2k0L7%j0LK3Jn3L7qK7o5O8j2k7L5
7693B8n1L8k9L4l4J0Jj5L1m6Q7o5k4N4k4j1OqJ3K5j2l2K2k5J4K0j3LO9k0l3on4
$$ plain form
7726 -47 10 6 1 -9 4 14 -1 5 -17 -4 -11 -56 5 6 -36 22 -8 56 -12 17 -36 15 1 -5 -26 -9 15 19 19 5 -11 -1 -10 2 -4
7761 -4 -3 23 -2 19 32 -42 32 31 29 12 20 1 -28 -5 30 3 -47 4 1 24 18 -27 6 7 3 12 -22 33 -58 20 28 29 42 -12 -18 -35 6
7798 6 15 42 -51 26 120 -15 -5 12 -62 12 -1 -12 -49 19 -4 11 -18 10 -16 25 9 42 15 -15 0 -5 10 18 4 -6 -22 -10
7830 -10 -28 -14 40 4 37 13 10 5 14 17 -19 34 9 -56 35 27 4 -50 6 -36 -55 17 13 26 -16 -13 -37 3 -2 -39 -23 -17 10 31 -22
7865 -22 29 16 16 -17 -34 -27 -34 18 -36 -9 -17 -49 -10 20 53 -36 -16 -30 -17 32 -27 9 -5 13 -5 16 -14 6 12 -8 8 -13 18
7898 18 -38 45 23 -12 11 -6 -30 -32 65 17 -38 4 -29 -8 -6 -12 -33 -11 -18 2 -15 21 -3 11 24 -18 5 -39 11 -30 -6 -22
7930 -22 11 41 3 35 -25 -30 22 -8 5 -7 -8 -63 3 -8 16 5 -36 43 -4 14 15 -9 -1 1 -31 -44 31 3 11 24 -18 11 -67
7963 -67 9 -17 -17 -9 -27 -82 -25 -11 -3 -28 -30 -1 12 -3 -4 21 4 3 4 19 17 -3 26 -37 25 6 -16 1 -7 44 9 12 -16 -23 -11 -34
$$ packed form
7726d7N7mnj0J3J0j5Ok2J3pm5O1Jm2N8l0O4o8K9n3N1j4ok1J7K4M%j4j6J0rJ2o
7761dJK6k5K1J3p4P4jkj7Qj9k9K3L5k7n0N1lK3om5L3JmRl4N5r1P8QJJ3n4oj7M1
7798FRK7r3P7R4j35J0J7p4P4j3j1l7O8k3J5k9K8k6M1j6L3k7l0J5nJ5Qj4j0j6J2
7830a0j8J4N4l6L3k4lnRLl6N3k5o5R1qk3n4N6m2j9P2mJ3m2Lk4M0nl7J6OK7K1n3
7865b2N1j3%l3j7PpN2n4K7ql2L9L0L3q9K0j4J3M9n9L6j4J8j8K1l0K0Ok0J6k1L1
7898A8n6Q3k2l5K3j7k4kR7m8n5M2l3K1Kok1K2pK0j7L6k4J4J3m2K3m4N0m1K4j6
7930b2L3L0l8L2o0nN2l0J3j2jn5O6j1K4j1m1P9m7J8Jk4QKl2j3P5k8QJ3m2K9p8
7963f7P6k6%Qj8n5N7J4Qk5kK9J3j5jK5j7jJJ5kk0K9o3O2j9k2J7qN1l5Lk8pJ2k3
$$ plain form
7999 -34 -16 -36 9 -29 16 -48 -15 22 5 -25 -21 28 2 -4 26 -12 8 -39 29 1 -15 -21 -8 -2 -37 11 7 -17 19 8 -26 9 19
8032 19 -6 17 -16 2 8 3 28 -21 5 1 2 -4 16 24 -16 8 -2 -13 -35 3 -10 -46 -18 9 -24 19 29 11 15 -57 0 29 -15 8
8066 8 -82 -11 -12 -15 -39 26 4 -8 -34 9 -19 -21 22 -15 -25 21 17 -5 25 11 19 -22 -26 -3 15 2 3 6 -21 12 13 18 9 31 14 11 16
8103 16 -55 8 -8 24 14 -46 22 14 26 48 -19 -24 -30 -35 4 -32 -4 13 0 -4 0 -10 -5 4 -15 27 42 27 -27 0 28 -27 12 -5
8137 -5 -24 9 6 41 3 0 -7 35 -19 -42 23 14 49 -10 -46 13 -7 18 -8 17 5 11 15 10 -36 -6 19 -30 -44 -40 7 4 -35 29 0
8172 0 -25 -19 -37 -3 4 33 -23 -42 -2 -7 9 -41 -1 27 -26 57 -4 -16 20 -27 -4 -25 27 5 -5 -8 20 7 -20 -52 -42 -25 -46
8205 -46 -15 4 -27 22 1 -42 -13 25 12 -64 -57 -18 -7 -12 -44 12 2 0 11 13 -25 -19 -10 -6 8 -11 18 -18 -43 -51 -30 -20 -49 8
8239 8 8 -27 -7 10 20 -19 8 -1 0 10 17 0 -33 -27 21 -8 4 23 -1 30 -9 44 34 41 -10 50 -6 -19 -45 -14 -17 17 55 14
$$ packed form
7999c4J8k0M5l8M5o4L3L7j7l0MM9k6oL0l8K0m7O8k8j6oJ3Ol5M8mk4L6j1l4L5J0
8032A9k5K3l3J8OnK5m9K6mJoK0Qm0K4j0j1k2L8j3l6K8K7l3M3J0j8Mp2N7K9m4K3
8066Hr0P1jlk4O5k2j2k6M3k8kM3l7j0M6mk2L0j4Qm1mK3J8j3JLk7L3JNrK2j7lN
8103A6p1O3j6L2j0o0O8qJ2K2o7nonL9l6K8J7j3mMj0NRj9M2J5j5n4K7K8n5L9j7
8137ej9L3lL5l8lpM2n4k3O5rL5n9l6N9k0K5k6K5j2OMnm6L0K5m9j4MM7ll9O4k9
8172@k5Oj8L4PK9n6j9M0nJ6n0M0K8n3Q3o1j2L6m7K3k1N2k2j0lK8j3k7l2J0J7k1
8205d6L1J9l1M9k1m3K9L8j3p6PL9J1nl2N6j0kJ1Kl8ORMJ4j9K9l6k5qK1J0k9N7
8239H%l5K0J7J0l9K7rJJ0Pj7l3OM8k9J2J9k4L1l9N3j0Pn1O0n6j3k6L1lL4L8m1
$$ plain form
8273 14 16 24 4 42 -32 2 48 39 14 37 52 4 -19 -16 -1 12 0 5 -31 -18 -4 -25 -46 35 3 8 7 -12 -16 6 17 -11 1 -9
8307 -9 -10 -13 -20 12 2 17 5 -16 -1 -22 -16 -19 22 -6 37 -39 14 15 -19 25 24 24 -31 57 -21 -22 29 15 31 -37 -88 -40 7 -11 12
8342 12 -15 -43 14 -25 43 26 -5 25 -45 23 -8 -9 8 -4 22 30 8 13 1 -13 8 29 0 39 -7 -26 -24 23 4 -3 -33 -24 -11
8375 -11 -66 21 -3 -3 -28 -18 -55 10 39 -23 -12 -1 -29 -12 -13 -22 -11 20 -42 -23 27 8 4 -17 -8 -4 53 1 -6 23 26 28 0 8 8 -8
8411 -8 -1 -12 -15 16 19 11 11 0 20 6 -12 24 -5 23 -5 8 10 3 9 -15 21 -36 -10 -16 20 -26 4 -53 22 30 47 -10 36 11 -22 -44
8447 -44 0 -7 30 -6 -28 22 -32 11 42 -33 -4 -24 33 -5 4 -6 -37 5 -34 16 36 45 7 24 22 -48 -1 12 -30 43 -21 0
8479 0 -10 22 -4 -19 -4 -5 -7 13 -26 26 -14 29 -32 3 7 16 -33 -15 38 -32 17 -21 4 -31 33 45 -10 12 -7 2 -41 26 -31
8512 -31 -31 -3 -51 12 -1 -18 48 -25 21 11 21 -23 13 -8 -19 13 -6 10 -1 6 -11 3 -17 -18 -39 33 10 -21 -39 4 -12 15
$$ packed form
8273A4KQk0L8p4L4M6rk5K3J5m8k3LJ5J3j2Nl6J3J4k1k1Q1l2Njj9mK2J1k8J2j0
8307ijlpL2j0J5j2k1J5k1OlM1k8M3p6N3Jl4M4j%n5Q8p8jN1j4J6o8n1M8M7j8K3
8342A2k7k8N7l9O8j7l1L0p0O8l1jJ7j2K6Qk2Nj2j4K1K1k9L9m6j9KM7j9pl0RJ3
8375a1n5Q7k4%k5J0l7O5K9o2J1J1k8J7jrJ1L1o2J9N0j9mk1RMN7n2pK9LKk8Q%j6
8411hPj1lL1Lq%j1K0j4j8L6k9K8k8J3KpOk4L6n7K6oL6m6L0n7P5QJ7n7M6k5l3k2
8447d4M4pL7l6k2N0n4M3L1p5K9k0N7l8Rj0l1M2l9N0K0Rl8J7kp0M7J3m2P3o4K1
8479@j0L2k6j5J5jkK0l9N2m0M3o1L5MRm9J8N3p0M9l8K5l5O4J2n5K2j9Rm3O7n7
8512c1%K8m8O3j3j7O6p3M6j0J0m4L6k1j1L2j9J6j1Pj7J4k0jk1P2k3l1j8M3j6K7
$$ plain form
8544 15 -21 -18 49 1 -11 -30 -28 -29 -50 22 -22 -8 -8 -1 36 19 4 16 -21 -39 -11 42 10 37 11 -8 38 3 7 -25 -19 -4 11 -22
8578 -22 -14 -11 5 27 27 21 14 -16 -7 -14 7 -2 -2 11 -2 -14 -13 -33 22 -2 -18 -42 0 6 46 5 11 32 -26 -38 37 -9 24 -6 -22 9
8614 9 10 -5 -18 12 -65 1 0 0 47 22 -16 -25 -10 15 -21 18 -53 -7 -66 39 11 -39 -13 9 1 22 -17 -6 -12 2 9 5 -44 -20
8648 -20 -20 14 11 -17 13 10 -3 6 14 -5 -6 11 1 -20 -20 -4 -34 -42 14 24 13 -36 -35 -30 -8 3 4 -12 -36 -2 6 4 -29 8 -6 4 -1
8685 -1 -2 3 -46 -18 -17 18 -16 -1 0 42 2 -11 -23 -8 -23 -30 29 13 9 -19 -53 -23 -35 22 -8 -38 10 -4 -11 -20 24 -16 12 -2 10
8720 10 5 1 -3 -13 -51 -20 13 15 -6 34 -12 -43 11 16 3 41 -6 -31 -7 -1 23 -62 -8 -5 28 -19 11 11 15 29 -12 -29 11 -16 -18
8755 -18 6 25 -6 -17 -24 -4 0 -1 -22 -35 -71 -27 -11 10 -52 -11 1 -15 17 17 -12 -63 11 8 9 2 1 27 -12 -24 -17 22 -43 19 -25
8790 -25 -19 30 9 15 -36 5 -7 -36 -6 -23 11 -1 -11 37 -15 6 3 -12 -49 14 -14 -7 4 -1 29 1 2 35 16 19 -19 -12 -18 -53 2
$$ packed form
8544A5l6LO7m8j2j9Kjk1P2m4J4%PL7j7j5J2l7j8K8N3l2K7k6j9M6l5Ml2OJ5J5l3
8578b2QLJ6K2%opl0RpK1r%J3j3j2Jk0N5k4j6k4M2OM0m1OK1n8j2P5m6L3l0j6L1
8614IJj5j3L0p7O6j%M7k5l8rJ5K5l6L9p1M6n9J05k8n0K6K2qK1l9J1oJ4Pmm9K4
8648b0%L4lk8L0lj3RQj9jJ7j0k1%J6l0qN6J0j1m9JNK2J1Jj6k4L4Qkl3L7j4J0n
8685ajNm9K8JL5l4J5JM2m0j3j2J5j5pN9j6mk8l4L0j2N7l0l0M8j4prM4m0K8j4J2
8720A0nmmj0l8L1L3Kk1M0m6l1N4Nj3L8m7k5K4OK4q5N4LL3m7L0%MJ4m1j7M0k7k
8755a8K4J9l1j1pK0Mjk1j3l6M4J6K1o2M1J2j6L2%k9n1P4lJpjK6l9j2PL9o5O2m4
8790b5OM9k1On1M1j2k9L0j7L4j2j0M8n2K1lj5l7O3k8PJ1nL0k8JL3j9Ll8Pol5N5
$$ plain form
8825 2 31 4 28 10 -20 24 -1 -87 -15 22 21 -14 -7 5 -22 20 -10 -10 -11 4 34 17 -8 -29 -15 -38 16 -7 -31 -3 24 24 18 -24
8859 -24 33 -10 -37 24 -14 40 -18 -16 -37 -41 -28 -21 -30 -24 43 35 0 -68 5 12 -17 -1 -13 -22 -28 -26 -9 -41 -14 20 -30 28 -49 -4 -19
8894 -19 41 -6 -15 33 -19 -7 2 -14 11 13 -31 48 -20 -10 46 -34 35 -10 6 15 -30 28 26 23 -23 15 18 -6 -14 -9 46 -1 -21 -3 7
8929 7 -13 -62 -10 4 6 -22 -1 39 18 -19 9 34 -38 2 37 4 17 16 -7 31 3 -10 -20 16 3 -9 -49 28 9 3 -1 22 -42
8962 -42 -34 -12 9 44 -9 -15 -20 -21 15 22 -13 -4 -41 -6 -43 -16 -1 -22 -23 -13 -22 17 17 9 -32 -15 28 -41 3 20 -5 -10 -25 -14 -42 23
8998 23 12 0 27 1 -15 7 -15 19 -11 -3 -3 -1 13 10 -46 4 -14 -18 -6 -9 -2 -44 7 -9 19 7 -16 13 -8 -37 -11 1 45 -25
9032 -25 -13 39 2 -5 -26 10 0 24 26 -17 -5 -40 -10 4 15 -13 -12 -16 11 6 20 6 -25 18 -11 7 4 -21 21 6 -4 -13 -31 46
9066 46 28 -2 14 10 12 -30 18 27 -35 -18 6 -10 -2 35 -13 43 26 8 14 -21 -2 41 27 20 18 7 11 17 -1 -28 29 -2 -15 4 14
$$ packed form
8825BK9k7K4j8l0M4k5q6P2L7jl5PJ2k7M2l0%jJ5L0j7k5k1J4k3N4k3k4K8K7%om2
8859b4N7m3k7O1l8N4n8Kk1mJ3PrOO7ql5o8P3Pk9J6j2roKJ7l2K7L4n0N8p7M5j5
8894a9O0m7rM8n2J2Rj6K5Km4P9o8J0N6q0O9m5J6Rm5N8klm6L8Lk4qNN5m7k0J8J0
8929Gk0m9N2J4Kk8K1M0k1l7K8K5p2M0L5l3J3jk3L8k8j3j0L6j3j2m0P7j9omK3o4
8962d2QK2K1L5n3onjL6Pl5Rl7L5l7K7J5k1jJ0rL9%qm1J7M3o9M4J7k5nj5J1k8O5
8998B3j1j2K7k6j6K2k2L4l0Q%KJ4ln6N0j8mJ2lPm2N1j6K8j2k3K9k1k9K6J2M4p0
9032b5J2N2l7pk1L6j0K4Km3J2l5L0J4J1k8JmK7nJ4j4l1M3k9J8lk5M2j5j0rj8P7
9066D6j8l0J6mKm2M8Ro2J7K4j6QL7m8N6j7j8Ol5J9M3j4pkj1MOj8k7N7l1j3J9J0
$$ plain form
9101 14 5 10 -33 -33 13 35 -6 -28 4 25 -25 -11 -26 1 -14 -6 -47 7 6 -9 17 -37 4 6 -14 1 -5 13 6 -24 -24 23 -38 -33 -25 7
9137 7 7 -37 7 19 12 -5 8 -19 -8 -1 -31 15 -38 32 -2 -2 -42 18 -19 -55 13 -1 14 -7 18 4 -21 20 1 -9 17 -6 48
9170 48 8 24 -14 -6 -26 41 -24 -32 7 -17 -6 -5 -14 34 -29 -14 -9 -4 -1 -25 9 -25 1 -32 -2 -26 -4 -3 15 -12 -31 -33 -3 9 -7
9205 -7 7 13 -11 -32 8 26 21 -1 16 -29 51 29 -9 -61 -41 -28 44 -47 -16 -24 7 2 10 -2 -14 3 18 0 -14 7 27 -2 2 -3
9239 -3 -34 0 -21 5 -10 11 -20 41 -6 -11 -8 -34 0 -6 33 -12 -36 -13 -39 3 19 19 16 -17 -19 -14 -1 -44 -14 -14 19 15 -35 -15 -2
9274 -2 -8 3 -28 2 -2 22 -21 -31 2 6 25 -26 -1 -7 4 -65 -22 -26 -5 41 -20 8 -70 -23 32 -38 19 -19 -8 -18 -17 -17 -21 8 -26
9309 -26 -19 -27 -3 10 -39 -24 14 -37 53 -7 -10 10 1 -1 -11 3 -4 2 23 -40 -1 -33 9 12 -16 -8 -16 13 -21 20 -22 6 4 -15 -1 37
9345 37 -21 -8 -8 50 4 -10 -5 1 -11 -35 -5 11 17 4 33 19 19 -13 -44 3 -35 -26 -51 -28 -52 -7 52 -24 2 6 -19 -19 -52 -37
$$ packed form
9101A4rNm3%M6K2m1k2L2K1n0J4j5K7j5Qm1N4jj5K6n4M1Kk0J5oJ8pl0%M7o1NQL2
9137G%m4M4J2pj7J3k7J1Pl0M6n3P0l4%m0O0l7l6O8j4J5k1K5j4k5M1j9j0K6k3N4
9170D8m0J6l8Qk0O7o5qL9k4J1JrM8o3J5NNLk4L4l4K6l3L0k4K2JJ8k7j9kL0J2j6
9205gJ4Ok4k1M0J8nk2J7m5Q0k2l8n2K0J3P2r1L1qL1nQj2j2J7J5j8j4K1K0k9Mn
9239cl1L4k1K6j5K1l1O1m7nLk6L4oL9m5k4K3k6M2J6%ll3kNJ3m3L0%L3mn0K0J3
9274boJ1l1L0mK4m3j0L3MJ9n1K5oJ1o9M3mK1M6o1K8p8M7N5p0N7l8J1j0J%mK9l4
9309b6PqK4J3m9J5L8n1R0o0lK0rkj0J4pOK1o3L9l2M2Lk8QqK9l4M1m2K8kj9J4L8
9345C7n8J3%N8m6j4NOj2k4L0J6Oj3K9j4%l2l1M7l8Rk5K3k4M5N9p6K6Mk5%l3J5
$$ plain form
9379 -37 -30 8 -11 -11 7 -19 -17 7 7 -6 -9 -40 -7 24 -54 -1 -6 -31 8 52 -49 -50 -50 -29 -5 -19 -22 15 -8 7 -8 -7 10 -3 -10
9414 -10 -6 -19 23 -23 8 -11 30 -10 16 -21 0 5 -23 36 -23 2 -24 19 18 -9 46 -3 5 -8 -20 46 -21 -5 32 13 23 5
9446 5 51 9 -32 33 9 19 -3 -54 -32 3 34 2 -2 -14 -27 28 5 -15 -38 -11 -12 -18 23 8 23 17 -39 4 -10 -6 3 -17 -22 -13 11
9481 11 -36 -11 19 -40 -35 -15 -19 -16 9 36 21 3 -13 -30 -23 -6 19 -5 -26 -62 -18 -11 -14 -26 -38 -42 -19 13 -26 7 8 47 23 -31
9515 -31 15 20 -28 -18 -40 -10 -9 -8 -6 40 -44 -9 5 -14 50 16 18 -32 -24 -2 15 -7 -30 -11 -8 -19 5 34 18 54 35 -28 -8 29
9549 29 5 11 9 16 -21 -15 -6 -15 -38 -28 -3 6 36 9 -13 -33 -42 -13 -21 -9 -30 37 2 0 3 5 28 -21 39 -13 -18 18 17 -4 2 19 -17 0
9587 0 -14 31 10 -33 11 2 -12 24 -4 25 36 -17 21 -44 -25 4 2 -11 -3 0 -29 -36 -19 14 -23 -4 1 -8 32 -55 -13 21 9 58
9621 58 -24 33 6 11 18 -19 -12 -24 32 15 -23 8 -5 -8 34 2 8 -23 1 -6 24 20 0 -21 -8 -20 -24 7 -19 33 18 0 -36 5
$$ packed form
9379c7PL8j9%J8k6KK4%j3ll1L3L1p8N3nk5L9M4j01j%K1K4j4lL7k3J5j5JJ7j3p
9414a0Mj3M2m6L1j9M1m0K6l7K1Nk8N9n9K5k6M3jk7N5m9Qj3j2O6o7J6L7j9J0j8
9446EM6m2m1O5k4J0k2n1K2L5L1l2mj2j3N5k3k0k3K7joM1j5J5on6M3j4MRk0nRK4
9481A1m7K5L0n9NK0mLK5K7j5j8j6j7PJ7K5k4k1l6M4Plj2j2mK3L2l9L3JL9k4n4
9515c1M6Nm8J0k2L0JJKM6q4L5J4j9O4l4Kn0QK2J7k2k3J9Lj1K4K9j6L6j9o3K0L7
9549B9k4OkPl7ORrk3J0K5RL0k7k2k0rK9qJ2k1O7l5kLKK3m9O0n2nL6jk1OJ7l6J7
9587@j4M5k1m3M4rj4L6k8K9J1n3L8o5J9K9kj3QLk9pJ7L3l7J9NrM0q7M2L4j2M9
9621E8q2N7k7NPl7Pj2N6j7l8L1j3lM2l2Ol1K4pL0mk0k1J3j2mL1k6N2j5j8l6M1
$$ plain form
9655 5 -47 -26 26 -12 8 16 20 3 -1 24 14 -27 -3 -50 -25 -2 7 26 -7 -20 -8 -14 -24 13 6 39 76 -2 19 -35 15 7 21 10
9689 10 31 7 -5 -9 8 -29 -37 -22 16 4 -4 8 5 2 -44 -3 37 -26 3 16 -14 -6 11 -16 -4 18 -13 26 36 25 2 6 21 7
9723 7 -23 10 0 2 5 10 0 -3 2 12 20 26 -1 -5 40 -13 -42 -25 24 -4 21 -39 2 11 -16 -40 -18 -52 6 19 -17 -30 2 -14 -18 -20
9759 -20 -22 -30 -18 -22 -14 -43 -15 -7 -36 12 -25 15 17 -15 -4 1 -2 -23 -1 14 -13 32 6 -5 3 -15 10 -4 -33 -20 -9 -16 -20 22 -7 14
9795 14 -2 18 -18 -4 -50 26 -6 -19 -15 -12 9 -31 -35 40 -20 -53 32 -11 -58 -30 25 -6 5 -36 12 -52 17 3 -46 1 15 8
9827 8 23 6 40 -2 1 -9 -10 -32 16 13 -18 1 -28 -62 -67 33 -7 -13 -9 -11 -11 25 -46 24 -6 -5 -10 46 13 -28 10 -22 -57 -5 3 19
9863 19 -26 18 19 -14 -5 8 -33 -38 11 -2 -11 -11 -6 -8 -19 41 -4 13 6 -17 57 13 14 5 -29 -10 13 -7 11 2 19 -7 -13 -48 32 19
9899 19 -17 26 -26 -9 1 -8 0 -13 2 -4 -9 -25 -25 -14 12 21 17 33 -14 -7 -54 -10 -10 -4 -20 8 23 -6 -9 -9 14 -12 -7 29 -6 -21 -22
$$ packed form
9655En2K1N2l8K0QMj7mK5j0m1K4m7K5K3RJ9l3j3J2oj0L7pL3L7p8K1n4N0qJ4j1
9689A0K1k4j2mJ7l7qJ5L8j2qJ2llm6M1M0o3K9J3l0QJ7k7J2K2l1L9J0j1k3MJ5j4
9723Gl0L3j0KLNj0lNJ0QOk7mM5n3k9J7M9k8K5o0M1Rk7k4K2l4N8J3l6j3L2j6mk
9759b0kqJ2mQk9K8Qk9M8l7M0Kl2J1Nlk1K2J5k7M5k6j1Qj8K5j4k9J3J1pmM2k9K1
9795A4j6K0l6J4m6P6l2j3MLK1m0mP5o0l3Q5m3m7K8N5l1J1m1M8o4O9j4m9M7J4p
9827HJ5j7L4m2Lj0jk2M8ll1J9k9l4nJ00m0oMk%L6p1P0l0JnN6l3m1L8l2l5N2QJ6
9863A9m5M4Jl3RJ3m1nM9j3r%Nkj1O0m5J7pk3P4m4Jrl4J9K3k0J8rJ7k6ol5Q0j3
9899A9l6M3n2J7J0rQj3J5onj6%J1K6RmJ6m7Pm7M4%Oj6K8J5k9l%K3k6NL6l5j5j
$$ plain form
9936 -22 -6 14 9 13 1 -60 -62 9 -27 -25 8 21 32 -7 19 -25 -34 6 5 35 -41 -1 -1 -37 -6 -1 -33 0 -19 -37 24 20 6 -45 -17
9971 -17 15 -46 -24 1 18 -55 -32 3 -21 46 -30 -5 23 4 9 -8 33 5 10 -12 -1 -28 -1 2 -27 50 -20 28 -10 10 1 -25
10003 -25 -29 -42 -11 6 20 8 -7 -51 -8 11 24 -17 -12 -10 19 -11 -19 -25 -24 -20 6 -51 15 8 -2 -60 -9 -10 -17 -30 -15 -12 -8 20 -26 43
10039 43 -36 -10 -7 -87 12 -37 -5 -35 -18 -9 -7 -10 -3 12 1 -4 -17 6 -7 -9 17 -29 41 7 -43 -20 15 -10 0 -25 14 0 32
10072 32 -15 -23 -16 43 49 -30 -38 -6 -3 -34 15 -1 0 -39 -13 -13 -30 -19 4 4 35 -13 -18 -2 -9 18 31 37 23 10 -19 27 -1 -13 -6 -25
10108 -25 21 3 14 -5 -2 -4 0 44 20 -12 -9 -5 -12 -1 -11 4 -21 15 -22 -11 -10 16 -3 -9 7 1 9 -49 0 -2 -35 1 48 -19 -20 -20
10144 -20 35 7 12 -27 -3 2 -39 13 -42 -7 6 12 57 6 -16 -35 -66 9 -17 -11 30 13 2 18 -39 -34 -15 8 -13 -33 22 -54
10176 -54 9 29 18 27 -21 5 17 -12 -12 47 29 -34 -24 3 4 12 34 -17 -24 1 -22 31 -28 -1 -6 44 10 -13 16 14 17 28 -49 -24
$$ packed form
9936b2J6K0nMj2o1kP1l6KL3J3J1l9K6m4rM0jL0p6M0%l6L1Nl2L3j9j8O1mj4n1K8
9971a7L2o1K2K5J7p3K3L5k4O7p6K5K8j9Nj7M1k8Nk2J1k7K7Lk9P7p0M8l8K0rk6
10003b5mj3L1J7J4j2j5m4M3J9J3m1NKK9l0qoJMK6n7O6pj0n8N1jpj3J5LMK8m6O9
10039D3p9K6Lq0R9m9L2l0J7RKlPJ5j1nj3K3j3kK6m6P0l4n0K3L5k5J0k5L9j4L2
10072C2m7qPN9Op9qL2Ll1M9j6Jl9K6%j7J1K3%L1m8nJ6pK7J3Oj4j3k9M6k8j2Pj9
10108b5M6j8J1j9LkMM4k4l2LMpJ1j0J5k5L6l7J1JK6j9oJ6oQn8M9kl3L6M7o7j%
10144b0N5k8Nl9K4Nm1N2n5L5J3OM5n1k2j9l1P5k6OM1j7j1J6n7NJ9K3k1k0N5p6
10176e4O3K0j1Rm8K6J2k9%N9j8o3J0K7JQK2n1pK5k3N3n9K7nN0l4k3K9kLJ1p7K5
$$ plain form
10210 -24 8 -10 -4 14 -24 23 36 -8 -61 37 -1 2 24 17 -8 -33 11 3 12 -38 39 4 -8 19 14 5 -11 -14 0 -36 23 -15 34 19
10244 19 17 58 -17 -1 -5 -10 21 12 -11 35 -5 38 49 27 26 -11 18 -34 3 -9 -34 7 16 5 -4 11 7 32 47 -26 -29 4 -33 -12
10278 -12 4 0 61 -10 -14 -11 -29 -6 10 -42 -9 26 -9 -30 -8 27 27 21 50 4 -14 -11 -19 -21 -32 13 -33 -15 -4 32 -12 4 26 -43
10312 -43 -12 -4 15 -19 0 17 -28 5 -12 -5 55 -15 -31 18 -20 17 -48 5 -20 78 -8 1 0 -5 3 -15 32 10 8 24 -35 -18 -10 -2
10346 -2 -1 -10 10 -25 21 2 15 -7 8 17 13 6 -12 -21 16 29 38 10 -9 39 1 -17 -34 9 11 32 30 -11 42 26 19 34 34 -1 -12 -3
10382 -3 19 40 11 -11 28 24 1 -15 4 -2 -8 48 -12 -14 18 -4 -5 -40 -25 -31 18 7 -11 37 -39 -52 -39 -9 -20 -19 -9 -1 11 -22
10416 -22 4 -2 52 -31 -41 3 -3 22 -44 76 -1 44 -7 -16 13 -8 -6 -62 13 29 -42 37 -32 -25 -35 -32 21 -6 25 26 76 21 -11
10449 -11 13 -29 -27 9 -3 -35 31 -14 2 11 -33 6 -15 -25 21 -1 -13 -4 16 -32 -22 37 -27 2 8 -7 2 -2 0 -13 25 14 1
$$ packed form
10210b4L2j8OJ8l8M7J3m4n3R8l8LK2pk5k5M4qRn0P7l5j2K7nrj6lJ4l6N9l8M9j5
10244A9kM1p5J6mnL1rk3M6m0M3J1k2jl7K9n2L7j2k5M1Rj1rJ5mK5J5p3lL3l7K1
10278a2J6mO1p1mLj8K3J6n2L3L5l5k1K2L5%oK9m6j8Lqkj1M5m6J8J1L6m4J6K2o9
10312d3L1QJ9l4J9J7m5L3j7PO0p0j6M9l8L7o5N3k5R8q6RjnQj8M7k2kJ6n9J7QQ
10346bJrK0l5M6j9J3k2J5Rmpj8rL7J3Rk8j9M8l8j8j7M3KK1km1N3j6pJ5%l5j1R
10382cK2K1k9k2L9mk3j6J9ooN6o0kL2k2jl5J5oM9j1j8M8p6j3J3L0j1JJ0QJ2l3
10416b2K6oN4q3j0M4oK5o6J20p7M5n1rK9k1Kn6P5J6p1P9o9Pj0LN3k7L1JN0n5l2
10449a1K4m2KL6j2l2O6m5J6Rm4L9k1j0M6k2j2RK0m8J0N9o4K9Oj5RmKj3L8j1j3
$$ plain form
10482 1 68 35 -55 -28 2 42 -55 8 -6 -6 19 34 8 -20 11 -5 20 -37 -2 -43 -16 -9 -4 6 -2 32 1 -3 -11 -3 -40 15 -3 -7
10516 -7 -20 11 23 -15 -7 44 4 -16 -16 -5 -15 -7 -7 5 4 21 3 -4 16 15 80 -27 28 5 -21 -37 -35 -71 16 23 -12 24 2 -8
10550 -8 -49 0 20 -12 36 28 5 5 9 -21 -33 -18 4 9 -33 -7 15 3 4 -20 -49 -32 30 11 2 15 19 56 -18 32 -33 20 -18 28
10584 28 31 -29 -18 -2 16 1 1 -34 -21 60 -19 -26 -35 -13 24 16 -34 21 -6 -12 -15 -30 14 -5 1 49 -17 -28 -18 -4 -3 -10 21 -13 -25
10619 -25 27 -4 -9 -10 13 5 0 -19 -17 -1 -39 53 0 -30 -7 11 6 -4 46 -52 -15 24 -10 -14 -8 26 -43 6 0 -18 1 11 16 5 -18
10654 -18 -19 20 49 45 20 -5 23 5 -9 -5 -31 -16 2 17 -28 15 5 11 23 -34 26 -11 20 14 -37 7 1 31 -7 -32 -15 2 -17
10687 -17 18 -61 32 -12 -10 -43 3 9 -23 -39 -49 24 -29 28 40 1 -13 -6 7 -11 -24 30 -14 32 -7 19 -33 35 -4 33 -8
10718 -8 -48 -16 -6 26 -30 -6 13 -39 13 -58 11 17 5 24 -22 -14 -1 -25 17 2 17 23 1 -11 7 -36 26 -1 16 3 -47 13
$$ packed form
10482AO7l3r0K7L0M0r7O3j4%K5J5k6k8L1j6K5n7L5m1K7PNJ0qL4l1mqQl7N5j8m
10516gj3L1J2l8QN1m0k0%J1j0Q%J2jJ7j8pK0jO5j07N5k3k6j6Kl6Q7Pl5L6k2j0
10550hm1M9K0l2M8qk3%Ml0j2J5K2Nm2K6K2j2Jk4k9J7O2j9rJ3ML7p4N0o5N3l8M6
10584B8Lo0J1J6J8j5%l5J3Q1p9prK2L7qn0N5k7olj5M4j9OM8o6j1J0J4JpL1l4j2
10619b5N2l1njK3qnj9KJ6l8R2n3l0K3J8nj0N0r8L7L9l4mOL4o9M9oj8J9J0Nj1k3
10654a8jL9K9mk5k5K8j8j4Mk6J5J8J5m5M3j0OJ2n7O0l7L1on1M4oL0l8k5J7J7j9
10687a7L5p9R3m4Kl3M6Ol2j6j0P3n3N7J2l9j4PJ3j8j3N4m4M6l9K6n2O8l9L7m1
10718hm0L2J0L2n6K4J9n2N2p1O9Oj2J9m6QJ3k4M2j5J5Ok2j2J8m3O2k7J7j3n0O0
$$ plain form
10750 13 26 12 -37 9 7 16 6 1 -17 -26 10 -16 -24 -2 14 -17 -2 17 19 11 -4 -17 -3 15 15 -17 42 -15 21 6 40 27 -39 -6
10784 -6 10 21 3 27 26 -25 -23 -7 13 -19 21 -10 -34 5 -12 1 -39 -45 22 -15 43 -46 -15 -36 1 -7 -20 26 -45 13 -16 5
10816 5 1 -8 8 -59 17 71 -2 -5 -4 12 14 5 8 51 -24 29 -50 27 7 -10 23 -14 -27 -7 5 -8 7 -41 23 0 -2 -7 8 27 5
10851 5 15 10 13 -13 13 19 1 -19 -39 30 1 -1 21 -4 32 -14 6 -1 -20 48 -15 6 5 -1 2 -37 17 -30 9 -6 -4 20 24 -4 25
10886 25 17 -40 1 -33 10 16 -27 9 -5 -16 31 -10 13 -22 -13 6 49 -14 37 0 3 40 -40 -22 -14 -2 -1 -20 -5 -1 15 -40 44
10919 44 26 -54 8 -12 -19 16 12 -26 26 -11 -24 -27 -16 -7 -23 4 5 -8 -24 -3 -37 27 1 -27 25 -22 14 3 -11 8 10 -7 -5
10952 -5 -14 -18 2 -32 7 -15 -14 27 -27 36 7 -61 14 18 -11 -18 -4 34 25 2 -22 -36 -6 -32 -5 29 -32 -34 -47 -27 27 -7 -14 12
10986 12 9 -18 -36 7 1 -3 -6 -12 16 -29 0 10 21 -4 -10 14 5 2 25 -26 -17 -45 4 14 2 -2 17 -5 9 7 36 30 -10 -18 4 13 6
$$ packed form
10750A3J3j4m9M6kRj0nj8rL6k6qK2J6l1J5J9Kqj5j3J4J8%l2N9n7L6j5L4j3o6L3
10784fJ6J1j8K4jn1KJ6K0l2M0l1k4L9j7J3m0oO7l7N8q9L1k1L7qj3M6p1N8k9K1
10816EmrJ6o7P6N4p3lJJ6KrLM3p5N3p9P7k0j7L3l7j3K0J2j3J5m8O4k3knJ5J9k2
10851EJ0nLk6K6Oj8k0k0O9k9kK2k5L6m6K0pj9O8o3K1joLl9N4m7L9j5KK4Mk8K9
10886B5qn7M1l4M3Om3L6j4j1M7m1K3l5RJ9M3o3N1l7LL7q0J8QJ2Jj9J5MJ6n5Q4
10919D4j8q0O2k0pL5ml8N2l7j3lJ1Rj6K7Jj3j6K1l4O4k6k8N2m7L6j1j4J9Kj7K
10952ermK0l4L9k2JM1n4O3k9o8P5Mk9pJ4L8rk3k4j4L0k6K7L4o1kj3K0N4l4pK6
10986A2lk7j8M3omloK8m5K9J0J1k5oK4rlK3n1Rk8M9J0j2mJ9k2J4kK9om0qK2Rp
$$ plain form
11023 6 -49 20 42 5 22 23 -30 14 -3 -31 -12 -15 -23 -7 8 -4 -4 -56 3 -45 14 -42 11 12 7 12 2 21 -5 -15 32 -34 23 -3
11057 -3 -7 -12 -38 24 38 -7 -56 -4 1 10 32 -21 16 21 -43 2 -26 -27 1 22 -3 -5 9 -56 -25 -11 -38 1 -10 -43 -27 -5 -4 -1 -27
11092 -27 -46 4 23 -32 -25 35 18 28 -24 17 20 -32 35 -21 -25 42 21 -73 -51 30 7 -2 2 -6 -7 -2 -30 18 36 19 -17 -1 36 -31
11126 -31 -7 1 30 -12 6 10 14 1 29 -17 12 -23 25 -27 -10 -9 -8 7 19 -2 4 24 0 16 3 8 11 44 9 -4 31 40 33 10 42
11161 42 -4 7 20 -16 37 -21 -30 37 -11 4 3 -40 -14 -8 13 37 -18 -43 -41 -32 -3 14 5 54 -19 18 11 -22 -67 -4 -31 20 16 -2
11195 -2 -6 -23 0 18 4 -9 19 -2 12 28 -16 -34 23 -28 -19 15 -32 33 19 -5 -5 28 17 18 2 -54 -10 3 -29 9 -19 9
11227 9 -28 4 34 8 -24 -49 -22 -17 22 15 -3 16 -4 4 24 53 46 -34 24 -1 -42 -27 -41 27 -36 23 -18 -19 -6 -16 -21 -20 29 13
11261 13 -38 -20 3 21 59 -52 -6 -8 -3 -23 10 -49 31 11 -6 22 2 3 -6 -18 -28 39 7 -17 -5 28 -12 -22 0 10 6 -24
$$ packed form
11023Fn5O9K2l7J7Jn3M4j7k8J9lqJ6J5j2%n2N9m8N9n6N3JnNj0J9k6j0M7o6N7k6
11057cmnk6O2J4m5m9N2NRK2n3L7No4M5k8jK8K1k5kJ4o5L1J4k7L9j1l3J6K2JLk6
11092b7j9N0J9n5PO0j7J0n2M1Ln2O7n6mO7k1r4K2Q1k3rMqjNk8M8J8j7l6J6L7o7
11126c1K4QK9m2J8MMj3K8m6K9l5M8n2J7JJJ5J2k1OK0k4J6j3NLL3l5j3L5Rpk3L2
11161D2m6J1J3l6N3n8rO7m8J5jm3K6OK1K4n5k5KRK9J7rM9p3L7pl3m5O3k7N1mj8
11195bmj7K3J8j4j3K8k1J4J6m4j8N7n1RL4m7O5j4k4%L3j1Jj6n6M4J3l2L8k8K8
11227Il7L2L0k6l2k5K7NL9pj8J9k0QK0K9pq0N8k5m1J5j4O8o3N9m1jJ3j0nJM9j6
11261A3n1J8K3J8L8j11M6kNk0L3n9Q0k0j7K8k0Jrj2j0O7l2k4J2L3m0j0K2J0ml0
$$ plain form
11293 -24 8 -70 35 11 -37 3 -3 -15 -15 3 -12 3 9 8 -21 5 12 2 -8 -14 -12 -24 -3 -26 6 -6 3 16 28 -45 12 2 -21
11326 -21 -7 30 78 17 26 -36 -57 -5 -2 12 -9 30 12 -4 -7 -27 -28 22 48 17 -21 -28 22 -9 9 12 24 -6 36 3 16 -9 -30
11359 -30 19 -42 -27 -11 -13 1 -11 -35 42 19 15 -28 -1 -22 -38 9 -9 2 20 -1 6 -3 -10 47 -14 6 12 -15 -30 -5 -2 -26 -8
11392 -8 -10 1 -14 -9 -21 -42 60 -2 6 -23 23 -31 -36 13 -27 -38 29 12 55 10 -8 8 11 -20 -9 -10 -7 1 -17 -5 1 -16 35 20
11426 20 -7 -8 1 -2 5 -12 -2 6 -8 12 29 9 23 -8 22 7 14 23 -13 29 22 17 -48 30 10 -24 3 50 -22 5 24 30 18 -16 8
11461 8 -42 10 -21 -17 -11 -5 20 29 -36 -6 -4 -20 8 -48 -17 -15 -17 21 -28 -35 32 -21 12 -4 -28 11 3 -1 -6 -23 -27 -5 -1 38 -28 -21 7
11498 7 -39 17 -21 -12 36 -19 45 -26 3 21 53 27 -6 51 -26 12 4 -45 17 9 9 21 4 1 5 12 24 3 -50 4 -5 15 13 7 -7
11533 -7 3 -12 -11 -12 7 16 27 15 5 -5 16 20 -53 -18 12 10 -23 -49 30 16 -13 12 -18 17 -5 -13 -1 -16 12 6 3 4 18 -43 15
$$ packed form
11293b4L2p8J05k4m8M0oj2%J8j5J5Ojk9K6Pj0j0oKj2K1k3L2j2RJ3J2p3N7j0k3
11326b1J4L7M8o1Ro2k1N2LJ4k1L9j8j6lk0jN0K6l1l8pN0l1J8LJ2l0M2l3J3k5k1
11359c0M9o1J5J6kJ4j2k4P7k3mm3K7k1j6M7j8J1J8k1PrpN7o1K0Ok7j5K5Lk4J8
11392hkJ1j5Nj2k1J02o2Qk9M6n4nM9m0j1O7j7M3m5j8J6Ll1J1jLQj8J2Oj7N1j5
11426B0k7jRlPj7J0Qj4K0J7k0J4l1L0j5PRl6M2pno5P8k0l4K7M7p2K7J9Oj2l4K4
11461Hn0N2l1MOOK5Ro5L0Kj6K8n6L1KkL8m9pO7n3L3j6k4L9qmnj7mK2ML9o6PK8
11498Gm6N6l8RM8n5O4p1K9J8L2k6l3N7p7L8qm9O2q%J2j7lMPJ2k1n3N4rK0koj4
11533gJ0j5JjJ9RJ1j2j0j0K1Mp3L5L0kl3k6P9j4k9K5l0L5k2qJ2j5K8olJJ4o1N8
$$ plain form
11568 15 14 2 19 16 2 -16 8 23 -16 23 15 -25 -30 -1 -14 4 -11 -49 -21 -1 -6 28 -34 31 12 -5 -3 -29 43 -30 -40 -2 45
11601 45 11 -61 -34 30 16 -9 -4 12 3 20 -26 8 21 16 36 27 3 -37 -6 11 25 -35 6 -22 2 23 -41 -8 6 4 -14 -1
11633 -1 32 12 -1 16 -7 11 18 17 -12 27 -9 -55 -17 11 1 46 30 -16 -34 22 5 -2 -25 -2 1 -33 -16 -19 8 14 -25 -14 -3
11666 -3 -7 29 -14 20 -44 15 2 -4 14 32 -1 28 5 31 1 -48 -23 32 -29 -13 21 -3 -31 -11 32 -9 32 -7 -17 -43 -4
11697 -4 7 39 -42 -9 -13 -11 0 26 -2 -10 -18 -6 -41 -45 -40 3 67 -18 5 -14 -2 13 -18 20 11 -9 3 14 33 27 -6 -4 8 10 -21
11732 -21 35 8 51 20 2 23 18 -2 -4 24 22 34 25 56 -7 -19 7 -13 -23 -55 -6 -14 -27 12 -16 0 -15 -10 1 -6 15 -9 -51
11765 -51 10 4 28 -30 -10 -21 20 7 -8 8 10 -7 -12 -4 -23 -13 -26 41 0 7 -15 15 -47 65 -8 -32 -22 11 -15 -6 37 -10
11797 -10 40 -24 -22 -6 1 7 17 10 0 21 -3 -15 14 13 39 -8 1 12 -25 5 -23 -35 -23 50 3 5 -2 0 -1 -15 44 31 -15 12 -8
$$ packed form
11568A5jj2J7lj4j8K4J5l9L9qm0nK9j3J8j5l8K8K0nL4o2O5j9j7Kk6P2p3j0L8M7
11601D5l4p2K7O4j4k5NJ6rJ7m6L4J3nK0rk4m0L1J7J4o0M1k8K4K1o4L3J4kj8J3
11633aL3k0j3J7k3J8Pjk9L9l6m6L8K8j0M5j6m6j8N6j7pk3K3Ll4J7lK7Ol9J1J1
11666cmL6m3L4o4N9j3oJ8J8l3K9k3K6l0m9K5N5o1J6L4k4k8K0M3m1M1l9j0k6L9
11697dJ1L2q1L3mKJ1K6k8qqJ2l5mNM3O4q5K3j9J2J5l1L8rk0J2J1J9ol3KJ2Kl1
11732b1N6k7M3l1j8K1nk0kK8kJ2rL1o3j2K6k0j0l2M9qj3L9k8J6j5NJ1pK1k4m2
11765e1O1oK4n8K0j1M1j3j5J6Kj7nQj9J0j3O7m1Pk2L0o2J12p3k4J0L3k6RM3m7
11797a0N0o4KJ6POJ0pj0K1k4j2K9jK6m7RJ1l7L0k8j2J2P3m7KpKjj4N9j3m6K7k0
$$ plain form
11832 -8 -46 3 -52 -1 -7 -4 -5 5 3 -20 29 -30 50 -43 -44 -10 1 13 0 21 -6 3 -27 -13 8 -24 -37 11 43 15 1 23 44
11865 44 1 4 -31 -8 17 44 6 24 -5 -27 -6 -27 -6 30 -28 31 -27 -12 -12 5 24 -16 4 -8 22 -16 5 -29 5 31 13
11896 13 56 16 2 8 21 -1 -28 37 -76 11 29 -16 -19 -50 36 -3 0 24 17 -32 -21 6 -39 36 -4 -37 4 1 -27 17 -11 9
11928 9 -25 51 -30 12 -22 -33 10 18 0 1 -12 24 -25 -34 -17 -32 20 25 -16 -6 20 -11 10 24 -20 -3 12 9 -46 6 -12 0 -5
11961 -5 -10 29 4 2 16 -2 -24 7 3 -13 -22 -6 -23 13 -29 -16 -5 -36 -6 -8 -43 -6 -3 -35 13 -39 -13 -16 -28 -5 4 6 7 18 -11
11996 -11 -18 14 -25 10 12 -8 -29 20 -6 -15 -7 1 4 -12 2 27 22 29 -23 13 28 19 26 -22 -12 -1 22 23 13 32 19 16 -15 -6 -5 17 -27
12033 -27 8 33 -18 -7 20 -4 19 -42 -26 20 -7 19 -1 -2 7 -10 10 -11 -16 10 -26 14 -5 1 -24 13 -27 -41 -19 19 10 -34
12065 -34 -17 -25 24 50 37 27 1 60 7 3 -17 -5 15 -16 17 17 27 38 5 -1 4 24 -16 11 0 -39 0 26 32 8 -13 49 -20
$$ packed form
11832hl8M9n5N1oLjJ0kk3M9n9Q0r3jL4J1J2j3K1k7Rl0J4K1l2j3M8L2k8j4K2K1
11865D4m3Ll5K3K5K7l8J8k9k2K1k1K1L6n8N9n8J5%J7J9m0K0j2L0l8K1l4L4K6j8
11896A3M3m0j4OJ3k2k7O5j13Q7J8m5ll1Q6l9LK4pm9J1K7m5P5m0l3M1lk8M4k8K0
11928Il4P6q1M2l4j1M3Qj8Jj3L6m9rJ7j5N2Nm1J0K6l1K1J4m4J7J5ln5N2j8J2n
11961enL9k5kJ4j8k2L1mj6rJ6j7L6m2J3J1l1L0kl5L7Ll2M8n2K6lj2K3RKJJ1k9
11996a1pL2l9L5Kk0k1M9k6rQQLj6J4K5nPn2L6J5rPm8J0J1K3Jj0J9j3ll1RJK2m4
12033b7L5K5n1J1K7k4K3o1J6M6k7K6k0jRj7K0k1nK6l6M0j9Ok5L7m0j4K2L8rm4
12065c4J7qM9K6j3j0k6N9n3mk0J2K0l1L3%J0J1l3oNK0m0K7j1l9L9K6Ok4k1O2o9
$$ plain form
12098 -20 23 9 -3 17 10 7 -23 9 -17 -32 -17 34 3 -9 -3 -19 -4 -29 2 -6 -15 22 -34 -10 10 21 34 29 49 -59 -19 25
12130 25 -32 58 19 46 -25 17 29 -43 5 -16 -17 -10 -2 13 21 23 35 -16 -12 7 -3 -35 66 44 38 39 41 -21 3 10 -45 42 8 2 -10
12165 -10 -14 23 -26 -17 -25 -24 15 25 27 8 13 24 -4 -11 -8 13 36 16 11 15 -1 -2 -49 8 35 18 -26 -17 20 -5 -2 19 -34 17 23 15 7 -3
12203 -3 29 17 9 -9 -16 18 10 37 -1 -1 -3 7 25 -19 1 7 -24 32 8 2 41 -54 -24 -11 -15 21 21 -3 -47 24 21 -8 31 6 33
12238 33 -8 -14 -28 13 20 6 -4 41 13 19 -3 5 -10 58 -33 26 34 -3 3 -40 17 -15 66 5 17 -16 -3 31 17 -12 17 -22 -34
12271 -34 50 9 -2 13 -42 22 60 10 2 -35 15 -29 42 33 20 31 -13 30 14 -24 3 34 -19 -38 48 -10 26 -22 -4 -8 -12 -38
12303 -38 5 -13 -33 -11 2 6 42 -6 -9 -27 26 13 -21 40 25 4 -3 23 19 -20 -48 -12 20 -33 4 13 29 19 35 -31 -8 -24
12335 -24 -26 -12 -10 13 -38 9 -34 30 43 26 -3 0 -4 -3 -24 14 -30 19 -36 46 7 47 -15 25 -30 -10 18 -16 17 21 -41 -23 0
$$ packed form
12098b0M3j4j2K0pll0L2k6j5J5N1l1j2Oj6J5k5L1qrL7n6K4K0J1J3nK0j08M0M4
12130B5n7R0l9K7p1M2J2p2M8k1jPQJ5QKJ2n1MJ9j0l2J01k2oJKo2K4Pn5Q7l4oj2
12165a0mL7m9RqJL9J0Kj9NJ1k8pLK1K3k0nMj6jm7N7K7j7m4RL7k5LK1n3N1Oqqj0
12203cL2j2qj8pL4qK7l8%kJ0J8m4K0Ol1N6k4oL9r5L0J3mL6%k4m4P1lk9L9k5K7
12238C3m1oj4M1Pj4j0M5k8Ok2Qj5O8r1N9Ql7Om3N7l2Q1o1J2l3J3L4j4k9K9l9j2
12271c4Q4m1j1J5n5O4L8n0ql7N0m4P1rj3J1m4M3j6l8K7L1n3j9Q6n8L6m8J8mmk6
12303c8M3j8k0K2J3ML6m8lj8N3j3l4O1j5k1pK6ml9k8L6L2n3L7RJ6j0J6o6K3j6
12335b4kJ4KK3n1M7m3O4J3j7k9LmJk1L8m4M9n5Q2l9M0o2M0n5K0K8l4L3Mo2J8K3
$$ plain form
12368 0 -17 -66 -5 -4 33 -7 -18 30 -11 18 20 -11 -30 -3 5 13 8 26 1 13 -20 3 0 -18 6 15 -13 12 -9 9 -43 2 -8 -16
12402 -16 39 7 -18 -4 -29 -22 -17 19 27 -11 -8 -21 51 9 6 3 16 -18 5 -16 6 -7 1 25 -29 8 31 -14 -2 51 42 7 42 4
12436 4 36 5 -38 -14 -3 -15 -12 -28 17 -21 4 7 -21 -4 21 -1 -12 -19 -20 -4 22 -11 -10 17 35 -32 -25 -42 1 22 10 46 -20
12469 -20 -11 -26 9 -20 33 48 -17 1 21 4 29 -3 3 7 57 21 -9 -21 26 -6 4 5 9 -25 -16 -2 -14 -2 5 -14 -34 36 -3
12502 -3 9 20 18 16 2 16 9 19 48 -8 -13 -11 37 -60 5 -28 7 14 -41 -32 19 38 30 -3 34 16 -9 5 40 20 -10 11 -55 -2
12536 -2 -22 -37 0 2 -35 5 -6 -9 39 21 -6 17 44 27 1 13 -11 7 4 -16 11 -13 -2 -10 28 13 -34 21 -14 -20 -19 -10 15 19
12570 19 31 -5 1 3 -42 37 -5 6 38 -18 21 -10 -2 -66 20 16 17 -20 -6 10 24 20 3 14 5 -2 48 30 0 -30 -37 17 -3 15
12604 15 -25 8 -52 -34 36 -48 8 -18 13 -13 -31 14 -11 16 -19 3 31 -5 37 -20 -5 -10 10 -28 -15 23 -1 23 -3 -5 -14
$$ packed form
12368@j7m9O1JL7m0j1M8m1K9Kl1j9K7QQnJ8k5J2l3K3lj8K4Rk8K5k1J8n2M5j0q
12402a6N5l2k5J4k5PNL6Ql8Lj3P2m2llJ3l4K3k1K2j3QK4n4L7K3m5J2N3rl5L5l8
12436DL2l1m3K4J1j2Lj6M5l8K5Lk8J7K5k2j1pjJ6K6l3JK7J8o7Pj7M3K1j2L6o6
12469b0Rj5L5k9N3J5o5J8K0j7K5l2OMN0l6l0j2M7l2J0JMl4RJ4j2J2Pj9k0P0l9
12502cJ2J1kkj4J4pJ0K9n6nKM8r7O5l3L5Pn5RN1J9ql3L7j8k5J4L5k0l0K1o6N3
12536bk0j5L7Kl7M0j1lM8j8k7K3K7j7k6J2k4J8lk0K7k4J1qL8j5m7N5l5oJRK5M
12570A9J2l6OKm5P9m2J1L2n6L9l1Qo4Q6mJl7J4J6J4mj7J1rpN0j8l0l0pN4k0J8
12604A5m0L3o0J8P0q4N6k6L1k6j8M5k5K7l5K2K8l6M2n7J5nK0l8J3L8k4K4k6kr
$$ plain form
12635 -14 20 8 -46 -29 -8 -17 -7 4 -7 -2 49 16 -27 14 22 -5 8 -29 -2 22 31 31 11 -16 2 73 -25 -18 -21 10 20 19 20 12 -13
12670 -13 -1 -30 -32 -31 -11 5 21 -22 8 21 -5 34 -41 23 -15 0 24 -12 -5 19 5 -6 -8 0 36 19 -51 40 -19 50 2 32
12702 32 25 45 27 27 -7 14 8 41 -5 -24 -22 -5 11 48 9 2 -3 -7 -6 -41 -43 -31 19 -8 54 22 -29 32 -1 -45 -19 22 5 -1 0
12737 0 3 26 -14 26 2 -15 -1 0 2 8 27 27 13 29 -11 -39 4 -33 39 -51 -33 -2 -6 -3 1 21 8 -4 30 -22 -40 14 -4 -30
12771 -30 -17 4 3 3 3 7 25 -20 -7 18 14 -27 -38 18 17 24 33 -26 5 -9 18 -39 4 18 -12 -21 -30 -2 -2 -1 25 26 41 -15 -27 18
12807 18 -16 30 -25 4 36 14 -10 47 9 7 -2 -10 45 23 6 16 28 48 -21 -6 -17 -15 27 30 -4 5 16 2 -3 24 8 41 -25
12840 -25 32 30 2 -20 -7 -9 21 19 27 -10 10 -58 -2 21 4 -3 -43 -4 -29 28 50 -9 6 7 11 -32 -3 35 0 26 17 50 -5 25
12874 25 -10 -3 -23 -21 1 22 -15 -22 3 7 -6 26 -5 13 30 13 1 -30 34 17 -24 4 -27 -28 27 4 -5 14 -5 -38 17 14 -21
$$ packed form
12635a4L4j2n4J7K1rJ0J1j1NN1l3m3M1Qk7J3l7K7K4R%k0k7J8P1r8PlL1J0jJqk5
12670a3J2k9kJK0J6J6m3L0J3k6L9p5O4l8J5K4l6PK4j4j1kQL6j7p0R1n9O9m8L0
12702C2pK0j8%l4K1oL3m6j9KJ7J6L7l9pnmJl5kJ2N0k7O2l2n1O1l3m4K6M1j7oJ
12737@LK3m0M0k4j7J4JKOJ9%j4J6m0k8M3l7P2r0J8L1mLMK0j3j2L4n2j8N4j8k6
12771c0J3K1j%%MJ8m5J3K5mm1j1N6jPRn9L1j4K7n7M3J4l0rrK8%JK6JJ5n6j2M5
12807A8l4M6n5K9L2k2k4N7l8krqN5k2j7J0J2K0o9J5j1KM2Ll4RJ1j4nK7j6L3o6
12840b5N7kk8k2J3kL0kQl7K0o8N6K3j7pm0L9k5N7K2n9J5JMm3K9L8l5K6rL3n5L0
12874B5l5Pk0KK2K1l7pK5Mj3L2l1J8J7j7j2l1O4j7m1K8l1jN5k3rJ9j9l3N5ll5
$$ plain form
12907 -21 -38 38 29 -30 30 -15 -7 -2 7 -9 2 -10 -33 2 10 19 22 -9 -20 24 -20 -25 13 -3 -3 -17 59 -7 -32 -25 -51 -22 26 -15 -17
12942 -17 -8 -4 31 42 14 -4 -22 10 -19 2 16 4 48 30 27 -7 9 -10 -12 -34 23 -6 -12 36 51 6 31 19 -3 -13 -16 -15 39
12975 39 37 -21 -24 -38 40 -25 26 35 -10 -24 16 32 -32 5 -6 16 -23 -33 17 -21 23 -24 -14 3 -28 13 34 -34 -1 -3 -1 46
13007 46 -6 -10 23 -9 27 -5 21 -11 -4 -40 -35 11 19 28 46 36 -30 8 22 22 0 14 9 27 28 -4 -13 -7 42 26 4 -3 -7 -6 -2 -9 -5 8
13045 8 8 -21 8 -10 14 16 -7 6 -30 40 -16 45 -18 -12 16 -2 -31 20 1 -6 -22 -33 -32 -8 27 30 -43 -27 -47 -25 48 24 -13
13078 -13 -29 -5 -19 -43 -15 10 -13 3 -35 -12 -28 17 -16 -11 -36 -24 -24 60 24 -7 38 4 11 -7 1 -5 -9 -60 33 -30 -15 -4 -1
13111 -1 -11 1 31 -53 40 -52 4 2 -19 48 -6 12 -10 11 8 -21 1 -16 21 5 -47 42 -33 34 3 -3 -1 4 -23 -22 49 -20 5
13144 5 7 11 -32 -26 -8 -13 -20 17 26 -4 -26 -11 14 -7 26 7 6 -25 24 0 -22 45 -26 34 -2 0 -17 17 -26 16 3 -39 -30 -20 -50
$$ packed form
12907b1j7P6rn9O0m5QNRj6J1j2k3L5QRLl1j1M4m4nL8j6%j4P6o6k5Pk6K9M8m1k
12942a7RML5J1k8j8j8L2k9K1J4j2M4j8ll4J6j9kk2N7k9oM8J5m5K5j2k2j0lJN4
12975C9kn8lj4P8o5N1Rm5j4M0J6o4L7j1K2l9j0N0l8M4m7J0J7l1M1K1o8L3kKM7
13007D6n2mL3l2L6l2K6l2Pl6NM6QRJ8j0o6L8J4%k2J4nJ8Jl2rOM9j6k2pmJMpMJ3
13045H%k9K9j8K4Kk3J3l6P0n6O1o3OK8j8k9N1j9pj6j1JK4L5Lp3J6k0K2P3k4l7
13078a3j6K4j4k4K8K5k3J6l8K3j6M5l3Nk5J2%Q4l6l1M5l4Pj8Qomn1R3o3J5J1L
13111aj0J2L0q4R3r2N6kk1O7n4J8k2K1lk9K2j7L7j6n2Q9p5O7l1oKNk7JP1o9K5
13144EKMm3OJ8npL7Rl0k2J5K5k1L3j9jl1M9k4k2O7p1O0l6Kj7L4m3M2j3m2RJ0l0
$$ plain form
13179 -50 -43 -19 -36 -19 0 17 7 15 10 -27 -13 15 14 29 -15 17 13 46 -13 36 -12 -33 2 8 8 31 0 46 -22 -7 23 25 -47 -15
13213 -15 -8 17 -9 -24 -3 -8 -54 -34 -6 19 -7 24 12 31 -54 -18 1 -3 -20 -17 -5 -30 -4 -14 10 -5 19 24 9 18 21 -18 -36
13246 -36 20 26 -24 7 -12 32 -16 -22 -23 1 6 -14 -7 30 -36 8 -14 19 -10 21 40 -44 28 -12 27 7 4 -5 -13 -22 13 42 15 -4
13280 -4 20 0 -8 26 -21 -13 -4 -43 -3 -40 28 -11 -6 -31 37 14 -32 -10 -16 -1 -18 39 -19 -20 30 22 -11 -23 4 23 49 33 -7 -7
13314 -7 -20 3 1 -8 21 -18 58 33 -17 -17 -35 -3 -14 6 5 50 4 -7 -88 -23 9 12 16 3 20 -32 8 -34 8 41 18 -10 -17 -3
13348 -3 -1 2 28 42 11 23 27 26 9 17 11 13 -7 5 52 -10 27 -2 -56 32 4 32 25 24 39 28 -11 -4 27 16 26 23 -15 -28 -13 1
13384 1 24 31 37 9 41 -8 34 -14 -18 -29 41 52 0 18 -7 -10 64 -3 -29 -14 17 49 -36 -52 12 10 -28 -14 41 24 -15 7 -3
13417 -3 31 -43 27 24 9 50 -1 -6 34 1 -11 40 -5 14 14 8 -52 8 -46 -5 11 0 33 27 5 -25 29 8 -23 3 -37 -18 -7
$$ packed form
13179e0PK4j7J7J9J7j0Qnl7J4K8jJ5m4L2mL3n9M9m8k1L5O%K3l1M6o8J5L0Kp2L2
13213a5PK5k6j5K1nm6K0K8K5k6L1j2J9q5L6J9mj7LJ2k5K6j0K4j5K4Nj5RLl9j8
13246c6N6On0L1j9M4m8ojK4Nk0PL7o6M4k2L3k9L1J9q4P2m0L9k0lrqrL5K9k7j9
13280dK4k0qL4m7QRl9M0l7O8l9Nk5O8k3m6K2oJ5j7N7n8jN0ql3j2K7J9K6j6m0%
13314gj3K3krK9l9P6k5n0%j8L2j1K0jM5m6j1q1O5L2LMj3J7n2M0m2M2L3k3k8pJ4
13348cKLK6J4l1J2Mjj7QoKk0J2M7o2L7k9n4Q8k8K8pjJ5j1l9PL1j1J0ll8j3J5J4
13384AK3POk8L2m9M2m8mj1P0J1n2J8k5lP4o7k6J5L1L2q5j6O4kl8J4N5j7l9K2j0
13417cL4p4P0lj5M1n1nM0l3j2N1m5J9%oo0O0n4M1J6j1L3ok2l0N4k1l1K6m0J9J1
$$ plain form
13450 -7 -23 8 1 17 -17 25 55 2 40 -6 27 -18 12 8 17 -18 -3 33 15 13 32 -34 -21 -17 -30 -12 0 10 -26 -13 -17 1 -9
13483 -9 -12 28 19 -5 -10 8 19 -7 35 -9 22 -3 31 -5 17 -19 9 -20 -18 -1 -27 -28 14 -12 9 -1 -10 30 15 -15 -19 -14 -31 3
13517 3 7 -1 30 55 15 -8 -47 17 -10 -29 -1 10 -26 -24 53 -13 31 -18 13 -7 -31 26 38 -3 20 -16 13 43 -40 -15 -58 -14
13549 -14 27 21 18 28 33 5 -2 11 40 8 -15 7 8 20 -20 40 5 38 -11 -19 6 -15 30 16 14 -2 -13 -8 25 -21 11 -11 15 -1
13583 -1 1 48 -24 12 -40 18 -3 -8 -7 -24 -3 5 24 -3 25 38 -13 -9 -12 26 18 -2 31 10 5 11 0 9 45 18 32 -11 28 38 3
13618 3 2 -43 -13 6 -3 8 8 20 3 11 -23 22 -24 -28 24 -29 -8 -15 28 0 2 40 -37 20 -3 10 11 -17 -19 -4 37 13 -9 -17 47
13653 47 -26 26 -21 6 -10 -24 -23 -6 4 5 1 2 -13 -13 4 -2 7 -7 -7 -33 12 5 89 17 12 -29 59 1 -11 -32 -23 49 17 -12 6
13688 6 -7 -25 -19 62 24 12 31 6 -11 -2 10 -22 -41 -11 22 -23 -3 -62 14 35 15 25 24 -28 -40 -34 -1 10 -12 5 4 30 -16
$$ packed form
13450gj6L1pJ6l4M2L0n3L8m6L3m5L0mRl5J5L6j8kJ9o6J3Mj3J8J2J0l6J3mJ8j0
13483ilM0rk4nJ8J1k6M2m4L1k5L4l6K2l6K8k9KJ7k6jM2k6K1j0rM0j5l0mNj7L4
13517CMqL1K5m0k3l9O4k7j9K8J1l6KP7o6M4m9L1k0k4N7J2m1K3l6K9L0q3K5m3M4
13549a4M1olJ0Nk8pJ3K9l2k3K2JJ2m0O0l5L3m9qK5k1M5j4kj6j1NL3m6L2k2K6j6
13583aKM7p2L6n2N8k1nJj7K1QJ9k7K8J3n1MlL8qk0L3k1nOj1RL6k7J4m3L9J0l5
13618Cjm5L0J9rJ1%J2j7Ql4M5m6mN2n3K1pM3k8KL8p7N7k3J3Jk8kJ5M1k4k2qO4
13653D7p3N2m7K7j6j4JJ7J0JmJj5%J7oRj4%k6M5pQ4p2nm1Q8n8j2k1RP2l2k9J8
13688Fj3j8OQ1l8j2J9k5j7RJ2l2j9L0L3m5K0n9P6K1k0J0jn2j2OL3J1k2J7jK6m6
$$ plain form
13721 -16 5 -15 -31 32 -7 -3 -22 12 -38 23 -19 3 14 19 -34 9 -2 9 9 -3 8 20 5 -6 -28 41 48 1 24 -19 28 37
13753 37 -9 -19 2 -15 41 -16 5 -23 -8 5 -3 2 1 15 2 1 11 30 8 -22 -7 48 -15 15 -30 40 -51 -18 19 -7 9 -19
13785 -19 -64 12 39 2 16 4 -26 35 -19 32 -29 -44 3 4 -13 4 -7 -9 11 47 -26 14 -10 -39 -8 -14 10 -19 2 9 15 -52
13817 -52 -52 31 32 -9 -30 23 -17 6 28 20 0 -38 23 -41 -9 -17 5 -12 27 7 -16 -15 -46 7 -42 3 -11 10 43 43 -14 15 -8
13850 -8 -21 -53 -18 37 10 -11 -9 7 -3 -25 30 -19 -6 6 13 -33 -42 19 35 8 4 -21 19 0 31 -3 -19 -7 20 8 -48 25
13882 25 -16 18 -2 21 34 -8 43 -16 -23 49 -7 3 -45 37 -12 -3 -18 -12 1 2 32 -12 56 41 -2 7 -13 -5 5 38 20 -4 9
13915 9 -19 36 2 -29 -10 20 9 -14 -3 20 -16 -5 -12 -6 -29 -22 11 -26 -19 6 16 -13 -22 13 -53 -7 12 24 -2 32 33 16 -4
13948 -4 37 -24 -27 20 0 -18 5 12 -39 -20 -14 -2 24 87 10 38 -2 59 10 -21 21 31 14 22 -3 -30 14 12 74 18 34 -39 38
$$ packed form
13721a6K1k0j6O3l9Mj9L4n0O1m2K2J1Nn3M3j1J1%j2J1J2j5j1k2O9Pm7K3m3M7R
13753C7m6j0K1j7N6n7K1k8J5J3qNjJ4j3jJ0J9k2l0J5N5o3L0m5P0r1L3L7k6J6k8
13785a9m5P6K7l7J4j2l0O1n4N1o1j5M7Jj7J7j1kK0L6p3M0k4k9L1oK4k9K1POo7
13817e2%Q3Jm1k1N3m0K3K2qk0l8O1o4L2qK2j7L9k0k3Jl1N3m9M5j4K1L3%n7K9k3
13850hj3l2L5N5k7k1KJ6j0k2N5m9J3J2Pm6rO1J6k7mk5M0j9L1l4j6J2K7j2n6P3
13882B5m1L4k0K3J3m2N1n9pP2n6J0m8Q2m9Rj5OJ3JL0m4O8j5m3Rk0QJ0L3j8k4J3
13915Ik8N5l4l1J9L0j1k3J1K3l6J1pOk3PL3l7PK5J0k9rL5o6M6J9J2k6L4Jj7k0
13948dM1o1lM7k0j8K3Pn1J9OJ2K6O3p7K8m0O1m9l1M2J0j7Qk5k7M4kO2n6J6p3P7
$$ plain form
13981 38 23 5 -23 -14 -10 2 7 26 -19 -1 -10 -21 -46 15 -24 -15 33 -28 1 0 10 -2 9 33 6 13 38 26 17 -31 44 55 3 -11
14015 -11 -8 7 25 28 -14 34 -1 29 45 9 11 15 6 32 -11 17 -13 1 5 -3 -29 70 -4 8 16 5 47 -10 34 16 -18 21 -17 -11
14049 -11 -18 12 3 6 59 -29 -3 11 20 47 43 30 -7 33 -21 18 30 20 12 -6 4 13 -5 25 49 -10 -17 -11 17 7 -15 22 -17 -22 60
14084 60 -47 22 27 -24 4 25 -2 -18 15 68 -21 42 2 1 -4 30 -20 5 -14 3 29 -12 25 -20 -10 4 23 -1 -38 2 31
14115 31 8 -14 -17 33 -18 -30 54 14 18 10 -25 0 32 24 -27 -54 -4 23 5 -18 -7 30 15 -32 -27 24 -28 40 -10 30 -7 6
14147 6 39 -23 37 -38 -10 12 -12 42 6 34 56 44 36 5 34 52 -14 -33 4 21 -44 20 -39 3 -15 46 25 11 14 -43 -22
14178 -22 -11 13 -16 8 -11 -19 13 -5 59 -27 1 14 3 35 -44 -20 -40 2 39 -23 37 22 0 46 -3 -21 17 -40 60 -36
14208 -36 37 37 15 -19 27 21 -16 -2 11 15 25 28 -2 12 -9 38 -9 -28 11 4 43 4 32 -48 14 33 30 -70 -17 14 -1 17
$$ packed form
13981C8j5j8k8RMJ2NJ9m5J8rj1k5O1l9RM8o1K9jJ0j2J1K4k7PK5j2rm8P5J1n2j4
14015a1LJ5J8Lm2M8l5L0J6l6KMrK6m3K8l0J4Mqk6R9p4J2Qj1M2n7M4j8l4L9l8O
14049a1pL0rLN3q8K6J4RK7mj3l7M0n4L9J2j0qj8J0Rj8L0K4n9pOK8j0k2L7l9nQ2
14084F0j07O9Nn1K8K1k7j6L3N3q9O3m0jnL4n0K5j9J7K6m1L7m5J0J4J9k4l7M0K9
14115C1k3k2lN0n1j2Q4m0Mql5K5L2qn1k7N0K7j8k3J1L7j5m7NN1n2O8n0M0l7J3
14147FL3o2O0p5K8K2k4N4l6K8K2j2ql1K9J8o6j9L7J7o5O4n9M2j8O1k1j4Ln7K1
14178b2J1K4k9K4j9qL2j8O4q6K8J3j1L2p9K4k0M2L7o2O0j5k2M6m9j8L8n7J00r6
14208c6P3%k2l4M6ol7J4J3MJ0Ll0J4k1M7m7j9L9pL9l9K8q0O2J9lj00N3L1j5J8
$$ plain form
14240 17 -8 7 37 5 -7 68 -6 10 41 9 22 -39 8 3 -9 -20 -14 27 0 37 17 -7 29 10 6 31 -9 0 3 76 -21 -9
14272 -9 -3 -14 7 -25 17 -16 -12 -1 -22 -37 8 -16 -18 -19 6 44 -24 31 -10 14 13 6 -4 44 29 17 19 -4 31 -37 -44 -15 25 22 -29
14307 -29 -22 26 -21 10 -1 41 9 33 56 22 -6 19 5 25 -10 5 3 51 -8 -3 -12 -24 14 14 -20 6 26 25 7 32 -22 -9 -33
14340 -33 -31 18 -1 21 -4 -19 -3 -2 18 36 -7 16 20 20 -16 19 2 32 -6 12 13 28 21 20 -29 13 -14 1 15 -11 37 -15 -5
14373 -5 -27 -7 6 -84 -20 -14 -20 23 -2 -17 -23 19 -14 25 43 -6 31 13 27 18 -5 3 35 -15 31 13 -1 13 14 -11 -24 -54 -12
14406 -12 18 18 10 12 20 -27 23 -11 -22 41 -6 8 -17 -16 29 11 35 28 -9 4 7 3 5 2 44 -28 28 23 7 46 -2 -15 20 11 -11 -11
14442 -11 7 5 5 11 -42 -21 -8 -10 -10 -63 5 23 -2 -18 27 -61 4 -10 -5 28 20 -3 1 4 33 16 9 19 -2 -6 -15 -25 1 13 -8 22
14478 22 -22 -14 10 -25 -28 4 -5 15 -41 46 -11 21 -1 -36 18 -25 63 -20 41 5 -7 7 -21 -1 -24 15 -12 -10 4 -28 -3 11
$$ packed form
14240A7k5J5L0l2j2P5p4J6L1l2J3o1M7nj2j1OM1k7L7k0k4L6j9mK5m0RLP3r7J2
14272iOj1K1l2M2l3MJ1k1j5M5k4kjK5L8o8N5m1K4jpj0M8j5j2Kk3L5o8pK9M0ln1
14307b9PM8m7L1j1M2l2K4K3l4k8K5j4K0l5J5kM8n9Nrj2L8%l4K6K0jj8K5n4J3k4
14340c3KM9j9K2k5j5J6JK0J8m3K3M%l6L5j7L0l8J8JJ5pjm9M2k7J5J4k6M8n2J0
14373ek2K0J3r0O4OoM3k5j5oM2l3L9J8m9L7j8J4rk3QL2n0M6j8j4J4Jk5j3l0M2
14406a2L0%qKQm7N0l4j1O3m7J4k5JM5j8K4pl7J3LmKlM2p2N6nj6L9m8j3L5rk2%
14442a1J8k%On3K1J3k%n3O8J8k5j6M5q8O5j4NL3qk3MLK9j7pJ0k1mrj0K6J2k1L0
14478B2m4QK4l5lL2rK0n6Q7n7L2k2l5N4m3Q8q3O1l6j2J4k8K0k3L9k7KJ4l2K5J4
$$ plain form
14510 11 18 -3 32 -29 -7 10 -1 55 -18 -61 -7 -35 -21 1 -24 5 -35 -18 -5 13 -38 -17 4 8 2 15 8 56 11 32 -32 27
14542 27 -5 24 0 -6 -11 -18 -12 -12 -16 20 19 2 -11 -7 2 -59 -16 -39 21 23 8 18 2 11 1 7 -21 -5 0 -5 -39 -11 25 -10 19 -39 -52
14579 -52 -7 -56 -15 -14 10 -15 25 2 9 2 15 -17 12 25 58 -4 -10 -6 12 40 -47 -2 -2 19 -1 -4 8 13 -10 -19 -40 -7 -16 44 -11
14614 -11 1 -16 24 21 40 -5 5 -21 11 -3 -63 -15 -25 14 -3 -3 7 16 -22 4 -39 1 -15 27 4 4 12 0 50 11 -22 -19 -4
14647 -4 -14 -5 -20 -6 4 32 -1 1 20 -5 28 -19 17 -4 0 -32 0 51 -17 30 -7 -24 18 2 -14 -22 33 25 -12 17 -5 23 27
14680 27 28 -2 14 -39 13 36 9 -5 -2 0 -8 -5 21 -11 65 33 -3 -1 -37 5 -15 -52 6 -12 5 -11 -13 31 -10 -3 -6 16 11 7 20
14715 20 -14 0 20 -6 -7 -42 22 3 9 12 31 -28 8 1 -28 11 22 6 8 23 18 39 3 43 7 -7 19 -43 13 40 23 9 20
14748 20 35 -3 4 -9 -1 -7 -21 11 -15 17 -14 -34 -12 -17 -1 -1 31 3 -13 20 -16 -6 29 20 -29 -1 -4 -38 17 61 10 9 1 28
$$ packed form
14510A1Pk1L5o1K2J7j1N6p3m3N4k8J4K2k5K9m0J7J3J8n1K1K1MoJ3pM8m5K1o4N9
14542B7l2K9k4onpO%mL6jj7j3MRo1M3k3O0Kj5J0j6Rj0Ok8J6Nnl4K8L6l5K9n8j3
14579e2M5m9M1JK4k5M0k3PpJ3l2K9J3L3o2oMJ8K8q7M5%K1k0lJ2Nk3rk1L3rO0n5
14614a1J2j7M0lJ9m5J0k6L2j4o0M8j0L9j7%J0Rl8K6m3M0j6M2k3%Qj2N0l9l3LJ5
14647dj0Rj5J4J0K8l3KJ9k5L3m7L6k1Ml2L2N1o8M7l7j7M2j6j6qN5ql7K9k2K8M
14680B7Jl0J6n3N2K3k7j4LKqLK6l2P6l2l6Kl6M2k0l7N8j8J7j6kM4m1PlK2nmJ3
14715B0l4J4K0k6jl5O4j9OLJ9n9L6pk9L9J1j6KJ5nK1l6M0l6j4K6o2N6K7j7j4J1
14748B0J5l8Pj3Qoj4L2k6L2l1k0K2nJ6%L2k8j6L3l6J0L5rm9K8ll4N5M4n1jqK7
$$ plain form
14782 28 39 6 -4 17 6 4 22 4 -4 -43 28 -4 -7 31 13 -6 -41 7 42 -37 17 5 44 5 59 19 4 -8 12 21 34 -28
14814 -28 -2 -37 25 -11 -11 47 -10 -3 31 42 -45 7 -4 -12 19 -37 23 6 0 -30 38 15 -19 46 0 -17 -2 -12 -2 29 26 9
14846 9 -2 -12 -16 70 -8 30 16 -39 -38 37 30 26 7 7 -10 20 -20 9 -16 28 10 12 33 -36 31 -27 -6 21 -33 22 -17 53 -16
14879 -16 1 5 20 -25 25 -1 6 9 -25 6 5 -10 11 -27 22 -31 -26 10 -11 7 -20 -3 -17 5 18 14 -35 3 34 40 -5 -3 29 11
14913 11 43 7 14 -21 9 -42 53 -2 -11 27 -34 -24 -26 12 -24 -36 14 -17 89 14 3 16 10 17 -4 25 -6 43 6 73 -10 22
14945 22 16 -55 3 27 -34 -6 -11 -2 8 -2 -10 -29 14 7 55 -14 -21 65 -4 31 7 -29 27 4 47 -8 17 3 -8 31 -16 40 23
14978 23 13 -1 -20 53 41 17 18 32 5 0 6 -12 27 3 23 -41 18 55 -44 21 -19 -32 -7 -1 -19 0 -13 -18 15 0 16 -18
15010 -18 3 19 -48 21 -54 -9 4 1 12 -39 9 40 -13 -31 3 14 -18 37 -1 8 33 29 0 -26 -9 -25 2 20 -1 24 -40
$$ packed form
14782B8J1l3j0K1j1kJ8j8ql9P1l2lL8j8j9l5M8L5p9N4j2L9l9N4m0j5j2K0RJ3o2
14814b8K6l5O2l6%N8n7PL4J1q7N2j1qL1n6O0j7ol0O8k3l4O5m6j7J5j0J0L1lj7
14846Ij1j0mQ6p8L8j4n5JP5pmj9%j7L0m0K9k5M4j8KK1o9O7n8K1K7n4N5l9P0o9
14879a6J7MJ5m5N0k6PLl4L1jj5K1l8M9n3NL6k1J8k7J7j4K2J3mm9L8L1Om5KL2j8
14913A1L2l6Pl5L0n1R5n5rL8o1J0kL8l6j2N0l1J06p5j1J3oPk1K9l1M9l7O7q3L2
14945B2op1N8K4o1K8nRJ0j0qj9M3pM8o9pQ6o9L5k4l6N6k3M3n5K5j4j1L9m7N6j7
14978B3j0j4j9P3j2k4JJ4k7nOj8L9k4K0o4N9L7r9O5m0j3K5Oj8J9j3nL3j5J6l4
15010a8K1J6o7O9p5M5J3lJ1n1M8L1n3j8L4J1l2N5l8RK5mk9k6J7j6K7J8k1K5o4
$$ plain form
15041 -40 -17 26 12 3 -12 13 31 -29 -5 25 18 20 -28 -6 -2 5 14 5 -20 21 10 3 -15 14 17 36 -53 4 -27 18 15 25 6 -1 24
15076 24 34 26 -39 41 23 13 -3 17 16 -40 44 17 9 12 37 27 -14 -17 4 5 9 -17 0 10 11 -20 37 10 -17 34 7 -44 -4 -4
15110 -4 21 -10 12 20 13 -35 -16 3 -37 -9 -12 -28 -8 -25 48 -8 4 38 -28 -2 56 -13 11 20 -20 5 -6 -2 12 -49 0 42 -20
15143 -20 11 -22 38 45 -28 -26 4 -30 10 50 10 33 -24 -3 8 -2 -5 28 4 40 -4 14 -42 16 2 22 23 -18 53 22 5 -36
15175 -36 11 7 29 -1 -41 -64 -10 -18 32 -22 17 32 17 -14 6 14 -4 32 -38 37 -37 12 19 -15 3 44 3 -46 -24 -54 10 -6
15207 -6 -8 -31 -24 19 14 26 -17 -4 -1 9 34 5 43 29 53 6 -18 -15 9 19 3 -43 -23 -6 -25 46 -38 -13 13 10 3 -23 -1 13
15241 13 -43 11 -12 -6 -8 9 9 -14 -11 5 -32 -17 18 -32 5 -5 12 -18 11 65 10 30 30 -21 -33 29 20 -41 22 16 -17 -6 -7 -17
15275 -17 -21 -6 64 2 29 22 -17 -21 9 -18 12 -7 -22 37 -23 -25 41 -21 -19 12 26 6 17 -9 3 11 1 10 -23 -17 45 -30 -6 17
$$ packed form
15041d0K3M3j4rj5K5J8o0K4L0pKm8K2MPRrk5M1j1pj8K9LJ9q9N7l1M5lJ0j9pK5
15076B4J0qo5Q0j8j0j6K0jn6Q4k7qLK5j0m1lK1JMk6J7J0Jl1N7k7k7N1k7n1M0%
15110dK5l1K2Qpm8J9J9m0K8lj6K0j7P3n6J2L4o6K6N8o9K4Rm0K5j1MJ4o1M9M2o2
15143b0L1l3O0Pp3KL0l4M0M0m0K3n7K1J1j0lL3k4L6m4J8n6N8j4K0Jm1P1l1j7m1
15175c6M7mK2l0m0k3N4qN0n4L9J5j5l1K0Qj8L6p0P5p4M9Pl4J8M1m1m9K2l0O4j6
15207fkk3PM3nJ2m3J3LJ0K5k9L8j4K4m7k4LK4J0j6m6K0J7j9P1q4K5K6lpk6K2J4
15241A3n6N4k3OkJ7%k3LJ6l7J5L5n0L7j0J7l0K9N4n5K0%n1j2O2ro1O3ol3J1jj0
15275a7mJ5P0o2K7pl9mL0k7L0j9j5N9o0kO6o2KL1J4k0J1k6J2Qj0Rl3OO2p5K4K3
$$ plain form
15309 17 -10 16 4 -23 -2 -20 -10 -20 -17 -6 -28 -2 -23 -26 -11 11 -46 -37 2 -8 31 -30 13 26 37 11 18 -34 16 24 -1 8 1
15342 1 -27 35 -24 16 2 12 -6 3 -7 18 -24 -42 22 43 21 5 -8 14 6 -5 14 -41 18 -5 -3 19 46 -3 -10 3 0 -9 -2 19
15376 19 -12 16 2 34 -18 -22 5 0 43 -1 -21 -1 -22 9 10 -10 0 18 -26 41 -35 -8 30 14 40 45 -33 6 -36 31 -22 19
15408 19 17 52 53 -46 -20 4 -26 1 12 5 -2 16 6 20 9 4 -25 -15 10 -20 -30 16 -19 38 8 -7 -10 -17 15 -20 -17 -9 18 39
15442 39 42 23 9 -64 2 -59 33 -2 43 -15 -16 -4 -33 -16 -19 13 5 -16 -31 -8 28 9 -2 19 11 7 -5 40 -9 -3 -13 -34 -24
15475 -24 19 23 25 -24 1 -29 42 6 -13 -21 -18 39 15 -20 12 -16 -23 -39 -9 -11 -10 -16 14 28 -30 5 -48 -6 -43 11 -26 2 -12 -5
15509 -5 12 -9 -9 37 23 29 -14 -33 6 16 47 -16 39 7 34 -19 17 1 8 30 -27 21 -44 -31 -7 35 31 2 -8 18 -37 -41 -15
15542 -15 -6 6 22 -1 30 36 14 36 -6 17 11 3 -6 6 48 1 -5 -13 -23 26 -5 -6 4 30 -20 -8 -31 4 30 -26 -32 1 4 7 8 20
$$ packed form
15309A7k7K6j2k7K1j8J0j0LJ1k2K6k1lJ5K2n7RL9j0L9o1M3J3J1k6Pn2N0Qk5Rp
15342Ak8O2n9M0j4J0j8Rj0K5m2j8O4K1k2j6j3K2qj1J9n5N9k3KK2K7m9pJ3lrPK1
15376A9l1K8j4L2n2mK7nM3m4k0K0k1L1Jk0J0J8m4O7p6K7L8j6K6Np8L9m2O7n3M1
15408A9kL5Jr9K6K4l0K7J1ppJ8j0J4j1nk9J0K5l0j0M6l5N7l0j5lpL2l5LQK7K1
15442C9Lj9j4p3O6o1R2l5M5n8jJ2k9J7lL2qk1j5K3L6j9j1K1qmj2M5m9Oj0k1J0
15475b4M3MKm9K5l0P1l6j9qLN7k4l5L2k8pj6L0kJoL0J4n8L5n3M2l7N4l7K8j4P
15509eJ7k1%M6j4Om3j9L9J0L1o3N5l2K7n3L6j6PK2n7M8o5J3K4M2mk9j0K6n5mK6
15542a5RJ2J6k3L1Ok2K2m2K3oqrJ2M2m7oqj0M9l1jJ0K6n0J2k3L5K6n6oL3LLJJ2
$$ plain form
15578 20 2 -6 5 7 7 -36 5 46 20 0 -1 -44 -32 2 9 2 24 -2 27 1 -21 -19 -15 -4 -23 -25 -4 -15 -9 -7 -17 -14 11 -5 37 52
15614 52 -16 43 -39 30 -48 0 0 -34 -2 -6 23 -6 1 -8 -43 4 -44 38 -12 7 11 0 19 -29 18 14 22 18 -38 26 -36 -11 6 -1
15648 -1 14 -19 22 -35 -13 -29 -8 12 -39 -4 -13 -15 1 16 7 0 -20 29 4 -17 -28 -20 2 31 -6 20 -30 -15 14 -16 25 56 15
15681 15 -3 15 25 4 -5 -34 9 7 -29 15 14 -11 4 -23 47 59 19 0 -12 17 8 23 -19 11 -19 5 37 26 21 -4 12 1
15713 1 31 11 -17 -1 14 26 -27 0 28 -35 -4 -33 -3 29 11 -4 -2 10 -44 -39 27 19 -17 -36 -40 -13 -36 4 -11 4 2 56 -30
15746 -30 31 21 3 -12 -2 45 -18 -22 -46 -39 35 -15 7 -53 19 -15 46 1 -47 0 -12 -36 24 -17 -23 -6 12 12 15 -12 26 16
15778 16 -8 -4 14 -44 9 8 10 -23 32 8 -7 -1 -14 -18 25 21 15 -4 2 29 23 13 13 26 -26 4 -11 -2 2 -23 -43 -17 18 -14 -30 23
15814 23 4 30 33 -20 17 15 -22 27 -3 -11 -52 -85 6 -22 -11 -15 0 34 -15 17 -16 16 -10 20 -6 18 17 -11 -44 -23 0 -12
$$ packed form
15578B0j8qJ1K%m3M1M1k6k0jm3J2L4PpK2k6K9k6k2KMJ1j9kK1j1OKj0LK5j6M2J5
15614E2o8N9q2O9p8M8%l4L2mK9k9Prl5M7m8Q2n0J9Mj1J9m8M7mQmn6O4o2K5J7p
15648aJ5l3M1n7K2j6K1K0n1L5rkJ6J5rpk0M9k5k1j1QK2K9l7K6n0J5K9l0M1L1m1
15681A5j8J8J0k1rk9M3kl6M4jk5J5k7P0J2m0j9j2K9rJ5m2L0l0K4L2j1nk5J6j1
15713AL0k0k8J6J5J2n3K7K8o3L1k9L0L2j8j5KJ2n4NO6ql6j9mK7k3M0j5J5kN4q6
15746c0O1j0j8j5J0M7o3mk4PP4n0K2o0P2l4O1m5m8M7j2k4O0m1oJ7J8%Lk7L8j0
15778A6k4MJ8n8N3jKl3N5k4j5Oj3mM3moj9OK7oj0%J3n2L0j5RMk5k0K6L5l2j6N3
15814B3j9K6Ln3L7kl7M9l0qm1l3R1k8J1mJ5L4m9L2l3L2k6L0k6K4jk8l3K1K3j2
$$ plain form
15846 -12 4 2 17 1 19 -36 23 28 -23 2 -2 40 -14 -12 26 9 -33 -19 7 -26 30 -3 -25 28 -35 -24 -28 34 -12 -25 -7 -28
15878 -28 4 -30 -6 -4 30 -32 -8 1 14 -16 -14 24 0 -32 -53 -9 1 -41 -32 -8 -35 39 -2 -30 48 23 6 -30 50 -22 14 -4
15910 -4 -26 31 3 -12 24 16 30 -28 -17 -8 -12 5 -25 -5 -58 15 -1 -34 10 12 -50 -20 -21 -13 30 -16 -8 -11 28 25 -14 -30 -36 -6 -20
15945 -20 -14 -20 17 6 11 39 -32 -30 -6 4 -32 10 -46 9 -4 6 -17 -37 42 -24 -56 -54 13 -5 7 -27 -22 37 -28 -11 -26 8 28
15978 28 9 18 -36 -14 -14 -30 16 -9 25 -2 15 -11 -21 -27 28 -3 -39 25 -11 -28 24 -10 27 5 -15 -10 -12 9 -39 -5 68 -20
16010 -20 23 2 14 -4 23 -54 21 15 -13 24 12 52 25 -33 6 -7 48 -4 -14 -34 4 28 -8 31 -34 -26 -2 -57 -7 6 -5
16041 -5 25 -36 1 9 10 0 22 -23 27 -14 -18 -41 -24 8 -3 -6 -24 -17 -4 -10 -10 -6 4 -18 34 7 24 36 36 -11 22 -1 -29 36 3
16076 3 -36 -8 -23 -15 8 12 15 0 22 -45 -3 8 5 11 -14 -64 24 -9 -7 19 9 -9 -20 44 -33 18 -9 -28 17 -13 -22 17 15 26
$$ packed form
15846a2J6kJ5j6J8n5N9Nn1K5mM2n4KL8j7m2J4K6l3N6l3k2N3o3J1mO2m6j3J8k1
15878b8L2l4K4KL4o2K4RJ3l0KL8k4l2k1M4J0m2RK4k7P4m1k8P8k5j7l6Q0p2L6j8
15910dk2N7k8j5L6qJ4n8J1RmJ7l0K0n3P3j6l3M4Ko2L0jQM3m6QlL9ll9j6oL0j4
15945b0OoL7j1NK8p1KK4J0l6M2n6N5j3J0k3k0P9o6l2KO7j8J2l4NN9o5J7j5L4K0
15978B8j9Rn4K2%j6M6k5L4k7J7k6j0oN5l1l6O4l6j7N2l4L7k2k0NkK1m8L4P3q8
16010b0M3k1J2j8K7p7P5ok8L7j2M0k7n8L9j3N5n2j0k0L8K4l6L9o5QK4n5N0J3j1
16041eL0o1L7QJj0K2m5N0m1mk3J7L2j1lj8PJ3o%MJ0k2N2k7J7J2%m7L3k3k8O5l3
16076Cl9K8j5QK3MLj5K2o7M2J1lOk5n0Q8l3KK6j0j8j1O4p7N1k7j9M5l0rL9kJ1
$$ plain form
16110 26 6 -15 -5 29 2 13 34 -2 -12 -50 17 -22 -38 -24 30 28 6 22 -41 -13 -26 3 -5 -17 22 -20 11 -7 -19 30 -16
16141 -16 17 -15 -15 22 -6 1 -27 16 -14 3 33 18 66 -12 15 20 1 13 41 -14 16 16 15 -10 24 10 -10 9 45 7 14 -42 34
16174 34 14 -15 15 -5 -17 -7 33 -20 -2 17 -2 -17 26 -2 10 19 62 45 17 28 9 -26 -18 0 1 -4 -5 -12 11 -36 16 2 13
16207 13 16 5 6 -49 -12 4 -16 -11 13 -23 30 7 25 27 18 9 18 -16 -3 -15 -5 7 19 25 56 43 -1 -13 2 -6 -44 -16 2 15
16241 15 -42 -12 -59 -15 14 -7 -9 27 18 13 -11 -62 -20 3 36 -5 -13 -11 -4 21 13 -25 25 -18 14 8 -33 18 -21 28 11 -4 -27 4
16275 4 15 -18 11 -13 -3 -11 15 -58 -14 8 2 20 23 12 -10 -4 13 -7 -11 -9 -7 -6 10 -16 -28 -4 -22 -38 -15 -43 14 39 11 44
16309 44 -11 18 -5 -59 9 -5 -12 -11 -11 -11 4 0 -8 4 -17 29 36 11 -4 -9 21 -44 6 -10 -32 -10 7 45 29 -35 -28 -1 -29 11
16343 11 63 -12 32 22 -14 3 -38 8 -36 -2 -20 -21 -29 -12 9 -5 -1 -3 36 -27 -7 29 9 -9 -12 -35 1 18 34 -15 -45 -4
$$ packed form
16110B6k0k1J0L4k7J1K1l6j0l8O7l9j6J4N4kk2J6o3K8j3K9qj2L9m2L1j8j2M9m6
16141a6L3l2%L7k8Pk8M3l0J7L0j5M8p8K7Nj9J2K8n5L0%jk5L4j4k0J9L6l8Pn6P6
16174C4k0k9L0k0j2J0M0n3J8J9j9j5M3k8J2RM3j7k8J1j9l5QJ8JnjpK3m7N2j4J1
16207A3Lj1Jn5L7J6k0NK4l6N3k3J8KrrRl4J3j2J0J2J2OL1j3m4j2J5ql8K8J8J3
16241A5n7L0m7M4K9k1kL6rnk4n1M2K3L3m1qKPK5ql8N0m3L2om1N1l9M9j7j5k3L1
16275DJ1l3K9k4J0qK6p3M4K2oJ8Lj1k2OJ7k0mKKJJ6k6j2K4j8j6K3k8N7K5k8L3
16309D4n5K9k3n4O8j4pJ%%J5mqJ2k1M6Pk5j5nL0o5N0j6k2K2J7L8j6o4PK7k8M0
16343A1N2p5M4j0l6J7m1M6m4L4j8jqJ7K1j4MkL9o3K0L6k0j8lk3L6J7J6m9l0M1
$$ plain form
16375 -4 -12 50 17 42 -7 -9 -2 9
$$ packed form
16375dqO2l3K5m9kPJ1
16383I
$$ Imaginary data points
##PAGE= N=2
##DATA TABLE= (X++(I..I)), XYDATA
$$ plain form
0 0 0 0 0 0 0 0 0 0 0 0 0 0 0 0 0 0 0 0 0 0 0 0 0 0 0 0 0 0 0 0 0 0 0 0 0 0 0 0 0 0 0 0 0 0 0 0 0 0 0 0 1 -1 1 -7 11 -15 20 -20 23
59 23 -31 34 -44 56 -72 118 -214 1789 3640 4220 3951 2511 688 -1447 -2959 -3757 -3477 -2445 -774
78 -774 1022 2686 3502 3535 2633 1094 -608 -2165 -3039 -3047 -2391 -1064 404 1775 2508 2611 2082 1031 -131
97 -131 -1279 -2028 -2284 -1940 -1140 -111 874 1534 1743 1485 859 62 -626 -1161 -1316 -1187 -691 -162 411 835
117 835 986 900 557 154 -237 -485 -654 -492 -318 -112 159 315 371 269 149 43 -50 -65 -76 -51 -16 -13 39 34
141 34 -58 -105 -88 -57 -23 -47 -29 -71 -51 -56 16 30 51 -29 93 63 10 -109 -225 -220 -198 -181 -51 167 312 500 526 375
169 375 161 -204 -521 -731 -780 -638 -303 200 704 1158 1242 1060 609 -127 -893 -1468 -1664 -1523 -880 22 958
190 958 1680 1951 1707 1069 142 -1000 -1861 -2346 -2277 -1511 -388 948 2007 2544 2478 1728 503 -877 -2037
$$ packed form
0@%%%%%%%%%%%%%%%%%%%%%%%%%%%%%%%%%%%%%%%%%%%%%%%%%%JkKqJ8k6L5m0M3
59B3n4O5p8J00j28J90l32K003J851N80k69j440j823k135j512p98K80J032J671
78g74J796J664Q16L3r02j539j702j557q74qO56J327J468J371P33J03n29j051j162
97a31j148p49k56L44Q00J029R85O60K09k58o26p97o88n35j55J29M96N29N73M24
117H35J51q6l43m03l91k48j69J62J74K06K71J56N6j02j20j06r3j5j1K5L5LN2n
141C4r2m7J7L1L4k4J8m2K0nP2J4K1q0J22l0n3j19j16NK2J7J30K18J45J88K6j51
169C75k14l65l17k10m9J42L35N03N04M54Q4j82m51p36p66n75j96J41O43R02R36
190I58P22K71k44o38r27j142q61m85O9P66J123J336J059N37o6p50j225j380j160
$$ plain form
209 -2037 -2710 -2684 -1974 -745 650 1941 2834 2959 2370 1153 -389 -1825 -2832 -3043 -2438 -1219 347
226 347 1685 2643 2882 2373 1321 -43 -1358 -2353 -2777 -2469 -1578 -259 1064 2120 2551 2328 1438 287
244 287 -914 -1890 -2246 -2047 -1391 -390 640 1427 1812 1795 1342 567 -296 -1077 -1485 -1484 -1073 -443 231 854
264 854 1134 1208 916 464 -62 -481 -775 -819 -666 -315 -16 353 542 498 375 196 -58 -210 -283 -242 -208 -89
286 -89 17 81 66 60 -3 -9 -63 -41 -22 51 89 109 95 -18 -58 -140 -155 -149 -77 -41 45 97 122 128 116 57 -6 -11 -51 -37 -27 -90
318 -90 -39 -80 -80 -62 -57 20 176 238 293 278 191 -19 -234 -460 -619 -624 -441 -123 282 660 904 879 679 206 -304 -784
$$ packed form
209b037o73K6P10J229J395J291Q93J25n89j217j542j436j007k11O05J219J566
226C47J338R58K39n09j052j364j315r95m24L08Q91J319J323J056M31k23q90j151
244B87j201r76l56J99O56J001J030P87L85j7m53p75q63p81m08JM11O30O74O23
264H54K80P4k92m52n26m19k94m4J53L51K99L69J89m4j23j79k54j52p3M1L4J19
286h9J06O4j5oo3on4K2J9P3L8K0j4j13m0q2j5OP2L6Q6N2K5Oj2n9o3nm0J4J0o3
318i0N1m1%J8NP7J56O2N5j5q7k10k15k26j59nJ83L18M05L78K44k5k00m73n10m80
$$ [...]
16383A0
##END NTUPLES=NMR FID
##END=
