##TITLE=31P_DE-80H_X3
 64 sc D2O
 26.2.2025
##JCAMPDX= 6.0         $$ Bruker NMR JCAMP-DX V2.0
##DATA TYPE= NMR FID
##DATA CLASS= NTUPLES
##ORIGIN= UXNMR, Bruker Analytische Messtechnik GmbH
##OWNER= root
$$ XWIN-NMR		Version 3.5
$$ Thu Feb 12 13:59:08 2026 Russian Standard Time (UT+4h)  Yarkov@DPX200
##.OBSERVE FREQUENCY= 81.013821
##.OBSERVE NUCLEUS= ^31P
##.DELAY= (6, 6)
##.ACQUISITION MODE= SIMULTANEOUS
##.ACQUISITION SCHEME= undefined
##.AVERAGES= 64
##.DIGITISER RES= 17
##SPECTROMETER/DATA SYSTEM= spect
##.PULSE SEQUENCE= zgpg30
##.SOLVENT NAME= CDCl3
##.SHIFT REFERENCE= (INTERNAL, CDCl3, 0, 243.863)
##AUDIT TRAIL= $$ (NUMBER, WHEN, WHO, WHERE, WHAT)
$$ ##TITLE= Audit trail, XWIN-NMR		Version 3.5
$$ ##JCAMPDX= 5.01
$$ ##ORIGIN= Bruker BioSpin GmbH
$$ ##OWNER= Yarkov
$$ C:/Bruker/XWIN-NMR/data/yarkov2/nmr/P31/2/audita.txt
$$ ##AUDIT TRAIL=  $$ (NUMBER, WHEN, WHO, WHERE, WHAT)
(   1,<2026-02-12 13:58:21.37 +0400>,<Yarkov>,<DPX200>,
      <created by zg, POWCHK disabled, PULCHK disabled
       configuration hash MD5:
       00 E9 B6 7A A2 85 ED C7 34 08 36 98 17 FE 4E 26
       data hash MD5: 32K
       B9 95 02 49 48 9E B0 BE D4 CC 2B D8 26 93 4A 01>)
$$ ##END=
$$ 
$$ hash MD5
$$ 0B EA 70 75 12 D3 24 99 9B 40 49 D5 43 B4 0D 68
##$RELAX= 
##$RELAX= 
##$RELAX= 
##$RELAX= 
##$RELAX= 
##$RELAX= 
##$RELAX= 
##$RELAX= 
$$ Bruker specific parameters
$$ --------------------------
##$DU= <C:/Bruker/XWIN-NMR>
##$EXPNO= 2
##$NAME= <P31>
##$PROCNO= 1
##$TYPE= <nmr>
##$USER= <yarkov2>
##$AMP= (0..31)
100 100 100 100 100 100 100 100 100 100 100 100 100 100 100 100 100 100 
100 100 100 100 100 100 100 100 100 100 100 100 100 100 
##$AQSEQ= 0
##$AQ_mod= 1
##$AUNM= <au_zg>
##$AUTOPOS= <>
##$BF1= 81.014009
##$BF2= 200.13
##$BF3= 200.13
##$BF4= 200.13
##$BF5= 200.13
##$BF6= 200.13
##$BF7= 200.13
##$BF8= 200.13
##$BYTORDA= 1
##$CFDGTYP= 0
##$CFRGTYP= 5
##$CHEMSTR= <none>
##$CNST= (0..31)
1 1 145 1 1 1 1 1 1 1 1 1 1 1 1 1 1 1 1 1 1 1 1 1 1 1 1 1 1 1 1 1 
##$CPDPRG= <waltz16>
##$CPDPRG1= <>
##$CPDPRG2= <waltz16>
##$CPDPRG3= <>
##$CPDPRG4= <mlev>
##$CPDPRG5= <mlev>
##$CPDPRG6= <mlev>
##$CPDPRG7= <mlev>
##$CPDPRG8= <mlev>
##$CPDPRGB= <>
##$CPDPRGT= <>
##$D= (0..31)
0 1 0 0 0 0 0 0 0 0.06 0 0.03 2e-05 3e-06 0 0 0.0002 0 0 0 0 0 0 0 0 0 
0 0 0 0 0 0 
##$DATE= 1770890300
##$DBL= (0..7)
120 120 120 11 120 120 24 19 
##$DBP= (0..7)
150 150 150 150 150 150 150 150 
##$DBP07= 0
##$DBPNAM0= <>
##$DBPNAM1= <>
##$DBPNAM2= <>
##$DBPNAM3= <>
##$DBPNAM4= <>
##$DBPNAM5= <>
##$DBPNAM6= <>
##$DBPNAM7= <>
##$DBPOAL= (0..7)
0.5 0.5 0.5 0.5 0.5 0.5 0.5 0.5 
##$DBPOFFS= (0..7)
0 0 0 0 0 0 0 0 
##$DE= 6
##$DECBNUC= <off>
##$DECIM= 4
##$DECNUC= <off>
##$DECSTAT= 4
##$DIGMOD= 1
##$DIGTYP= 9
##$DL= (0..7)
0 0 52 120 120 21 21 25 
##$DP= (0..7)
150 150 150 150 150 150 150 150 
##$DP07= 0
##$DPNAME0= <>
##$DPNAME1= <>
##$DPNAME2= <>
##$DPNAME3= <>
##$DPNAME4= <>
##$DPNAME5= <>
##$DPNAME6= <>
##$DPNAME7= <>
##$DPOAL= (0..7)
0.5 0.5 0.5 0.5 0.5 0.5 0.5 0.5 
##$DPOFFS= (0..7)
0 0 0 0 0 0 0 0 
$$ [...]
##$SUBNAM1= <"">
##$SUBNAM2= <"">
##$SUBNAM3= <"">
##$SUBNAM4= <"">
##$SUBNAM5= <"">
##$SUBNAM6= <"">
##$SUBNAM7= <"">
##$SUBNAM8= <"">
##$SUBNAM9= <"">
##$SW= 400.765351723535
##$SWIBOX= (0..15)
0 1 3 0 0 0 0 0 0 0 0 0 0 0 0 0 
##$SW_h= 32467.5324675325
##$TD= 32768
##$TD0= 1
##$TE= 0
##$TE2= 300
##$TE3= 300
##$TEG= 300
##$TL= (0..7)
0 120 53 12 22 120 120 120 
##$TP= (0..7)
150 150 150 150 150 150 150 150 
##$TP07= 0
##$TPNAME0= <>
##$TPNAME1= <>
##$TPNAME2= <>
##$TPNAME3= <>
##$TPNAME4= <>
##$TPNAME5= <>
##$TPNAME6= <>
##$TPNAME7= <>
##$TPOAL= (0..7)
0.5 0.5 0.5 0.5 0.5 0.5 0.5 0.5 
##$TPOFFS= (0..7)
0 0 0 0 0 0 0 0 
##$TUNHIN= 0
##$TUNHOUT= 0
##$TUNXOUT= 0
##$USERA1= <user>
##$USERA2= <user>
##$USERA3= <user>
##$USERA4= <user>
##$USERA5= <user>
##$V9= 5
##$VALIST= <valist>
##$VCLIST= <CCCCCCCCCCCCCCC>
##$VD= 0
##$VDLIST= <DDDDDDDDDDDDDDD>
##$VPLIST= <PPPPPPPPPPPPPPP>
##$VTLIST= <TTTTTTTTTTTTTTT>
##$WBST= 1024
##$WBSW= 4
##$XGAIN= (0..3)
0 0 0 0 
##$XL= 0
##$YL= 0
##$YMAX_a= 1059
##$YMIN_a= -1031
##$ZGOPTNS= <>
##$ZL1= 120
##$ZL2= 120
##$ZL3= 120
##$ZL4= 120
##$ABSF1= 60
##$ABSF2= -190
##$ABSG= 5
##$ABSL= 3
##$ALPHA= 0
##$AQORDER= 0
##$ASSFAC= 0
##$ASSFACI= 0
##$ASSFACX= 0
##$ASSWID= 0
##$AUNMP= <proc_1d>
##$AZFE= 0.1
##$AZFW= 0.5
##$BCFW= 1
##$BC_mod= 2
##$BYTORDP= 1
##$COROFFS= 0
##$CY= 9.86611175537109
##$DATMOD= 1
##$DC= 1
##$DFILT= <>
##$DTYPP= 0
##$F1P= 182.462994727601
##$F2P= 168.069089081705
##$FCOR= 0.5
##$FTSIZE= 0
##$FT_mod= 0
##$GAMMA= 1
##$GB= 0
##$INTBC= 1
##$INTSCL= 1
##$ISEN= 30
##$LB= 1.5
##$LEV0= 0
##$LPBIN= 0
##$MAXI= 11.51145
##$MC2= 0
##$MEAN= 0
##$ME_mod= 0
##$MI= 1.244541
##$NCOEF= 0
##$NC_proc= 0
##$NLEV= 6
##$NOISF1= 0
##$NOISF2= 0
##$NSP= 1
##$NTH_PI= 0
##$NZP= 1
##$OFFSET= 243.8632
##$PC= 1.4
##$PHC0= 1673.609
##$PHC1= -1.240479
##$PH_mod= 0
##$PKNL= yes
##$PPARMOD= 0
##$PSCAL= 0
##$PSIGN= 0
##$REVERSE= no
##$SF= 81.0140731611343
##$SI= 65536
##$SIGF1= 0
##$SIGF2= 0
##$SINO= 80
##$SIOLD= 65536
##$SREGLST= <31P.CDCl3>
##$SSB= 0
##$STSI= 0
##$STSR= 0
##$SW_p= 25641.0256410257
##$SYMM= 0
##$S_DEV= 0
##$TDeff= 0
##$TDoff= 0
##$TI= <>
##$TILT= no
##$TM1= 0
##$TM2= 0
##$TOPLEV= 0
##$USERP1= <user>
##$USERP2= <user>
##$USERP3= <user>
##$USERP4= <user>
##$USERP5= <user>
##$WDW= 1
##$XDIM= 64
##$YMAX_p= 0
##$YMIN_p= 0
$$ End of Bruker specific parameters
$$ ---------------------------------
##NTUPLES= NMR FID
##VAR_NAME=  TIME,          FID/REAL,        FID/IMAG
##SYMBOL=    X,             R,               I
##VAR_TYPE=  INDEPENDENT,   DEPENDENT,       DEPENDENT
##VAR_FORM=  AFFN,          ASDF,            ASDF
##VAR_DIM=   16384,         16384,           16384
##UNITS=     SECONDS,       ARBITRARY UNITS, ARBITRARY UNITS
##FACTOR=    3.08e-05,      1,               1
##FIRST=     0,             0,               0
##LAST=      0.5045964,     0,               0
##MIN=       0,             -1031,           0
##MAX=       0.5045964,     1059,            0
$$ Real data points
##PAGE= N=1
##DATA TABLE= (X++(R..R)), XYDATA
0@%%%%%%%%%%%%%%%%%%%%%%%%%%%%%%%%%%%%%%%%%%%%%%%%%%%%%%KnPj0J3j5J8
61A0k0K0k3L7p5L21O89o35n83n28k44J34M57N37M41K93J01l10m33o15m35j35J50
84h46N65N01N59K02j51m68o03m02k54N6L49N21M69K75P5j51m71n34m70j91J43
105h26N37N96M04K25j33m28n64l87k89K2L17M78M01M04J61j54m67n56n02j59J52
126g68M07N60N19J85j42l55n15m20k11l8K56M03L90M08J98j41l99n55n01j83J18
147g84M32N34M26K32o6l67m77m08k64p6K32L91N20M29J24j36l85o22m59k25J60
168g89M22N47M55J79o0l28m10m22k80j01J98L95N06L49K44j40m44n06n02j33R5
189g25L74M19M85J97j01k51l50l85l52p5J83L56M66M27K18j93l99m90m13j99N6
$$ plain form
0 0 0 0 0 0 0 0 0 0 0 0 0 0 0 0 0 0 0 0 0 0 0 0 0 0 0 0 0 0 0 0 0 0 0 0 0 0 0 0 0 0 0 0 0 0 0 0 0 0 0 0 0 0 0 0 2 -3 4 -6 7 -8 10
61 10 -10 10 -13 24 -51 270 959 324 -259 -787 -1031 -897 -440 97 538 831 932 622 189 -426 -861 -996 -846
84 -846 -281 220 779 981 830 362 -241 -643 -897 -841 -492 29 498 773 848 697 226 -308 -778 -969 -826
105 -826 -289 307 711 936 803 375 -189 -576 -865 -843 -526 -48 353 757 918 764 297 -259 -761 -920 -768
126 -768 -361 199 718 903 761 406 -109 -529 -740 -778 -522 -119 271 679 877 736 337 -218 -719 -902 -784
147 -784 -352 182 608 840 774 407 -70 -478 -742 -818 -586 -195 325 754 878 742 357 -265 -724 -949 -789
168 -789 -367 180 635 814 754 426 16 -406 -686 -787 -589 -194 312 661 905 765 321 -185 -687 -820 -725
189 -725 -351 68 553 750 649 398 48 -337 -689 -764 -581 -225 241 668 886 693 294 -196 -609 -808 -752
210g52M02M71M08K18j8k51l54m70l07j42J64L97M69M22K39j17m29n40m30j26Q3
231f63K75M19M45J91L7k05l47m31l48k03J68L36N94L92J66p9m49m31m43k21J42
252f55K59M31M03K77kj42k72n78l29k50J50M00N09M38K16j77l17m76m08k23M8
273f98K22M54M05K93O6j21l29n67l74k16J54M37M74M55J64r2l52m22l68k79o8
294g62K78L82M20L36J07j37l29n06m32j41P1M23M85M15J63o3l62l68m28k25n6
315g29J96L80L88L76K13j62l67m71m62k23J15L77N07M41J92p7k56m48l51k86r9
336g46J92L11M69L81J93o9l79m85m85k39R9L48N22L73K29m5j83l79m27l15o6P1
358f30L72M33M29J77j9l34n26m41l02J00K99M55M12K48P4k11l25m23m17j47J04
$$ plain form
210 -752 -350 121 529 747 729 478 124 -346 -653 -795 -631 -234 235 657 896 779 350 -190 -620 -746 -663
231 -663 -388 31 476 667 704 499 152 -279 -627 -830 -662 -326 268 660 826 747 298 -133 -576 -797 -655
252 -655 -396 35 438 715 713 571 299 -279 -608 -858 -708 -308 201 639 855 678 361 -115 -523 -746 -698
273 -698 -476 -22 383 676 742 621 292 -275 -649 -865 -711 -274 200 655 819 727 375 -47 -415 -694 -762
294 -762 -484 -102 318 654 761 624 295 -211 -643 -784 -713 -290 195 610 773 710 348 -20 -448 -673 -729
315 -729 -533 -153 235 611 824 662 295 -176 -638 -861 -746 -369 138 579 771 694 438 -10 -361 -647 -746
336 -746 -554 -243 226 607 800 731 352 -133 -618 -857 -758 -410 112 485 714 669 486 107 -320 -635 -701 -630
358 -630 -258 175 604 781 762 428 -98 -539 -841 -741 -442 13 425 673 747 536 211 -212 -629 -776 -672
379f72L31M79M02L08j06l67m89m11k22L6K50M21M26K38J11j72l48m25l13k38J00
400f61L12M60M16K14rl33m64m09k55lK26M19L81K87J25p5l76m55k95k90N0L30
422d05M80M44K22j3k86m84l89j97o7J72L58L61L79R6o9k63m29m44k36K9K98M59
444A6M74K33k9k61m41l63j71j08J18L80K92L94J02o3k13m42l87k68P9J94M82M50
466D68J66K8l11l37l29k41p8J48K04M28L10J82Ol50l77m13k80N4K71M80L57K81
488F67m9k10l37l28k86p1N9K91L66L40K54q2k55m90l37k70M1L29L93L20K59nj20
511D79l74l43j96k03J07K37L88L71K91j36k25m82m09k19N3K34L86M04K25J3j85
532D16k46m06k61j55J9L33M01M07K28m5k92m73l68k27%K86L82L50K15M5j18k67
$$ plain form
379 -672 -341 138 540 848 742 375 -114 -525 -747 -711 -461 -40 386 624 735 563 215 -210 -523 -761 -661
400 -661 -349 111 527 741 732 399 -65 -474 -729 -732 -506 -87 294 581 706 631 255 -200 -495 -785 -735 -405
422 -405 75 519 741 728 442 -42 -431 -628 -695 -523 -165 196 575 671 602 339 -90 -534 -770 -741 -443 16
444 16 490 723 694 433 -8 -371 -542 -650 -532 -152 140 534 636 573 360 -82 -469 -737 -658 -464 18 468
466 468 634 662 351 14 -315 -556 -634 -486 -282 146 456 638 644 294 -83 -496 -776 -722 -451 29 386 667
488 667 618 408 71 -257 -543 -614 -555 -264 102 442 696 614 359 -131 -468 -738 -697 -368 25 345 604 599 479
511 479 105 -238 -434 -637 -530 -293 95 466 757 621 396 -86 -495 -714 -661 -427 -41 363 588 601 416
532 416 170 -236 -497 -652 -633 -300 101 508 736 691 399 -74 -442 -669 -669 -383 -1 349 564 609 491 224
554B24l99l23j72O2L08L49M83K11n4l17m56l27k53J8K63L43L18K54R9r3l05m08
576a75l20j72K5L05M35M05J77o2k46m27l69j73l7K03L60L22L31K8n4l28l24l89
598d85k42K1L76M24M13K32o2k97l88l54k72k4J83L35L84K39J68l6k91l88m36k06
620g06L3L06M52L71K59m3k37m22l37k13j26J54L33L30L99J09j7k91l97m18k58
641g19m8L33M63L92K49j3k37l25l52l10p3J52K27M16K84K21J4k73l93m37k92N8
663f63K86L84L58K49J8j94k79l78k93j09P1K79L98L51K41n1k45m92l82k49K5K86
685c89L02M32K45M5j36l13l75k66j84L6K29M05M17K34mk55m14l65k77p1K58L79
707f7L54K19Q2j17k52l23k82k32J9K62L70M04J90O6k24m92l66k72M5J51L69L26
$$ plain form
554 224 -175 -498 -670 -608 -300 49 532 743 689 372 -84 -411 -664 -646 -383 -40 278 532 631 538 233 -175
576 -175 -495 -667 -642 -337 98 503 680 618 372 -55 -424 -597 -634 -431 -71 251 582 610 556 228 -96 -485
598 -485 -727 -706 -330 94 507 739 677 380 -8 -362 -634 -658 -475 -140 244 483 651 615 324 -64 -500 -706
620 -706 -673 -367 85 456 715 672 435 13 -324 -537 -663 -509 -176 154 553 662 645 354 -43 -461 -719
641 -719 -767 -434 29 421 670 657 420 95 -257 -567 -640 -488 -261 155 439 660 674 401 8 -429 -721 -663
663 -663 -377 7 365 614 632 438 159 -219 -512 -621 -550 -271 127 478 719 668 423 -69 -451 -700 -675 -389
685 -389 -87 345 590 635 499 186 -189 -455 -639 -603 -374 31 448 682 678 423 9 -356 -633 -704 -446 -67
707 -67 287 506 588 471 219 -104 -386 -618 -599 -337 33 437 627 693 469 -23 -389 -661 -616 -465 -96 230
729B30K42J19q0j88m58k89k07L6K29L57M37K12M0k85l87l95k04l5J47M03K26L16
751D66J19o4k03l56l35k75OK23L96L80K68j8k65l16l28k01q4J64K77L12K39J61
773E66m5k14l00l81k65rL12L14L94K32k0k14l24l11k05j16J54K53K97K71K18n5
795E52k52l30l74j59j7J74M04L12K84n6j53l07k95k23n1O5K19L02K77K35l3k18
817C56l86l57k15l1K86L56L06K08J0j86k63k72k82r7R9J84L24K66K39J6k31l55
839b5l37k47J7K29L31L50J60M1j26k87k54k89p1J6J72L60L27K23nk13m15l47j88
862e78LJ79L53K88J94P8j75k36k07k91j54P4K13K84L09J91R3l00k90l80k65O6
884e51J60L19L14K09J8p0j87l18k60j34o4K20L79L22K03R1l14k80l75j57m2J75
$$ plain form
729 230 472 591 511 323 -135 -424 -631 -595 -366 -9 428 640 680 395 8 -387 -591 -626 -479 -76 150 466
751 466 585 521 318 -38 -373 -648 -642 -419 -23 357 625 607 342 26 -302 -503 -587 -423 -146 166 405 566
773 566 521 307 7 -374 -639 -648 -336 -22 372 604 584 370 46 -265 -470 -586 -432 -179 118 389 607 552
795 552 300 -30 -404 -563 -580 -406 -2 310 594 538 385 78 -217 -440 -491 -426 -207 95 372 607 574 356
817 356 -30 -387 -602 -633 -347 9 315 523 533 347 84 -188 -470 -567 -468 -284 40 306 545 561 330 -25
839 -25 -362 -609 -592 -363 -32 318 478 519 393 106 -148 -437 -508 -492 -320 40 367 590 585 372 -43 -390 -578
862 -578 -575 -396 -43 245 439 517 342 106 -101 -392 -546 -472 -259 25 334 525 618 318 28 -352 -617 -551
884 -551 -391 -72 242 451 469 399 212 -106 -366 -500 -564 -344 35 357 560 651 337 57 -318 -475 -517 -342
906c42K37K78K45J44j12j56l22l58j69k5K31L03M01K26k1j84l26l09k21k0J12
927c88J64L68K51J17K8k14l08l08k70l3K10L38L40K33K5j41l07l57k27n4J14K35
949a84K41K94J25P3k11l08l64k27rJ56L73L81J89pj42k74k64k22j28Q4J35L35
971D6K60K28j8j60l03l80j99p7K53K90L26K01K7j12k13l12k25q5J5J40L00K96
993B98K13J1j77k11m10j97n7K02K34L31K29K6r2k25k82k27r3j5J72K28L38K03
1015D99P3j71l46l17k20p2K14K52K94J82J15j15j03l27k38j71k8J08K95L12K23
1036D59P7j54k70l54j85r6J83K03K77K18Q3Mj81k74k40j48o1R5L22K74K51Pm9
1059D41l54k67k48j1Q5J20L89J10J30K7j21k73k13k35m1N4L36K49K40J06j74k50
$$ plain form
906 -342 -105 173 418 562 450 294 -28 -386 -555 -580 -349 -46 355 581 560 376 50 -259 -480 -500 -388
927 -388 -224 144 395 512 540 326 18 -290 -560 -593 -383 -45 295 528 553 412 105 -252 -479 -533 -419 -184
949 -184 57 351 476 549 338 30 -334 -561 -570 -414 -41 340 529 522 380 106 -158 -380 -508 -424 -289 46
971 46 306 534 516 356 53 -327 -526 -603 -350 -60 266 467 494 382 169 -143 -368 -453 -438 -298 2 298
993 298 511 522 345 134 -276 -473 -530 -328 -94 237 466 492 400 175 -107 -334 -427 -442 -270 -42 296 499
1015 499 572 401 55 -262 -482 -554 -340 -88 206 388 503 388 285 -42 -280 -451 -479 -371 -76 236 459
1036 459 536 382 112 -242 -427 -523 -340 -137 140 358 441 445 264 -10 -250 -398 -459 -364 -42 232 483 490 441
1059 441 87 -180 -428 -439 -354 -234 155 265 395 422 301 28 -185 -420 -461 -407 -71 178 418 524 350 100
1081A00k88k09J6L3J92K25K62M0P1j34k69k46k17n1R8L10K45L50q5n8k77k64j76
1104c32r4O0J83K34J99J42K6j29k17l23k05o0J52K83L29J95k3q6k35k40j39j38
1126d18J20P2K03K58J75K1j18k30l14j60j16J50K19L55J96O4j25k37k14j93o6
1147c58o1J43K64K00K31Oj33k38k54k21k3R7K14L39J77lm7j23k78j88j28m6J10
1170c20K45L22J67L8p9k50l01k75k1J23J58L31K10O1j01j42j98k50j01m2R5K46
1192h4L12K00K5j12k80k22k82K1Q0K00K94J33J13p8j02k28k23j71o5J51K34K96
1214B12K51K4j13k79k76k07o1Q4K28K05K05J39k8j57k08k62j25j17J28K60K86
1235A89K43M3j28k53k37j70q9N6J77J59K44J39O7k13j18l38j59j18R1K87L13K19
$$ plain form
1081 100 -188 -397 -381 -348 -156 69 331 371 442 308 39 -207 -424 -475 -377 -67 178 528 443 385 108 -156 -332
1104 -332 -426 -366 -183 51 250 392 418 289 72 -251 -456 -516 -364 -81 248 443 420 334 99 -141 -280 -418
1126 -418 -298 -226 -23 235 410 431 313 83 -231 -391 -507 -357 -138 217 413 477 352 115 -99 -292 -358
1147 -358 -419 -276 -12 188 419 425 292 54 -200 -421 -444 -347 -133 206 383 380 333 210 -68 -256 -384 -430 -320
1170 -320 -75 247 414 452 373 123 -178 -453 -474 -351 -193 138 348 409 308 166 -32 -282 -383 -425 -330 -84
1192 -84 228 428 453 341 61 -161 -443 -422 -342 -142 152 285 398 320 218 -10 -233 -404 -469 -318 -84 212
1214 212 463 487 374 95 -181 -388 -449 -365 -137 68 273 412 384 227 19 -243 -368 -485 -357 -97 189
1235 189 432 475 347 94 -143 -313 -402 -346 -169 -10 234 373 440 227 109 -229 -388 -506 -415 -128 185 404
1257D04N8j37k27k65j58p0O7J07K08K38J56j7o5j46l58j80n6O4K69K21K43P6q9
1280C43k15k22j76j30N6J30J87K58J11R5j67j40k76j97j04L0K84K51K12R5r0j81
1302A54j86k27j13O2O5K13J50K45J4j6k17l29j50p0J17J20L12J78R8j06j62j91
1324c9j44j84M4P4J75K21J44J22q6k06k77j92l6R7J63K18K15N9q8q7j89j42j42
1347b80l1M7J41K83J27J14j04j43k03k26p6L6J62K37J53J00pj50j03k07j45r5
1369c70J02J62K12J71J27j46j36k54j86n3J15J64J04K12RJ4j1j74j28k40k3L3
1391b96K08K16J96M0n7j54k58j89k2P2J26J33J49R9N0o2j98j31k09j6K9J32K58
1414A16J93M7o2j92j87j28q3R8P9J38J18J17M7n3j26k63q9j01L0J94K09J98P2
$$ plain form
1257 404 462 325 98 -167 -325 -395 -328 -221 -13 225 381 364 299 153 -205 -385 -441 -377 -108 113 356 432 343
1280 343 128 -94 -270 -400 -344 -214 -27 231 342 437 270 130 -146 -343 -447 -417 -133 118 330 425 335 154
1302 154 -32 -259 -372 -310 -245 -32 118 363 377 361 144 -185 -335 -405 -288 -168 144 322 420 314 152 -39
1324 -39 -183 -367 -323 -249 -74 147 291 413 327 121 -156 -348 -384 -287 -124 94 309 368 280 193 4 -138 -280
1347 -280 -311 -264 -123 160 287 401 297 154 -49 -275 -351 -315 -153 84 237 337 330 180 77 -130 -275 -370
1369 -370 -268 -106 106 277 404 258 122 -132 -318 -371 -256 -92 12 224 233 247 236 62 -66 -306 -329 -296
1391 -296 -88 128 324 364 307 153 -105 -294 -316 -244 -118 15 164 263 313 251 53 -78 -287 -303 -274 -142 116
1414 116 309 356 294 102 -85 -213 -296 -198 -119 19 137 254 301 248 122 -141 -230 -331 -301 -107 102 300 372
1437C72m2j91k34j08r2O6O5J08J41J38J17p2j69j76j63j07P2J61K02J52R5l8j85
1460A12j78j47l7oP3K10O0J31J45r4j72j35k03q1N3J71J75J91P1r0j11j46j46
1483a54j08j3N6J39J89J25Q3p0j21j90k08p9Q0J80J65J88j9l0o4j48r8j25j8J7
1507b23N9K20J83Q7q9j02j97k11n6K9J84J61J41L3L4j19q6j19j52m6K6J35K19
1530A11J25Q1l3j36k20j82m0P1J35J34J00Q9j0p7j06j07j79knJ16J85J78O8l0
1554B66j89j51j61k5K3J23J21J53P5K5o7j49j21j13p2JQ9J82K03P6k2j81j63j06
1578a83j3m9J03J10J12J01M0J7j08k01j17j32J12J04J71K09K1r5m4k05j50L6n2
1601b13R6L6J78N6O7J4j09j51j37j14J6J06K28J40M4m2j30j22j09o0K3N2R2Q9
$$ plain form
1437 372 330 139 -95 -203 -295 -229 -164 -56 85 223 340 268 99 -77 -240 -347 -275 -114 88 240 335 297 112
1460 112 -66 -213 -250 -256 -183 27 87 218 363 269 97 -38 -241 -322 -269 -98 77 268 339 249 138 -8 -154
1483 -154 -262 -275 -219 -80 109 234 317 247 126 -64 -272 -351 -271 -91 74 262 243 213 149 1 -97 -222 -240 -223
1507 -223 -164 56 239 326 237 135 -62 -273 -329 -300 -116 45 186 219 253 134 48 -71 -223 -269 -243 -108 111
1530 111 236 317 284 148 -72 -254 -294 -223 -88 46 146 235 225 148 42 -65 -244 -246 -251 -135 50 228 296 266
1554 266 77 -74 -235 -260 -237 -114 7 160 235 260 193 44 -77 -190 -262 -261 -172 10 213 289 267 86 -77 -183
1578 -183 -196 -245 -142 -32 80 181 221 238 130 -71 -188 -320 -208 -104 67 276 297 202 158 -47 -197 -161 -213
1601 -213 -117 -81 97 153 220 234 125 -26 -163 -277 -261 -155 73 213 257 215 85 -37 -146 -206 -183 -131 -39 50
1625E0J22N0ko1k38r1j33J2J76J69J33L9o3j09p5j10m5k0M4R5M7K09M4M5j78j45
1651c5j14n2n3J16J87O7J47o9o1j33p2j01k3J0Q1J18J48N5k5n2k26q8l1OQ3J41
1677B4R8N9ln5o3q7r5o6J1N6J34J28J13n2q4j36j53l8J1J10R3J40L2l5oq7j14
1704f5n2q5PJ16M0K05P6K6j14j88q8q8l1J81J02Q5k1N0J2q7r0r6j01kJ09J78N3
1731A32P7ln6j23j61l0%R3J18K4K0O6n9J6p4j81p8M0R8J00J63J25j12j22j27k1
1757g5j10P9J6N6P2R4N3ll8j47r8q2j9J34J57J06K6Oj41j09p1m4m0P2L2J31Q2
1784A39J4P1j30j09j06p2j5J42J11J03O2k7j21l1o9q2k7P9qJ32M9N8N7p1j80j17
1810a48k5J0J19J24M6P9l5m4j60j3k7q1O6J3J12P5J52j00j00p3j26k2J4N7J68
$$ plain form
1625 50 172 222 220 159 -79 -170 -303 -291 -115 54 187 226 163 54 -21 -131 -176 -196 -152 -57 -10 199 243 288 110 -35
1651 -35 -149 -201 -254 -138 49 116 263 194 133 0 -72 -173 -196 -186 -105 13 161 216 191 139 -87 -175 -206 -200 -117 24
1677 24 122 181 178 123 60 -27 -122 -188 -177 -121 13 141 254 202 118 -18 -171 -209 -198 -88 5 145 177 142 136 49 -65
1704 -65 -117 -202 -195 -79 -39 166 242 268 154 -34 -122 -210 -241 -60 42 127 106 156 168 81 -9 -105 -206 -208 -99 79 132
1731 132 209 206 150 27 -134 -164 -164 -71 47 71 91 157 98 114 40 -141 -219 -179 -81 19 182 307 195 73 -54 -75
1757 -75 -185 -106 -90 -34 38 132 185 182 144 -3 -101 -183 -202 -68 89 195 221 227 86 -23 -94 -138 -178 -106 -74 57 139
1784 139 153 224 94 -15 -121 -193 -208 -66 45 148 210 183 62 31 -38 -120 -147 -68 -76 56 105 163 220 149 -31 -148
1810 -148 -173 -163 -44 80 126 205 170 126 -34 -47 -74 -155 -89 -76 36 111 263 163 63 -10 -136 -158 -144 -87 81
1835H1M0P9l5p6q6l5o9l4K0K3J13Q7O3K0q4j29q7r5N6R4J08J5P4m6j2l9p0p4o3
1864a61j0Q7Q7R0J23l6r4j15j40K3M5J4Q7Q4L3K2n8j8o5p9q9OO2N6K02J3no1q1
1893B2j55l7K0M9J02M5N5l0M4o6l9j27j0k2K6J19J45J5N5j75q7o7l9M2j9J25%
1920iO0Q9p2L2j11q4m7j0Q7P3Q5J23J1j93l2j14m0L1Q0k1Q3O1rlM4q8j02p2k0
1949a68P8J16O6J7%k9q0r0n1L8K3M3N3L6Q6k6K6j26o6j24N3J9P7J05N7l5n2l7
1977IMr6%m6RP0Q1Q4K0n3q6j07l0qJ09M5O9L3k6J9r1k6p4LmRL3J47L9k8j7j02
2009a1r4%n2J02P7O0l5rJ9p4j8j0n4J5J4M6O6P8oj2j43k8o6j7R8M5N9l1J3NJ4
2040E1j5q7n4rJ03M1L5P4j3o5n6q5Nn7L4P8L6N1l4M4jp0q1kJ6p1J34N2Q0lo9j07
$$ plain form
1835 81 121 200 165 89 3 -32 -101 -135 -115 -92 21 108 171 191 107 -22 -109 -204 -148 -54 54 69 143 97 85 46 -24 -98 -161
1864 -161 -171 -84 3 93 216 180 86 -29 -169 -146 -101 -87 0 84 117 139 81 63 -2 -81 -170 -164 -102 -46 156 169 164 103 22
1893 22 -133 -170 -150 -101 1 46 101 71 115 49 10 -117 -127 -149 -123 -4 141 156 211 36 -51 -118 -157 -115 -134 -9 -9
1920 -9 51 140 68 100 -11 -95 -142 -152 -65 8 93 216 227 34 2 -112 -152 -121 -41 -62 21 82 73 70 114 26 -76 -148 -168
1949 -168 -90 26 92 109 109 80 0 -90 -141 -103 -80 -37 16 52 138 112 138 12 -54 -178 -125 -106 -29 76 133 98 46 9
1977 9 13 -83 -83 -129 -120 -50 31 115 135 82 -4 -111 -141 -149 -40 5 74 107 81 100 9 -17 -91 -88 -92 -83 -50 97 136 108 91 -11
2009 -11 -105 -105 -157 -55 22 82 47 38 57 -17 -35 -45 -99 -84 -70 -24 42 120 114 102 -41 -69 -135 -152 -54 -9 50 19 32 37 51
2040 51 36 -51 -105 -114 -11 30 65 139 126 61 5 -80 -75 -132 -98 -20 16 67 33 77 76 6 -75 -77 -61 -132 2 54 134 131 62 -45
2072d5l0k4P3k8N4N1l7N3M8m8pr3n8L7k0J06P6rQn6r5j4j8MN7J3%K7K0Q5m8p7
2104Em6o8K6kJ28O0k4M2q6oj3p3O0j6j4%P8J6K6Jn9q9k8j2L9P7P7%l0Jq4k7PJ4
2138b0m3l0L2Q8M6K8l6n1m6k4k9P6k4J39l5rl0qQn4j3m0L3LP7M3LK1j12n2J6p0
2170a13J19L6m8R0n4J9Jl3k0q2O2m6N2M4J5J02o3n9n1p4K1P4K9J0qK6K8k5J8j15
2200d5L8n4K6j8Q9P2l8K3q2r1J3RL7J7M8k0J8J9Lnl1kr7K8J8RJ30p3j9k1m2Lk
2233d0l3J14Qq0Q1j5j0j2k1j0r9PK2J06R0p4J9p0m6rM0M2q1L9M3PK1kPpj21j9
2265a03N8L4K2P7k1r7O8o6K0j0Nk3rO1j1P7j2J3q9l4NQL1J5K4j2j1k1k5K7k4k2
2297d5JRL1J1P1j3o4k3l8pN1k4J16n3K4k1k4l8N2pn3Pl1N2%P3l6K0l9o8pO6RK3
$$ plain form
2072 -45 -75 -99 -26 -54 0 51 14 67 115 67 60 -33 -91 -54 -74 32 108 99 107 51 -44 -58 -76 -72 -15 -2 -2 25 45 130 82 5
2104 5 -41 -109 -83 -85 43 103 79 121 35 29 16 -57 3 -13 -27 -27 51 67 93 94 35 -54 -82 -94 -55 22 99 99 69 70 -14 -41 -34 -20
2138 -20 -63 -93 -61 27 73 101 65 14 -32 -56 -85 -9 -33 106 71 62 32 24 32 -22 -35 -75 -42 -39 38 81 84 105 -7 -59 -43 -113
2170 -113 6 42 -6 84 30 49 50 17 -3 -85 -23 -69 -17 27 42 144 81 22 -29 -103 -82 -8 21 31 23 49 77 52 70 -45
2200 -45 -7 -61 -35 -53 36 108 70 93 11 -80 -67 -58 -21 -4 44 24 42 61 64 59 28 26 -71 -43 -25 -16 114 41 22 1 -41 -38 -40
2233 -40 -73 41 49 -31 50 35 25 13 -8 -18 -117 -110 -88 18 108 34 53 -17 -63 -72 -32 10 -71 -32 11 18 39 37 44 37 -84 -103
2265 -103 -45 -11 11 88 67 -30 38 -28 -8 -18 -13 -36 -45 16 5 82 70 83 -6 -40 -35 -27 4 19 43 31 20 -1 -26 1 -23 -45
2297 -45 -44 -35 -4 7 78 65 1 -22 -60 -67 -16 -40 76 23 47 26 2 -36 16 9 -44 -37 -68 -16 -16 57 21 41 2 -66 -73 -7 2 25
2331B5Loo0P4J1o4L9m2k3LkN9L3mn1l9k5N1n4N2J7n2P6n6M5nj2k6mJ3l0O1MN0
2365F1Qk3m0j6M7j8J5q6K6N1m3O0rj6j9l5n1N7M1JMOm8J8m2P5n5M1mo1K0O9M3
2398G7ko1k6oo0N1M9j3P0n9n4K3l2K4K7k2qk2L2Mj0J07j00Lk5J3K4M3Jl3J8q9
2430e6J7O0L0l8l5L0k9k1R1J1j9k3j6jnLJ8Mk0Om1K1J6N5m5L0j10P3QL0Ln0l9
2463d2O5n6J7L2J5Jrp4N1j6L3N2m6m7m0j4P0N7j1k3J5k8q9J17m8J3j3k3M1l1Q2
2494E1l9J4%p7mM7rL6K0j8j5k5L0pM4l3l2Qj8R4o6N0j7l5lk5PJ1J5N4l3j6j9k1
2528c1M5N4p6l7j9N0P1l3Q6j09J2q0M6RM5J6l9j9K5J0k9L0PJ2o3k9L1J2J1M4j1
2559D1n3Om5O5k7KLO0o3J2N5J9l2p9Mk0MO5l6Q5j3q1K7RKm0M9p3P2kkJ3Qo1k2
$$ plain form
2331 25 28 22 -38 36 47 -17 22 -20 -43 -40 -42 17 50 46 -5 -44 -69 -18 -72 -20 -3 -55 21 -35 10 5 -7 -33 -37 -24 -54 7 11 61
2365 61 69 46 6 -10 37 19 34 -52 -26 25 -18 42 33 17 -2 -37 -88 -31 10 11 15 21 -27 -9 -51 24 -31 10 6 -55 -35 34 77
2398 77 75 14 -12 -18 -78 -27 22 9 79 20 -34 -11 -43 -19 8 -14 -22 -44 -12 -8 -18 89 -11 -8 -33 -20 4 47 48 15 33 -56
2430 -56 -39 21 51 13 -22 8 -21 -42 49 60 41 18 2 1 -4 -1 17 21 1 7 -34 -13 3 58 13 43 -67 6 14 44 47 -3 -42
2463 -42 23 -33 -16 16 31 32 23 -51 0 -16 17 69 23 -24 -64 -78 -8 49 38 15 30 2 -87 30 -18 -5 -18 -41 0 -31 51
2494 51 12 26 26 -51 -55 -8 -17 19 39 21 6 -19 11 4 48 15 -17 -9 -27 67 1 51 34 -1 -4 -29 -22 -11 4 58 25 9 -10 -31
2528 -31 14 68 -8 -45 -64 -14 57 24 110 1 13 -67 -21 -12 33 49 10 -9 16 26 -3 27 34 46 -17 -46 -15 -3 8 52 41
2559 41 -12 -6 -51 14 -13 -11 -8 52 -11 1 56 75 43 -36 -32 -52 -48 17 -19 66 53 -28 -1 8 10 -30 19 -54 18 16 14 27 35 -26 -48
2594d8k7L6L2K7mO7j01M2r5P0j7j6j8M7j1K5LM2qq1O9j43L4R3j0J4L6m7j4M3n2
2625a2L6k2m9K8m3P2j7Q9l4k0o6k5O1JoN3o4PL5k6J7J8p7j3OK9O9M0l8j7m9j8
2657c5k4O6j0mN7n9m8R6mJ8k5r3L4l6JK8R1k9n2O4r2N5m0K2pk3L2M6n3L7J9m8
2689a6lj00P4M3J5P2k8n8mn4K8j8N9Qj5L5o1L6jN7j01qk4J3N1L7M2o2K4n7Mm6
2721e8lM5m0Q3j7j5L2%j2l6j5o0L2Q7k0P9K0p7n5K8m4KLJ4K1M4m3R0l3mp3n3n
2754h3JQ1K5Rj0m0Oj7M5l7j4j2K8M9k8R3m8%j22O4l6nN5L5j7J7l2J1J4o8l1K0
2786d7L3l6M7N1J7J6j8j14j0m9O4N9m7L2K8nL4j0o3j5l1Pj7J15k3R0k2l2q2k8
2816e6ojM9lM8l6L5Qp2O6j13N2lJ4O8O1k5%m6j10qK8j0O1J1J9jK1KMn4k1n6K3
$$ plain form
2594 -48 -75 -39 -7 20 16 83 -18 24 -71 -1 -18 -34 -52 -5 -16 9 12 54 46 -35 34 -109 -75 18 8 22 58 11 -3 40 -12
2625 -12 24 2 -47 -19 -62 10 -7 82 48 28 -38 -63 -2 -1 -7 46 -18 -11 24 -2 15 33 -44 -57 -51 -22 47 87 49 32 -17 -35
2657 -35 -59 7 -3 -7 50 -9 -57 39 35 53 28 -65 -31 -67 -66 -38 53 24 -28 36 -56 -1 -41 -19 -26 -49 -17 29 -24 13 32 -16
2689 -16 -19 -119 -45 -2 13 85 57 -1 -5 -59 -31 -49 10 18 3 38 -23 13 12 69 -32 -40 -64 -51 0 37 79 17 41 -16 -12 -58
2721 -58 -61 -16 -56 27 10 -5 27 27 15 -21 -36 -96 -64 23 3 82 102 25 -30 -2 -46 -44 -41 -27 -6 38 -5 85 52 48 -25 -78 -83
2754 -83 -82 -1 24 33 23 -17 -11 -28 17 -20 -34 -46 -18 31 3 96 48 48 -74 -10 -46 -51 4 39 22 39 7 18 32 -36 -67 -47
2786 -47 -14 -50 -3 48 65 81 63 -51 -61 -110 -46 13 -34 -2 26 21 55 45 -18 -33 -64 -57 -74 41 18 108 86 54 -28 -56
2816 -56 -62 -63 -14 -17 31 -5 30 38 -34 32 -81 -29 -32 -18 50 111 86 86 40 -70 -78 -50 -60 1 12 31 30 51 53 57 3 -18 -74 -51
2850e1N3L2J0K8Jj10M3n4K6pj3N7J6L5j8Kpl7p2k9P7j1O3M0QL9j49L2k4n4O5L6
2882B7o6O8oO6k0m7k7p5j4K5N1K6R2m1M3p4K5p4jj7k6K2K5P7k2J15j24k3p1Oj1
2913g1L5J9M7j8M4po4j3K7n3j0J2K2R5O3m3p0j6n6Kj9O7K7O2o8L0J0l9l3m1qk3
2945i0O6L0K4N0L2n9m6p4K2k4P5K0L0ml4P9o8ll0j20PQ3K0J11j1l0K6j40m1N7
2975d2k2N8j6Q4K2q4L5j5l3m0J4j6k3L7N4J06o4k4n6n1%OO2j0M0l1R3k0l5l2l7
3006d0o6L0M7MJ07k0n2Ll6m8j0J1QM4M7lL9k8Qo9n5J3o5Q0P2M5o6P5o7l0l7Ol6
3039h9Q5L9o6O6K3K3k8o7q6n9M5L8P8R5n8L6n7m9l5J2m5O7LJO9M5L8r0j6q5l2
3070i9NM0P4j0R1j4n6l9j5o1rJ3N8MO3K5L2j08M3j50l3M6J9N4M9P1p9J5n2l2j6
$$ plain form
2850 -51 2 34 44 72 73 -37 6 -48 -22 -29 -42 15 31 66 48 50 43 6 -66 -95 -18 -29 34 74 82 121 -28 4 -20 -74 -9 27
2882 27 -39 29 23 89 69 22 -5 -80 -94 -69 -18 8 100 59 102 28 53 -21 -22 -39 -65 -43 -18 59 37 152 28 5 -66 -60 -71
2913 -71 -36 -17 30 12 56 49 -15 -28 -1 -54 -64 -52 -30 65 128 85 15 -1 -57 -55 -74 -7 20 82 14 44 54 15 -18 -59 -67 -90
2945 -90 -24 6 30 80 112 53 7 -67 -45 -69 6 26 56 52 18 97 29 26 -4 -124 -117 -34 -14 97 86 56 82 -58 -99 -42
2975 -42 -64 -6 -22 62 84 0 35 20 -13 -53 -39 -55 -78 -41 13 119 55 31 -25 -76 -76 -70 -8 -18 22 -9 84 64 29 -3 -40
3006 -40 -106 -76 -29 -25 82 62 10 13 -23 -71 -81 -70 -62 -18 29 26 65 37 45 -24 -79 -66 -131 -51 21 66 0 75 8 -22 -59 -53 -89
3039 -89 -4 35 -31 35 58 81 53 -14 -100 -159 -114 -76 2 97 39 75 18 -31 -66 -54 -99 -32 -29 -28 41 86 124 34 18 -67 -99
3070 -99 -94 -54 20 10 101 87 31 -8 -23 -84 -93 -80 -22 -18 45 70 102 -6 37 -113 -146 -100 -81 -27 22 93 14 29 -23 -55 -71
3101g1m3K2K9P3J4P8L1r8l4j07n2K9J11j0M3L3K2j3l0n3k5o6kL9P4R1mkk4p0n4
3132f9o5K7J00L5KO2Rq4K6l5r3l4m3J09L8O1N0l6mq9k8k1m4P9J7O2K7ppK4j03
3163c4j0j1r4Q6J4J70l8M5m9j20j1n1N5k1K1J02j8L1J8l4p0m4J0p0Q7L3R2%L2
3192A21n5p2M2q9j1J0M8M2oK1j3O1j33j4j8L0n7R0N9QLJ5m3j00JJ4m1O5O1J4O
3223E9J6rq0mq6K9K4N3P1J6l3o2Rj6n4k5L9KO6L9M7On4j8j09K9m6M1P9P8qn3J0
3256E6o1K0j8p6J5J8M9J8R2K2j27N2j07j7j3J2N2P3K5k5k1l1k1j3m2k5M8J0J36
3285A01j9L3l2p9n6l2oM6L4JJ26n4L8l6l8m7k5m1J1R7KP2j1l4k6m8n7Qj1R4O4
3316G5l9M9m1J7m4k9n5k6L9Q5J2N9j2n1o2l2k1MJ4N3K4J8M3j4%n4m7k0m9%P4R9
$$ plain form
3101 -71 -114 -92 -63 10 24 102 133 35 1 -106 -158 -129 -18 -28 15 48 70 57 27 -26 -51 -117 -119 -80 -6 85 81 79 55 -15 -69
3132 -69 -134 -107 -7 28 30 92 101 17 43 8 -85 -119 -162 -53 -15 46 96 60 56 -33 -61 -82 -126 -47 -30 32 59 52 45 69 -34
3163 -34 -44 -55 -149 -63 -49 121 83 128 79 -41 -52 -103 -48 -69 -48 54 36 67 85 51 -19 -63 -53 -123 -36 -3 89 89 121
3192 121 66 -6 36 -53 -64 -54 -6 36 30 51 38 99 -34 -48 -66 -36 -93 -3 56 64 67 82 39 -61 -60 -46 -87 -22 39 53 59
3223 59 75 66 -14 -18 -104 -75 -51 2 73 89 56 -6 3 -13 -67 -92 -53 -51 15 54 101 107 53 35 -74 -45 -91 -50 29 107 99 46 56
3256 56 -5 15 -3 -79 -64 -46 3 21 113 135 8 60 -47 -64 -77 -65 -13 60 85 60 39 8 -13 -26 -68 -93 -45 -35 101
3285 101 82 115 83 4 -52 -84 -90 -44 -10 -9 117 63 101 65 27 -20 -45 -86 -75 22 24 96 85 51 25 -23 -80 -72 -83 11 75
3316 75 36 85 44 61 17 -12 -67 -93 -54 31 43 102 90 39 -23 -55 -76 -72 -58 -5 19 37 80 66 66 12 -35 -55 -104 -104 -30 69
3348F9J9L1n8k6j13RM1n9J00m5Q9K3kNq1n5k6rl9R8O4K4R8j19J9j08rm1K8O5J8
3379A0L0N7j0k2k0p7k1r4P9O6L6P8o0K7o6l4k0p5K0K5M2J22lM9n0o3n1o4l3K7
3409i5R2M9K2J6l4l9jn0n8L0jJ00k0R2L9p7n6j13OJ2PM7L3M3M8m3n3l7l7m5K6
3440i7K0K8O7P7k3K5j16o2j8l4N7K8Q5M2k5J8m9Oj12qK3l0O2N2N8K3j9q4n8m1
3470a05k4N5M3M3K3J9O2p6Qr4pl3j6M1J07J1K6j3n6o9j4m8J0Q0l6J27L3o5L1n1
3500A2k6n5o9L7N8O5R4k6p0J6j36K2J9m0Q8n2O2J15k4l0m1l8m3k5j8J30JL4L4
3529I4j0p1o1Jn0P4k6M6Q1n2R7p8Lq7o4Rj6P7Q6K9Mk3m3l2o2J1L0m7M8P3lJ19
3561A57q2l4j27K9m4l5P7J28oK0Rm2m4o0pj8K2O4nJ12L5j07l2m6p1K7k9R5M8M6
$$ plain form
3348 69 88 119 61 35 -78 -69 -28 -87 13 -32 57 80 78 83 2 -53 -79 -88 -127 -29 35 59 157 38 57 -51 -60 -101 -73 -8 10
3379 10 40 97 87 65 45 -32 -53 -147 -68 -2 34 112 52 79 13 -21 -41 -116 -96 -71 -29 93 90 139 89 26 -25 -89 -122 -95
3409 -95 -3 46 68 84 50 11 10 -40 -98 -68 -69 31 11 103 142 65 9 -104 -98 -86 -79 -32 1 44 92 49 -4 -41 -78 -123 -97
3440 -97 -77 -49 18 95 72 97 -19 -81 -99 -133 -76 -48 37 79 54 72 23 29 -83 -91 -68 -98 -36 16 74 97 78 -6 -64 -105
3470 -105 -129 -74 -31 12 35 54 116 40 48 -46 -53 -86 -102 -61 46 57 83 70 14 -55 -69 -117 -107 -27 -63 64 97 32 63 12
3500 12 -14 -69 -138 -101 -43 22 116 90 20 36 -100 -78 -59 -99 -11 -63 -1 114 90 60 19 -19 -62 -87 -105 25 26 60 94
3529 94 84 13 -48 -47 -97 -23 -49 -3 78 26 123 45 48 -39 -103 -94 -110 -33 53 82 86 63 20 -12 -74 -63 -33 -80 -32 41 38 157
3561 157 75 41 -86 -57 -101 -136 -59 69 63 83 92 50 6 -54 -61 -79 -57 7 2 114 149 42 10 -36 -107 -80 -109 -14 34 80
3591H0J7n0j0m4n1J9qk7P2O7PL6J3r2k4r9L5oL9Q2LL9m5J4m7n5o0J9M3l0J07L0
3623G4%N8j36m3l1rN4n0J07J4N5k2p6P2r8n7oL9M0O3N6J0n6K1j48k1j1M9J6L5
3653aM4M4l5K5n3m5m9j3K6O0N2J8J0M5p4k2r9RQJ6M1M9M9k8jl3r0l0l2M8K4J01
3685F4K0K5mj05J2n0%k4l5J11O0J3pN7j40j2j12O0k2M7P8Q6k7o8N4q5j9o6L2l4
3715i1Q8M4J6M8m8L8j21j16O5J3N8L9N6j1j9l7p2Kk9oK5kQ3N8J6mk8q5n1l6j9
3746a26M0R3L6K2j1l4j5k9o3L9j2kJ17k6J07m5r3Qm9n5N3j1N1O8JM4l7k6j12p
3776g4j4j4Q6M9OP4l3n7m2n1k9l4J03J7N5M8l6L8n8m2o4o3Q3N4J9K0M8rk5p6k9
3807e0l5OK7P6KM3r8Q5n2o5l6J1J6jQ9M5L1m3j1k3r7pL7l1J05j7lN0M2j18j2p9
$$ plain form
3591 80 97 47 37 -7 -58 -39 -47 -74 -2 65 72 108 121 29 5 -94 -59 -65 -26 56 59 98 53 67 20 -35 -95 -76 -33 -63 44 74
3623 74 74 132 -4 -47 -78 -87 -33 -83 24 38 93 71 -5 67 -31 -88 -94 -55 -15 48 104 114 58 79 -69 -90 -101 -52 -36 -1
3653 -1 43 87 52 77 24 -21 -70 -83 -57 3 55 73 83 128 54 32 -67 -58 -50 -34 7 56 105 77 76 43 -47 -77 -109 -61 -37 64
3685 64 84 109 105 0 12 -38 -38 -62 -97 14 74 87 80 137 -3 -15 -127 -67 -89 -42 36 122 95 27 81 -4 -23 -89 -57 -91
3715 -91 -3 41 57 105 57 95 -26 -142 -77 -64 -6 33 89 78 59 22 -50 -48 -77 -83 -58 -60 23 81 97 93 65 -20 -71 -107 -126
3746 -126 -86 7 43 65 54 20 5 -24 -87 -48 -60 -62 55 29 136 91 -2 6 -43 -98 -45 -56 -5 63 64 108 71 45 -67 -74
3776 -74 -88 -102 -16 33 39 113 80 23 -19 -70 -99 -133 -30 -13 42 90 54 92 34 -8 -72 -135 -52 2 21 41 89 80 55 -21 -50
3807 -50 -85 -79 -52 24 26 69 -29 56 4 -61 -97 -86 -70 -71 18 63 94 51 40 17 -80 -87 -50 -81 24 7 4 54 96 -22 -34 -113
3839a13J7j0QJ26M1J5Rn9r0oj9j7M2O8%KM2qk7q0qo5N3P1qJ10o0L2l7q1j1o2N4
3872g1j4R0%LQ6o2j2l4n0j9k7L1J36m0M2Kk2l7p5j2K2l9P5O6k3N3ok8q4o4JN3
3904e9pP7M9L2rl8n1nm6Pk9O9M6O3k1n6J5j19M4n4P4QO5N3m7l0J7ro0m8K9nO4
3937A9j7P3J8m3%n0o1j2l4N6K4J12k5j1k9%p0L2n5RK8M8O4Lj7j0j20j1K6l8L4
3968e7J05l3L9J1m1n2K2p0K1k0NR8L6J5K7r3k7o6J1k0O5M2k2Q3l4O9r0k5q3j9
3998a03%P2J3O0L5J7J3j41k9JPk3P8M4RL0n3K4m2o1l5QK3R7lK2N6m2n5p5J0k8
4030g1L6L4%J08o0J9j1m9n9K6o5P2Q2n2K6M2r0K3n7j8j6J9M8K1J04k0l5Lo6l2
4060c8q3P9K4M7J4lN6q7O3j25J4k7j9J11m5R8L8l7m0p6l2j6L6J4L9kO1K2m5Pl8
$$ plain form
3839 -113 -96 -106 -98 28 69 84 93 34 -56 -62 -81 -98 -56 12 12 14 56 48 21 -59 -67 -132 -79 -8 -16 94 34 66 29 -52 -63 -125 -71
3872 -71 -85 5 5 8 94 32 20 -14 -64 -83 -110 -79 57 17 59 61 39 2 -73 -85 -63 -102 -27 39 16 69 63 35 -49 -113 -112 -59
3904 -59 -66 11 60 92 83 45 -6 -11 -57 -50 -79 -10 36 99 78 22 37 -82 -38 -92 -18 -10 55 108 61 31 48 39 -21 -69 -40 -45 19
3937 19 2 75 93 50 50 0 -61 -73 -107 -51 -27 85 60 49 20 20 -50 -18 -73 -64 -36 12 76 79 62 52 -68 -79 -53 -91 -57
3968 -57 48 15 54 65 24 -28 -6 -76 -55 -75 -70 28 64 79 106 13 -14 -80 -69 -89 -24 18 -4 79 45 114 24 -1 -84 -103
3998 -103 -103 -31 -18 42 77 94 107 -34 -63 -62 -55 -78 0 44 53 83 30 54 12 -49 -84 -76 -53 44 41 63 119 77 22 -53 -43 -71
4030 -71 -35 -1 -1 107 47 66 55 6 -53 -27 -92 -20 62 10 36 78 -12 11 -46 -64 -80 -61 -13 8 112 92 57 60 -6 -38
4060 -38 -121 -42 -18 29 43 40 96 9 72 -53 -39 -66 -85 26 -19 79 117 80 40 -36 -68 -84 -48 -34 5 3 64 86 41 48 10
4091A0l0r1J9Q9L6M2M6m7l9po8m4L1%P8K1MK7n9J8j5m7l4mL8L9N1jj7K5q6m0k1
4124g6O2p2Q2K3RM1k9Rq1j0j3m3P1J1R7pol3k9q2L2l7mR4K6J7J0J0o8Jn0nk3J5
4158e8P7M2J2l3J9q8K7l0OooM0L9KQn6%m4j8lK0K2J03l4j7l2J4l4n7j7L9L9J9
4191eN6J6m1j1k9o8j3J1P8l8R3J9l7pn9rk4j4P2l7R3pL6%n3j6m2l9k4P6M5O8o
4224H4Ro8j1p1K0n6j6J15JM1KN1o8o1ol2l4O8K7l1P3L4k5q7J5k0m8P9o7R4M2R
4256F3mp9L8j25O2K2j5P0m8J01l4k1k8l8qj7k8K8O4K8K7kn7J4j02J1nK2K5M4M8
4287E6k0L2m9j9j5q1QN6N0L9Rm9qJ4o9j9M0k4N2L2J6J9jo3pj4n5pJ8N9P9ll4O
4321D8p0k0k7O6p2P5M0k7O3l1k8n3L8q6%O8lJ10j2J7m8n2J0n8N8l4J5OM9K5m1
$$ plain form
4091 10 -20 -111 -92 -3 33 75 121 74 35 28 -40 -84 -53 -53 25 46 50 77 18 36 21 -26 -60 -64 -26 13 64 63 46 71 -15 -55 -76
4124 -76 -14 -86 -4 19 28 69 40 49 -32 -42 -55 -98 -27 -16 81 74 68 35 6 -76 -44 -81 -85 9 35 52 62 72 4 5 -45 -50 -73 -58
4158 -58 19 61 73 40 59 -29 -2 -32 -26 -32 -38 2 41 43 51 -5 -5 -49 -67 -70 -50 -28 75 41 24 -8 6 -28 -85 -102 -63 -24 -5
4191 -5 51 67 26 15 -14 -82 -95 -84 -6 -44 49 68 31 24 -35 -44 -68 -82 -10 -47 46 39 75 75 22 6 -36 -75 -99 -23 22 90 84
4224 84 93 25 14 -57 -37 -93 -109 6 7 48 50 101 33 -28 -34 -66 -100 -32 -5 -36 37 71 46 -41 -26 -46 -94 -15 -82 12 54 63
4256 63 59 -20 18 -107 -45 -23 -38 32 -16 85 51 30 2 -36 -44 -61 -89 -61 3 31 58 56 -1 13 -89 -78 -83 -61 -36 8 56
4287 56 36 68 19 0 -15 -96 -88 -32 18 57 66 17 9 23 -46 -65 -25 -49 3 35 51 70 69 6 -1 -15 -70 -77 -59 0 79 76 42 48
4321 48 -22 -42 -69 -3 -75 0 40 13 76 45 17 -36 2 -84 -84 -16 -19 91 79 96 48 -4 6 -52 6 -28 -13 -7 42 67 26
4352B6N2o0n3n7O8PJ3P9K5n5Qo2Ln3QK2M0J2j3L1K1j3l8l9j5j6L2K9L6J1KO4j23
4385hk0PL3o1J3M3N3j7K4k5l5l0j5j0N0qK1M6pj0Jp2j0j8j0M9K9N4M5q8K8k2l7
4418gJ6n8QL0J7L7K4p3K5m9Mj3J7pJ0P1m2M4k1j7j5q3M3mP3JK8Pjn5pm3J5k1J3
4453c3Q7k9L4j6kp1jok2L6K0M1L4J2p3RJ7o5ln1M1R2n4J32p9o0j7K6k9j7P0k5
4485bM3k1jO6p1nn3L8l3L5j3Q2n0M4Ln4J1p2j0L0MK4K6QK1l3k3nlk5N9J2Nm0M8
4520D5k4j8m1o0P4n9J02MMJ6lj0n9J2p9P7n1O7J8K6O3j03j3n0J2L8n2Q6k6J5O3
4551G4lj45R3j3n2Rm1R2jM7l0n1L4k1p8P7m5rP7K8Oo3K5o1J1k5m1J44n6rM7k0
4583@M4j7p9nKJ0L4p2J09JM4l1n8j7l1M0n7N8M5l2Q2k2m8L1m4jk5mMJ09l9k6N
$$ plain form
4352 26 78 18 -35 -92 -24 -17 -4 75 100 45 53 -9 -6 -59 -51 -29 11 23 10 41 62 49 11 -28 -43 -59 -27 2 38 49 51 115 -8
4385 -8 -28 -21 12 -49 -36 7 60 43 67 42 7 -23 -38 -48 2 -6 15 61 54 44 45 -27 -37 -55 -65 -16 13 67 112 24 52 30 -7
4418 -7 9 -49 -41 -11 6 43 67 -6 19 -30 -26 -39 -22 -29 -19 52 10 54 33 16 1 -82 -39 -43 30 31 59 66 65 10 3 -40 -25 -46 -33
4453 -33 54 25 59 43 41 -30 -31 -37 -59 -23 -3 38 72 84 11 20 37 -28 -31 -82 -41 51 -3 129 50 -10 -27 -1 -30 -47 23 -2
4485 -2 41 20 19 85 14 9 -44 -6 -39 -4 -17 65 15 59 62 8 19 -53 -63 -33 -29 -5 21 29 50 17 -6 -11 -14 -39 20 32 37 -3 45
4520 45 21 3 -38 -98 -24 -83 19 23 27 43 40 30 -29 -17 -96 -19 -70 -3 15 41 104 1 -12 -62 -50 -12 -64 22 -4 11 74
4551 74 71 -74 19 6 -46 -37 -78 14 13 60 30 -21 13 -8 -86 -9 -54 -63 14 42 48 -15 10 -51 -40 -65 -106 38 -18 -27 20 0
4583 0 44 27 -52 -57 -55 -45 -11 -83 26 27 71 40 -18 -35 -66 -26 -83 -25 20 -12 70 48 0 31 -13 -14 -39 -43 -39 70 31 5 10
4616A0Pk1m6k0N2k1L3K9%k8k3J9J4l2j8J2K2J3N8l6L7l4k5n6K0j1J0KQ7q1R0m0
4648B3m0L5o8K7J0J2L0QrN3q2J0o6j5L3l9O5QL8m1M0p4M4q8L9RJ7L6KP2r3kj6
4681b2m6M5L8m3O2N2n6l2N3j7p2%K3k0K0QM0L6k0m3n1J02o3n1LP8m3M2N5n4M8
4712G2r9m6P1k8L4K8K8k2l0P0o7m2rj6Q6j4J3oNk1rk9k7M2k4K0K0L2k8K3k0k7
4744b0J5L4J0m6l4P4k1O5m1j9k5k7O1m7J0L9M4j3l7%ln6j3M5RlM9m8R1o1m4kJ4
4777@j4n3J00k6j2%N1k3Nq8O4m1L0J8k1L7k2J7L0l4k1nonO6m7N6l6n6M8k9kj3
4810c2N8l0M3Nm0J7K0l3j8J9J8k7L8l1L6Mj9k3Mj2m5O7n1L0L9j8J9l0k8jk4K3
4842b2J7P4p2Q5n5n3J6M0o4mO0j9MN3K2%q1n0Q9j18O6L8qN0m9Pl8K9l3Jk3k0O0
$$ plain form
4616 10 17 -4 -50 -70 -18 -39 -6 23 23 -5 -28 -9 5 -27 -45 -33 -11 2 60 24 61 27 2 -54 -34 -45 -35 -33 54 -27 63 23
4648 23 -17 18 -50 -23 -13 -1 29 37 28 81 -1 9 -57 -72 -39 -78 -13 -5 33 -8 32 -42 2 -86 -47 -38 -21 15 17 89 -4 -6 -22
4681 -22 -68 -23 15 -28 34 86 30 -2 51 34 -38 -38 -15 -35 -15 -7 33 69 49 6 -45 57 -6 -57 -54 24 -19 23 78 24 72
4712 72 -27 -73 -2 -30 4 32 60 38 8 78 11 -31 -40 -56 30 16 29 23 28 7 -2 -31 -58 -16 -40 -20 0 32 4 27 7 -20
4744 -20 -5 29 39 -7 -41 33 12 77 36 17 -8 -35 26 -21 -11 28 72 59 22 22 19 -37 -50 -5 4 1 50 2 93 32 -12 -14 0
4777 0 -14 -67 33 7 -5 -5 46 23 28 -60 4 -37 -7 11 -10 27 5 22 52 18 -3 -8 -14 -19 47 0 56 20 -36 12 -17 -19 -32
4810 -32 26 -4 39 44 4 21 41 8 -10 9 27 0 38 7 43 47 28 5 9 -3 -48 19 -32 -2 37 19 38 8 -20 -21 -45 -22
4842 -22 -5 69 -3 82 27 -26 -10 30 -34 -38 22 3 7 60 82 82 1 -49 40 -78 -12 26 18 68 19 26 -12 17 -16 -15 -38 -58 2
4875BK4J4Lk0K2n5K8m5j0P3o7J6M7kKj4n3M0l8lL4k7O2k4L4p5L5l0k1J5QO8k3
4908B0rL8o5K7r6K9J8j5L8J8j3J0KjJ1lp1K3j2Q0j0l5N9k5j5q9J38q7K7J2J4j6
4940BL7m4M0n9j1m2M1NM5L3l3k7NmJ5l6jj8N3L1kK2q2L2j2jk4JM3k8M5n9Q7l0
4974B4k2Mo1L3%k1J8K3j0M3l6J5m1rK1qJ4J4j3K3K2m1kJPm1K2O3p3Q1n8J9m1O2
5008C2l9j3P5o5J6l7P3p0Q1p9J4j0rN1j4l3R7k7j9l8K6m4k6M7J6J3L6j9n7O9p2
5039b5jL5J2m5jL0rL5Mm7l2J0M5%n2K5K2M5j0%l8Npk8K4L7%o0K0Rjk0K3L6l7J8
5075B2k9NK3L5o6%J1k8M6j1l9O6j0L5q7O1n7j4J3jK4L9m1M5l3NM8o3j5N1k7Qk5
5108iJ3QJ4km9ok3N6m0M1M0n4J8qJ4J9n1J2k4L7J3mJ8o8K7M7n4K0m5K0M6j9K7
$$ plain form
4875 2 26 40 43 23 45 -10 18 -27 -37 36 -31 -15 32 30 32 18 -35 5 -33 -36 -2 -29 33 9 43 -32 3 -27 -48 -33 -25 43 20
4908 20 11 49 -16 11 -85 -56 -38 -53 -15 3 -10 0 2 1 12 9 -62 -39 -51 29 19 -16 43 18 3 -86 52 -35 -8 4 18 2
4940 2 39 -5 35 -24 -35 -77 -36 -31 14 47 14 -13 -8 -12 3 -33 -34 -52 1 32 30 52 -30 2 -10 -11 -35 -34 9 -19 26 -33 54 24
4974 24 2 6 -55 -22 -22 -43 -25 -2 -12 31 -5 10 -31 -40 -19 -27 -13 1 -12 11 33 -8 -10 -9 -2 -43 -21 42 -31 50 -8 11 -30 32
5008 32 -7 -20 55 -10 6 -31 42 -28 53 -26 -12 -22 -31 20 6 -27 70 43 24 -14 12 -32 -58 -11 5 18 54 35 -22 47 -25
5039 -25 -26 9 21 -24 -25 5 -4 31 35 -12 -44 -34 11 11 -41 -16 6 51 41 41 3 8 1 -27 -3 34 34 -26 -6 3 2 -18 5 41 4 22
5075 22 -7 -2 21 56 -10 -10 1 -27 19 8 -31 35 25 60 -27 34 -23 -37 -24 -25 -1 38 -3 42 9 14 62 -1 -16 35 8 16 -9
5108 -9 4 12 26 24 -25 -31 -54 2 -38 3 43 -11 7 -1 13 32 -19 -7 -31 6 19 15 33 -35 -8 39 -15 5 -40 -20 26 7 34
5141C4j1j1Jk8loK1k2L7k4J01o8Lnm6N6n5J2M0l8M3ok5P7p5Pm2L3M2m2K0k3J6
5174A3l6J0mQj6M3j1J8j4pL9n9J8l3K3jML3o1P9o7K1n3R6m0jL0p1L9N3K1l1m2
5207ANMj3PpJL8l0J5kLj8m7m4O8P4p8L0LL3J0k8m0MkrL2n5Q0k3Qk3L7n8J3K0K6
5244C5o8M7mL0n6K0l2l0Q2m2K4k4J4pPR3j48P8l0L1Ll4Q6p5KK6l4KlL4o0M3Qk2
5278dl9K7M1m2KJ6k2QK8n8N8N2l9k3J3Jj4l4J9L5J0k3mj8N7m5n1N1qN0m1K7m5
5311a5K9ojK1lk3JJ8l8O2m5l4J4J1J1k9J1L0k2M8o6P2n3%K2l1N8n4M9k0moMoj2
5346gJ0rK1l3Pn5P6j9m7O9k1LK0m5Q6j26Q6m3rL2k5J4j0J2oJ2L0j3QJ2Jk6lL7
5380C9q4O1p3P4j6oN3r3QJ5qLJ6K6k7l0K6Km5J13p7K6j7J8jl4J4l5Q4J1l7rk3
$$ plain form
5141 34 23 12 13 -15 -18 -24 -3 -25 12 -12 89 21 24 19 -27 29 -26 -14 26 -12 31 25 0 77 2 9 -33 0 42 0 20 -3 13
5174 13 -23 -13 -17 -9 -25 18 7 25 11 4 43 -16 2 -31 -8 -9 -5 28 -33 46 -21 0 -53 43 3 2 32 -39 0 53 74 43 1
5207 1 6 10 -3 4 -3 -2 36 6 21 19 22 4 -43 -87 -19 55 -23 7 10 43 53 25 -15 -11 -13 -22 10 -45 35 12 20 -3 34 -24 -11 9 35
5244 35 -33 14 10 40 -16 4 -28 -58 24 -18 6 -18 -4 -11 -4 89 -59 19 -11 20 23 -11 75 0 2 28 -6 -4 -7 27 -33 10 18 -4
5278 -4 -43 -16 25 -17 -15 1 -21 -13 15 -43 15 67 28 5 18 19 5 -29 -10 25 35 12 8 -10 47 2 -49 2 -6 44 3 30 -15
5311 -15 14 8 7 28 25 2 3 21 -17 45 0 -34 -20 -9 2 -27 -16 14 -8 40 -26 46 -7 -7 15 -16 42 -12 37 17 13 7 11 5 -7
5346 -7 3 -6 15 -18 -11 -66 10 -9 -56 13 -8 -5 15 -30 56 -70 16 -27 -36 -4 -29 -15 -25 -13 -19 -7 23 10 18 30 31 5 2 39
5380 39 -45 16 -57 17 1 -5 48 -45 -37 -22 -30 -27 -11 15 -12 -42 -16 -14 -59 54 -23 3 -14 4 3 -31 -17 -52 32 43 6 -3 -26
5413b6J9m2P5%l3j3kL4j5oJ7M2m9OKJ2k3jM7l2Ll8L0J7J2p2J8l0P8q0N4K3n7P8
5447D8p6P1J0m1m2L2K0JJ1j0l2J3qk4JN5k1qL8l1N1o5J2Rj5O%QPLj8k6PN0j2j1
5483A3L3k1M2k3o8K8K2l9L9J9j3km2K3n0M2rl1P3o4J5N7m9N8m5j8J6n6R1o5L8
5514A4J5n0%N2k7Nj2K9j9k7R6m3k1N6l4M4j15P8m8j3Q1p0O1m1ORk9J8jj6jJ1O1
5547F9n5j8K0j4l8K0K5j4mM7nk0L5k0Ll4j2M9qK1o5mN4Ql6%K0m3J7OL7l8L1n3
5581a9K8K2o6L9l0L7l2K0J4m2M0k4M3m7rJ9qM5m9K2ol2O2o7L9J7m0m1O0j2L6K0
5613C9l4nj5PL2p5L1k0M6jJ4J4j6l1pL0m7Q1p5K6O9o0Kj9K1j7K1m1L9l1rN4l2
5646iqK4Lj7L5j4o3O2J7lk3jk2K4J3nm8R0o1Jk2KK9Qm2M7qL0Rm9K8l3rJ7nJ9r
$$ plain form
5413 -26 -7 -49 26 26 -7 -20 -22 12 -3 -9 8 50 1 7 9 21 -2 -3 44 12 15 -23 7 24 36 -36 -18 -48 30 -50 4 27 -30 48
5447 48 -28 43 53 12 -30 2 22 23 34 24 -8 5 -3 -27 -26 29 8 0 38 7 58 -7 5 14 -1 5 5 13 20 23 5 -21 -14 36 24 13
5483 13 46 25 67 44 -24 4 26 -13 26 45 32 30 -12 11 -39 3 -6 -37 36 -28 -13 44 -5 53 8 -10 6 -50 41 -24 14
5514 14 29 -21 -21 31 4 9 -3 26 7 -20 76 33 12 68 34 78 -37 41 -7 -20 61 -9 52 11 17 26 -3 15 14 -2 -3 8 69
5547 69 14 -4 16 2 -36 -16 9 -5 -9 38 33 13 48 28 31 -3 -15 34 26 47 -18 -22 32 40 4 4 24 -19 -2 4 41 3 34 -19
5581 -19 9 31 -35 4 -26 11 -21 -1 13 -29 11 -13 30 -17 -26 -7 -15 30 -19 3 -3 -35 27 -40 -1 16 -24 -65 -5 -17 19 39
5613 39 5 0 -15 -8 24 -51 -20 -40 6 5 19 33 17 -14 -21 9 -38 43 -32 -6 63 3 5 -14 7 -10 11 -30 9 -22 -31 23 -9
5646 -9 -17 7 10 -7 28 14 -49 13 30 27 4 3 -19 5 18 13 -35 55 -6 -5 -27 -25 4 12 -30 17 9 39 48 -1 27 -6 -15 2 -3 16 7
5683GKj7L6m1K5o7L9%lNk1N3l2M3l9k7O0p2l7Q1K6k8M3p5J4K3n2O7o6L1M9k1k9
5716b3O9o2l2%N3o6K8KM3k5ONj0m1K0L9rk3JJ9K7l1K9k9JM3p3M1nJ6K9k0l2Pm7
5751e0O2l0oK3j7LJ3k3MK5km0Ok7P5l7M0m8M1J5o7j6O1m8RN5o2M0J2k9K2l1lo0
5785i0N0K8j1M5k7J7k4M5l6kq7O5j0N0j8j5M7m3m6Q8p5M1M4n9O0k4M2p2K8J0n1
5816c0mQM7k3L2k2K2L8j07O0l4jKK7j7k2K9j4K4k2Pj1j8NL4J3q2P3K0n5j0J8L5
5849B2k8mK1rk2J4N5o3J6J4k9J0l5M5L0n5N6o0k8R4k2j6m9LN0k4O3o6j8L3rK6
5881A5k4J3lM0l3L5r4R1o0MK2k9M3n6P5m4K9Ll1K2l6L8K0n1L0k9M1n5l7Q3j20
5912i8R3l6N0k8M3mol7K0K5n2QkK2M0ok4k4J02r1l1K9j5J9j3M0k4j1mkQN6m2J9
$$ plain form
5683 7 9 -8 28 -13 12 -55 -16 -16 -19 -14 -35 18 -14 29 -10 -37 23 -49 -86 -5 21 -7 36 -39 -25 -2 -54 13 -53 -22 27 6 -23
5716 -23 46 -16 -48 -48 5 -61 -33 -31 12 -13 -7 -2 -12 -53 -33 6 -3 -26 -25 -6 21 -10 19 -10 -9 34 -39 2 -3 13 42 22 -10 -3 -50
5751 -50 12 -18 -24 -1 -18 -15 -2 -25 -21 4 2 -38 -32 -59 16 -21 19 -29 12 27 -40 -56 5 -43 -34 21 -41 -1 11 -18 4 -27 -30 -90
5785 -90 -40 -12 -23 22 -5 12 -12 33 -3 -5 -92 -27 -37 13 -5 -20 27 -16 -62 26 -49 -8 36 -23 37 13 55 -17 11 21 -30
5816 -30 -34 -26 21 -2 30 8 30 68 -39 21 -13 -14 -12 15 -2 -24 5 -9 15 -7 0 -11 -29 -24 10 23 -59 14 34 -21 -31 -13 22
5849 22 -6 -10 11 2 -20 -6 49 -14 2 16 -13 -3 -38 7 37 -18 38 -22 -50 44 22 6 -43 -40 10 -14 49 -17 -35 -2 -11 15
5881 15 -9 4 1 41 8 43 -51 40 -20 -16 6 -23 20 -36 39 -5 24 27 -4 18 -18 20 40 -11 19 -10 31 -24 -61 22 -98
5912 -98 -5 -41 9 -19 24 20 14 -23 -3 22 -30 -22 -24 -2 38 32 8 -16 86 -5 -36 -7 -22 -3 -16 24 0 -11 -15 -17 -9 47 5 24
5946B4kK8L3o6Pm0nOj5L7lj2K8J3m3QK3p2%K3J9K2Jk2j3L2qL0o0l0J10q8Q2j7
5980C0J1l7J0m2Lj2RL2n4P1PnJ4m3J3l6j0J2L4QKrL1l1o4K1L1oO5p4M9k2o1O7
6014A4o5MJ5M3L9n2QK1m0K8l6qoPK3%Q4j9l5j2k5j9K6K9q9O0j3O0q0N0J1o2K9
6047a0L0p0P5p4P6o4P7j7j5lko2M3J2J6J5k0%j8k4L1m5K9M3o4N7j6Nk2k7J5l7
6079f6M4jK3k0K4KRK3p1K0l1O4nQm3K1M3n4L3j9Jl8k3PK3L5pNrk9Mj4O8q8O5l7
6115c3L7l2KL0JPl3oJ5L9Jj5J7m2k5M1J4jl4Pl0K1L0n4O6l8k5K5NN7o3L4m1j4
6149c7M4j8rL1k3j6j7M2L3m6O2o7J5Mpk1k6J12o3mK0M6j10K2M1p5J20n9M4n0J9
6180GN0m1%o0N6m3j0N3o8O2oJ4j0mL7p6K8K1Rj2L2N0j06K9mroj6pP7l7KkK3rl4
$$ plain form
5946 24 22 50 83 17 24 -16 -21 -15 -30 7 4 -8 20 33 -10 -2 21 -51 -51 -28 -9 13 14 -8 -21 11 3 33 -27 -57 53 -35 47 30
5980 30 41 4 14 -28 -25 -37 -28 4 -50 21 28 23 37 -6 7 -29 -39 -27 7 15 17 8 39 8 -56 -35 -4 -10 55 -19 30 8 -53 14
6014 14 -51 -47 -32 11 50 -2 6 27 -13 15 -21 -29 -35 -28 -5 -5 79 60 25 13 -12 -31 -5 24 -65 -5 -18 42 -38 12 23 -39 -10
6047 -10 20 -50 25 -49 27 -37 40 23 8 5 3 -59 -16 -4 12 27 7 7 -11 -35 -4 -49 -20 23 -41 16 0 5 -17 -44 -29 -66
6079 -66 -22 -23 0 -20 4 6 15 38 -33 -13 -44 20 15 23 -20 1 44 -10 23 4 5 -33 -56 -49 -26 9 2 7 -2 -31 -27 -41 27 -61 4 -33
6115 -33 4 -28 -26 4 5 12 -21 -27 -12 27 28 13 30 -12 -37 4 18 17 -17 -10 -40 -19 11 -43 23 -15 -40 -15 -10 47 -16 18 -23 -37
6149 -37 7 -11 -20 11 -12 -28 -45 -3 30 -16 46 -21 -6 -2 -9 -30 -56 56 -7 -11 9 55 -55 -33 8 -67 53 -6 38 -12 7
6180 7 57 16 16 -44 12 -31 -41 12 -56 6 0 14 4 0 37 -39 -11 10 19 7 39 89 -17 12 8 -1 -7 -23 -30 47 10 12 10 33 24 -10
6216a0K8n8K5j1nP4l2K5p6KQ0n3J7j8nPM9L2j25K9K5j4J1L4n1K5QJ6l0%j4j7M2
6249A0okj2J1%M0j8j9o5N5j5O4l9K2NL9n1k0n3l7J31p0M3lK9j1pj4k9L8qk3K4
6282IK0Jj0K2%n5L9n1J6kk2O1l0Pj7L3kj6M4j9lQp1J13q0N4m7j4K3j7NM0k3RL7
6317F2n8O6j7o8%n2M2N0qN0l3kMpqm0m0N5P1o0jJ7m5O8o5J8L5n0K7J0rn4P6j4
6351B0Qm1n1K6L2L%K9jk5M0r5Q2p3O5PjlK9j7qn4pL1j8J0j2R2l9Mm7K6n1K5Q%
6387fJ6k2J7k3L3J4m5m0K5K0K1lK6k6n2O1l7J4l8L4LPj2K7Jj2jk6M0o0O3n4N3
6420A8qk0N7o4P5m9l0l3PK3L3qM5j3K1o1l4om4M7M6rrM3l6L5n5L2mp0Q1j8PK4
6454B3j9K7n7mnJ6m8K8L2J3K6k6l5J3j8L0j1J8j6N6k7K7o1nn2J8J4K4pN0m3K5
$$ plain form
6216 -10 18 -40 -15 -26 -31 43 11 36 -40 -38 42 -11 6 -12 -17 -10 39 71 -54 -25 0 -14 -3 31 -20 5 13 29 -1 -1 -15 -32 10
6249 10 4 2 -10 1 1 41 23 4 -61 -6 -21 43 4 26 31 70 19 -1 -54 -91 40 -30 13 10 39 28 21 7 -22 16 8 -15 9
6282 9 29 30 20 42 42 -13 26 -25 -9 -11 -33 28 -2 5 -12 21 19 3 47 28 25 33 -38 75 -5 49 2 -12 11 -6 -1 39 16 25 62
6317 62 4 70 53 -15 -15 -67 -25 25 17 67 34 32 36 29 21 -19 -59 -4 67 7 6 23 -22 46 -19 -1 34 -16 11 21 12 -42 34 20
6351 20 28 -13 -64 -38 -6 -3 -3 26 25 0 40 -55 27 -46 19 26 25 22 51 34 26 -28 -35 -4 -22 -12 -24 68 29 33 -14 12 -39 -14 -6 -6
6387 -6 10 -12 5 -18 15 29 -16 -56 -31 -11 10 7 33 7 -45 16 -21 -7 -45 -11 -8 -1 -13 14 15 3 2 -24 16 -44 19 -35 18
6420 18 10 -10 47 -17 58 9 -21 -54 -47 -24 9 1 46 33 54 -7 -41 -47 -91 -44 2 -7 -16 27 -9 26 -29 3 -1 -71 10 -8 -1 23
6454 23 4 31 -26 -30 -35 -19 -67 -39 -7 6 32 6 -29 -16 -34 -4 -15 3 -13 43 16 43 -18 -23 -75 -57 -43 -19 -26 24 -19 6
6486Fj7L9n9QJ1ljM2o9Q1q8N0m2J0N2j38J90j08N4j9NJ8k4np8O1L9k3PJ4J8l9
6518hL2m9j3j4NP2r6R1l0NJ2k1L7l1l8L4JM0l8rJ9kk0JrNK4j4M2j6Mk6K7jo8O4
6554A2p4M4L5l1Q6o1J1J1l9Po1L8k6M1j6M7m8k7R9n5j2l7M2J6lN5m9J3k0Nk0K6
6586Ij0k4N2Jj3J5L4p3L3n6J9ooM3jM7n8L5p0K8j3m8N4oJ4L4j1l8pL0l0M5l6M1
6620B8k5L6k2l8L3n0O5p9O9j5m0N1L2jj9l7mj8L3k2J3k3M7pJ0rl5O4j04Q9l4K
6652a0rpL1j8L5l5K3mj0k9N7m2M7l3mk2mN0m7j6J7O6l0J3J1r5O5K2n8N%K8lML0
6687B8Oj6nN6p6K3l6O5n3M1L3r7M5m2M4J1o4J00m0K3k0l5L1m3K5l9pK5QL0PNk4
6720Il7lL0j3j2K7jKNJ9l3j3L6j08J15NpNJ9l3k9L1j5j0RK0pL9r1Q1oj4p6N3l2
$$ plain form
6486 6 -11 28 -31 -23 -12 -15 -16 26 -43 38 -50 0 -42 -32 20 -118 72 -36 18 -1 4 22 -2 -7 -85 -24 15 -8 -1 13 31 -8
6518 -8 24 -25 -38 -52 -47 25 -71 20 -10 -5 7 -14 23 -8 -46 -12 -11 29 -9 -18 1 -1 -21 -20 -29 -24 0 -14 28 12 16 -10 17 16 -52 12
6554 12 -62 -18 17 -14 72 11 22 33 -6 1 -60 -22 -48 -7 -23 24 -24 -51 48 -7 -19 -56 -14 2 -1 54 5 18 -2 3 -17 9
6586 9 -1 -25 27 28 15 30 64 -9 24 -32 -13 -19 -25 18 17 64 6 41 -29 -1 -14 -62 -8 -14 0 34 23 -15 -22 8 -22 23 -13 28
6620 28 3 39 17 -21 12 -38 27 -52 17 2 -38 13 45 44 25 -12 -16 -34 -1 -23 -10 -33 14 7 17 8 -27 37 -67 22 -12 -10
6652 -10 -19 -26 5 -13 22 -13 10 6 -4 -33 24 -18 29 -4 -8 -30 -34 16 -31 -47 -30 36 6 19 30 -65 0 22 -36 -31 -31 -3 -6 -2 28
6687 28 34 18 13 69 -7 16 -20 45 -8 33 66 -31 14 -28 16 27 -37 63 23 46 26 -9 22 -21 4 -35 -42 -17 -9 21 28 33 9
6720 9 -28 -31 -1 -14 -26 1 0 2 7 26 -7 -20 16 -92 23 28 21 26 45 12 -17 14 -1 -11 -2 18 11 50 -41 40 34 20 -56 -3 -35
6755c5K5L4l5M3k3L5k1m2L0nKJ0J1q1Q3l0NL4n2j0oP1m0j3K8qpk3LKj7OJJ7N8
6790E0q9O0Jk1j0nj6K7k4J6L2r2N8K0J3om8L2l7M1J8mqL3p1J1O7o1j6K3oL1j0
6823Ijk7J8jl2O0q4M2L7m7N2o4oJ1j1k4Q6m4lM2m1J7NJj9jjm6M2kO0J5l5j7K8
6858A9n9K5k6J9K2l4L8nNj6oJ2m8P0n2M3J0m1mM5k1j3j1J4m6N4MkkN6n0j5K1o3
6892e7Q2n6O8l8%J3JRj0k0l7L7m3M2K2K6Ol5K8r3L6Qj5O2l9M0n2kL2n7LL8k4K
6926b3K7m1M1l5N6m7KO0p9N8%N1m1m5ONom5M6k8J8L7Pj2M1r1N5n4j1N4k8RN7j2
6960C2k1pk5K0pKm5K7K7K7J8p0M0k4k3J7K0KlN2p6N0o3L2j1L7pqk0oM1J1K8k4
6994D3m2o2N7L9q4M1j3M6rOm9P3p0j4M2N6j0K0k7J4m5L2o9n2J10q6Q8k3k2PJ0
$$ plain form
6755 -35 -10 24 -11 32 9 44 23 -19 11 6 8 18 29 -52 31 1 6 40 -12 -22 -28 43 3 -10 18 10 3 -20 -17 -15 -32 -26 -25 -8 50
6790 50 -39 21 22 1 -9 -14 -30 -3 -27 -11 21 -71 -13 7 20 14 -34 -2 -39 2 20 16 8 41 -30 -19 48 -13 -29 -6 -12 19 9
6823 9 8 -19 -1 -2 -34 26 -58 -16 21 -26 26 -38 -44 -33 -44 -68 18 -26 -29 13 -28 -11 -6 -5 -24 -25 -26 -72 -30 -32 28 43 8 -9 19
6858 19 -40 -15 -41 -22 0 -34 4 -1 4 -12 -18 -6 -54 16 -36 7 17 -24 -28 17 -4 -17 -28 -14 -60 -6 -2 -4 -6 50 0 -15 6 -57
6892 -57 25 -31 37 -1 -1 12 13 22 12 -8 -45 -8 -51 -9 13 39 45 10 38 -55 -19 -11 -26 36 -3 37 -15 -17 15 -42 -39 -1 -25 -23
6926 -23 4 -37 4 -31 25 -22 -20 40 -39 19 19 70 29 -16 -10 -5 -11 -56 -10 -38 -20 17 24 12 53 -38 17 -37 -48 6 -22 -13 44 32
6960 32 11 4 -21 -1 -8 -6 -51 -24 3 30 48 -22 18 -6 -29 -12 8 10 7 59 -17 33 -30 2 -9 28 21 13 -7 -13 28 39 67 43
6994 43 1 -61 -4 35 -49 -8 -21 25 16 22 -27 46 -24 -38 4 60 50 70 43 57 12 44 -25 -77 33 -53 35 12 -10 -3 7
7025GQn2L5Kl4M3k3J7N7m2mm8K9k3QQ8p3J0L7l6OJ6j3r8O3L3l0O3o4O2m9mJ6J7
7059B4Jm9M0l6O3m7JL0j3j6l2N6m9L4J1m9M1j0K4n8J8K2K4k7k8Q1p3L3Rk1j1l8
7091d5L2JK9nj7M8p5P0k4n5L2o5R8m1K0J5k1K5rPn7Nk9O0%L2J1m5jN8o4MJ8l8
7125b6J6k2N9l4%m1N0J1l9MK2J8mk0J4pl7K3J9k3o8K9N4J8j2N3q6M0k5k7K8n5
7157f8J10o8J4K3j7K9o7L1m2jN0nK0LL2j01N3j1O1q5QM9k4Qk4P5n9J4j3n2L9m
7189b2QN1l0nj7K9m9K0m9P6Jm7Q2j02M6Qk6lk0P0p1N2J3J0on0L5ml6j3N0k1K5
7222EJ6j2l8O5r0L7nn4K6L8O0m4m4K4RQl9RJ2n5O2PJ5l2M5q7L3oj5Q1k9k0K6r
7256aN1p6K4n9M1J9J3J4n7L9j4K2q4M8J0J6Ok2K4k6J8K4k0K6q4K2K3L5l8JM9r
$$ plain form
7025 7 15 -37 -2 0 -34 9 -14 3 60 18 14 -34 -5 -28 -20 68 -5 5 42 6 12 28 15 -83 -20 13 -17 46 -18 44 -5 -9 7 24
7059 24 25 -24 16 -20 43 -4 -3 27 14 -2 -34 22 -27 7 18 -31 10 0 24 -34 -16 6 30 3 -25 56 -17 16 25 4 -7 -45
7091 -45 -13 -12 17 12 -5 43 -32 38 14 -41 -9 -74 24 -17 3 18 -3 22 13 20 -37 -32 -61 -1 -1 31 42 -3 -4 54 -10 -6 12 -26
7125 -26 -10 -32 27 -7 -7 -48 2 13 -26 -22 0 18 14 -6 8 1 -36 -13 6 -17 -85 -56 -2 16 4 57 -29 11 -14 -41 -13 -68
7157 -68 42 -26 -12 11 -6 23 -44 -13 -55 -56 -6 -11 9 12 44 -57 -4 -15 46 -39 -31 18 -6 2 -22 53 -6 8 -5 -57 -18 -22
7189 -22 -14 37 7 2 -15 14 -35 -15 -64 12 13 -34 48 -54 -8 0 -26 -29 -49 21 -50 2 15 25 19 -31 4 0 -36 -49 1 -20 5
7222 5 21 9 -29 36 -54 -17 -22 -76 -50 -12 48 4 -40 -16 -7 1 -38 -29 -17 -72 -10 -3 12 -20 25 -62 -29 -35 -50 31 2 -18 8 -1
7256 -1 50 -26 -2 -61 -20 -1 12 26 -31 8 -6 16 -68 -20 -10 6 12 -10 14 -12 6 30 10 36 -48 -26 -3 32 -6 -5 44 35
7288C5k4j7Pl4L8j8M9Kp4M0n0Q2m2l5K4N0rl7K3K3m2J2m1mO1o4L5J3K9npl3k2
7321c5L9kn5M7m0K7N3jk4J5J5l0m8K4k0P0k9K9o6P1l5k7j0K3LPPL9n7P0qn3Mk0
7355a7JJ8lLK9n6M8k3k6M1K8m6Mm6N1L4ll0Lj9j0M1j0k5k4O7kqmpJ3n4LK0L1L3
7391E5m6M9n9J2L1kj6J3l7j9N2l0M3k6j8J8J0n4M5m8NJN4Jk5nK7k6l3K2oO1k2
7424B7pL3o7L5n6J6J7j7N1M9m4j7nl5%M8l5J1J5Nrj2L6m5J6k3nJ2jM3Km5N3j1
7458C5K3Mk9p5J4P7l5L1l6L0q2R3n0m5Q0m3J2k4mk0K1P9m1Nk5j8OPO8o5O4m0n7
7491d0P2p5P1l1m4M0l5R7nl1l2K4j6m8J08q2Q1l7l3N8n5N9l5k3O5q7R3q5M0P5
7521H9j05M2n6JL1mRL2o5K9j7LL1m6O1p3Q2ql7L5l0J9n7P1n7j6Q8j23J13r4L8
$$ plain form
7288 35 11 -6 1 -33 5 -13 36 38 -36 4 -46 36 -6 -41 -17 33 24 -13 10 33 -9 3 -38 -42 19 -45 -10 3 32 27 20 -13 -35
7321 -35 4 2 -53 -6 -46 -19 34 33 9 24 39 9 -39 -15 -35 35 6 35 -31 40 5 -22 -32 -9 -6 1 8 47 -10 60 52 -1 3 -17
7355 -17 -16 2 -1 2 31 -25 23 0 -26 15 43 -3 1 -45 6 40 37 7 10 -9 -19 22 12 -13 -37 30 28 20 16 9 22 -32 -29 -9 22 55
7391 55 9 58 -1 11 42 40 24 37 0 -19 33 3 46 20 2 20 30 -24 21 -27 -22 -21 33 34 9 4 31 5 -28 -6 -12 49 27
7424 27 20 53 -14 21 -35 -19 -2 -19 32 81 37 20 15 -20 -20 28 -7 4 19 24 15 3 39 -6 10 -13 -18 -6 -7 36 38 -7 46 35
7458 35 58 62 33 -42 -28 49 14 45 9 39 -43 50 0 -45 35 -8 4 -20 -24 -44 -23 56 15 20 -5 -23 -17 -10 58 -7 57 17 -40
7491 -40 32 -43 28 -3 -47 -7 -42 55 50 19 -13 11 -5 -53 55 -27 54 17 -16 42 -13 46 11 -12 53 -34 59 -26 14 89
7521 89 -16 26 -30 -29 2 -2 7 39 -26 3 -14 -11 20 -26 35 -38 44 36 -1 34 4 23 -34 37 -20 -36 52 -71 42 -52 -14
7552a4L5l2j4rO1l9J1nj2N6n7L9k4J1l0j3J4O3o8J8J8K2prm5M5K8p0M7ok4K7L0
7585D7m0k0mJ8K2l2J9n3M9M4k7l8lN5j07M6K3j1L9j4J1l2K0k2L6jn7R6q1j6M1
7616HjmPk1L4p7O5jj0O7p5k0mM5m4L2J9j0M1o9l1L5L0k5qL1o7K2J9jl7L5n1N4
7650a2Qk9K8J8J1m2K0PLl4oj8ML5nM0Km1n4P2k0J3K8l6k0k7P3k7L1j8%J1j3k8
7684b6J5l6J04r6K7m5J7M0n6P1j9M8l4J4ojNm2jL9m8R6o5N1m4qL7m8Nj1J2rJ1
7717ckmK1l0K0l7P1j7K2k9m5N7n8K0qJ9l9N9o1L3LlRL0J0jm8nJ5J2J2k9K0m8N5
7752B1o4L8lkOj3M7l1J1Pom7N0m4M8Ko0M7l4K8j6K9J0j2m8N7k0LK1J3k4j2J7k1
7786bl3jj0O3o6P1n8J0L4n0J08p5L8k6J1l5K6L9Jp9K5N6pl6k4K3J9j2Ql0nK1K7
$$ plain form
7552 -14 21 -11 -25 -34 27 -12 -1 -6 -18 38 -19 20 -4 7 -23 -36 -22 41 -27 -9 9 31 24 15 -30 15 43 -27 20 14 -10 17 47
7585 47 7 -13 -17 1 23 -9 10 -43 6 50 23 -15 -18 37 -70 -24 -1 -12 27 13 24 -8 12 -10 26 25 -32 64 -17 -33 8
7616 8 7 3 10 -11 23 -54 11 10 0 67 -8 -28 -32 13 -31 1 20 10 51 -18 -49 -14 16 -9 -17 14 -53 -31 -12 -13 -50 -15 -66 -12
7650 -12 -4 -33 -5 13 24 -18 2 9 12 -22 -28 -46 -42 -7 -12 28 30 -11 -65 7 -13 0 28 -8 -28 -55 18 -9 22 4 4 15 2 -26
7684 -26 -11 -47 57 -39 -12 -57 -40 0 -56 15 -4 44 10 24 18 17 22 -20 -21 18 -30 66 1 52 8 0 37 -11 -6 -17 -5 -14 -3
7717 -3 -5 -9 12 -18 2 -35 36 19 41 12 -33 24 -34 -14 -22 -3 -42 17 -44 -11 -8 -11 -2 28 38 37 -11 -16 -1 11 23 -6 14 -34 21
7752 21 -43 -5 -8 -10 -4 -17 30 -1 10 17 11 -36 14 -30 18 20 -40 7 -27 1 -15 14 24 12 -36 21 1 4 25 38 14 2 19 -2
7786 -2 -35 -36 -46 17 -49 22 -36 -26 8 -42 66 -9 29 3 14 -21 5 44 45 -34 -9 47 40 4 -20 3 22 10 18 -12 -17 4 31
7819C1o0J2N3k9mJ1om6O4KKj5KK9k8lk3P0o1L2n2PK2K9rrj0M6o9J3k4QL6m2N7
7854C6k6j5K1J0k6j8K1RPjkN0r5M2k0M8o8N3l5K7j0m9O9n6J20j21MK7k0MmPK9
7887A8Pk9j3P1m5j3PL5o0J9O7o9K7l4L8k1l7N0KQl5J7Pj7lMKK2m7O7n8N6l6k0
7921a3Pk3P6o1K8n1P7j6j6K7p7P4n0L2l2K2K6j7k4M5m3NJ0j8QlL3o4L5pk0MnL5
7955Dm3OJ8J1K5Ln0k2P4q5N0K7pk7J1N4n0q2J18n4M1n6L0%j1K2J5l1o6J20o1L4
7987A8k1PK2n4O4r2P6j5k4Ml8M9M4o4J9QM0n3L6ml3j4L2o3N0K0k1j2J8j4rj4L2
8020fk2J3K7L2o8K7j3k3P4q9N9k9L5m9L0l2M8n2P2K1m3k0n0M3L0n4M2m6Q4j9l6
8051a4K8k1J4n2Q0p7N0L3l5j5J9l9O6jj7nk0Mj7pK8L2Rl4j3M3m1k5L5j9qj7K7
$$ plain form
7819 31 -29 -17 36 7 3 14 8 -38 26 28 30 15 17 46 18 15 -8 62 1 33 -19 -12 10 39 30 21 11 57 -12 1 -23 -15 21 -21 36
7854 36 10 -5 16 26 0 -18 3 12 19 18 16 66 -29 13 -7 41 -27 26 -9 18 8 -41 28 -28 92 -29 -25 2 -18 -14 -18 -11 18
7887 18 25 -4 -17 54 9 -4 3 38 -22 -3 64 -5 22 -12 26 5 -32 18 20 28 -7 10 17 0 -3 1 3 25 -22 45 -13 43 7 -13
7921 -13 -6 -29 47 -14 14 -37 40 24 8 35 -42 32 -18 14 -18 4 30 13 -11 34 -9 -4 6 -12 -4 -7 26 -38 -3 -10 -30 -26 -31 4
7955 4 -39 -33 -15 -4 21 24 -26 -48 26 -59 -9 18 11 -16 -5 49 -1 -83 35 -19 22 -34 -4 -4 -15 7 22 -9 -75 45 -16 18
7987 18 -3 4 26 -28 36 -56 20 5 -19 -15 -53 -4 40 -24 -5 3 43 -10 26 22 -11 -25 7 -56 -6 14 -7 -19 -1 -15 -24 -38 -6
8020 -6 -28 -15 12 44 -24 3 -10 -33 41 -48 11 -18 17 -32 -2 -34 14 -38 34 55 12 -8 -58 -15 15 -39 3 -43 41 22 -14
8051 -14 14 -7 7 -45 35 -42 8 41 6 -9 10 -29 37 36 19 14 -6 -2 -19 -26 2 34 43 9 -4 39 -2 -27 8 -11 -19 -36 -9
8084iRn1N1m2O4n6N4m8J1J3L0l6qKl6K0PN5n0QJ2N1j14P1J8n5K5NK8ml3K0j08
8117i6P7J2J9k8j5N3k0j3P1l5qj7j9N7n5K5Jk9J8K7k5J7K5k4lK9m0LQl6j3Q8j3
8150D1m2J6K3j2k5l8L2nML5n5nK6Rq4J20q6N4j3L4k0n3O8n1O0o4NJ0j1J16p5M1
8182E5n7J0j2oN3q1N5Rk4qL8kJ5J8m5pJ0m3L4K7J1p0L2m4J19n5n4K5k1J4pk8M5
8215Fj6NL3l7J9j7j2K1PJ3Nj4K3m8ON1mk4k8N2o9K9L2j9l4K5Ok3K8j1M0n1j0L8
8249B2k5oL7pj22J44q6L6K6J3L6j18M1J5Pk2jQ7j03O4k7J1qk5M0LNm2J6j4Lm5
8281d5J1R0p9K5J2kK8j5j5K4m2kj2j4P0rk3kM0J2j14Q2j4qN1m7j2M4n3J5K6k8
8313fL0n2J2K8m5LM4n7J01p7oL6m3K5k4K2j7J9k4L2l7M7n8M4m6O2j8J8Ll8k7M2
$$ plain form
8084 -9 0 -51 0 -42 22 -34 20 -28 -17 -4 26 -10 -18 -16 -52 -32 -25 30 -20 -12 0 51 -63 8 26 -29 -4 1 29 25 -8 12 -96
8117 -96 -19 -7 12 -16 -31 22 2 -11 60 25 17 0 -19 38 -17 8 9 -20 -2 25 0 17 42 18 15 44 4 7 15 -21 -34 54 41
8150 41 -1 15 38 26 1 -37 -5 -10 -6 29 -26 -31 -5 4 -80 40 -46 8 -5 29 9 -44 24 -27 33 -31 -26 -16 -27 89 14 55
8182 55 -2 8 -4 -10 43 -38 17 26 2 -6 32 30 45 63 18 11 21 -22 12 39 50 -20 12 -32 87 32 -22 3 -18 -4 -11 -39 6
8215 6 -10 -5 28 -9 10 -7 -19 2 9 22 27 13 36 -12 -6 45 41 17 -11 41 -28 1 33 14 -20 5 11 -12 16 5 45 -6 -16 22
8249 22 -3 -9 28 21 -101 43 -43 -7 19 32 68 -50 -9 6 13 -9 -10 77 -26 38 11 22 14 -11 29 32 37 -5 11 -3 0 -45
8281 -45 -34 56 -23 2 14 12 40 25 10 34 -8 -10 -22 -36 34 25 2 0 40 52 -62 20 6 -2 49 2 -10 34 -19 -4 22 -6
8313 -6 24 -28 -16 12 -33 -30 14 -43 58 -19 -25 11 -32 -7 -31 -9 -26 -7 -31 1 -36 11 -47 -3 -49 13 -5 13 16 -22 -49 -7
8345gJ9J9n8N2J3m5k3K8j1K1j8n5N8%J6j4k3L9rl4Rk4jOL0m7R0p5lQ8r5R1q0K9
8379a4lj7RpL6m2N5rlK5j7l5K9k9J7l1M8l7j3J3K3k1Qk4J8nPjK4J7n1L0m2N5j6
8414cK1m6j6N2m2j3L7J7N6p3j9J9Oj6L7k3j7L0Qm4N0rj1nl4NJ9l6O6m9N2K2o1
8447b0j0J4Nl4O1n6J4N1J1o6N5Lo2K2jJ3Ll5N0l8N6o1m6O3j5L5n0L6qK9k5M3n
8480C2o1K9q%l2N3J1k1lk2L6k0K4j9L3l4K8j7J0Jl8j1L7J5k1o5N1L1J8o8K5rO4
8513D9k2n7J02l2q0O4o2Ml2M0QmN3j7K1o0L6o4K7K8j0K6n1L8J4rj5J1l4J1J1k5
8545c1J8PJ6K5j8J9l3J9n5O2qj7K4o6K9M1l3K1j3j7OL3p5N5K2q1K5P0j4n2L4j9
8577fk5J4K0j8KJ5l6K5J2K9Pq9O0o7P4oj9k5J14r4J7l6J5j3M4k4M7k6j4J2o2P0
$$ plain form
8345 -7 12 31 -27 25 38 -7 -30 -2 -13 8 -10 -65 -7 -7 9 -5 -28 11 2 -32 -23 -47 -48 -42 -12 -59 31 -44 -47 41 -54 37 -43 -14
8379 -14 -17 -34 -25 -32 4 -38 17 8 5 30 13 -22 7 -22 -5 -36 12 -25 -38 -25 -2 -23 -15 -39 -21 -26 -19 -20 4 21 -30 0 -42 13 -3
8414 -3 18 -28 -44 8 -34 -47 -10 7 63 -10 -29 -10 -4 -20 17 -6 -23 7 15 -29 21 12 1 -4 -38 -33 -14 -50 16 -33 19 41 -20
8447 -20 -30 -16 -11 -45 16 -40 -26 25 36 -30 25 28 -34 -12 -13 0 3 -32 18 -20 36 -25 -71 -8 -23 12 -38 -2 -10 19 -6 37 32
8480 32 -29 0 -8 -8 -40 13 24 3 0 -22 14 -6 18 -1 32 -2 26 9 19 20 -18 -29 8 23 2 -63 -12 19 37 -31 -6 -15 49
8513 49 27 -30 72 40 -40 24 -38 -34 -66 -26 -18 -22 31 14 35 -25 11 -53 -26 2 -8 18 -33 5 19 10 -5 6 -28 -17 -6 -31
8545 -31 -13 -6 10 35 17 36 3 22 -33 29 21 4 28 -38 -9 32 -1 20 7 -10 -4 29 -46 9 31 -50 -25 45 31 -21 13 -6
8577 -6 -31 -17 3 -15 -13 2 -34 -9 3 32 39 -50 10 -57 17 11 -8 -33 81 -13 4 -32 -17 -30 14 -10 37 11 -3 9 -53 17
8609A7K8qLq0O7j9pL7n4O9r8P1Jp2M1p0O9J7KL7o8nJ4K0J2l6K7nj1k4M1j2J6J2
8643C2m7L6n8P3q9M4lK5m5K5RN7j3l1j1k1j4L4oM0rKm4K2nJ1n7O9m0OK9j3J5o5
8677d2L0oL7k2k9K9J2qk4k0M5j6ML0J2l2M9n6k3J5l5J3L3j5K9l9M1k7J2Kj1K6
8709A4j0jK2K5n4j6N8l1K0n1L5rqNkK2Lk8J8l2J8j5O2p6pK8lJ1k0Mj2K8mL9k1
8744A2lJ7p0Q9o1k4K4J3M0J3p9K1M6n9O0p5K7j7J8qlJ1o0P3l8M4l4oRJ3k5lO5
8777C0o8J4jLK1l0M3m1pK4k9K5L2n7K8jpRK1m1K3J5j9O2p2K8mrj6j4JQ7q3pM9
8812In1N6q3Q8l3J0j4k8N7rm1J2j4JM3j5l6L2j7M3k6L4moj4Kj6J8j7J2N3q5qQ3
8846C6p5N4M6q5P6o9J3pm3P3n5K6oLl7M6j6J6M2m1K5j5lk2M0l5N2l9L5n0J6M9
$$ plain form
8609 17 45 37 40 -40 27 8 1 38 -16 53 -45 26 27 -45 -4 -74 -5 12 14 51 -17 -22 -8 12 24 -12 15 10 -1 -25 16 4 20 32
8643 32 -15 21 -37 36 -53 -9 -12 13 -32 -7 2 59 46 15 4 -17 -31 3 -3 37 28 30 -14 8 3 14 -43 26 -14 -8 21 8 23 -42
8677 -42 -12 -18 19 -3 -32 -3 9 1 -23 -43 2 -14 -10 20 32 0 49 -7 -30 -15 -50 -37 -4 -19 10 -29 12 -15 -3 -1 -12 14
8709 14 4 3 25 50 -4 -20 38 7 27 -24 11 2 -6 -1 -3 19 22 -6 12 -20 -2 -17 45 -31 -38 -10 -13 -2 -22 -18 -30 -2 -6 33 12
8744 12 9 26 -44 45 -16 -40 -16 -3 37 50 -29 -8 38 -21 39 -36 -9 -26 -8 -16 -19 -8 -68 5 -33 11 -23 -29 -20 -7 -32 -35 30
8777 30 -38 -24 -25 -22 -1 -31 12 -29 -36 -12 -41 -16 16 -41 -13 -14 -21 -12 9 -32 -9 6 -13 49 -23 5 1 -8 -24 -38 -37 50 -33 -40 9
8812 9 -42 14 -69 19 -14 -4 -18 -46 11 2 -39 -27 -41 -40 3 -12 -48 -16 -33 10 -16 18 14 8 -6 -4 -20 -2 -19 -7 46 -39 -47 36
8846 36 -39 15 61 -24 52 -17 -4 -11 -54 19 -36 -10 -16 -13 -50 -4 -20 -4 38 -3 22 7 4 -18 22 -13 39 0 35 -15 1 50
8878E0m4M4m6jj1L8j3p9Q6n8P7n2M7j7q7J33l8l1L7l5K5ol3j1K3Q3p2ok9L4K4
8909C2k3l5L9J1p7R2p0L9l5N9L0l4l0L8k4k2N6m4J8J4j0l5RK8n3J0j4N5l4rN7
8940C8l9J7k7O0j09O1j2k0%L6j8K1j3O8k5n4J4K2k6K5%m4O3l4j3l9M3j5kL6k3
8971iL4o8J5lM0l2J0K9k5L4p8L8K7k5J5OJ2p0M7rOO2o3K5j3rMk7J8K9%j2nl2P2
9006D3k7j2K0j1nK2j3j0j2kK6n3M5JL1q4qK3K4j7LJ8M2p7K9j0k1N5l3J5j2m6L5
9039b1N8p4O0k2l2N0k8P2m2j5L5k6oj9L0m1M7j1nm4%%j7N1j0N0n6K2JJ2j8mlK9
9073B3o5J08r9J6K1Jk7l3N4JNJ0K8n9k0MK8Jj9L0Pm3N6m1K1n5N8q9R5lj5J1j3
9106cN3l0l9L5j0L2m5Rj4J1O1m5m0JK2RK5j2k3R%L1k4L5j1k8J7o6O1m2K4nJ3n1
$$ plain form
8878 50 6 50 4 3 -8 30 17 -62 24 -34 43 -9 38 21 -66 67 29 -2 35 0 25 19 -14 -25 -2 81 9 3 -26 8 32
8909 32 9 -26 13 24 -53 39 -31 8 -27 32 62 28 -2 36 12 -10 46 2 20 34 24 -11 -2 26 -27 -17 -31 24 -10 -19 38
8940 38 -1 16 -11 49 -60 1 -11 -31 -31 5 -13 8 -5 63 38 -16 -2 20 -6 19 19 -25 38 4 -9 -48 -5 -20 -22 14 -9
8971 -9 25 -43 -28 -31 9 -23 -13 16 -9 25 -53 -15 12 -13 2 8 20 -50 -3 -12 -6 56 -7 18 5 -4 0 -27 -9 20 20 8 3 -29 43
9006 43 16 4 24 13 8 30 17 7 -5 -7 19 -34 11 12 43 -41 -49 -26 -2 -19 -16 2 44 -33 -4 -14 -35 20 -13 2 -10 -56 -21
9039 -21 37 -37 23 1 -31 19 -9 63 21 6 41 15 9 -10 20 -21 26 15 10 -34 -34 -34 -51 0 -10 40 -16 6 7 19 1 -3 -6 23
9073 23 -42 66 -33 -17 4 5 -22 -55 -1 0 5 15 43 -16 -36 -32 -4 -3 -22 8 15 -28 28 -13 8 -47 11 -78 17 14 -1 10 -3
9106 -3 50 20 -19 16 6 38 -7 2 -12 -1 60 15 -25 -24 -2 7 32 20 -3 6 6 37 13 48 37 9 26 -40 21 -21 3 -2 11 -40
9140d0L4OO2m4k5qj8PJ2OM0m2Mk2M9n5M4j4k7N4q8L7J8N3k4l7L5n7mO0l1M0k5
9173@Lj1J6k3K5KJ9o1M0k8K9j3j6O2o3J0m4M8J5Nn4K2PJ5PNj6J5k7k1MOj0K1L4
9208B3j0l1K6n2M1k1j4j7M9Km9N8k1K4m5K1k6O2n9k2M2Jj4N1l4NJ0mj0j8K6k3
9240b9J2M4j4l0J6k8PQQ6n9Rr2R3k7MJ4m0N7k9Qqk7K4k3M0n1M3J6m1n0M6J2n1
9273f0P7l0JQ%rKP1p3l2L4M1J8k3l5NM1l6j9jL2K4o2OL6l2j2N5Rn3L3pN0p4PK1
9309A3j9L8J8n2nmL3p0Q8m4j0K4k0J3K5j8Pl9N1K3k9Mol3k4pQ7p9K9O5n7j3LN1
9343D3k8K0l7M2k4OJ1l5k5L3lj4J5L6Pm9j6OlK5o7R5j3j9k3J7j3N6k8mLm0qN9
9377B5J4K6p4k6K3k4O5n8O4j3k1j7j9O6l6p4J57r8M7l7kpL7Mm4J9m0N9m6M0J9
$$ plain form
9140 -40 -6 0 62 18 -7 -15 -33 -26 -14 -8 32 -10 -6 -28 21 -34 10 -4 -31 23 -65 -28 -10 43 19 -18 17 -40 -44 16 -15 25 0
9173 0 3 -8 8 -15 10 12 31 -30 10 -18 11 -2 -18 44 -19 -9 -53 -5 10 15 -39 -17 -10 5 12 17 1 16 -11 -32 -28 -22 -32 -11 23
9208 23 13 -18 8 -44 -3 -24 -38 -55 -6 -4 -53 5 -16 8 -37 -16 -42 20 -39 -61 -19 -18 -32 19 -15 -10 0 -4 -14 -32 -6 -29
9240 -29 -17 27 13 -17 -1 -29 -22 -14 72 13 22 -70 23 -4 0 14 -26 31 2 10 2 -25 -1 -24 16 -35 8 24 -17 -67 -21 -9 -60
9273 -60 17 -13 -12 -4 -4 -13 -11 60 -13 -45 -11 30 48 25 -10 -5 36 0 -19 -20 12 36 -26 -20 16 -16 -28 27 36 -17 16 9 59 -15 -8 13
9309 13 -6 32 50 -2 -7 -11 22 -48 40 -4 -14 10 -10 3 28 10 17 -22 29 52 23 27 21 -12 -36 -43 44 -35 -6 59 2 -11 -8 43
9343 43 15 35 -2 40 16 22 33 -2 -27 6 3 -11 4 40 47 -2 -18 -12 -15 10 -57 38 25 6 -17 0 -13 43 15 11 14 -26 -34 25
9377 25 39 65 -9 -35 -12 -36 29 -29 35 22 1 -16 -35 31 -5 -79 78 -20 27 -10 -12 -19 18 22 -22 -3 -43 16 -30 10 29
9408B9Nk5k2%l6Q4m4OQL5m3L8l4j2qOM9n6J2j6j3P9n5K8l0lj5K1K6k4Lj4N6k1
9442A4Ol0RNo0Q1n1n8J53p8N1l1j6j9RK4l1L4k2J7o2O2qRM4o7L0o9N0k0Nj5O7
9475C3j1o3J5j3M0m0O8j4Ll2K7l3J3J6m4L5k3Oj4K0Nl1L9m3L6j1m5Q1o4L1MJ3
9507DK4o5N4m0K2n3O3ml5M1m3Q7m6j0j8J4P5p2P%o0P1%M6r4N4o0oL3J2pl1M8k0
9541iK1l8M7L6q1N1j7Ll0J7Jj4j6n6N6m4Q0l9j7N0q1Q8n4LO3p2Q2m6j7M8k6j6
9573b7N1q7N2K5l6Q3p7J9Oj6J6qJ0QJ4m4K6p7O3k1MO1j03N5K2k0PN0r2N7l5K3
9605ILPjm3M0Ml2J9lM5n8N2r9M1L6k9K9k8L3m6nL6k1K0k6kP0j06O9l7N5n5J1K4
9639A2j8L8q3Q1m8M3j6j3Lk7L7L9J2j0p9N5J5nl4qj4J5K2k4L0n3N2k0qn2N9j4
$$ plain form
9408 29 34 9 -13 -13 -49 35 -9 -3 5 40 -3 35 1 -11 -19 -13 36 -20 -8 -24 -37 42 -13 15 -15 -18 -33 -12 14 -10 -7 -21 35 14
9442 14 20 -10 -1 4 -56 25 -26 -84 69 -9 42 11 -5 -24 -15 9 -22 12 -10 7 -55 7 -1 8 52 -15 15 -54 -4 -24 -19 -34 33
9475 33 22 -41 -26 -39 1 -39 29 15 18 -14 13 -20 -7 9 -35 0 -23 -17 -31 -11 -6 -37 2 -41 -5 -16 -61 20 -44 -13 -9 4
9507 4 28 -37 17 -23 -1 -54 9 5 -30 11 -32 55 9 -1 -19 -5 70 -2 5 5 -55 16 16 62 -32 22 -38 -44 -11 1 -6 -37 11 -9
9541 -9 12 -26 21 57 -24 27 10 13 -17 0 1 -13 -29 -85 -29 -73 7 -32 -49 1 -80 8 -46 -43 20 -52 30 -16 -33 15 -11 -27
9573 -27 24 -63 -11 14 -22 61 -16 3 9 -7 9 1 11 19 33 -11 15 -62 1 -20 -16 45 -58 -3 19 -1 6 56 -36 21 -14 9
9605 9 12 19 18 -25 15 19 -13 6 3 48 -10 42 -57 -16 20 -9 20 -8 25 -21 -26 10 -11 9 -17 -19 51 -55 14 -23 32 -23 -12 12
9639 12 -6 32 -51 30 -18 25 9 -4 -1 -28 9 48 60 50 -29 26 41 36 2 -6 -20 -5 17 -7 23 -30 22 2 -6 -58 1 -13
9671a3N1j9m6j3M9Lk7kj6L4j9K1l7j4O3J4on5K6j9N0k4mM0m8M2op9R8p8PM7j3
9704Gk0jL8lj1K%%k1J2J5J5k1J5On1j4N3J3k6K5m4k1k6K3K6k4M7n9M0j6L4oj5
9738hL8m5j8R5q8M3j7k0R%J8j2L1nj1J1L0m8M4mn7L3pm2O3m7PKK5k0j8O1r2O2
9772A3oQk4l2L7m%J8k7M6q0L6mj2N2k2J3kl2j5N0j7QJk8K6o1P3jl1L6n4K2k9L2
9807a0k5P0o2K4J6ppl5JJ7K3qK3n2M2m4N9j2lp3K1M8KLk5Rj7j9L3Lj4o0J15p1
9841c5N7k4N0m2mrL7m4J4Po6N7j2k1M6nMm6O7p3L0J9k2L0k3p0Q2l0J5j0k1K4L8
9874B0mn1K1k7J19r7Rj7M5J1o9N0n1N5n2Q1p1mM1rJl1P1o3J6lL1k8l8M1j9K4L
9907ElJ4kn8J5N0Oo2M1l9l2O4l3N9p0J3MK9N5m3l3K9m8L2j0j9K1mj8L7K8Lq1N0
$$ plain form
9671 -13 38 19 -27 -40 9 12 -15 -17 -33 1 -18 3 -34 -48 15 29 23 -32 -6 -25 25 1 -3 37 -11 31 25 -54 44 -34 -27 20 7
9704 7 -13 -14 24 21 10 12 12 12 -9 3 18 33 12 27 33 -18 -32 21 34 8 33 -11 -32 -58 -35 -9 -33 14 -45 -5 -21 13 7 -8
9738 -8 30 -15 -33 62 -26 17 0 -20 -11 -11 7 -5 26 21 10 21 51 3 47 43 -14 19 12 -30 33 -14 -7 -5 20 0 -18 43 -49 13
9772 13 7 15 -9 -41 -4 -8 -8 10 -17 29 -51 -15 -19 -31 21 -1 12 10 -22 -37 13 -4 4 5 -23 3 -58 15 14 -17 19 -35 -13 -42 -10
9807 -10 -35 35 -27 -3 13 6 -1 -36 -35 -18 5 -3 20 -32 10 -34 25 13 10 -63 -42 6 8 11 -14 -5 -22 -41 -8 -5 -19 -79 36 -35
9841 -35 22 -2 48 6 2 -7 30 -14 0 7 -59 -2 -14 -35 11 6 10 -36 31 -42 -12 7 -15 15 -8 -78 4 -26 -11 -21 -42 -18 20
9874 20 16 -35 -14 -41 78 -19 -10 -27 18 29 -40 10 -41 14 -38 43 -28 -32 9 0 1 -30 41 -22 -6 -9 22 -6 -44 -3 -22 2 5
9907 5 2 16 14 -44 -29 21 27 -35 6 -33 -65 -1 -34 25 -45 -32 -28 1 56 13 -20 9 -39 -7 -17 -36 -15 -19 -37 0 28 31 -50 0
9941@k2j9P2o0K4j6L9j2k1J8Nk3RqN8j11M9K3k5O6q6P3p7O6kq8J6L8O4n5nnJ3
9974bnq1J10j6pm3M0kK1ll6L3K5ll8k6J0M6m4N1n3M7j3j3j1M1j5JJj5oL4n8O2
10008C2K4m0m5M9m9P8q6P7m0J3k4L5k3K8m8K3PJ5l2K9ml0nL2k6M8j4k0j4M1lo4
10040c6L9mJ5Ok4K6J3q3K3J2J7L6j5j3L1m6j0K9jjJ8Rk5k0nL2j3L9p2K2J0l6O2
10073C5k0n2N3j4M1o0K7K0o2L3j3O7k9Jm6O9m4j6O2q9O7n4L5k9K0M3m7K5o2P9
10103D0p1N3rl7L1j3J5Qj7Kk3K9M6p5L8j7J5J0jjqrM1r1P3K0j2ol7pJ1K5n0L2
10137ENK8j1n2P0o3J9rk9O2l2L9q9M2O0o7L2l9M9n4L9KNk5lP0p6M4l4mj0P4q0
10170c2L3QrlJ9n0J4j4O7j2j6l1K4K6n4K9m6M8nQ%K7o5N5J1l9j0M8k0m8J0J5N6
$$ plain form
9941 0 -22 -41 31 -29 -5 -21 18 6 -15 3 8 -15 -6 -14 44 -67 -18 5 -20 46 -40 33 -44 22 20 -68 -52 -14 50 -5 -10 -15 -2
9974 -2 -7 -88 22 6 -1 -44 -4 -6 15 12 -24 9 34 31 -7 -33 -23 23 -21 30 -23 24 11 -2 -13 28 13 14 15 0 -6 28 -30 32
10008 32 56 16 -29 20 -29 49 -37 40 0 13 -11 24 1 29 -19 4 11 26 -6 23 19 -11 -16 16 -10 38 24 4 -10 31 28 -36
10040 -36 3 -1 14 20 -4 22 35 -48 -25 -13 4 40 25 12 43 -3 -13 16 15 14 32 41 16 -4 -9 23 10 49 -23 -1 9 -27 35
10073 35 15 -37 16 2 43 -17 10 30 -32 1 -12 55 26 27 -19 50 6 -10 52 -37 30 -24 11 -18 2 45 -2 23 -39 40
10103 40 -31 22 13 -24 7 -6 9 17 0 2 -21 8 54 -21 17 0 15 25 24 23 15 6 47 -44 29 49 37 31 -6 -13 -2 23 -27 5
10137 5 10 38 27 -25 45 -18 1 -8 -37 25 -7 32 -57 -15 45 -22 10 -29 20 -34 5 7 12 -13 -16 54 -22 22 -12 -16 -26 48 -32
10170 -32 1 9 0 -3 16 -34 -20 -34 33 21 5 -26 -2 24 -30 -1 -47 1 -4 4 4 31 -34 21 32 -7 -17 31 11 -37 -27 -12 44
10203D4n6K6lkj5Rj0L0m0J9Oj2K1mj3J6l2PJ3p5P5j6kL3n2M5m6L0NL6q2K2M0q0
10237f3Q4l5kQk0j1N9J2j2m3K2J2nJ3M2m4Mm2MO6n3J7k0M6p3M6m7J0J9J7J2J0
10269C3nNk4k2pL1lKj8K1Lk0J6ll8pM2Mm5N6k9j7N0q8O2j6K8n6N6J7n6k0M5k4
10303b7M0m7M9j0j2kk0Q1r4M6j2qN6p1N3qn8M7nk3j7K6m9P8l5L2rl1L9mL1j04
10335f8J10k4n3O4n7J0M6j2k1NNNj9J2j1RRN4q0J2J0kK3q1P5j1L3om2Mk0L8j4
10368Cj2J2OJ8k1J0k3k5oL4J7l8L0kJ4%l2L5l9PK7KJ0k3j0J4J0n7M2j4J7l4N2
10401B4L9l6p7L9J4K1m3M0J2p6P6m1K1JJ5qn1L1K2j7N7n7L0km7L6m4j2N8m3K4
10432FJ2pm4j4N1L6q3N1L6j0j4k8N2j07J11r7P4m3MK5K4k6o1R5j6n2%L2J3oL7
$$ plain form
10203 44 -12 14 11 9 -6 3 -7 23 -17 2 8 -4 17 13 0 16 -16 -9 4 -71 4 -12 -14 19 -33 12 -34 -4 1 37 -45 -23 17 -63
10237 -63 21 -14 -16 -8 -28 -39 20 32 20 -23 -1 11 6 19 61 17 21 -21 -17 49 -4 13 -7 39 -34 12 -35 -25 -6 11 23 33
10269 33 28 33 9 -13 -20 11 8 10 -8 13 16 -4 12 9 -29 -36 6 10 -35 21 -8 -25 25 -63 -1 -17 11 -45 11 28 -28 -48 -3 -27
10303 -27 13 -34 15 5 -7 -9 -29 52 -42 4 -8 -16 40 -31 22 14 -44 3 -2 -25 -42 -16 -65 13 -22 10 1 -30 9 5 36 -68
10335 -68 42 18 -35 29 -28 -18 28 16 -5 0 5 10 -9 3 -8 1 10 64 -16 -4 6 4 27 -54 21 10 43 37 -5 -1 -21 17 3
10368 3 -9 3 9 27 6 16 -7 -32 -38 -4 13 -25 5 3 17 17 -15 20 -19 -12 15 17 27 4 -6 8 18 -39 3 -11 6 -28 24
10401 24 63 27 -50 -11 3 24 -19 21 33 -43 33 -8 13 14 29 21 -30 1 23 6 63 6 36 34 -13 23 -21 -33 25 -18 6
10432 6 18 11 -33 -47 4 40 -43 8 44 34 20 -8 44 -63 48 -49 25 -18 -14 11 35 9 -52 43 27 -25 -25 7 20 14 51
10463E1qn8qJ19p6J9k2l8Q9n9j6L5k3l2J9L6j2K4m2L4r5Q9k0k7N8m1K7k0K8Ll4
10494@O0j07M0m2M5J5k2K5l5P0m5pJ5J3J1ok8J8k5klN0J1l8l8K5N9j2q2N0j2m9
10526d6P1k1J4J4n5pJ9j4mN6Nm9K0L1K4p5O5j32J24n1L9l1pO0n7NK1n5M7Qm5L2
10558Fl3K2k0OJ5k3J7l5L7L0p0M5j7J2j2K5j6kRj9K0j5M6K6p1N2q3P3jn0L3M4
10590E1l1m8M1J4k3m0Q9r0O7k0J0j2j6L4n9J4M3p3N6J7J9n1mJ5l6O5l1J8j2j1
10620dK1m0L8j6l7N7j5j6k8j9k0R2k1J2J3o1L8l6L0J7j9L6Nl5m4P1k7K4lj5O0
10651E8p8O0m2J3K9p2M8l4M4%%k5K3k3l1M2L2j0q6N6k5j5N3j7K2m7J7rK6m3Q9
10682E5p3L3k8j0N6o4N7k3k1M2l3j5L4M6m8j0K5l7j7pO3o9Q7k9lRo3L1J1L7m2
$$ plain form
10463 51 43 -15 -23 96 20 39 17 -21 68 9 -7 28 5 -27 -8 28 16 40 -2 32 -63 26 6 -21 37 -4 23 3 31 34 0
10494 0 60 -47 -7 -49 -4 11 -11 14 -21 49 4 -3 12 25 36 30 2 20 -5 -7 -10 40 51 13 -25 0 59 47 -35 15 3 -46
10526 -46 25 4 18 32 -23 -30 -11 -25 -29 27 32 -17 3 34 58 -17 48 -84 40 -11 28 -3 -10 50 -7 -2 19 -36 11 19 -26 6
10558 6 -27 -5 -25 -19 -4 -27 -10 -45 -8 22 -48 -3 -20 -8 -20 5 -11 -13 -4 -23 -3 -18 28 54 -17 35 -48 25 24 -26 7 51
10590 51 20 -28 13 27 4 -36 53 -37 30 10 20 8 -8 26 -33 -19 24 -49 7 24 43 -8 -12 3 -33 32 1 19 7 -4
10620 -4 17 -23 15 -1 -38 19 4 -12 -40 -59 -79 13 -8 4 17 -44 -6 -42 -12 5 -14 22 27 -8 -52 19 -8 16 13 -2 58
10651 58 -20 40 -2 11 40 -32 16 -18 26 26 26 1 24 1 -30 12 44 34 -52 4 -21 -36 17 0 22 -25 -8 -17 9 -34 55
10682 55 -18 15 -13 -23 33 -31 26 3 -18 24 -9 -24 10 56 8 -2 23 -14 -31 -38 25 -44 43 14 11 20 -43 -12 -1 36 -6
10713f%J6n2M4l3P1k7LK2q2M8nn2Q2JK4m4j7po2J00l5k5L2j7J9K5m7N3n2M9m8
10745b2jM1l2M6m1j0O2l6k4k%K5K1n1K2OM0n4KJ7M2om2J2LJjn0R5p5K4K4J0k3
10779B3l5M5k5j2k2k2Q0J3n9N8Lj0k4k6L0l7K8j7%oL2O2o2k1N1o4Ol7N2j6j0L0
10811Hk2N1n3O8k9l1KJ2l8M9j5K0k7L6j3j6pN0M1q9J1l4L1nJ6j6L9k5KOpl0l1
10844d6O6oqj6L2k1k8O7q7Q4k1K6n3K9nj7JOJ0RKJ8p7O1j7M4jj2m3J1J9PJ9o9
10878a6J2KMN2n2K4Olk8K4n6M6Oml7j1L5Nj6k1L7MK2J9o6K7m9K7lk7M0M3m7Pm8
10913d2O7p4K1N1j6J9n9jO0m2qM4Qp0M8l6M0L0l5ll6M8Oo3PN9n9L7L3j5j5J1P
10946B2oOn0M6j4j1j2J3K3m3J04r1J7NJ0L7j36J19p5M4k6j8J5RL5n1kM4%n7M5
$$ plain form
10713 -6 -6 10 -42 2 -31 40 13 16 38 -44 4 -1 -53 29 30 54 10 -7 -14 -76 24 -11 -36 -4 -21 -2 23 -24 29 -23 26 -22
10745 -22 -23 18 -14 32 -9 -19 43 7 -17 -19 -19 6 27 -24 -2 4 44 -10 -8 9 51 45 3 15 18 19 18 -32 63 -12 12 36 46 23
10779 23 -12 33 8 -4 -26 -48 32 45 -14 44 47 37 13 -13 17 -20 8 -9 -9 -15 17 79 17 -4 47 -17 -11 -48 4 -12 -22 8
10811 8 -14 37 -16 52 23 -8 -6 6 -32 17 2 22 -5 31 18 2 -5 45 86 -3 8 -26 5 0 16 0 39 14 16 22 15 -15 -46
10844 -46 20 14 6 -10 22 1 -27 40 -47 37 16 42 -11 18 13 -4 -3 3 13 22 24 42 -35 26 9 53 52 40 -3 8 27 34 53 -16
10878 -16 -4 -2 2 54 2 26 32 29 1 25 -31 15 21 17 -20 -31 4 9 -7 -28 9 13 35 54 -12 15 -34 -7 -10 -37 3 46 -1 6 -42
10913 -42 25 -49 -28 23 7 26 -33 -34 26 -16 -24 20 28 -42 6 -30 10 40 5 2 -34 14 20 -43 -36 23 -36 1 34 19 4 15 22
10946 22 16 22 -28 18 4 -7 -19 -6 17 -26 78 -13 4 9 19 56 -80 39 -36 8 -18 -36 -21 -12 23 -28 -30 14 14 -43 2
10977BJ2Kk1J1K3j4o0N6k7O3p9M9J6r0J11o9lO0o0J3n2O7k9k0k3K2k4Q4jn1M6
11008A4k0Jk3K1j0lL9KLn1k1P3l6J1PL8m3k6K5Rk6L5m4MJ4K0k3qj3K7j1Qnk1J1
11043b2K5j1K8j9m5RM2j0K1J1n7J6j1j8K6NK0j7p5R3n6Q5p0K5j5m3P0m1Q2p0j2
11074c4qN5Nk8J0m1M1L0k3l3J1L2oK0o6M6l8K5M2p1M2m7L5J8qk8QmL1Q%j1j8M5
11108D0l5M3k6k4N9o6MM2l4Q8r2JN8o0J0pOk7j8j7K9L5j3l2N2j6m1N7K6K7k2j2
11140C5k1m6M7n3J6O2n7J4K4k8j0j2M4Ql9P3n0j4%M7j8j7j2K6l0Nj3M7j8l0K6
11171FJ7kLj5J3m2L6l1L0pnR2j36P9%n1J7M5o9P4r4R1k1m2N1oj9M9k9%Kj4k6L0
11205B6K1l2K2K7m1k6oRkK5j3Kn0N1J6j9N0n9J3J4l6J7l8L3k1K2jMm6J01n6J8
$$ plain form
10977 2 14 16 -5 6 29 15 -45 11 -16 47 -32 17 33 -57 54 -15 -18 42 -18 -5 -57 10 -19 -39 -62 -40 -64 20 19 -32 14
11008 14 -6 -5 -28 -7 -17 -20 19 21 24 -27 -48 25 -11 0 7 45 2 -24 1 10 -16 19 -25 -21 -7 13 -10 -18 -31 -4 -15 -7 -12 -33 -22
11043 -22 3 -8 20 1 -44 -35 7 -3 18 29 -28 -12 -23 -41 -15 -10 10 -7 -82 11 -45 40 -30 -5 -20 -63 7 -34 48 -22 -34
11074 -34 -42 13 18 -10 0 -41 0 30 7 -26 -15 17 11 31 -35 11 -27 -2 40 -31 11 -36 -1 17 9 -19 -11 -15 16 24 24 13 -5 40
11108 40 5 48 22 -2 57 -9 -5 37 3 91 -1 0 58 -2 8 1 7 -20 -38 -55 -26 9 -4 -36 16 0 -41 16 42 69 47 35
11140 35 14 -32 15 -38 -22 40 -17 -3 21 -7 -17 -29 15 23 -16 57 7 -7 -7 40 22 5 -7 19 -11 -6 -19 28 10 -20 6
11171 6 23 21 24 9 22 -20 16 -15 15 8 3 95 -41 38 38 -13 4 49 -20 54 -40 51 30 -12 39 33 14 63 34 34 36 22 -4 26
11205 26 47 15 37 64 23 -3 -9 0 -2 23 10 12 -38 13 29 10 60 1 14 28 -8 9 -29 4 -17 5 4 8 -38 63 7 25
11237B5m2L3Mn7RqN7k3J9j9LOL9n2K3J3k0K1k3L7p6K5J2l6L8n2O3k7n0O0l7M8
11269A3l9K6m8N1j4j2K5j4J3K8j4L6m8mj3K2J0Mk0K7j4k9J3KN3m7M3j6k3llKl
11302Dj5%K4m9L9lJ4J4m9O7n5N5l0k0N8Ro0J0J6m8L4j5oL8o5K3m5P2l3mK3pMm6
11336d6K4K8o0N0J1J7l3L2J5k2k1l1O7l2j0qK4J6j0l3PK6j1kJ2Qm5L3OmK3j1P
11369B7j0k2j9J1M5j5qmj6Mkj1K8j1J5j2j6lK8l9K5k0L8j5Ok3K9J2l3nO2n8J7
11402EL3n6O8lm9J4m8O3o5K5M0q1L3O7k5j02N9QJ1K0m5M9m3j1Q2q0OML4m5qN1
11434A1l7nK3J7Ok8K7j4J7j6nk3M9nj2k7L9m8K0K7MqJ8q2N3l2J0L3k7L8j2pK6
11467C0n6L0rk2L2n1R3m7NO5n1m0nN6n2J8k9K4rJ9M1o1%J0KlJ2j3NJ9j9K6O9q7
$$ plain form
11237 25 -17 16 20 -37 -28 -36 21 -2 17 -2 1 7 46 -6 17 30 10 31 8 45 -31 -6 6 -30 8 -44 19 -8 -58 2 -35 13
11269 13 -26 0 -48 3 -11 -23 2 -12 1 29 15 51 3 -1 -14 8 18 22 2 29 15 -14 -1 1 54 7 50 34 11 8 5 7 4
11302 4 -11 -11 13 -36 3 0 14 28 -21 46 -9 46 16 -4 54 63 3 13 29 -19 15 0 -6 32 -33 -10 -55 17 -16 -20 3 -4 0 -46
11336 -46 -22 6 -54 -4 7 24 -9 23 38 16 -5 -36 31 -1 -11 -19 5 21 11 -22 -15 11 0 -2 10 18 -27 6 12 8 31 20 27
11369 27 17 -5 -24 -13 32 17 9 5 -11 -7 -9 -20 8 -3 12 0 -16 -19 9 -30 -5 -25 13 -2 4 -19 10 22 -11 -16 46 -12 5
11402 5 38 -18 50 47 -2 12 -36 27 -38 -13 27 -54 -21 46 21 -81 -22 -14 -3 17 -28 21 -22 -33 49 -31 -25 -21 13 -32 -40 11
11434 11 -26 -31 -8 9 15 -13 14 0 17 1 -4 -27 22 17 5 -22 17 -31 -11 16 20 12 30 -52 1 -31 -21 12 -15 23 11 4 30
11467 30 -26 4 -5 -27 5 -46 47 0 5 70 19 -21 -26 30 -22 -4 -33 -9 -18 1 42 -19 -19 -9 -7 -10 2 -11 -6 13 -6 20 89 2
11501BQJ6J1m5j2L5m2O5j3m3RQk4j1O0k4m0J8N2Jl2K2k3J2K5m2j9qM0K0mk6K1
11534A7j0k5N4m2nKJ1l5M9K0j9kj3N8q0N5nl2K5L5m8j3m4N1N4j9j8J1l5K7j3K
11566A3Nkj0l1M1j3rj1K1K2o7N7L7o9OL6n4L4l2K7L7p1Q0m2K4m0j1O8j8j8jJ1
11598B0Kk5omL2j5J7qm1O0l8JJ7J9q0R4l5j4L7nj2%jM5m3l4N9kl8j1qJ9N7q4L9
11633A4nj1J9p4J07p0L9J0j1k6N2Kl3K7l8j8L5l5pL2Ml5K8j7M8lk7Kj6m0L7J5
11665Em2M9j4M8k1l1J2k5j5JK7Rj0j1K8K6o2O1o7R2q5J9k4O0mkk1J6l2jJ5Lk2
11698a8ML1K8Qn0mmL9m4K4om0K8j0L4l1M4k9M5n4k6P2r7J18r4M1l8K1M7n5K2k8
11730b2J5M1o3rJ9MK5%l1m3M6K6J1n0OK7%MJ4kqm4k0Q2l3%l2K3K2lJ7l8J1Qm2
$$ plain form
11501 2 10 26 37 -8 -20 15 -27 38 25 -18 -9 -1 -25 -36 24 0 -40 -22 30 31 -1 21 -2 10 35 -7 -26 -34 6 26 22 -4 17
11534 17 7 -18 36 -6 -11 -9 2 -33 16 36 17 15 2 60 -20 35 30 -2 23 58 10 -3 -47 4 58 39 21 32 -3 24 11 13
11566 13 18 16 6 -25 16 3 -6 -17 4 26 -41 16 53 -16 -10 26 -28 6 -26 1 38 -33 47 5 29 -11 -22 46 28 10 9 20
11598 20 22 -3 -9 -13 19 4 21 13 -28 32 -6 -5 12 31 -49 45 10 -4 33 28 16 16 15 60 17 -17 42 40 2 -9 -17 2 59 -25 14
11633 14 9 -2 17 -57 50 -20 19 29 18 -8 44 46 13 40 2 -16 19 -16 -23 9 13 -22 6 -11 37 34 7 9 -7 -47 -10 5
11665 5 -37 12 -2 46 25 -6 6 -19 -34 -33 -6 3 -7 -18 10 36 -26 35 -32 60 -25 -6 -30 30 26 24 3 19 -13 -14 1 4 -18
11698 -18 -14 17 45 53 3 -1 -5 34 -10 14 8 -32 -4 -14 20 -11 33 4 49 -5 -31 41 -56 62 -32 9 -29 -8 39 -16 6 -22
11730 -22 -7 34 -29 -38 -19 -15 10 10 -21 -64 -18 8 19 -31 -25 2 2 6 20 18 10 -34 -54 28 -5 -5 -37 -14 8 5 22 -16 -5 3 -39
11765c9L2j5j5M0J6p1O1n5M2%m4M3mJ6rl5pJ4L2Jn3O0k0k0L2J4k4Kk5L6K0l1j
11798gO2q1K6k9j1J2K9J9k8K6ol1PK9l2M8l9L3j9k7J0j3L8k0K1J8mp4M3l%K7o3
11831c9RN4m4L1o2R5j08P4K6q0J09r5Q4m5l2J5N6m4%l0L8l6K3Ok4K8%n1Q9n0L1
11862B8m7K6k5J4K1ql1lK2j8P2q3M9l1J2M4o1JK0k3PK8Rp5O0k1Rj3jJ9M0ol3l3
11896c1J8l7N8l6J01m5L5o5J8K1Lpr1M1M8j4l1K6k2l2P2LmJ3j2K0o3K7Rn6O8m3
11928hrM7l1o5Q2K3l8M5l6j4J1j2M0q9L7K8k0M7j6NNJ3k4m0O0n4l3JM7J5K9p4
11960b8K2JJ%%J1M2p2L5J0j2J9l4N1p8N0kjKJ5lj9L0j1j4K0m1j3J9j7M5l2K5k2
11994aj6M7N5j11Q8m4M1k8l0J1J9k2m5OJ3K5jML3k0j2M5m1J8o2M2k2J7J5%l0M
$$ plain form
11765 -39 -7 -22 -37 3 19 -52 9 -46 -4 -4 -48 -5 -9 7 -2 -37 -44 -30 2 3 -50 10 -10 -30 2 16 -8 -6 -31 5 25 -6 -7
11798 -7 55 -26 0 -29 -40 -28 1 20 -8 18 12 -19 -12 17 -15 33 -6 27 8 -19 -9 -22 16 -4 17 35 31 -43 0 -3 -3 24 -39
11831 -39 -30 24 -20 11 -51 44 -64 10 36 -44 65 -30 54 9 -23 -8 48 4 4 -26 12 -24 -1 5 -19 9 9 -42 47 -3 28
11862 28 -19 7 -18 -4 17 9 -22 -25 -3 -21 51 -32 17 -14 -2 42 -19 -18 2 -21 -14 14 23 -52 8 -13 -4 -17 -18 1 41 35 2 -31
11896 -31 -13 -50 8 -28 73 28 63 -2 16 37 40 33 -58 -17 31 17 -14 12 -10 -42 30 33 29 42 30 50 -13 14 23 -33 35 -8
11928 -8 -17 30 -1 -66 16 39 1 46 10 -4 7 -5 35 -54 -17 11 -9 38 22 27 32 45 21 -19 41 -13 -46 -45 2 17 46 -28
11960 -28 -6 -5 -4 -4 -4 7 49 -23 12 22 10 29 -5 46 -32 18 16 15 17 32 29 10 40 29 15 35 -6 -19 0 -17 28 -4 21 -1
11994 -1 -17 30 85 -26 62 18 59 31 1 12 31 9 -36 -30 -17 8 7 11 44 24 12 57 16 34 -28 14 -8 9 24 24 -6 -2
12026bK0jKo5Q4m4N3j7l5k5O4k4k3L6Qj6m0R2j03M5l6K2lk3%J03p1N6k4J2p8J0
12058b3L3n0P4o0K9L2n1N1j1J9l7k3L1j9Rm5%L0Rj6OK7n7M5l7P6o6K9rjM3k4m
12091A0j0J9k8J1j9K7L9n0O2j07M0nJ7%k9K5l5L2j5J8l2K2orP9o2qJ7m7P0o2P5
12123C9m7k0j3K6K0m5N9o3RML7j3J6j4L9m6J6l7qR3o8Rl9O5J0o8M7l1L4nj4M0
12155C2r8R4n2k7M7l8P7m7j1kMK8j8klM6J6n3m4O3rJ4L0q0L8Qm6M7Nk5l4M1k9
12188b8J0%j9J0OM5k7J9j0jL2n0mK8ln1K1N3l1k5k1L3KK6l5KJ0l1Q2l4k7j8J2
12221b4J9j8j2J0J0J6n2O2j1KJ3k1n5J18o7N6l2k2K0J0j2rj6J4j9J4l6Q5n8JJ2
12252bj0l7L1P7q1M9j8%KJ1Lo8O0j5J5jk1J4Ql6nK9l2K7m6O7m2MrR1oq4K7L8n8
$$ plain form
12026 -2 18 17 19 -46 38 -6 47 30 -5 -30 34 10 -13 23 31 15 -25 67 -36 9 -27 -5 -8 -31 -31 72 1 57 33 45 -33 -23
12058 -23 10 -40 34 -26 3 35 -16 35 24 43 6 -17 14 -5 4 -41 -41 -11 -2 -18 -12 15 -42 3 -34 42 -24 5 -4 -5 38 14 10
12091 10 0 19 -9 2 -17 10 49 -1 61 -46 -6 -11 6 6 -23 2 -33 -1 -16 2 -30 -8 -14 -23 56 -6 -14 3 -44 26 -36 39
12123 39 -8 -28 -41 -15 5 -40 19 -44 -35 -31 6 -7 9 -5 34 -12 4 -33 -41 52 -16 -7 -46 19 29 -39 8 -23 11 6 -8 32
12155 32 -66 28 -24 -51 -4 -42 35 -12 -23 -25 -21 7 -11 -13 -16 30 46 -7 -51 12 3 17 47 -33 5 13 -33 14 19 -6 -40 1 -28
12188 -28 -18 -18 -37 -27 -21 24 -3 16 6 5 37 -13 -17 11 8 -43 -22 31 0 -25 -46 -13 -11 15 -20 -18 -8 -39 43 9 -18 -36 -24
12221 -24 -5 -23 -35 -25 -15 1 -51 11 0 2 15 -6 -61 57 -10 46 14 -8 12 22 10 1 -15 -1 -20 -6 -42 43 -15 -14 -2
12252 -2 -12 -49 -18 59 -22 27 9 9 11 22 25 -43 17 2 17 16 -5 9 17 -19 -24 5 -27 0 -46 21 -21 -17 -26 65 59 -25 2 40 -18
12287a8K8l8K8oJ6K0j0K9p8K5QJ8k2L5j5nL%k0L9n0Qk4M9n6J0Q%%K9l2L9J6K1
12321E5l9J8M3p4J2pl3J7J4L3l5l7P5q7Q5o3L1Nj9M2k5l7K8j6l2N0Nk6M1n1M4
12352A7l0JK6%k2J3Jo1J06m7J4nJ7ql3O3m7Pl9j6P0l0K1l2K0j4J3L2n7K5p9J46
12384G2rk9j5q4J06n5M4p1J3M0Oj0oJ2J6k2n0P7k7j9pJ2NKj5M5j4k4NL8m4k1O8
12417C9k3J2k6J3J3l7J9Ko0R7n8rL5l6K6j0k5O6j3Rm7O0p1N1q4L2Q9o7N1o1K2
12448Ij6k4O2l3j4j1L2K1j8Pn7O3k1P%Jl3K1J7J7j4k6L5k7k3J5O6o8J5Ol1j0M1
12481In8O7k5nNjN%m2M2oK1Mq5J04m7J2%N1l5l9L3K6o7k4N1K6k5pJ8J8m8L3k7
12515a6k4Q6j11Q7n8O1q1O8o6N0L5m8Ql5L1j2K2J1l8M7n6M6k5l3P5l7M5n8J9l1
$$ plain form
12287 -18 10 -28 0 -6 10 30 20 49 -29 -4 4 22 0 35 20 15 18 18 -2 37 -13 -5 -29 20 -36 -26 -18 -18 -18 11 -21 18 34 55
12321 55 16 34 77 3 15 8 -25 -8 6 39 4 -33 42 -45 40 -23 8 13 -6 36 11 -26 2 -14 -46 4 9 -17 24 -27 17
12352 17 -13 -12 14 14 -8 5 6 -55 51 4 18 13 30 22 -11 52 5 12 -27 -43 27 -3 18 -14 6 -8 5 37 -20 5 -74 72
12384 72 63 34 19 -65 41 -14 30 -41 -28 12 18 8 2 14 30 8 -42 35 8 -11 -18 -6 -1 1 -14 31 17 -7 -2 36 -8 -29 39
12417 39 16 28 2 15 28 -9 10 12 -48 49 -9 -18 17 -19 7 -3 -28 38 25 34 -13 47 -24 27 -57 -25 64 -3 48 -13 9
12448 9 -7 -31 31 -2 -16 -27 5 26 8 15 -42 21 0 7 7 8 -25 -4 13 30 16 -10 25 -2 -25 -10 56 -12 3 9 -22 -32 9
12481 9 -49 18 -7 -12 -7 -8 -3 -3 -45 -3 -9 12 16 -69 35 -12 0 0 51 16 -23 10 36 -31 -55 -4 22 -3 -10 8 26 -22 11 -16
12515 -16 -40 46 -65 22 -36 25 -56 12 -54 -4 31 -17 -9 -44 -13 -25 -3 8 -30 17 -39 7 -18 -51 24 -13 32 -26 -7 -38
12545c8PK0rJ9onl3K0J1j0P3o1J1k8K9k5J5K5j4ml0N5Ll0N8o6mk7L0j5J7k1%P
12579b6M4K1p7N2K8k2k2k0K1l0M5l0Nk6N8m2K9j5K0qJ9M4q0j5P0l7m5j5O1m8P
12610c4M5o6Q3l4M8q5N7o2O6ok8L1k4L0m8mJM8L3o7Mk4K2M7n5M4Pm2j6M2k0j0
12642a7N0m7M3o0oKP5j5m7M8l6m2M7l1M8J5j4J2qo2O1J7j7K4K0o4m6N1%L6n0J6
12674CK6p7Q1o0J03n1l2N0p1M7l9NK9K7o5mMO8k7l4N1m8KjnM3o6M2k2KM2n8N1
12707A6K4J5q0PO4n2jL9J0o7J8JJ7l6JL5p3R5m1pj6k4Q4l7M8l6J0qJ5Rk8L0o2
12740c0lM5K0j7j3L6l7PL4m6P%j1kL0m1L3jl1K9m3O2j6k1M5m4JPM4p2P0ol9J6
12774A3J4l9j6K5J9j1J5NJ0l4O0j11O8l8N6k8P%l9P6Jl4m0N8jn1L9k8L5n6N0j4
$$ plain form
12545 -38 -31 -11 -20 -1 -7 -12 -45 -25 -14 -24 49 -12 -1 -29 0 -25 -10 15 1 -3 -33 22 25 -5 53 -13 -17 -44 -14 -29 -12 -33 -33 -26
12579 -26 18 39 -38 14 42 20 -2 -22 -1 -31 14 -16 -11 -37 21 -21 8 -7 13 5 24 68 -12 -27 43 6 -39 -54 7 -41 -34
12610 -34 11 -55 28 -6 42 -43 14 -48 18 12 -16 15 -9 21 -27 -31 -30 18 51 -16 -12 -36 -14 33 -22 22 29 -13 -29 13 -7 -17
12642 -17 33 -14 29 -31 -37 -35 40 25 -22 26 -10 -52 -5 -36 12 27 13 25 17 -45 16 33 16 40 60 -4 -50 1 1 37 -13 3
12674 3 29 -48 33 -27 76 25 -7 43 -28 19 -20 -15 14 41 -24 -28 -24 44 17 -17 34 -14 -12 -13 -18 25 -41 1 -21 -19 23 -35 16
12707 16 40 55 -25 -18 46 -6 -7 32 42 -25 -7 -6 11 -25 -24 11 -62 33 -8 -15 -31 -55 29 -8 40 4 14 6 21 30 2 32 -30
12740 -30 -33 12 32 15 2 38 1 8 42 -4 3 3 -8 -10 20 -21 12 11 -20 9 -34 28 12 -9 36 -8 -7 0 44 -28 42 36 -3 13
12774 13 27 -12 -28 -3 16 5 20 25 35 1 61 -50 18 -20 36 8 15 15 -24 52 53 19 -21 37 36 -15 24 -4 31 -25 25 11
12806A1j4llopK7L5Jn3K6L9k1j3o6K2oJ1N9m0j8K0k5L5j9K7p9R4l1Rkk1K2k7m
12840b0l2O9Mk6L5l4K5mLM3m3l5J3L2l6N0p0J7K6n1N9k6K0l1J2k6M2n9mO1o7M1
12872a2j9J5oL3q4N0k2M2j0PQl8L6k7K6j4jL5rk4J6n8P6m9J3rJ1J0j0oM5k9n1
12905e5M1%N4o1rJ8k8L3n0Q3n1J9j4JJ5j7J8QQjl5KNK9oj0Jn4L1L2j4J3Lj8K3
12940A4J1lj5j6Pk0l4K8L9J7l0j6j2KnJ8jQJ9m8O9n3j7L7NKJ3nm3O5q2N8m6PL2
12975Ej5N8n3J5Np0N2LM1o8O9m3MJ7n7O5o8O3l6L2K2l0L4p3L%l7Q3Jo1N3m6L6
13008DM9j4k9o9J3Q3l4%LLJ1m1M9p1Q8l4rK6J8n8K5n2L5j0k8L3K5j0JNk1Kj9r
13042c5P0m1j9pJ4L5m4M3k0M0J0p0K6J6m9M8oj2Nj0k5L4k1N6k3k2J2o2M5j9Q7
$$ plain form
12806 11 -3 -6 -9 -15 -22 5 40 41 -12 14 53 32 19 -47 -25 -31 -20 39 -1 -19 1 -24 11 -8 19 -60 34 3 12 10 -11 11 -16 -20
12840 -20 -52 17 21 -5 30 -4 21 17 20 63 20 -15 -2 30 -6 44 -26 -9 17 -34 25 -1 19 -12 0 -26 16 -43 -47 14 -53 -12
12872 -12 -31 -16 -22 11 -73 -23 -45 -3 -13 -6 2 -36 0 -27 -1 -15 -16 19 10 -14 2 -56 20 -29 -16 -25 -14 -4 -14 -20 25 -4 -55
12905 -55 -14 -14 40 -21 -30 -12 -40 -7 -57 26 -25 -6 -20 -19 -4 -21 -3 5 13 12 -23 -21 -16 13 7 -3 -2 -56 -25 7 -7 6 9 -9 14
12940 14 25 22 7 -9 -2 -22 -56 -28 11 28 -2 -18 -30 -28 -33 -15 -16 -8 11 -37 32 -21 -38 -1 4 6 19 14 -29 36 -46 12 -34 -27 5
12975 5 -10 48 -5 10 15 -55 -3 0 41 -27 42 -1 3 20 -37 28 -40 23 -13 19 41 11 45 -28 -25 -25 -62 21 22 -39 14 -32 4
13008 4 53 39 10 -59 -46 37 3 3 6 9 20 -21 28 -43 45 11 2 28 46 -12 13 -39 -4 -14 -42 -9 16 6 7 12 -9 -7 -26 -35
13042 -35 35 -6 -25 -32 -18 17 -27 16 -4 36 46 -24 2 18 -31 17 11 -1 4 -6 -31 3 -18 38 15 -7 5 -57 -12 -31 56
13073E6m4o3L6l5N1rN3j5m5J3pmMM2o7P6o9L0J7l6L8jj8k2L4J5j7oJJ8qo0K9l7
13107e0J00j00O4J3l3nLL5Ql8j6M1qk0k0rk2K9K6j3K4m5M0J2n9K9K9n7O8n2LO1
13139C8ol4NK4k0ork4L4K7Pl7j3%pK5J0m0K0J1J0m6jJ2K0Rp0P5j6l2N2l5K2l7
13173c2M8m8L3K9m5J1l4L1rLJ3k7L6Mnm5O2o2K7j2L9jj4l5L3j9K0L7o7K1j9L4
13205GJn2L4QpN9n4K3n6J9mj0K2O5n7J7j1RJj7J2j8Rk5pL2l6K1PJ5%qL7q5O4k7
13241a2kJj5K1pJ0j8K4l3N2m4N9p2j0L7M6n9M0m1M7m7k6Q6n1m1j6P4k3K7kj4l
13273a2l3P2k5k0QkJ1j0klQl5P6m2NJ8l4Ql4J2P6n1N0n6K5M0q5j2j6N9%K5o4M8
13307Ejm1J9mj6M5j7k9lL6j6PL0m2L1mjOJ8m1mQJ0o1Q4rL5o8K7K3m5M4k7l0J9
$$ plain form
13073 56 12 -51 -15 -50 1 -8 45 30 -15 -2 -9 -13 -9 33 -34 42 -27 3 20 -16 22 21 3 -19 15 30 13 7 8 26 18 -42 -13 -50
13107 -50 50 -50 14 27 -6 -11 -8 27 35 -3 -19 22 14 -6 -26 -35 -57 -28 -2 -15 9 -36 4 16 -43 -14 15 -42 26 -26 -23 38
13139 38 32 -2 3 27 7 1 -8 -32 2 29 36 -1 -14 -14 -21 4 14 -26 -6 5 15 -31 -32 -20 0 9 -61 14 -2 -34 18 -17 5 -32
13173 -32 16 -32 1 30 -15 -4 -38 -7 -16 -13 0 -27 9 13 8 -37 25 -37 -10 -22 17 16 2 -33 0 -19 1 38 -29 -8 -27 7
13205 7 8 -44 -10 -2 -9 50 -4 19 -37 -18 -22 -32 -10 55 -2 15 4 13 14 -3 9 -9 0 -25 -32 0 -36 -15 -8 7 7 -1 36 -49 15 -12
13241 -12 -14 -13 -28 -7 -14 -4 -22 2 -31 21 -23 36 -36 -46 -9 37 -22 18 -23 24 -23 -49 37 -14 -55 -71 3 -20 7 5 -9 -12
13273 -12 -45 27 2 -18 -10 -12 -1 -11 -13 -16 -8 -43 33 -9 -4 14 -20 -12 -46 -34 42 -9 41 -15 10 50 -35 -47 -63 -4 -4 21 -43 5
13307 5 4 -37 -18 -22 -38 7 -10 -39 -42 -6 -22 -15 15 -27 4 0 -1 5 23 -18 -22 -14 -4 -65 19 10 45 -23 4 27 -18 26 -1 -31 -12
13342a2m9Q7m1qjL4mj0J6p5Q6%J9q4J5L5mJRk0m9Q6q2L7pJ3k2J3L7oK1j6l3L5
13376B1k7K0k0K5p7M6MMK8r2Q6Nk4KK5l3k4J2K3k3N8po6Q4p1P2m3l3M6q8J03j3
13408B3p4M5j4M7j1N4m6j2NJ5k7nK9J7k5J4k4On6P5j03O3L4l5J6J3Lr8P4m1QL8
13440Hj5J1koJ4Rj7LM0o7N2q4R7p4K4K0Ok1k1K1J0LOo8J38q2kMJj0l0M3m5M7m1
13475b8N2k8lL0l8l4L3J4O3l9l7K2QNL2n5k5K0k0K5nL2m5J1L5o1M9k2om2N3qM0
13508B8p0R0q2O2k6j2jpO4j02J8J7L9jr3P8OKRm4N3n8M3l0%N2k1j0pOj2K6l9M1
13542A9pl0K9j5L2o1M7l0qO0n6L3j9J3j4J9m0K4j7K5ll1lN9n4L7j7m4O8mn2N0
13574A0qpm7P3Kn2QrKMM0k7J1k0L6m3K2J1K2n7M2j7j1N7m4%J9j2p7J39q8Qnk5
$$ plain form
13342 -12 -61 26 -15 -23 -24 10 6 -4 12 -63 23 23 42 -42 -27 8 4 5 14 -6 -55 31 -51 -14 -21 -8 -30 -17 20 14 35 19 -14 21
13376 21 -6 14 -6 19 -58 -12 -8 -4 24 -68 18 23 -1 1 26 -7 -31 -19 4 -19 39 32 -34 50 -21 51 8 -25 21 -67 36 23
13408 23 -51 -6 -20 27 16 70 24 12 17 32 5 0 29 46 21 35 11 17 -39 36 -67 -4 30 -5 11 24 27 -71 3 -38 -30 8
13440 8 -7 4 2 -4 10 19 2 5 45 -22 30 -54 43 -31 -7 13 19 -2 -23 -2 8 11 17 -51 87 5 3 7 8 -2 -32 11 -34 13 -28
13475 -28 24 -4 -7 23 -15 -49 -16 -2 61 22 -15 7 15 20 52 -3 -28 -8 -28 -3 -8 24 -21 -10 25 -36 13 -9 -15 -57 -4 -12 28
13508 28 -42 48 -34 28 2 -10 -11 -18 46 -56 -38 -21 18 17 -76 2 8 10 19 -25 28 -30 13 -17 -17 35 14 4 -3 3 -9 17 -22 19
13542 19 12 -18 11 -4 28 -33 14 -16 -24 36 -20 13 -6 7 -7 12 -28 -4 -21 4 1 -30 -33 26 -28 9 -8 -52 16 12 -40 10
13574 10 2 -5 -52 21 23 -29 -21 -30 -28 -24 16 -11 0 -20 16 -27 -5 6 28 -29 13 -4 -15 42 -2 -2 17 5 -72 67 -21 -13 -18 -43
13608d3K1L7Mj2Ml6L0m%Qo3J00p1L6j5l6M3k3O5o%m3nj7PO0j06M7K6j6L6o3J4
13641b1NL1l7J3j4qL4m0nN8k7K6Jk7L0pKm1K3l5M9jk5L8Jo2N7l2M6n2N1l4k5N4
13675B6m0l6M8Non0M7K6k3J0k1J2K6o0L7j5J3j5N0p3J3qM4KOo1O1j1K1j9l0K2
13707Al5k0N3j5M4n0K3L1q3Q2p6K0m0O5RK1n4j2L8o2L3K5K6No3N1p9J06q4M8K9
13738C7k2k9mK8m1O6l2l8LJ8J4j4K0j3%J5k1J1k1K7j6K9l9OK7rk7j2L5%OQk0L3
13772B5l3QK6m2K3K0j7Mj5k2N8l5J8k8K6J0k1J1j4K8m1k4K9oR5m7ok6J7l4J1L4
13804C2m7N7l3KK0n4RK0M0o0P7l5K3n5j4K5Jj0n2R7r4K7M1m3K5L1n9M7m3N4p7
13835d8K9qQ6q0N3%n4O5m6%MkJ5L4j8j8N2j7j9o3M9Kj8M5q0M9qJLO5r3K7k8J6
$$ plain form
13608 -43 -22 15 19 7 11 -25 5 1 1 9 -54 46 -25 11 -4 -40 3 -20 45 39 39 -4 -9 -26 -19 41 -65 -18 8 -8 28 -35 -21
13641 -21 -16 15 -22 -9 -23 -31 3 -37 -42 16 -11 15 16 -11 19 12 14 -27 -4 -39 10 9 -16 22 23 -39 18 -14 32 -20 31 -3 -28 26
13675 26 -14 -50 -2 3 -3 -53 -6 20 -3 7 -14 -2 24 -36 1 -14 -1 -16 34 -39 -26 -34 10 12 18 -43 18 7 28 9 -21 1
13707 1 -34 -54 -1 -16 28 -22 1 32 -51 31 -45 -25 -65 0 9 30 -24 -36 2 -60 -27 -2 24 29 -34 17 -62 44 -40 8 37
13738 37 15 -14 -18 10 -31 35 3 -35 -32 -14 0 -14 6 -7 -7 8 -13 -2 -23 4 -12 17 -22 -16 11 2 -25 -37 -2 -2 4 12 -8 25
13772 25 -8 0 26 -16 7 27 10 14 -1 -23 35 0 18 -10 16 26 5 16 2 30 -11 -35 -6 -12 83 36 30 4 21 -13 -2 32
13804 32 -15 42 9 11 31 -23 -14 6 46 -14 63 28 51 -4 -18 7 8 -2 -54 43 -51 -24 17 -26 -1 30 -29 18 -25 29 -48
13835 -48 -19 -27 59 -21 32 32 -22 43 -3 -3 1 -1 14 48 30 12 64 47 28 -35 14 16 -2 43 -37 12 4 5 8 73 -20 7 -21 -5
13869eJ3pL9m1pM6rm1L9n7N7n0L1nN4q5O5l6K7j4pN0q6L7K0k6j9J6M1l9KmJ2K5
13903C6n3O9j06J10m9oj7jM2m7O4n5K2k6j2J9jjj0O8m2j7K6l8N5m2M1Jn5O0m3
13934hK3k3JN6n9mj7M7k3k4j3Q2m5L0l3K7pJ5j5l0N6o7O5m8M8j00L3L5l4M8n9
13965d3O9j3n2O3k0J8l6N3n0Kl0pN5l7M4k0N2m7j8N5j7j2n8K3rL1k3NQ1o6J6n9
13997e0L0L2qJ0lk9k5M7K4l6omO1l7L1l9m5N1lk8N9l9j0Nk4M1j2N5n2L6l1qk5
14030c2R3p4Qm4J5jM0J1m3qN7m5M9rj1%m2P8o9M2j1L0l2J3ok6OlK4l3j6J24j08
14063b3J2k0MN5rj7pQJ4k6K2q2Q6r2R8%l8J9j7K9n3P5J2o1NJJ3m4J5J0l3L8KJ8
14097A4jmj8j4M2K3l2l3mLM4R%Op3N5m0J0J6j5J5L4n6lj1L4K1k4M7n5J3k3L0p
$$ plain form
13869 -5 8 1 40 -1 -8 38 29 -12 27 -30 27 -23 8 3 57 -28 37 1 28 14 7 57 -29 8 28 2 -17 -1 40 1 3 -1 11 36
13903 36 -17 52 -54 56 7 1 -16 -17 25 -22 42 -13 9 -17 -29 -10 -11 -12 -22 46 4 -13 13 -25 30 -12 29 30 -25 35 -8
13934 -8 15 -8 -7 49 -10 -14 -31 16 -7 -31 -44 38 -7 23 -10 17 10 25 10 -20 36 -31 34 -14 34 -66 -33 2 -32 16 -43
13965 -43 26 13 -39 24 4 22 -14 39 -11 -9 -39 -46 9 -28 16 -4 48 1 -17 38 21 9 -49 -26 -35 -4 -27 -22 59 -7 9 -50
13997 -50 -20 12 4 14 11 -18 -43 4 28 -8 -14 -18 43 6 37 -2 -47 4 1 -27 32 -7 -17 -12 -36 5 -7 48 -4 32 1 -7 -32
14030 -32 61 -13 -5 -49 -34 -35 5 16 -27 -35 22 -23 26 17 6 6 -36 42 -27 15 4 34 2 15 9 -17 -11 -14 10 -23 -39 85 -23
14063 -23 -11 -31 -27 28 19 2 -5 3 17 -9 13 -69 17 -75 23 23 -15 4 -13 16 -37 38 50 -11 -6 -5 8 -36 -21 -11 -44 -6 -4 14
14097 14 13 9 -9 -23 19 42 10 -23 -27 -24 20 29 29 35 -38 17 -23 -13 3 -12 3 37 -19 -22 -33 1 22 -2 45 -10 3 -20 10 3
14131Co1P5n3L8M6j5m5QJ8J7kMk4m0rQ0o1J3J9l1O4o3K8k3K8l3M4n9M6lj6m1P1
14164B3j5JJl7J7J6J9rk0Pj6J4k0N9q8N2LJ8j9j8pJ8M2m2K0On1J7K1qk9N3m9L3
14198A2ppoO7l5MJ6k3j4rl9L0M9k5k8M0r2J29r6O5r1R2k6k3J2k8O2n2Nj0M1k2
14230ij1Q4m1jk7RK8l2Nj1L6n9N5j5j9J7l8K8nj9oL7N6q1P7k3L6j27L8K4pL2k0
14263A1J5k6K5n7O0l9mM4n0N0l2M8pj06R2o2P5p1Q4m4j6L1m3J7KP5n1m0K3Qk2
14294a0L2l3J4k0j8mO5o6O9l8J4j9M5l4J1L3j4j2o1M4P7p4J9Qj6J2k2J6L8l0j
14325B5n7K9L7m8J7%j6Rl6J4L3pPm2N6j4K1o5J6O0m1J8j7K0k8Q3j09M7m6J7P6
14356E9r8J3J7j0Rj2J6kKJ0RNl3O4qpn6lk0P3n9j4nN6Lk9J0K1m0oL1Kok0L6rR
$$ plain form
14131 3 -58 17 -36 2 48 33 -12 -4 14 31 29 33 9 -31 -40 40 -21 -8 11 -20 44 -19 9 -14 14 -19 25 -34 12 9 -7 -48 23
14164 23 8 9 10 -27 -10 6 25 16 -4 3 -13 1 -19 40 -48 4 7 25 6 -12 -19 -1 41 -1 19 25 -26 -9 12 4 -25 28 -21 12
14198 12 5 -2 -8 59 24 28 44 21 7 -2 -41 -11 38 13 -15 25 -67 62 -34 31 -60 32 6 -17 -5 -33 29 -23 -18 -28 13 -9
14230 -9 -20 64 23 22 -5 4 32 0 5 -6 30 -29 26 11 -8 9 -29 -1 -6 -25 -31 6 62 -19 58 35 71 -56 -18 6 -1 31 11
14263 11 26 0 25 -32 28 -11 -15 29 -21 29 -3 45 38 -68 24 -38 37 -34 50 6 -10 21 -22 -5 -3 72 21 -19 4 12 -10
14294 -10 22 -11 3 -17 -35 -39 26 -40 29 -9 5 -14 31 -3 8 41 27 15 -46 -2 75 1 20 28 12 24 2 18 56 26 25
14325 25 -32 -3 34 -14 3 3 -13 -4 -40 -26 7 0 7 -35 21 7 28 -37 -21 39 -2 16 -1 19 -9 74 -35 12 -34 -17 59
14356 59 -39 -26 -9 -19 -10 -22 -6 -8 -6 4 13 18 -15 49 41 34 -22 -25 -45 28 -31 -45 -50 6 9 -20 -10 11 -29 -35 -4 -2 -8 -28 8 -1 8
14393Hm0J9k9O5l1K3n1L8k4N8p3N1K6l1l1QKm3P6k1o0M7j9KJK3L2k1Rk6j6J1M5
14426B8l1j8M0j04P5k7K1M6q1R1q7M6J5jl3L9J5p9L1rJ4n3N6Rk0J7LM1r0O8m1
14457a9j4L7p0N5k5R6j02j1O2k0L0KNk0rk8L4p7O7J9p3M2%qQoN6l1J4Lk6ppk5
14491d8M2k5K0J1J1J4j8Orj2L5m6rL3m8N9l8k3R6m4k3qMM7o7J0K7L0n4n1J02m5
14523b1J8L8p8L6j5J7k3K6L2k4qRkk3PL2j3L2k6qL1q7K0K8j0MM0j5L9m0K3o3K0
14556dnkQJ5lj2J5j6M1m7oN4m5K7k0qL1k9j5J8K1j6K0k2j3M2j1jn9R6m6J5k3J4
14590A4J0l4J7j9M2k4NMk4L7ml2M4m7M8l9K6n7L3Kj2lK9KK0p0N8k3M7n4m1P4L
14623C2m7ml5N8L3qPl4Kk6K9lj6%nMJ1l5L3o0M1L3k8O6p0N2o6nN2j1lK6l0m7N5
$$ plain form
14393 8 -32 -13 -42 23 -8 15 -36 2 -22 36 -37 14 40 9 -22 -14 -12 -55 21 0 -60 -13 -32 -30 -29 -6 26 5 14 -12 -28 -17 28
14426 28 -3 -21 19 -85 -10 -37 -16 30 -51 40 -47 -1 14 13 -20 19 34 -45 -14 -23 -9 -62 -6 3 -17 0 3 44 -46 22 -19
14457 -19 -33 4 -66 -11 -36 60 -42 -53 9 -11 19 21 26 6 -3 -31 3 -74 -7 12 -61 -19 -19 -27 -19 -25 31 0 14 17 -9 -16 -23 -48
14491 -48 -6 -31 -11 0 11 25 7 13 4 -8 27 -19 -28 5 -43 16 -22 -45 51 7 -16 -24 -20 27 -40 -30 -3 27 -27 -78 24 -21
14523 -21 -3 35 -43 -7 -22 -5 -28 -2 30 6 -2 7 5 -18 -11 21 8 40 14 6 37 -50 -30 -2 -12 -8 32 17 56 16 39 -24 -4
14556 -4 -9 -11 -3 12 9 -3 12 -4 37 -10 -16 38 -7 20 0 -8 23 -6 -21 -3 18 2 22 0 -13 29 18 17 -42 54 8 23 0 14
14590 14 24 -10 7 -12 30 6 11 15 -9 28 24 -8 36 -11 37 -2 24 -33 0 2 -10 -13 16 18 38 -32 26 3 50 -4 -45 29 32
14623 32 -15 -19 -54 4 37 29 36 2 4 -22 7 4 -12 -12 -17 -13 -2 -37 -4 -64 -23 10 -18 48 -22 30 -36 -41 11 0 -3 23 -7 -54 1
14658An4Q6Lk1Kk3L4o9Q2n1l6O4nKj9Km5M5J0MK3p0K8m0P5q6Q2m5L9k9oN1Ol9
14692Ak3K4N0m0omK4l8j2N6l6pk7K2l9M9K6k2NKMk9K7l6P1j4o1R5r6R1k0k2%j2
14726CK8o7Q6n0j3n1O8pk9N1p2R7l8lo4J07k3m9N3l2K3k6j9J8m4L9k4N8k0J3j9
14757fj0J3m2K9M6l7J5k9K5kl2K9NK2o7K5j8N3m1M0l1J4k8k1M3j9K5n7N9k3K3
14788CK1m6K0RK8p0N6o9K4M4J2j5p7O9j4k9L4Kj3o9Q0k7M0m2N4n4K6J5l6O3p7
14819c8nO2n3R4m7j7K3m4jJ9OK0m6J9J4J2LQj8l1N4q5P7Op4j5j4O4L1m7J4k7j4
14852e0J2K8N7o7mrK6k7J6l4K9L9m2K0j8M0j7j5Pl2K9j0M0k8L2o1R8p0QL3n5M9
14884B4l5M6K0q5L1L3j8J9nn1J6K5l3J5O8l4jo2M9ql4j0M4j8k0L2j0J0k4K5J9
$$ plain form
14658 1 -53 33 36 15 17 -6 28 -41 41 -10 -46 18 13 15 -4 -2 -47 -2 8 12 35 -35 -7 -47 28 -58 24 -21 18 -11 -17 34 40 1
14692 1 -22 2 52 12 6 2 26 -12 -24 32 -4 -11 -38 -16 -55 -6 20 -2 3 5 9 -20 7 -29 42 28 -33 62 -34 57 37 15 15 3
14726 3 31 -36 50 0 -13 -64 4 -3 -32 19 -53 44 6 3 -61 46 23 -26 27 -5 18 -8 -27 -9 -53 -14 -38 20 0 13 -6
14757 -6 -16 -3 -45 -16 30 -7 8 -21 4 2 -30 -1 4 26 -41 -16 -34 19 -22 18 -13 1 -27 -48 -5 -24 1 -56 3 -20 3
14788 3 24 -22 -2 7 35 -35 21 -48 -24 20 32 17 -60 9 -5 -34 0 2 -11 -80 0 -27 13 -29 25 -29 -3 12 -24 39 -38
14819 -38 -43 19 -34 60 13 -4 19 -25 -26 -7 -1 19 -27 -8 6 18 21 29 11 -20 34 -51 26 32 -42 -57 -71 -7 24 -23 -9 -36 -50
14852 -50 -38 -10 47 -20 -24 -33 -7 -34 -18 -52 -23 16 -26 -6 -24 16 -1 -16 -9 -41 -12 -22 18 -10 22 -39 59 -11 -3 30 -25 24
14884 24 -11 35 55 -30 1 34 16 35 30 -21 -5 20 -13 2 70 36 35 -27 22 14 -20 -30 14 -4 -24 8 -2 8 -16 9 28
14915B8l0k2M0j8k0J9l6MN5j8L6k6k9J3k4N4l9L2j3J8J5o7M8p4R4j5k7kK0k3j
14946hJ0O4l2j2j7k5M1rNj0qK3k1JRL1j8n7M5l0pK8L7j5km0J4J5J2l6K5j9J7J4
14980B5k8j8L5l0Q1n1Qkk7L1k4L2mn3L1K2j3%m7M7m3O2k7J6on6P3l4n0P7LK2m2
15013A0j3K0J6j6M6o2qJ0M0m4N0%k9j4k0L8l9L2rJ2n%Nrl6L4QmJ1mo8Q5j3K3l9
15048HJ0l0M6%m5K0nJ9p7O5k6j5L7o9P3k7K1nojj6j0J5O1o7N2Nn3L7nmk4N2l4
15082BQl5K6j1j2K9m5O7Kn4KJ2J3l4L3l0L7J8k6L1n5K1K2n0O6n9L1j0j0J7q0Q7
15114A3n2J0J0L8Lj2N0n4l5L8RK7l0p2Q8p6jM8l5kP3n1O3k3n3M4j6jkj4L7m4o
15147b8O0l8N8j08L0L2n6P7l7L2n1K7J5QKn1J6pq%L4PnlJ2kk8L8kl4O1o6J6J5
$$ plain form
14915 28 -2 -24 16 -2 -22 -3 -39 -35 20 2 38 12 -17 -4 -28 26 -13 19 6 24 39 -28 20 -54 40 25 -2 -4 16 -7 -8
14946 -8 2 66 34 22 5 -20 21 12 17 7 -1 22 1 2 11 42 24 -33 12 -18 -25 3 40 25 23 -17 -3 12 24 -12 13 -6 11 25
14980 25 -3 -21 14 -16 65 14 22 20 -7 24 0 32 28 -25 6 28 15 15 -32 15 -28 34 7 23 17 -39 34 0 -50 27 30 52 10
15013 10 -3 17 33 17 63 1 -7 3 43 -1 49 49 20 6 -14 24 -15 17 8 20 15 15 20 11 -25 9 17 13 24 20 -48 37 24 47 8
15048 8 18 -12 34 34 -11 9 4 23 -54 11 -15 -30 7 -62 11 -16 5 0 -6 -7 -23 -33 -18 43 -24 28 33 -20 17 12 8 -16 36 2
15082 2 10 -25 1 -10 -22 7 -38 29 31 -23 -21 -9 4 -30 3 -27 10 28 2 33 -22 -1 21 -29 37 -22 9 -1 -11 6 -74 13
15114 13 -39 -29 -19 19 22 10 60 6 -29 9 18 45 15 -57 31 -45 -46 2 -33 -35 38 -13 50 27 -26 18 2 1 -1 -15 22 -22 -28
15147 -28 32 -6 52 -56 -26 6 -50 27 -10 22 -29 -2 13 21 23 -28 -12 -19 -27 -27 7 14 9 6 18 16 -12 26 24 -10 51 -15 1 16
15181A6m1J3oK9J2k2m5N9Ol3R6j11M5qQ%K3k2j26J38o1M1Rk5kl2N7kPj7k6j6M9
15214A3o7Q2j7j2K3m4J8Lk6K1Qk9M1m0M4ol0j3rR5o9M6l5j4KN0p5O6j0n4M6RJ
15247A8l6O1o4M3k4N0Mq6P5q1P9ll1J6j8M7j18O1L5j4Qn3L0l2j5M8OrK8m2N1r
15279B5j15J27j8m1M9k2J0m3M4l0l2Q2q2PK7j9N4rl2M7rk1qL0k9jM0nj7m9M9j6
15311gj8K3M4qj8K3m5J8l4M6Pk8Nl0R5o4j5l0RO3j6ml3N2mj1mJ8m5j9P5l6l7O2
15345C4j4lj7m1P9r9N5O5Ln5l6Q7r2P0m1N2n5J6rKN1o3K8m5L2Lj0K3j2k4K4j3
15377emL0k1J6k1J1N1n0rK5m5L2l4oPM3j8J5j9Ql8L2j2N9n2RJ5m5L6k0l0O4L1
15410E5l4m7j9P0p3O4j2L6o9MJ0K7J3m4J4RJ3K8n5L1nL4j00O6j6j0O0p4L9j4N3
$$ plain form
15181 16 -25 -12 -18 11 23 1 -44 15 21 -12 84 -27 18 10 18 18 41 19 -107 31 -30 11 20 -5 -7 -39 18 16 23 6 -20 -36 13
15214 13 -54 28 11 -1 22 -22 -4 -1 -27 -6 2 -27 14 -26 18 12 -18 -31 -40 55 -14 32 -3 -17 -15 35 -40 26 16 -38 8 17 18
15247 18 -18 43 -21 22 -2 48 52 -34 41 -40 39 36 5 21 3 50 -68 -7 28 14 22 -31 -1 -33 -48 0 6 -3 25 -17 34 25
15279 25 -90 37 19 -22 27 5 15 -28 16 -14 -46 36 -46 -39 -12 -31 23 14 -18 29 20 -1 -9 21 -8 -9 31 26 9 -40 9 -7
15311 -7 -25 -2 42 34 16 39 -6 12 -22 24 31 3 8 -22 73 9 -6 -36 -27 36 20 16 -17 35 31 20 16 34 -11 -30 45 9 -28 34
15345 34 20 17 0 -41 38 -61 -6 59 62 7 -29 58 -34 36 -5 47 -8 8 -1 1 52 -11 17 -28 4 7 -3 20 8 -16 8 -5
15377 -5 -9 21 0 16 -5 6 57 7 -2 23 -22 10 -24 -30 -23 20 2 17 -2 6 -32 0 -12 47 -5 4 19 -26 10 -10 -40 24 55
15410 55 21 -26 -45 25 -48 16 4 40 -29 -25 -15 12 25 -19 -5 4 17 45 -10 21 16 50 -50 16 0 -10 50 -24 15 1 54
15441E4k3l4N6m4m1K4j6K2K2L6j6n7J0J0nM5l7pl1j8N7Jj4nl0P1j5j6L6l6Pl4
15473b8K5J7J1m6P4m3J9j4o1Q5n0Nj5mJ5oK7j4l4K9j8K7J6j0j7L0J1n1N5K1n7
15504aj0kK5Nk2oK5j0Ok7M2p0N0o4P1j4O%j6Rm1N9n2O3j8J8n6J8Mj4N2m4Rk5j7
15539d7P0n4M0m7Q0m8j1Qj0JN6j5m3Q8n8k4M3j1j5l9O9j9m5J9n1Q7o4N6p2P9o9
15570d6kN3k6knL8l6Pj1M0ql1M1k3K7n3J1L8qM7l6Qo6M1l8N4m5K7K4j1j1k0M8
15603B6j3j5o8K0O8j7L2n0l5R1k6N0j05J8M6k8jK5l3L6jp7O2l3N3l5k5O6k1k3
15633a3L8pm1L1jN2m5jk6JK6l7K1k9NpL2ojL6Ml0mqK7l3nK1K1n0MJ4j1j0N5k9
15669fO1l6k2K4j7o9Q3k9j1K0pN5n9K6k2K8k8j8K4m7N9k6mM5m9K6oM4p1J7L1j6
$$ plain form
15441 54 31 -3 53 9 -32 -8 -24 -2 20 56 40 -17 -7 3 -2 43 6 -1 -32 -50 7 8 -6 -11 -41 30 15 -1 35 -1 6 -28
15473 -28 -3 14 25 -21 53 10 29 15 -46 39 -11 -6 -21 -25 -10 -16 11 -3 -37 -8 -26 1 17 7 -10 20 31 -20 35 56 -1
15504 -1 -11 -13 12 17 -5 -11 14 4 10 -17 25 -45 5 -59 12 -2 4 4 -12 -3 -44 15 -37 26 8 26 -30 -12 -8 -22 30 -14 -5 -30 -47
15539 -47 23 -31 9 -38 42 -6 -17 -9 -19 -18 38 23 -20 68 10 -14 29 18 3 -36 33 14 -31 -12 -63 24 -40 16 -56 23 -46
15570 -46 -48 5 -21 -23 -28 10 -26 -19 -30 10 2 -29 12 -11 16 -37 -26 12 4 51 15 23 -43 -2 -40 14 -31 -4 20 9 -2 -22 26
15603 26 13 -2 -70 -50 18 1 33 -17 -52 39 13 63 -42 -24 22 -6 -7 18 -15 21 20 -57 5 -28 25 -10 -35 31 10 -13
15633 -13 25 18 -23 8 7 59 14 13 -13 -12 14 -23 -2 -31 -26 -33 -1 -7 -8 28 32 2 -2 -10 17 -16 -21 0 21 -29 -25 -11 -22 -32 23 -6
15669 -6 55 19 -3 21 4 -65 18 -11 -22 -2 -9 46 -13 13 -9 19 -9 -27 -3 -50 9 -17 -21 24 -25 1 -5 39 -32 -15 16 0
15701@Qj0J7K4o3K0qJ0k9M8m4N2jo7N0o3L2k5M7RJ3J8k6j8j8N4j5%J4J0m9K0J
15734A1k2l6L3M0l3k7M4k4j1K1L3l0J5K7o3O4n6K4l6k5P5l0KK8m5L8J3qk8j4P5
15765E5n2m9Q1Ll4K4J1n2N2j0L0n7J3nPL3n6O1m2Nl3M0J2Ln5L1n5K3M1o3R2q7
15797c3O3m7j2K8K5l8K7lmjm1K7Jm3Q2l5M1m7rM6k1L0p3K5L4m0L4J9j6NJ4r0P8
15830B6Kn4O2q1L9LJ9J6m7L2p0O5k5qJ5K7j1L6k6j6K8l2N1q6K7j3P3j5p5K7k2
15861c3M1n1jO6k2L1m4%L8k9N7o0j3%O4l1j2j0M4n8J5M2m1j2LL3l3j6L5pk5L3
15893Dl1K3KK2pOl3k9R6r6R0o8J3L1J4k8j8j0l2P3m9O8m4J0M0m7n5O4rl1kP0p4
15926c7L6j5N9l8rK8l9K9r7P4k2K6M1l1kpj5L0m7O7K7l5J9n4K8K3q4K4j8M4l0
$$ plain form
15701 0 8 -2 15 39 -24 -4 -12 -2 -31 17 -27 25 24 -43 7 -56 -24 -49 -2 7 20 38 12 -6 -24 30 15 15 29 39 -10 10 11
15734 11 -11 -47 -14 26 -7 -34 10 -14 -25 -4 29 -1 14 41 -22 42 -14 10 -26 -51 24 -6 -4 24 -21 17 30 22 -6 -20 55
15765 55 3 -46 35 38 4 28 39 -13 39 29 59 2 15 10 17 50 -6 55 13 18 -15 25 37 40 -15 16 -39 -16 25 -38 54 -33
15797 -33 30 -17 -29 -1 24 -14 13 10 6 5 -36 -9 -8 -51 31 -4 37 -10 -19 27 6 36 -37 -12 22 -18 16 35 19 24 38 -52 26
15830 26 28 -26 36 -45 -6 -3 16 32 -15 17 -53 12 -13 -21 -6 21 10 46 20 4 32 0 51 -35 -8 -21 52 37 -38 -11 -33
15861 -33 8 -43 -44 22 0 31 -13 -13 25 -4 53 -7 -20 -20 44 13 1 -9 35 -23 -8 34 -7 -19 -16 17 -16 -32 3 -4 -29 4
15893 4 -27 -4 -2 20 13 19 -14 -43 53 -43 47 -21 -8 23 37 9 -9 -19 -51 22 -27 41 -3 7 47 0 -55 9 0 -31 -33 37 -37
15926 -37 -1 -16 43 5 -4 24 -15 14 -83 -9 -31 -5 36 5 3 -4 -19 11 -36 31 58 23 42 -12 16 39 -45 -21 -39 5 -25
15957b5J5J8Jl4J6J1qM1k3L2m3K5n3j0O0n6KK4j4P0n6L9j18J07j3j4M3l7O2j07
15987d5Q6m4K8k9L1ol2mk5N6k3k5N3o3M0Qj2l0L0j8nnMK0PJ1jpPjJ1mn7N0J1r
16023HMl8rO4n5P1k7l8kJ5M8n8M2j7qLJ6M1j14N8m1N3L0m0K1l3Pk9J03j09L8K1
16055B5J0j2m9O9o4M9l6K0j1k4N4l7L2j9Oj0l3O8m6K6k6L7j4%j6m3P7m6M3m4K6
16086A2J0n4Q4p2MJ6Qjj9pk2P3l8jL2m1K3k4L9rM0k9l1Pm4L8L2m4N5n6M4m4M9
$$ plain form
15957 -25 -10 8 9 -25 -9 2 -6 35 12 44 1 26 -27 -37 23 -33 -31 -7 -21 49 -7 32 -86 21 8 -6 37 0 62 -45
15987 -45 41 -3 25 -4 27 21 -11 -15 -40 16 -7 -32 21 -42 -2 6 -6 -36 -6 -24 -29 -34 -30 -10 -3 8 7 0 7 6 17 13 -44 6 17 8
16023 8 12 -26 -35 29 -26 45 18 -20 -22 -7 41 -17 25 8 0 3 19 60 -54 4 -37 16 46 6 27 -6 1 -28 75 -34 4 25
16055 25 35 23 -26 43 -21 28 -8 12 1 -23 31 -6 26 7 13 3 -30 38 -8 18 -8 29 15 15 -1 -44 33 -13 30 -14 12
16086 12 22 -32 52 -20 -16 0 8 7 -12 -19 -41 32 -6 -7 25 -16 7 -17 22 13 53 24 -7 0 -44 -6 26 -18 37 -19 25 -19 30
$$ [...]
16383A4
##END NTUPLES=NMR FID
##END=
