##TITLE=31P_DE-80H_X3
 64 sc D2O
 26.2.2025
##JCAMPDX= 6.0         $$ Bruker NMR JCAMP-DX V2.0
##DATA TYPE= NMR FID
##DATA CLASS= NTUPLES
##ORIGIN= UXNMR, Bruker Analytische Messtechnik GmbH
##OWNER= root
$$ XWIN-NMR		Version 3.5
$$ Fri Feb  6 12:15:35 2026 Russian Standard Time (UT+4h)  Yarkov@DPX200
##.OBSERVE FREQUENCY= 81.013821
##.OBSERVE NUCLEUS= ^31P
##.DELAY= (6, 6)
##.ACQUISITION MODE= SIMULTANEOUS
##.ACQUISITION SCHEME= undefined
##.AVERAGES= 64
##.DIGITISER RES= 17
##SPECTROMETER/DATA SYSTEM= spect
##.PULSE SEQUENCE= zgpg30
##.SOLVENT NAME= CDCl3
##.SHIFT REFERENCE= (INTERNAL, CDCl3, 0, 243.863)
##AUDIT TRAIL= $$ (NUMBER, WHEN, WHO, WHERE, WHAT)
$$ ##TITLE= Audit trail, XWIN-NMR		Version 3.5
$$ ##JCAMPDX= 5.01
$$ ##ORIGIN= Bruker BioSpin GmbH
$$ ##OWNER= Yarkov
$$ C:/Bruker/XWIN-NMR/data/yarkov2/nmr/P31/2/audita.txt
$$ ##AUDIT TRAIL=  $$ (NUMBER, WHEN, WHO, WHERE, WHAT)
(   1,<2026-02-06 12:14:39.00 +0400>,<Yarkov>,<DPX200>,
      <created by zg, POWCHK disabled, PULCHK disabled
       configuration hash MD5:
       00 E9 B6 7A A2 85 ED C7 34 08 36 98 17 FE 4E 26
       data hash MD5: 32K
       FE 49 6E 82 0D 05 0C 39 B9 CA 19 70 CA AC 98 D7>)
$$ ##END=
$$ 
$$ hash MD5
$$ 59 BB 04 AE 96 73 BB E4 94 51 CD A5 3B 5E 3D 78
##$RELAX= 
##$RELAX= 
##$RELAX= 
##$RELAX= 
##$RELAX= 
##$RELAX= 
##$RELAX= 
##$RELAX= 
$$ Bruker specific parameters
$$ --------------------------
##$DU= <C:/Bruker/XWIN-NMR>
##$EXPNO= 2
##$NAME= <P31>
##$PROCNO= 1
##$TYPE= <nmr>
##$USER= <yarkov2>
##$AMP= (0..31)
100 100 100 100 100 100 100 100 100 100 100 100 100 100 100 100 100 100 
100 100 100 100 100 100 100 100 100 100 100 100 100 100 
##$AQSEQ= 0
##$AQ_mod= 1
##$AUNM= <au_zg>
##$AUTOPOS= <>
##$BF1= 81.014009
##$BF2= 200.13
##$BF3= 200.13
##$BF4= 200.13
##$BF5= 200.13
##$BF6= 200.13
##$BF7= 200.13
##$BF8= 200.13
##$BYTORDA= 1
##$CFDGTYP= 0
##$CFRGTYP= 5
##$CHEMSTR= <none>
##$CNST= (0..31)
1 1 145 1 1 1 1 1 1 1 1 1 1 1 1 1 1 1 1 1 1 1 1 1 1 1 1 1 1 1 1 1 
##$CPDPRG= <waltz16>
##$CPDPRG1= <>
##$CPDPRG2= <waltz16>
##$CPDPRG3= <>
##$CPDPRG4= <mlev>
##$CPDPRG5= <mlev>
##$CPDPRG6= <mlev>
##$CPDPRG7= <mlev>
##$CPDPRG8= <mlev>
##$CPDPRGB= <>
##$CPDPRGT= <>
##$D= (0..31)
0 1 0 0 0 0 0 0 0 0.06 0 0.03 2e-05 3e-06 0 0 0.0002 0 0 0 0 0 0 0 0 0 
0 0 0 0 0 0 
##$DATE= 1770365678
##$DBL= (0..7)
120 120 120 11 120 120 24 19 
##$DBP= (0..7)
150 150 150 150 150 150 150 150 
##$DBP07= 0
##$DBPNAM0= <>
##$DBPNAM1= <>
##$DBPNAM2= <>
##$DBPNAM3= <>
##$DBPNAM4= <>
##$DBPNAM5= <>
##$DBPNAM6= <>
##$DBPNAM7= <>
##$DBPOAL= (0..7)
0.5 0.5 0.5 0.5 0.5 0.5 0.5 0.5 
##$DBPOFFS= (0..7)
0 0 0 0 0 0 0 0 
##$DE= 6
##$DECBNUC= <off>
##$DECIM= 4
##$DECNUC= <off>
##$DECSTAT= 4
##$DIGMOD= 1
##$DIGTYP= 9
##$DL= (0..7)
0 0 52 120 120 21 21 25 
##$DP= (0..7)
150 150 150 150 150 150 150 150 
##$DP07= 0
##$DPNAME0= <>
##$DPNAME1= <>
##$DPNAME2= <>
##$DPNAME3= <>
##$DPNAME4= <>
##$DPNAME5= <>
##$DPNAME6= <>
##$DPNAME7= <>
##$DPOAL= (0..7)
0.5 0.5 0.5 0.5 0.5 0.5 0.5 0.5 
##$DPOFFS= (0..7)
0 0 0 0 0 0 0 0 
$$ [...]
##$SUBNAM1= <"">
##$SUBNAM2= <"">
##$SUBNAM3= <"">
##$SUBNAM4= <"">
##$SUBNAM5= <"">
##$SUBNAM6= <"">
##$SUBNAM7= <"">
##$SUBNAM8= <"">
##$SUBNAM9= <"">
##$SW= 400.765351723535
##$SWIBOX= (0..15)
0 1 3 0 0 0 0 0 0 0 0 0 0 0 0 0 
##$SW_h= 32467.5324675325
##$TD= 32768
##$TD0= 1
##$TE= 0
##$TE2= 300
##$TE3= 300
##$TEG= 300
##$TL= (0..7)
0 120 53 12 22 120 120 120 
##$TP= (0..7)
150 150 150 150 150 150 150 150 
##$TP07= 0
##$TPNAME0= <>
##$TPNAME1= <>
##$TPNAME2= <>
##$TPNAME3= <>
##$TPNAME4= <>
##$TPNAME5= <>
##$TPNAME6= <>
##$TPNAME7= <>
##$TPOAL= (0..7)
0.5 0.5 0.5 0.5 0.5 0.5 0.5 0.5 
##$TPOFFS= (0..7)
0 0 0 0 0 0 0 0 
##$TUNHIN= 0
##$TUNHOUT= 0
##$TUNXOUT= 0
##$USERA1= <user>
##$USERA2= <user>
##$USERA3= <user>
##$USERA4= <user>
##$USERA5= <user>
##$V9= 5
##$VALIST= <valist>
##$VCLIST= <CCCCCCCCCCCCCCC>
##$VD= 0
##$VDLIST= <DDDDDDDDDDDDDDD>
##$VPLIST= <PPPPPPPPPPPPPPP>
##$VTLIST= <TTTTTTTTTTTTTTT>
##$WBST= 1024
##$WBSW= 4
##$XGAIN= (0..3)
0 0 0 0 
##$XL= 0
##$YL= 0
##$YMAX_a= 3529
##$YMIN_a= -3323
##$ZGOPTNS= <>
##$ZL1= 120
##$ZL2= 120
##$ZL3= 120
##$ZL4= 120
##$ABSF1= 60
##$ABSF2= -190
##$ABSG= 5
##$ABSL= 3
##$ALPHA= 0
##$AQORDER= 0
##$ASSFAC= 0
##$ASSFACI= 0
##$ASSFACX= 0
##$ASSWID= 0
##$AUNMP= <proc_1d>
##$AZFE= 0.1
##$AZFW= 0.5
##$BCFW= 1
##$BC_mod= 2
##$BYTORDP= 1
##$COROFFS= 0
##$CY= 9.86611175537109
##$DATMOD= 1
##$DC= 1
##$DFILT= <>
##$DTYPP= 0
##$F1P= 182.462994727601
##$F2P= 168.069089081705
##$FCOR= 0.5
##$FTSIZE= 0
##$FT_mod= 0
##$GAMMA= 1
##$GB= 0
##$INTBC= 1
##$INTSCL= 1
##$ISEN= 30
##$LB= 1.5
##$LEV0= 0
##$LPBIN= 0
##$MAXI= 11.51145
##$MC2= 0
##$MEAN= 0
##$ME_mod= 0
##$MI= 1.244541
##$NCOEF= 0
##$NC_proc= 0
##$NLEV= 6
##$NOISF1= 0
##$NOISF2= 0
##$NSP= 1
##$NTH_PI= 0
##$NZP= 1
##$OFFSET= 243.8632
##$PC= 1.4
##$PHC0= 1700.809
##$PHC1= -1.240479
##$PH_mod= 0
##$PKNL= yes
##$PPARMOD= 0
##$PSCAL= 0
##$PSIGN= 0
##$REVERSE= no
##$SF= 81.0140731611343
##$SI= 65536
##$SIGF1= 0
##$SIGF2= 0
##$SINO= 80
##$SIOLD= 65536
##$SREGLST= <31P.CDCl3>
##$SSB= 0
##$STSI= 0
##$STSR= 0
##$SW_p= 25641.0256410257
##$SYMM= 0
##$S_DEV= 0
##$TDeff= 0
##$TDoff= 0
##$TI= <>
##$TILT= no
##$TM1= 0
##$TM2= 0
##$TOPLEV= 0
##$USERP1= <user>
##$USERP2= <user>
##$USERP3= <user>
##$USERP4= <user>
##$USERP5= <user>
##$WDW= 1
##$XDIM= 64
##$YMAX_p= 0
##$YMIN_p= 0
$$ End of Bruker specific parameters
$$ ---------------------------------
##NTUPLES= NMR FID
##VAR_NAME=  TIME,          FID/REAL,        FID/IMAG
##SYMBOL=    X,             R,               I
##VAR_TYPE=  INDEPENDENT,   DEPENDENT,       DEPENDENT
##VAR_FORM=  AFFN,          ASDF,            ASDF
##VAR_DIM=   16384,         16384,           16384
##UNITS=     SECONDS,       ARBITRARY UNITS, ARBITRARY UNITS
##FACTOR=    3.08e-05,      1,               1
##FIRST=     0,             0,               0
##LAST=      0.5045964,     0,               0
##MIN=       0,             -3323,           0
##MAX=       0.5045964,     3529,            0
$$ Real data points
##PAGE= N=1
##DATA TABLE= (X++(R..R)), XYDATA
$$ plain form
0 0 0 0 0 0 0 0 0 0 0 0 0 0 0 0 0 0 0 0 0 0 0 0 0 0 0 0 0 0 0 0 0 0 0 0 0 0 0 0 0 0 0 0 0 0 0 0 0 0 0 0 2 -8 13 -19 23 -27 31 -38
58 -38 43 -47 61 -73 86 -121 171 -311 575 2573 302 -1142 -2658 -3078 -2925 -1831 -515 1032 2177
77 2177 3010 2933 2291 916 -622 -2148 -3150 -3323 -2543 -1156 551 2028 2857 2920 2157 929 -491 -1781
95 -1781 -2623 -2923 -2496 -1529 -148 1392 2617 3181 2866 1765 197 -1370 -2497 -2990 -2550 -1460 -79
112 -79 1287 2330 2831 2679 1955 809 -667 -1982 -2798 -2916 -2178 -805 760 2164 2908 2829 1986 687
130 687 -807 -1967 -2709 -2803 -2185 -1214 41 1344 2364 2753 2405 1400 -111 -1585 -2609 -2896 -2449 -1321
148 -1321 82 1443 2398 2667 2354 1514 334 -903 -1961 -2625 -2581 -1787 -521 1045 2336 2993 2906 1931
166 1931 633 -882 -2043 -2599 -2516 -1848 -745 501 1610 2434 2632 2195 1103 -302 -1748 -2751 -3005
$$ packed form
0@%%%%%%%%%%%%%%%%%%%%%%%%%%%%%%%%%%%%%%%%%%%%%%%%%%Kj0K1l2M2n0N8o9
58c8Q1r0J08j34J59k07K92m82Q86J998k271j444j516m20J53J094J316J547J145
77B177Q33p7o42j375j538j526j002j73P80J387J707J477Q29O3p63j228j420j290
95a781q42l00M27R67J381J540J225N64l15j101j568j567j127m93M40J090J381
112g9J366J043N01j52p24j146j476j315q16j18P38J373J565J404P44p9q43j299
130F87j494j160p42r4O18R71J255J303J020L89l48j005j511j474j024k87M47J128
148a321J403J361R55K69l13q40j180j237j058o64M4P94J266J566J291O57q7r75
166A931j298j515j161n56Q3O68J103J246J109Q24J98m37j092j405j446j003k54
$$ plain form
183 -3005 -2436 -1220 215 1548 2411 2581 2058 1098 -117 -1329 -2210 -2615 -2399 -1562 -386 1012 2192
200 2192 2824 2593 1718 413 -1011 -2138 -2621 -2337 -1530 -393 853 1911 2506 2491 1967 911 -345 -1638
218 -1638 -2526 -2693 -2157 -965 485 1780 2553 2588 1913 844 -355 -1496 -2248 -2472 -2161 -1342 -154 1023
236 1023 2041 2602 2324 1428 112 -1253 -2236 -2629 -2220 -1398 -141 1028 2012 2386 2297 1606 599 -543
254 -543 -1650 -2334 -2414 -1846 -695 669 1913 2586 2573 1805 771 -514 -1610 -2193 -2266 -1811 -975 174 1231
273 1231 2100 2407 2093 1195 -66 -1388 -2345 -2643 -2261 -1300 -40 1158 2004 2239 1948 1180 197 -850
291 -850 -1772 -2282 -2241 -1652 -571 682 1803 2460 2391 1638 509 -682 -1675 -2157 -2019 -1470 -537 478 1393
310 1393 2108 2230 1881 1064 -108 -1284 -2160 -2407 -1993 -977 238 1369 2133 2235 1821 928 -97 -1077
$$ packed form
183c005N69J216J435J333Q63J70n23r60j215j212q81m05K16Q37J176J398J180
200B192O32k31q75j305j424j127m83K84Q07J137J246J058N95j5n24j056j256j293
218a638q88j67N36J192J450J295P73L5o75j069j199j141p52k24L11Q19J188J177
236A023J018N61k78q96j316j365r83l93M09Q22J257J169R84L74q9o91j007j142
254e43j107o84q0N68J151J364J244O73j3p68j034j285j096n83p3M55Q36J149J057
273A231Q69L07l14q98j261j322r57k98L82R61J260J198Q46K35k91p68r83j047
291h50r22n10M1N89J081J253J121O57o9p53j129j191r93m82J38N49R33J015R15
310A393P15J22l49q17j172j176q76k47M14J016J215J131P64J02m14q93j025r80
$$ plain form
328 -1077 -1851 -2172 -1975 -1392 -410 718 1770 2391 2195 1451 284 -979 -1883 -2274 -2101 -1316 -317 697
346 697 1514 2011 2000 1573 761 -247 -1296 -2053 -2201 -1751 -836 421 1546 2210 2219 1678 762 -295 -1250 -1807
366 -1807 -1983 -1747 -1005 -98 916 1760 2192 2020 1268 123 -1077 -2000 -2406 -2081 -1277 -207 868 1652
384 1652 1966 1761 1235 445 -557 -1451 -2058 -2157 -1682 -759 440 1567 2178 2222 1643 660 -446 -1340 -1829
403 -1829 -1853 -1414 -692 257 1113 1807 2083 1862 1183 134 -991 -1840 -2220 -1878 -1002 32 1069 1780 1960
422 1960 1689 989 136 -698 -1510 -1961 -1959 -1458 -566 468 1440 2065 2052 1395 459 -635 -1585 -1987 -1898 -1292 -477
443 -477 406 1224 1748 1868 1550 902 -62 -979 -1797 -2024 -1712 -818 237 1181 1879 1941 1624 787 -28 -847
463 -847 -1446 -1753 -1598 -1056 -315 615 1450 1949 1949 1265 282 -790 -1631 -2031 -1904 -1260 -345 578 1329 1677 1692
$$ packed form
328a077p74l21J97N83R82J128J052O21j96p44j167j263r04l91J73P85R99J014
346F97Q17M97j1m27q12j008j049p57j48M50R15J257J125O64Rn41r16j057r55n57
366a807j76K36P42R07J014Q44M32j72p52j145j200r23m06L25Q04J070J075P84
384A652L14k05n26p90j002q94o07r9M75R23J199J127O11M4n79r83j106q94m89
403a829k4M39P22R49Q56O94K76k21o79j049j125q49l80L42Q76J034J037P11J80
422A960k71p00q53q34q12m51KN01Q92J034R72O25j3o57r36j094r50m02Q9O06Q15
443d77Q83Q18N24J20l18o48r64r17q18k27L12Q94J055R44O98O2l17q37q15q19
463h47n99l07J55N42P41R30Q35M99%o84r83j072q41m00J27O44R15R23P51L48J5
$$ plain form
484 1692 1258 576 -262 -1097 -1751 -1853 -1575 -792 277 1282 1884 1959 1465 716 -290 -1066 -1523 -1655 -1423
503 -1423 -761 -32 801 1527 1863 1718 1159 228 -804 -1580 -1941 -1719 -1021 -99 746 1448 1724 1573 1097 290
523 290 -501 -1284 -1691 -1795 -1458 -663 316 1246 1806 1915 1449 481 -473 -1294 -1718 -1746 -1295 -600 181 921 1471
544 1471 1733 1572 997 112 -804 -1576 -1895 -1628 -942 32 911 1538 1770 1490 913 103 -614 -1225 -1616 -1601
564 -1601 -1176 -418 402 1229 1757 1784 1273 399 -586 -1392 -1790 -1667 -1143 -505 298 1047 1443 1514 1254 704 -91
585 -91 -927 -1569 -1785 -1575 -838 96 1029 1636 1719 1381 691 -66 -802 -1289 -1487 -1417 -918 -210 589 1258 1718
606 1718 1643 1168 354 -625 -1360 -1707 -1573 -1005 -235 548 1186 1469 1382 1026 465 -249 -977 -1499 -1678 -1447 -750
627 -750 131 1029 1627 1674 1263 494 -329 -1023 -1375 -1521 -1215 -724 -57 677 1214 1585 1503 989 220 -621 -1360
$$ packed form
484A692m34o82q38q35o54j02K78P83J069J005O02P5m94p49j006p76m57j32K32
503a423O62P29Q33P26L36j45n59r31j032p76l61K22O98R22Q45P02K76j51m76q07
523B90p91p83m07j04L37P95R79R30N60J09m66r68r54q21m24k8M51O95P81P40N50
544A471K62j61n75q85r16p72l19K67O86R74Q79O27K32k80n77q10p17o11l91J5
564a601M25P58Q20Q27N28K7n11q74r85q06l98J23N24O38Q03P49L96P1k60n50p95
585i1q36o42k16K10P37R34R33O07Q3l38o90p57p36m87j98P0M99P08P99O69M60
606A718p5m75q14r79p35l47J34N68P70P83O38K83q7l56n61p14p28n22j79K31O97
627g50Q81Q98N98M7m11p69q23o94l52j46L06M91O67P34N37L71q2n14p69q41p39
$$ plain form
648 -1360 -1714 -1490 -933 -123 723 1319 1533 1390 908 290 -364 -1009 -1399 -1444 -1172 -596 274 1068 1598 1650 1213
669 1213 433 -424 -1081 -1528 -1432 -1146 -528 163 797 1264 1418 1279 829 47 -676 -1387 -1698 -1471 -854 -10
689 -10 845 1391 1612 1320 779 85 -537 -1091 -1331 -1288 -961 -374 406 1104 1558 1646 1177 432 -437 -1143 -1499
710 -1499 -1444 -945 -263 398 942 1268 1312 1062 596 -54 -707 -1336 -1607 -1358 -752 60 790 1446 1531 1230 631
731 631 -97 -722 -1158 -1306 -1141 -731 -107 466 1091 1445 1466 1075 331 -431 -1172 -1526 -1423 -838 -146 534 1061
752 1061 1360 1275 985 395 -173 -800 -1176 -1392 -1218 -618 156 888 1419 1486 1142 506 -212 -896 -1247 -1289 -1025
773 -1025 -579 1 535 1006 1282 1208 860 222 -554 -1195 -1506 -1314 -844 -43 638 1169 1359 1209 850 249
793 249 -338 -891 -1190 -1189 -1038 -445 183 908 1357 1470 1140 466 -284 -980 -1268 -1250 -911 -384 179 688 1070
$$ packed form
648a360l54K24N57Q10Q46N96K14j43m82o18o54o45l90m5K72N76Q70P94N30N2m37
669A213p80q57o57m47R6K86O18O91O34M67J54j39m50p82p23p11l11K27O17Q44
689a0Q55N46K21k92n41o94o22n54k40M3L27N87P80O98M54Q8m69p45q69p06l56
710a499N5M99O82O61N44L26M4k50m66o50o53o29k71K49O06Q12P30O56Q5l01n99
731F31p28o25m36j48J65M10O24N73O25L54K1l91p44p62p41l54J03N85O92O80N27
752A061K99q5k90n90n68o27l76k16J74O00P74P32N31O7l44o36p18o84l51m2K64
773a025M46N80N34M71K76p4l48o38p76o41l11J92M70Q01O81N31J90j50l59o01
793B49n87n53k99JJ51N93O28P25M49J13l30o74p50o96k88J8L39N27N63N09L82
$$ plain form
814 1070 1194 1069 654 134 -586 -1123 -1447 -1280 -803 -53 677 1175 1333 1114 602 51 -571 -993 -1158 -1103
834 -1103 -788 -292 259 872 1306 1338 1041 438 -356 -937 -1290 -1288 -879 -244 377 843 1149 1175 920 512 -28
855 -28 -591 -1069 -1281 -1149 -634 15 742 1252 1339 1079 518 -112 -644 -1030 -1125 -1000 -659 -123 405 847 1179
876 1179 1200 895 276 -401 -966 -1357 -1204 -836 -176 459 883 1178 1040 814 339 -181 -657 -1017 -1134 -1012
896 -1012 -530 129 724 1258 1330 1049 491 -157 -792 -1091 -1122 -955 -473 13 501 911 1087 1028 700 195 -477
917 -477 -964 -1299 -1235 -752 -146 503 954 1144 1011 578 142 -314 -755 -984 -1044 -851 -413 151 711 1150 1248
938 1248 917 429 -228 -787 -1114 -1114 -822 -307 229 610 973 1022 913 608 102 -461 -932 -1187 -1090 -668 -126
959 -126 605 1069 1112 958 558 -7 -473 -842 -1001 -960 -693 -301 221 685 1015 1136 806 318 -290 -844 -1129
$$ packed form
814A070J24j25m15n20p20n37l24J67M77P50P30M98J58k19n12n51o22m22j65N5
834a103L15M96N51O13M34L2k97o03p94n81l53KM09O35O21M66L06K6k55m08n40
855b8n63m78k12J32N15O49P27N10Q7k60n61o30n32l86r5J25L41N36N28M42L32
876A179K1l05o19o77n65l91J53L68O60O35M24K95j38k26m75n20m76l60j17J22
896a012M82O59N95N34P2k81n58o48o35k99l1J67M82M86M88M10J76n9l28n05o72
917d77m87l35O4M83O06O49M51J90j33m33m36m56m41k29o0J93M38N64N60M39R8
938A248l31m88o57n59l27%K92N15N36L81L63M9j09l05n06n63m71k55R7M22N42
959a26P31M64M3j54m00n65m66l69j59M1K67L92N22M64L30J21l30m88o08n54k85
$$ plain form
980 -1129 -1135 -811 -216 282 732 959 978 741 411 -40 -514 -937 -1073 -958 -629 8 551 1057 1152 997 470
1001 470 -75 -568 -906 -959 -831 -560 -132 323 667 924 990 727 233 -358 -822 -1197 -1076 -751 -215 356 751
1022 751 976 859 624 240 -164 -590 -823 -981 -850 -533 4 601 949 1155 930 468 -144 -672 -944 -977
1042 -977 -723 -385 61 467 733 895 825 596 171 -313 -767 -1052 -1005 -680 -106 403 860 1014 855 562 79
1063 79 -325 -630 -890 -836 -721 -352 114 588 915 1021 869 394 -128 -712 -977 -952 -743 -282 160 547 796
1084 796 848 697 487 102 -375 -754 -964 -886 -602 -93 478 871 1005 921 516 1 -401 -689 -794 -741 -548
1105 -548 -184 232 578 908 918 768 338 -186 -698 -1006 -1037 -718 -296 253 673 870 797 664 300 -61 -392
1126 -392 -708 -922 -850 -499 -49 440 882 1036 899 505 -22 -454 -734 -810 -698 -408 -55 306 612 836 825
$$ packed form
980a129oL24N95M98M50K27J9k37l30m51m74m23j36J15L29O37N43N06R5j55n27
1001D70n45m93l38n3J28K71M28M55L44K57O6k63m94n91m64l75J21L25N36N71L95
1022G51K25j17k35l84m04m26k33j58J31L17N37N97L48K06k25m62o12n28k72l3
1042i77K54L38M46M06K66J62p0k29m25m84m54k85M7L25N74N09M57J54j59k93m83
1063G9m04l05k60N4J15L69M66M74L27J06j52m75n22n84k65K5K09M61M42L87K49
1084G96N2j51k10l85m77l79k10P8K84N09N71L93J34q4m05n15m02k88j05N3J93
1105e48L64M16L46L30J0j50m30n24n12l08l1L19M22N49M20J97p3j33l64l61l31
1126c92l16k14P2L51M50M89M42J54j37l94n27m32k80p6J12K90L53L61L06K24j1
$$ plain form
1147 825 641 249 -177 -664 -926 -894 -644 -207 326 703 896 777 574 178 -198 -463 -725 -775 -712 -402 20
1168 20 481 854 924 814 399 -82 -560 -831 -820 -651 -333 99 419 643 753 741 496 216 -194 -601 -875
1189 -875 -839 -562 -102 381 773 907 774 507 111 -288 -534 -698 -720 -561 -300 94 436 749 852 752 399
1210 399 -147 -570 -887 -894 -656 -259 139 475 651 716 576 364 72 -288 -626 -783 -780 -537 -91 368 766 947
1232 947 828 450 45 -342 -604 -637 -618 -454 -134 127 509 695 838 677 366 -105 -578 -815 -867 -610 -201
1253 -201 169 579 725 639 530 258 -78 -369 -578 -737 -682 -473 -64 338 674 866 776 415 -40 -424 -719
1274 -719 -718 -619 -368 -6 219 503 677 702 560 288 -174 -531 -794 -836 -612 -221 283 628 755 734 430 165
1296 165 -121 -458 -588 -686 -587 -378 11 356 669 812 686 364 -108 -530 -746 -796 -531 -266 61 346 535
$$ packed form
1147H25j84l92m26m87k62L2K50M37N33L77J93j19k03l96l76k65k62n0O3L10M22
1168B0M61L73P0j10m15m81m78k71J1J69L18M32L20K24J10j2k45k80m10m07k74
1189h75L6K77M60M83L92J34j33k67l96l99k46j64k2J59K61L94L42L13J03j00l53
1210C99n46m23l17pK38L97L98L36J76O5j40k12k92l60l38j57LK43M46M59L98J81
1232I47j19l78m05l87k62l3J9J64L20K61L82J86J43j61l11m71m73k37n2K57M09
1253b01L70M10J46q6j09k72l36k91k09j59N5K09M09M02L36J92r0l61m55l84k95
1274g19JR9K51L62K25K84J74K5j42k72m62l57k63m2K24L91N04L45J27k1l04k65
1296A65k86l37j30r8R9K09L89L45L13J43j26l22m72m22k16n0K65K65L27K85J89
$$ plain form
1317 535 622 553 419 184 -203 -503 -733 -756 -522 -136 296 666 839 715 471 57 -285 -422 -538 -557 -436
1338 -436 -262 55 370 644 759 675 364 -121 -484 -697 -780 -604 -249 148 403 543 596 495 339 48 -270
1359 -270 -486 -710 -679 -483 -141 323 630 798 702 396 9 -380 -565 -603 -538 -325 -102 145 384 578 634 524
1381 524 326 -65 -469 -754 -773 -517 -182 198 529 633 572 427 203 -58 -271 -539 -615 -567 -406 -106 215
1402 215 580 715 651 356 5 -386 -620 -642 -544 -292 -23 204 450 526 558 452 214 -77 -440 -665 -731 -519
1424 -519 -214 199 591 707 609 433 110 -164 -354 -510 -539 -493 -266 -37 266 589 647 639 330 -60 -390 -660
1446 -660 -669 -533 -251 78 298 486 512 447 314 140 -153 -413 -591 -626 -444 -176 187 529 684 589 434 96
1468 96 -195 -417 -525 -477 -383 -173 52 299 530 631 558 363 -12 -381 -583 -611 -521 -241 114 425 562 543
$$ packed form
1317E35Q7o9j34k35l87l00k30k3K34L86M32L70J73j24k44m14l42j37j16j9J21
1338d36J74L17L15K74J15q4l11m85l63k13q3J76L55L97K55J40N3j01j56k91l18
1359b70k16k24L1J96L42M64L07J68r6l06l87l89j85l8O5K13K23K47K39J94N6j10
1381E24j98l91m04k85j9K56L35L80L31J04o1j45k24k61k13k68p6M8J61L00L21
1402B15L65J35o4k95l51l91k34k2R8K52K69K27K46P6L2j06k38k91l63k25o6K12
1424e19L05M13L92J16r8j76l23k74j90j56k9M6K27K29L03L23N8ql09l90l30k70
1446f60rJ36K82L29K20J88K6o5j33j74k93k60j78l5J82K68L63L42J55r5j55l38
1468I6k91k22j08M8R4K10K25K47K31J01p3j95l75l69k02k8R0K80L55L11J37j9
$$ plain form
1490 543 456 242 33 -222 -374 -527 -550 -388 -127 208 558 712 615 404 54 -262 -493 -570 -430 -323 -59
1511 -59 169 325 440 514 449 230 -14 -385 -611 -663 -459 -178 139 470 609 480 339 204 -37 -221 -433
1532 -433 -485 -407 -343 -92 206 498 628 562 360 42 -304 -534 -587 -425 -276 37 210 349 485 479 389 205 -92
1555 -92 -317 -488 -611 -437 -197 176 428 620 545 368 116 -121 -350 -413 -402 -346 -240 -23 254 458 575 526
1577 526 337 5 -289 -493 -573 -463 -180 52 305 443 420 383 268 113 -141 -331 -526 -531 -409 -184 200 436
1599 436 608 554 350 86 -227 -432 -456 -424 -307 -119 68 203 428 504 432 274 7 -277 -490 -593 -457 -185
1621 -185 89 350 456 432 367 187 62 -186 -336 -455 -422 -337 -89 193 381 556 506 279 -26 -269 -439 -519
1643 -519 -429 -252 -22 131 247 354 389 399 223 -29 -223 -489 -542 -447 -155 119 343 495 482 356 90 -83
$$ packed form
1490E43q7k14k09k55j52j53k3J62K61L35L50J54r7k11l50l16k31p7J40J07K64
1511e9K28J56J15P4o5k19k44l71k26n2K04K81L17L31J39j29j41j35k41j84k12
1532d33n2P8O4K51K98K92J30o6k02l18l46k30n3J62J49L13J73J39J36or0j84k97
1555i2k25j71j23J74K40L73K52J92p5j77k52k37k29o3J1N6J06K17K77K04J17m9
1577E26j89l32k94k04q0J10K83K32K53J38k3l7j15j55k54j90j95nJ22K25L84K36
1599D36J72n4k04k64l13k05k4L2J17J88J87J35K25P6p2j58k67k84k13j03J36K72
1621a85K74K61J06k4o5j80j25k48j50j19L3Q5K48K82J88J75n0k27l05k43j70q0
1643e19R0J77K30J53J16J07L5J0j76k52j94k66n3R5K92K74K24J52j3j26k66j73
$$ plain form
1665 -83 -219 -346 -414 -335 -288 -56 161 376 501 486 351 32 -251 -445 -534 -435 -220 0 201 291 374 340 292 139
1689 139 -93 -326 -490 -496 -433 -189 127 339 492 510 310 101 -137 -267 -394 -362 -271 -239 -48 143 316 419
1711 419 447 272 23 -225 -478 -512 -425 -230 50 256 391 317 281 184 80 -126 -286 -362 -442 -372 -160 108 341
1734 341 515 469 283 42 -178 -377 -413 -371 -285 -85 46 224 337 415 367 235 22 -265 -435 -523 -441 -180 84
1757 84 327 442 375 241 165 -8 -142 -281 -311 -332 -298 -108 85 380 467 436 283 85 -209 -357 -445 -393 -232
1780 -232 -9 151 243 292 358 322 192 13 -221 -344 -452 -428 -165 65 336 410 437 226 75 -57 -225 -297 -364
1803 -364 -306 -221 -126 147 278 467 425 306 69 -154 -378 -466 -389 -190 18 142 333 291 285 226 111 -41 -166
1826 -166 -335 -402 -355 -172 86 313 394 422 289 79 -123 -271 -352 -292 -240 -145 3 188 281 347 385 226 51 -214
$$ packed form
1665h3j36j27o8P9M7K32K17K15J25j5j35l19k83j94q9R9K15K20K01R0Q3l4m8j53
1689A39k32k33j64oO3K44L16K12J53J8k00k09k38j30j27L2R1L2J91J91J73J03
1711D19K8j75k49k48k53l4Q7J95K80K06J35p4l6r7j04k06j60p6q0P0K12K68K33
1734C41J74m6j86k41k20j99l6M2Q6K00J31J78J13P8m8j32k13k87j70q8Q2K61K64
1757H4K43J15o7j34p6j73j34j39l0k1L4J90J93K95Q7l1j53j98k94j48q8N2J61
1780b32K23J60R2M9O6l6j30j79k34j23j08K4K63K30K71P4K7k11j51j32j68p2o7
1803c64N8Q5R5K73J31J89m2j19k37k23k24q8P7J99K08J24J91m2on9j15j52j25
1826a66j69o7M7J83K58K27Q1K8j33k10k02j48q1O0N2R5J48J85R3O6L8j59j75k65
$$ plain form
1850 -214 -323 -457 -360 -167 45 261 352 364 263 148 8 -129 -197 -310 -323 -266 -142 91 255 456 442 315
1872 315 80 -108 -315 -393 -286 -186 -78 103 192 227 306 347 225 58 -170 -375 -441 -311 -188 31 296 363
1894 363 400 277 136 -46 -114 -261 -309 -277 -214 -90 88 289 432 387 294 70 -155 -298 -351 -288 -171 -6 138
1917 138 242 312 340 244 198 23 -150 -338 -388 -339 -170 75 314 378 383 241 120 -89 -181 -247 -251 -224 -136 -32 98
1942 98 244 354 389 255 92 -136 -325 -380 -348 -133 48 211 332 320 276 139 39 -7 -144 -285 -371 -263 -124
1965 -124 61 275 376 408 248 54 -118 -222 -277 -228 -200 -96 57 123 283 323 342 282 63 -162 -310 -389 -350
1988 -350 -160 7 220 329 281 239 130 15 -81 -171 -207 -293 -256 -132 55 295 385 360 265 74 -110 -264 -344 -276
2012 -276 -157 -69 126 166 219 288 264 162 61 -86 -279 -348 -276 -160 7 226 325 327 216 147 -18 -152 -194 -244
$$ packed form
1850b14j09j34R7J93K12K16R1J2j01j15j40j37o8j13j3N7J24K33J64K01j4j27
1872C15k35j88k07p8J07J00J08J81Q9L5P9M1j22j67k28k05o6J30J23K19K65O7
1894C63L7j23j41j82o8j47m8L2O3J24J78K01J43m5r3k24k25j43n3O3J17J65J44
1917A38J04P0K8r6m6j75j73j88n0M9J69K45K39O4Nj42j21k09r2o6mK7Q8J04J30
1942I8J46J10L5j34j63k28j89n5L2K15J81J63J21j2m4j37j00m6j37j41q6J08J39
1965a24J85K14J01L2j60j94j72j04n5M9K8J04J53O6J60M0J9o0k19k25j48p9L9
1988c50J90J67K13J09m8m2j09j15r6r0l6q6L7J24J87K40R0k5r5j91j84j54q0O8
2012b76J19Q8J95M0N3O9k4j02j01j47j93o9P2J16J67K19R9Kj11o9j65j34m2n0
$$ plain form
2036 -244 -199 -195 -64 44 183 373 352 256 108 -108 -307 -368 -268 -178 19 108 192 233 220 192 82 3 -93 -248 -358
2061 -358 -321 -181 10 230 310 352 261 33 -93 -208 -266 -267 -156 -161 -64 54 184 263 322 267 37 -112 -259 -339 -294
2086 -294 -174 33 136 280 232 234 139 41 -18 -122 -229 -324 -289 -165 30 180 308 315 276 89 -90 -241 -224 -244
2110 -244 -160 -99 5 110 159 226 288 156 67 -92 -250 -353 -280 -191 39 160 280 277 212 89 -5 -86 -166 -209 -253
2135 -253 -222 -214 18 136 245 312 202 53 -68 -269 -335 -255 -168 -62 105 168 224 174 154 126 70 -145 -290 -344 -300
2160 -300 -159 -11 182 303 283 220 47 -50 -165 -194 -207 -181 -162 -51 45 144 282 322 250 89 -70 -209 -326 -277
2184 -277 -154 -15 104 167 235 182 144 66 -6 -102 -170 -314 -247 -169 -5 180 285 340 233 98 -20 -182 -227 -205
2208 -205 -137 -88 -26 73 136 209 230 205 106 -50 -247 -279 -280 -158 13 148 270 254 188 135 62 -19 -134 -164 -212 -206 -149
$$ packed form
2036b44M5MJ31J08J39J90k1r6j48k16j99o1J00R0J97Q9Q4M1j3k8j10p9r6j55j10
2061c58L7J40J91K20Q0M2r1k28j26j15n8jJ11nR7J18J30P9N9n5k30j49j47q0M5
2086b94J20K07J03J44m8Kr5r8n9j04j07r5L5J24J95J50J28Pl9j87j79j51J7k0
2110b44Q4O1J04J05M9O7O2j32q9j59j58j03P3Q9K30J21J20lo5j23r4q1q0m3m4
2135b53L1QK32J18J09O7j10j49j21k01o6Q0Q7J06J67O3N6n0k0k8n6k15j45n4M4
2160c00J41J48J93J21k0o3j73r7j15k9j3K6J9J11R6R9J38M0p2j61j59j39j17M9
2184b77J23J39J19O3O8n3l8p8p2r6o8j44O7P8J64J85J05N5j07j35j18j62m5K2
2208b05O8M9O2R9O3P3K1k5r9j56j97l2jJ22J71J35J22j6o6n3p3q1j15l0m8ON7
$$ plain form
2235 -149 3 200 290 292 223 123 -70 -185 -275 -202 -152 -95 35 118 169 221 232 168 81 -38 -226 -260 -286 -214 43 133
2261 133 226 242 161 93 15 -80 -97 -186 -188 -150 -82 12 168 204 337 240 91 -47 -231 -284 -226 -128 7 50 162 192 157
2288 157 171 113 11 -54 -178 -197 -183 -146 21 174 229 274 200 125 -3 -104 -126 -163 -146 -130 -31 15 108 221 188 237
2314 237 90 -75 -196 -268 -286 -136 8 123 154 224 151 129 60 -22 -56 -143 -204 -212 -179 -17 203 208 297 194 95 5
2340 5 -143 -211 -177 -138 -38 27 104 143 210 207 173 96 -54 -164 -260 -188 -164 33 142 142 200 170 142 24 -23 -113 -124 -139
2368 -139 -163 -114 13 110 236 228 260 88 -65 -205 -192 -161 -74 -43 87 122 112 153 144 149 57 -34 -128 -239 -218 -104 44
2395 44 129 223 208 208 89 -13 -82 -92 -128 -165 -120 -96 -2 69 192 215 188 106 -53 -150 -210 -206 -127 -20 77 136 154 102 124
2424 124 66 66 -5 -140 -200 -238 -137 -4 135 187 271 216 78 2 -109 -175 -164 -152 -55 -28 23 103 175 186 150 102 -66
$$ packed form
2235a49J52J97R0Ko9j00j93j15r0P3N0N7J30Q3N1N2J1o4q7j19j88l4k6P2K57R0
2261A33R3J6q1o8p8r5j7q9kL8O8R4J56L6J33r7j49j38j84n3N8R8J35M3J12L0l5
2288A57J4n8j02o5j24j9J4L7J67J53N5M5p4p5j28j01k2l7J7J6R9M6R3J13l3M9
2314B37j47j65j21p2j8J50J44J15L1P0p3k2o9q2l4q7o1qL3J62K20NQ9j03r9r0
2340Ej48o8L4L9J00O5P7L9O7ll4p7j50j10r6P2K4J97J09%N8l0k8j18m7r0j1j5
2368a39k4M9J27R7J26qL2j72j53j40J3L1Q7L1J30L5j0M1rNr2r1r4j11K1J14J48
2395D4Q5R4j5%j19j02o9j0l6l7M5K4R4P1J23K3k7q2j59r7o0MP9J07R7N9J8n2K2
2424A24n8%p1j35o0l8J01J33J39N2Q4n5j38p6j11o6J1J2R7K7N1Q0P2J1l6m8j68
$$ plain form
2451 -66 -194 -193 -194 -185 28 80 128 165 133 97 19 -4 -38 -112 -183 -173 -113 -22 116 177 277 200 121 -91 -163 -216 -202 -115 -103
2480 -103 31 46 71 188 184 120 50 -29 -174 -214 -226 -190 41 116 158 176 188 99 7 -32 -105 -138 -103 -137 -106 12 61 144
2508 144 236 147 112 -54 -148 -153 -195 -70 -30 33 108 150 91 138 122 3 -39 -109 -191 -195 -138 -52 113 192 188 173 52 -15 -100
2537 -100 -118 -142 -72 -76 -39 -5 102 174 217 182 93 -64 -130 -157 -163 -120 -58 2 100 121 113 103 54 2 -8 -92 -185 -180 -108 -60 68
2568 68 179 213 183 13 -35 -99 -153 -159 -71 -109 11 32 26 124 166 143 104 -19 -104 -174 -188 -105 7 105 114 152 111 52 -62
2597 -62 -7 -35 -84 -121 -155 -128 -21 95 132 207 170 83 -26 -113 -191 -151 -62 -39 -11 85 92 154 145 137 90 -20 -86 -183 -173 -85
2627 -85 -15 92 190 170 135 60 -31 -30 -53 -109 -88 -114 -56 -19 87 200 223 233 114 -34 -109 -89 -160 -97 17 71 87 108
2655 108 115 98 58 40 23 -54 -165 -132 -142 -14 68 208 229 162 61 -36 -121 -99 -74 -80 -15 -46 0 59 135 164 129 151 3
$$ packed form
2451f6j28JjRK13N2M8L7l2l6p8k3l4p4p1J0O0R1J38O1J00p7p9k12p2n3J4Q7J2
2480a03J34J5K5J17mo4p0p9j45m0j2L6K31P5M2J8J2q9r2l9p3l3L5l4L1J18M9Q3
2508A44R2q9l5j66r4nm2J25M0O3P5M2n9M7j6j19m2p0q2mN7Q6J65P9mj5j21o7q5
2537a00j8k4P0mL7L4J07P2M3l5q9j57o6k7oM3O2O0R8K1qj0m9n2j0q4r3NP2M8J28
2568F8J11L4l0j70m8o4n4oQ8l8J20K1oR8M2k3l9j23q5p0j4Q3J12R8RL8m1n9j14
2597f2N5k8m9l7l4K7J07J16L7P5l7q7j09q7p8M0Q9K3K8R6PO2rqm7j10o6r7J0Q8
2627h5P0J07R8k0l5p5r1Jk3n6K1k6N8L7J06J13K3J0j19j48p5K0p1O3J14N4J6K1
2655A08Pj7m0j8j7p7j11L3j0J28Q2J40K1o7j01r7q5K2K5oO5l1M6N9P6K9l5K2j48
$$ plain form
2684 3 -115 -186 -160 -74 -45 85 156 193 107 21 32 20 -12 -82 -64 -60 -102 -44 34 207 193 194 69 -42 -81 -114 -132 -64 -34
2713 -34 30 -44 70 96 169 123 86 -12 -59 -161 -169 -136 -53 68 82 161 95 55 47 -8 -55 -77 -93 -102 -104 -26 78 114 159 176
2743 176 82 7 -123 -133 -85 -93 -20 53 65 62 134 106 76 41 -37 -65 -125 -109 -138 -23 92 179 212 158 70 38 -82 -86 -66
2772 -66 -69 -70 -49 -33 48 90 157 148 63 -22 -91 -186 -174 -83 -22 64 153 54 84 60 47 34 -14 -85 -81 -150 -176 -3 32 101 169 172
2804 172 66 -1 -28 -70 -99 -37 -46 6 -4 30 59 92 79 119 -19 -108 -148 -155 -124 -74 69 98 149 76 29 11 -2 -51 -71
2833 -71 -99 -97 -48 -38 13 172 145 159 68 -17 -126 -103 -81 -86 7 -42 55 34 47 149 95 91 29 -77 -170 -203 -127 -31 42 130
2863 130 171 87 74 -38 -60 -30 -75 -96 -76 -66 -5 34 59 146 137 109 -17 -160 -160 -125 -57 -31 34 118 41 74 94 83 17
2892 17 -13 -28 -131 -82 -143 -36 -11 96 141 108 64 0 -91 -46 -59 -48 -64 -4 -28 52 108 93 107 80 29 -70 -187 -119
$$ packed form
2684Cj18p1K6Q6K9J30P1L7q6q6J1j2l2p0J8Mm2N8P8J73j4Jj25j11l9l3j8O8L0
2713c4O4p4J14K6P3m6l7r8m7j02qL3Q3J21J4P9o6m0qn5m7k2j6rkP8J04L6M5J7
2743A76r4p5j30j0M8qP3P3J2lP2k8l0l5p8k8o0J6k9J15J15Q7L3n4q8l2j20mK0
2772f6ljK1J6Q1M2O7rq5q5o9r5J2R1O1Q6Q9r9L0k4j3j3m8p1Mo9k6J73L5O9O8L
2804A72j06o7k7m2k9O2rN2j0L4K9L3j3M0j38q9m0pL1N0J43K9N1p3m7j8j3m9k0
2833g1k8KM9J0N1J59k7J4r1q5j09K3K2nR3m9R7k1J3J02n4mo2j06r3l3P6R6P3Q8
2863A30M1q4j3j12k2L0m5k1K0J0O1L9K5Q7rk8j26j43%L5O8K6O5Q4p7L3K0j1o6
2892A7l0j5j03M9o1J07K5J07M5l3m4o4r1M5j3J1j6O0k4Q0N6j5J4k7n1r9j17O8
$$ plain form
2920 -119 -129 -40 47 48 57 115 43 17 62 24 -40 -52 -148 -141 -39 29 81 127 158 61 -44 -97 -100 -105 -65 -59 -51 35 38 26 94 96 58
2953 58 5 -69 -86 -111 -110 -69 64 103 113 36 17 -6 -12 -45 -34 -37 -66 -108 -15 -50 94 99 146 65 -47 -1 -109 -98 -62 -49
2983 -49 46 52 48 66 58 81 84 13 -57 -80 -155 -145 -21 79 105 136 95 78 20 5 -52 -51 -53 -78 -50 -6 57 63 150 134 88 29 -85
3016 -85 -128 -118 -84 -30 1 106 81 126 70 41 45 9 -13 -49 -100 -100 -26 7 99 154 125 73 -15 -49 -117 -83 -36 -38 -4 12 39
3047 39 35 94 116 70 43 -17 -122 -181 -63 -18 28 131 127 98 56 48 14 -15 -13 -30 -82 -76 -17 -22 117 112 125 80 -49 -36 -93
3078 -93 -72 -75 5 31 21 21 65 75 65 53 91 -42 -115 -109 -70 -37 32 96 119 86 6 -12 -34 -19 -10 -78 -31 -68 -36 13 95 110
3110 110 90 62 19 -65 -110 -92 -57 -8 29 104 33 66 72 33 40 -13 -42 -86 -88 -127 -80 39 83 116 94 42 -7 -39 -70 -70 -25
3141 -25 -88 -42 -53 4 66 130 55 44 43 -56 -127 -120 -106 -20 50 80 69 50 48 36 16 -1 12 -90 -111 -80 -39 42 74 166 102
$$ packed form
2920a19j0Q9Q7JRN8p2k6M5l8o4j2r6PJ02O8N2M6L1r7j05n3lnM0OQQ6Lj2O8Kl8
2953E8n3p4j7k5JM1J33L9J0p7j9k3ol3J1lk9m2R3l5J44NM7q1j12M6j08J1L6J3
2983d9R5OmJ8qK3Lp1p0k3p5J0J24J00K6L1m1j7n8j5n7Jkk5K8M4O3OQ7j6m6n9j14
3016h5m3J0L4N4L1J05k5M5n6k9Ml6k2l6n1%P4L3R2N5k9n2q8l4o8L4M7kL4J6K7
3047C9mN9K2m6k7o0j05n9J18M5M6J03mk9m2ql4k9Kj7n2ON9nJ39nJ3m5j29J3n7
3078i3K1lQ0K6j0%M4J0j0j2L8j33p3OL9L3O9O4K3l3q0j8k2J5Ro8M7l7L2M9Q2J5
3110A10k0k8m3q4m5J8L5M9L7P5p1L3Ol9Pn3k9m4kl9M7J19M4L3k2n2m9l2l1%M5
3141b5o3M6j1N7O2O4p5j1jr9p1PJ4Q6P0L0j1j9kj2k0j7J3j02k1L1M1Q1L2R2o4
$$ plain form
3172 102 97 -17 -53 -72 -107 -81 -23 -2 12 40 47 78 88 75 17 -69 -67 -102 -104 -66 4 90 111 92 15 -7 -17 -14 -59 -64 -64 -126 -49
3205 -49 -18 41 79 92 78 -14 -80 -66 -82 -64 2 9 28 27 15 62 33 56 37 -18 -55 -131 -100 -34 26 70 82 124 33 -29 -18
3236 -18 -29 -67 -41 -73 -75 -32 25 44 86 152 59 2 -34 -107 -98 -62 12 16 11 91 54 15 76 68 -9 -36 -55 -87 -50 -57 -11 88 93 99
3270 99 29 -32 -52 -70 -36 -51 -21 -39 -48 -6 0 89 112 79 29 -27 -68 -105 -81 -4 22 62 32 49 22 -14 21 16 -7 -13 -33 -95
3302 -95 -40 -2 61 117 88 61 -22 -27 -63 -59 -21 -21 36 -20 12 -8 75 61 30 7 -6 -69 -69 -77 -49 31 106 71 44 13 43 29 -27
3335 -27 29 -91 33 -72 -71 8 4 94 28 29 16 -41 -85 -50 -58 -38 90 19 76 -14 9 81 84 8 -10 -18 -25 -103 -53 55 34
3366 34 87 153 50 6 -41 -53 -60 -44 -1 -2 -7 -25 86 58 129 62 24 -55 -97 -82 -72 -20 45 64 71 72 -3 1 23 -34 -11 -29
3398 -29 -56 -83 -31 -10 18 98 61 77 -18 5 -48 -53 -2 4 -13 10 38 31 54 129 87 55 -5 -79 -89 -53 1 -2 94 79 59 35
$$ packed form
3172A02nj14l6j9l5K6N8K1J4K8PL1J0j3n8q6Kl5kL8P0Q6K1j9p7k2j0Lm5n%o2P7
3205d9L1N9L8J3j4r2o6J4j6J8O6PJ9jj2M7k9K3j9n5l7p6L1O6O0M4J2M2r1o2J1
3236a8j1l8K6l2kM3N7J9M2O6r3n7l6p3RL6P4MnQ0l7l9O1qp7k7j9l2L7pM6R9NO
3270I9p0o1k0j8L4j5L0j8rM2OQ9K3l3n0n6m1l7K4P7K6M0l0J7k7l6L5nk3ok0o2
3302i5N5L8O3N6k9k7q3nl6ML8%N7n6L2k0Q3j4l1k3j3o3%qK8Q0P5l5k7l1L0j4n6
3335b7N6j20J24j05JP9mR0o6Jj3n7m4L5qK0J28p1N7r0K3P2Lp6j8qpp8N0J08k1
3366C4N3O6j03m4m7j2pJ6M3jnj8J11k8P1o7l8p9m2J5J0N2O5J9PJp5MK2n7K3j8
3398b9k7k7N2K1K8Q0l7J6r5K3n3nN1Oj7K3K8pK3P5m2l2o0p4j0L6N4lR6j5k0k4
$$ plain form
3430 35 -46 33 30 15 -22 -41 -33 -62 -8 27 107 112 53 49 -13 -30 -16 -29 26 31 28 58 72 49 57 53 9 30 -50 -64 -48 -13 34 80
3464 80 116 75 39 4 -10 26 6 -8 -52 -54 -50 6 53 65 70 106 39 -43 -45 -25 -25 -1 68 11 46 67 8 36 81 25 14 -10 -103
3497 -103 -26 -15 9 82 93 72 46 -2 -21 -11 1 -16 48 -23 -1 -10 17 55 115 90 64 -41 -86 -61 -35 -26 30 49 65 64 63
3528 63 9 27 46 -42 11 -51 -45 -80 -12 16 121 110 40 51 -47 -35 -72 -14 -13 -20 17 39 -1 24 62 23 -13 -9 -56 -78 -89 -38
3560 -38 38 23 63 5 30 21 8 -28 -64 -8 -58 -47 -96 -21 40 76 107 91 -27 -61 -43 -58 -48 -43 23 -3 39 39 12 5 8 49
3592 49 -22 -51 -73 -99 -73 13 67 75 80 52 -24 -27 -38 -30 35 -13 -56 -39 -85 -36 35 69 85 2 -35 -11 -97 -22 -50 -4 -4 35 12
3625 12 -8 34 -18 25 -21 -28 -70 -103 -8 -29 40 60 113 78 -42 -40 -84 -10 -21 9 -27 -49 -29 10 48 68 43 6 -34 -84 -99
3656 -99 -100 -54 16 32 55 57 12 21 45 16 9 -64 -43 -36 -75 -28 30 110 100 34 16 -71 -39 -12 -7 -33 32 23 -26 21 51 61 76 3
$$ packed form
3430C5q1P9lj5l7j9Qk9N4L5Q0Nn9mo2j7J4j3N5NlL0J4k3Qmm4K1q0j4J6L5M7M6
3464H0L6m1l6l5j4L6k0j4m4kMN6M7J2NL6o7q2kK0%K4O9n7L5K1n9K8M5n6j1k4r3
3497a03P7J1K4P3J1k1k6m8j9J0J2j7O4p1K2rK7L8O0k5k6j05m5K5K6RN6J9J6jj
3528F3n4J8J9q8N3o2Ol5O8K8J05j1p0J1r8J2l7N8JpL7K2m0K5L8l9l6Mm7k2j1N1
3560c8P6j5M0n8K5rj3l6l6N6n0J1m9P5O1L6L1j6j18l4J8j5J0NO6k6M2%k7pLM1
3592D9p1k9k2k6K6Q6N4QNk8p6lj1QO5m8m3J7m6M9P1L4J6q3l7K4q6P5k8M6%L9k3
3625A2k0M2n2M3m6pm2l3R5k1O9K0N3l5j20Km4P4j1L0l6k2K0L9L8K0k5l7m0n0j5
3656i9jM6P0J6K3Km5RK4k9pp3K1Pl9M7N8Q0j0o6j8q7L2K7Nk6O5rm9M7L0J0J5p3
$$ plain form
3690 3 64 -60 -55 -47 -36 2 80 84 70 39 -14 5 -42 19 -35 -18 -19 -33 10 -21 73 60 38 10 30 -38 -93 -34 -29 24 21 54 12
3723 12 39 34 55 19 13 -25 -39 -57 -59 -6 35 73 65 27 -14 -5 -2 -43 21 -32 15 18 -14 38 21 56 69 8 71 -56 -84 -49 -35
3756 -35 37 56 31 -11 17 24 3 -1 -8 4 -76 -47 -17 -26 17 50 101 16 47 -53 -3 -28 -10 24 12 6 -31 -2 36 25 54 53 -11
3789 -11 -49 -41 -51 -6 17 -7 49 5 -15 8 -8 -35 17 -4 -4 -17 38 8 49 47 79 52 18 6 -34 15 -8 20 29 37 42 59 33
3822 33 58 48 71 -33 9 -51 -77 -41 5 70 82 29 19 -8 -14 -18 -39 -3 35 -49 10 14 22 79 47 81 2 -16 -74 -27 -12 -3
3854 -3 33 17 17 -6 8 -25 20 35 -14 -16 -72 -91 -28 0 56 45 107 81 35 -15 -35 9 37 -9 -68 -14 -26 -45 47 40 55 51 24
3887 24 11 -97 -12 7 33 62 81 85 22 -1 18 12 -11 6 2 -47 -50 -16 39 68 81 63 10 -25 -23 -20 -17 1 3 25 47 20 43 55
3921 55 42 54 16 5 -35 -87 -10 33 78 64 77 77 -19 -6 10 12 28 15 -26 -48 -16 29 53 113 47 29 -71 -2 -15 -34 -14
$$ packed form
3690CO1j24NQJ1L8P8Mj4l1n3J9m7O1n4J7jj4M3l1R4j3k2k8K0o8n5N9NN3lL3m2
3723A2K7nK1l6ol8j4j8kN3M1L8ql8m1RLm1O4n3M7Ll2N2j7L5J3o1O3j27k8L5J4
3756c5P2J9k5m2K8Pk1mpJ2q0K9L0rM3L3N1q5L1j00N0k5J8L4j2ol7K9L8j1K9jo4
3789a1l8Qj0M5K3k4N6m4k0K3j6k7N2k1%j3N5l0M1kL2k7l4j2m0M9k3K8RQNJ7k6
3822C3K5j0K3j04M2o0k6L6M6O5J2n3j0k7omk1L6L8q4N9MQN7l2L4p9j8n8M7J5R
3854cL6j6%k3J4l3M5J5m9kn6j9O3K8N6j1O2k6m6n0k0M4K8m6n9N4j2j9R2pJ5mk7
3887B4j3j08Q5J9K6K9J9Mo3k3J9ok3J7mm9lL4N5K9J3j8n3l5KLLJ8KK2K2k7K3J2
3921E5j3J2l8j1m0n2P7M3M5j4J3%r6J3J6KJ6j3m1k2L2M5K4O0o6j8j00O9j3j9K0
$$ plain form
3952 -14 -3 44 -8 44 -9 33 18 30 71 -43 -35 -33 -39 -28 48 96 79 19 -27 -23 -25 28 -35 -8 -26 -12 -36 59 24 63 32 34 -57
3985 -57 -21 -40 -34 -10 0 42 32 -3 -30 10 2 36 0 -24 -59 -90 -49 16 22 67 31 57 -19 -5 -43 -63 -15 -38 37 29 -9 -11 -28
4018 -28 -8 12 22 -2 -74 -66 -71 -42 15 14 81 -9 8 -6 -52 51 -9 -53 4 -13 -32 -19 21 49 60 60 51 -33 -75 -64 -72 6 13
4051 13 30 6 -26 45 6 22 -7 -16 -71 -42 -37 -56 -6 41 75 30 11 -25 28 -24 -4 -11 -52 -12 -43 0 2 41 44 61 5 -11 -28
4084 -28 -58 -61 -20 -20 0 49 31 16 47 28 9 -27 -15 -89 -31 -35 -26 41 69 46 43 38 -1 -51 -36 -5 0 35 21 5 11 37 13 40
4118 40 54 20 0 -31 18 -77 23 34 33 42 17 32 11 9 -7 -16 -1 -3 -24 -29 16 57 74 55 -11 -20 -5 15 17 2 26 20 4 -24
4152 -24 13 -15 33 29 -1 -11 -57 -46 -7 13 45 26 22 -48 -30 2 -30 -14 12 51 -27 5 -40 7 40 58 50 15 2 -43 -30 -8
4184 -8 -21 5 29 -4 41 28 -4 30 58 6 -17 -5 -78 -27 40 54 47 68 50 13 -14 21 -6 10 36 20 -20 24 78 15 34
$$ packed form
3952a4J1M7n2N2n3M2j5J2M1j14QKoJ1P6M8j7o0m6MkN3o3K7j8J4k4R5l5L9l1Kr1
3985e7L6j9OK4J0M2j0l5k7M0qL4l6k4l5l1M1O5OM5l6K6p6J4l8k0M8k3P5ql8kj7
4018b8K0K0J0k4p2QnK9N7jO7r0J7j4m6J03o0m4N7j7j9J3M0K8J1%rq4m2J1qP8P
4051A3J7k4l2P1l9J6k9rn5K9Nj9N0M7L4m5j9l6N3n2K0pm1M0l1M3KL9LJ7n6j6j7
4084b8l0lM1%K0M9j8j5L1j9j9l6J2p4N8mRO7K8k3lnl9n0J5L1NL5j4j6OK6k4K7
4118D0J4l4k0l1M9r5J00J1jRk5J5k1kj6rJ5kk1nM5M1J7j9o6rJ5K0Kj5K4oj6k8
4152b4L7k8M8ml0j0m6J1L9K0L2j9mp0J8L2l2J6K6L9p8L2m5M7L3J8ql5j3m5J3K2
4184hj3K6K4l3M5j3l2L4K8n2k3J2p3N1O7J4pK1j8l7k7L5k7J6K6j6m0M4N4o3J9
$$ plain form
4215 34 41 36 0 13 -69 -8 13 30 68 44 73 59 53 -7 16 37 -7 -10 -13 -35 18 -21 80 94 54 22 6 -62 -4 3 -11 18 -18
4248 -18 32 -10 30 43 27 103 -10 -46 -20 -32 -24 -17 52 50 41 -5 19 16 27 32 -14 9 -53 -23 -17 8 42 -37 -8 2 22 -1 -33
4281 -33 -3 -38 13 20 -3 -42 -31 12 67 14 10 7 -52 -55 -37 14 3 16 23 40 11 -18 -11 18 34 -24 -6 21 -88 -16 -2 47 37
4314 37 31 41 -64 -13 -35 -23 5 35 -1 3 2 40 29 16 25 -36 -45 -23 -48 -13 24 77 6 56 -11 -30 -33 -4 18 -21 5 13 -4
4347 -4 13 34 8 95 81 3 1 -30 -50 -15 -1 24 38 -41 8 -88 16 51 53 19 -22 -40 -28 -13 -6 42 54 39 -16 -28 -62 -41
4379 -41 -57 -37 -6 9 -28 7 12 20 22 2 -8 -23 -11 -43 -59 -17 43 48 14 22 -11 -35 29 38 -14 45 -62 -53 -68 10 -1 15 25
4412 25 43 3 -67 -10 -31 -22 5 3 -20 8 16 -27 37 -15 8 -21 -36 -1 -27 -1 26 39 48 25 23 -4 -45 -8 -1 -33 -13 -41 -10
4445 -10 -41 0 56 -6 17 6 -38 -58 -12 -27 -7 -5 18 37 38 -34 -25 -11 -23 -10 -10 -26 -91 41 20 37 26 37 -18 -50 -40 -52
$$ packed form
4215C4Pnl6J3q2O1K1J7L8k4K9j4oo0K3K1m4llk2N3l9J01J4m0l2j6o8N8Pj4K9l6
4248a8N0m2M0J3j6P6j13l6K6j2QPO9krm6K4lJ1Nm6K3o2L0OK5L4p9K9J0K0k3l2
4281c3L0l5N1Pk3l9J1M3N5n3mln9lJ8N1j1J3PJ7k9k9PK9J6n8J8K7j09P2J4M9j0
4314C7oJ0j05N1k2J2K8L0l6MjL8j1j3Ro1rK2k5L5L7N3p1N0o7j9lK9K2l9K6Qj7
4347dJ7K1k6Q7j4p8kl1k0L5J4K5J4p9M9r6J04L5Kl4m1j8J2J5PM8J2j5n5j2l4K1
4379d1j6K0L1J5l7L5NQKk0j0j5J2l2j6M2O0Nl4Ql3k4O4Rn2N9j07Rj5P8j1J6J0
4412B5J8m0p0N7k1RK7kk3K8Qm3O4n2K3k9j5L5k6K6K7J3Rk3kk7m1L7Pl2K0k8L1
4445a0l1M1N6o2K3j1m4k0M6j5K0KK3J9Jp2RJ4j2J3%j6o5J32k1J7j1J1n5l2J0j2
$$ plain form
4477 -52 2 -15 -6 -32 -29 32 0 34 72 64 30 -44 -31 -53 16 1 30 -5 29 -3 -3 -28 -14 20 17 9 -18 -50 -5 -36 33 50 78
4510 78 61 0 -22 -17 21 -13 4 38 30 -10 27 -13 50 -3 22 26 -6 -29 -40 -42 -13 14 54 66 -24 10 -1 -10 -8 1 6 -28 11 -53
4544 -53 5 54 51 35 26 23 33 -15 15 49 56 5 -1 9 48 52 72 14 22 -36 6 -24 16 37 68 59 -11 93 -34 25 13 10 17 24 -7
4579 -7 -14 28 56 29 55 23 15 -3 4 -2 13 -17 52 32 43 0 9 73 -1 3 29 2 -15 -35 37 -2 61 59 56 38 -4 -10 -14 14 22 -16
4615 -16 22 -18 -19 24 20 43 12 48 18 17 -49 -6 24 77 -9 11 17 6 5 -2 40 11 -25 -7 -23 -15 -41 17 19 26 22 -24 -59 -9 -20
4650 -20 -10 44 56 30 7 -3 37 21 64 37 42 -11 -27 -34 -4 48 32 67 31 -15 22 2 27 51 -17 -3 15 -23 -10 51 39
4681 39 65 8 -15 -8 -5 -14 -11 22 -11 29 5 -19 3 13 53 -12 -7 52 -51 -60 -5 34 -35 34 0 -6 7 -7 12 36 -14 6 31
4714 31 51 -9 42 12 20 12 29 -44 19 -28 -15 -57 27 46 -25 15 9 53 12 28 6 -19 -10 -19 -64 -33 4 35 36 -22 -50 -11 -46
$$ packed form
4477e2N4j7Rk6LO1l2L4L8ql4p4J3k2O9j5K9l5L4l2%k5J4L4lqk7l2M5l1O9J7K8
4510G8j7o1k2NL8l4J7L4qm0L7m0O3n3K5Ml2k3j1kK9K7M0J2r0L4j1rKRNl4L9o4
4544e3N8M9lj6rlJ0m8L0L4Pn1oJ0L9MK0n8Qn8M2l0M0K1L1rp0J04j27N9j2lPPl1
4579gpM2K8k7K6l2qj8PoJ5l0O9k0J1m3RO4p4MK6k7j7k0P2l9O3klj8m2omK8Ql8
4615a6L8m0jM3mK3l1L6l0jo6M3L0N3q6K0Oj1jpM2k9l6J8j6Qk6N8KPmm6l5N0j1
4650b0J0N4J2k6k3j0M0j6M3k7Nn3j6pL0N2j6L5l6m6L7k0K5K4o8J4J8l8J3O1j2
4681C9K6n7k3PLrLL3l3M0k4k4K2J0M0o5NN9j03rN5L9o9O9l4oJ3j4J9K4n0K0K5
4714C1K0o0N1l0QqJ7p3O3m7J3m2Q4J9p1M0oM4m1J6k2k5Rrm5L1L7L1Jn8k8L9l5
$$ plain form
4747 -46 -32 19 40 -22 -20 -18 -34 18 10 71 8 -9 -43 -38 -3 -24 -21 16 29 29 11 -4 21 2 51 1 -14 -1 -15 -25 36 27 35 -11
4781 -11 9 11 -46 0 -4 48 -12 40 2 -13 -14 18 -20 22 19 -60 -59 1 9 -13 39 31 17 12 -37 -20 3 9 16 22 -60 -26 -34 10 -13 -45
4817 -45 43 -13 -2 -37 -32 -19 2 11 26 5 0 11 -27 12 -10 27 -42 -22 -10 -33 -8 6 61 20 25 -2 19 -18 26 31 9 34 -7
4850 -7 1 -3 -9 27 45 14 -19 19 -51 13 0 13 43 37 67 -27 30 6 -11 17 -33 -20 31 -41 -26 1 48 -3 31 2 0 34 -20
4883 -20 -25 3 12 5 -25 1 -28 12 51 32 -31 -25 -2 -16 1 -1 28 -9 20 11 -27 10 18 24 -14 -23 55 12 7 -22 45 42 43 2 -33 -81
4919 -81 -12 17 26 4 -7 25 25 -4 48 -16 -25 9 -2 -3 -14 -32 4 42 60 8 -28 1 -10 -46 -23 60 52 -6 -7 12 -12 12 53
4952 53 28 24 -3 -53 7 -10 21 28 19 7 21 27 -51 14 27 68 20 -16 -23 25 -21 31 48 -7 0 -12 3 8 2 2 -17 -19 1 21 -5
4987 -5 44 58 41 32 -30 -12 11 -11 -29 51 12 1 13 39 9 -31 7 -17 31 5 3 -13 -9 30 7 43 42 -10 -39 -24 2 -5 36
$$ packed form
4747d6J4N1K1o2KKj6N2qO1o3j7l4NL5k1LL7J3%j8j5K5j9M9n0j5J3j4j0O1rQm6
4781a1K0Kn7M6mN2o0N2l8j5jL2l8M2lp9JO0Qk2N2qj4nm9J7K3OPOq2L4qM4k3l2
4817d5Q8n6J1l5NJ3K1RJ5k1nJ1l8L9k2L7o9K0J2k3K5J4N5m1Nk7K1l7M4Nk2K5m1
4850gQmoL6J8l1l3L8p0O4j3J3L0oL0r4N7k4j7K8n0J3N1p2J5K7M7n1L4k9kL4n4
4883b0nK8Rpl0K6k9M0L9j9o3OK3j4J7kK9l7K9rl8L7QOl8rP8m3nk9O7lJm1l5m8
4919h1O9K9Rk2j1L2%k9N2o4rL4j1jj1j8L6L8J8n2l6K9j1l6K3Q3qn8jJ9k4K4M1
4952E3k5mk7n0O0j7L1Prj2J4Op8O5J3M1m8l6pM8m6N2J7n5Pj2J5No%j9kK0K0k6
4987eM9J4j7ro2J8K3k2j8Q0l9j1J2K6l0m0L8k4M8k6kj6ML9k3L6jn2k9J5K6pM1
$$ plain form
5020 36 -6 -22 67 41 34 12 6 7 -15 4 -24 2 -15 5 58 -6 53 11 -5 -14 24 1 15 10 -11 21 17 6 41 48 49 10 -19 -7
5054 -7 -49 28 -11 6 34 26 -33 -15 20 -14 15 -26 -15 -25 -1 8 6 73 0 -8 6 11 9 -11 84 5 9 33 24 -7 30 -18 6 20 17
5089 17 16 -30 -47 -11 -20 57 27 -5 -14 -22 -6 -2 33 11 -17 20 -35 6 38 -15 17 47 -14 6 -41 -40 -16 -16 -9 -3 -19 -41 -15 -56 -5
5124 -5 -11 5 -26 10 -9 2 -9 -22 43 -10 25 20 -4 0 -13 50 11 2 -19 -32 -13 -15 32 2 12 2 2 -31 -30 -4 6 72 11 38
5158 38 3 -6 10 28 -3 35 -13 -44 -29 -7 7 28 45 -8 1 -8 -10 -16 38 -13 15 15 -8 -22 -3 -25 -1 -3 14 -17 -10 -12 -37 12 6
5193 6 59 23 17 -36 -16 -40 7 7 -1 -26 -42 10 20 -24 45 63 6 36 28 -52 -25 -42 -23 -9 -32 16 25 -42 48 -8 -31 14 -36
5226 -36 -28 -45 22 18 31 35 49 35 9 0 -31 14 19 3 18 25 9 19 57 54 51 -15 -6 14 8 8 42 25 -18 15 8 -4 12 22 40 -57
5262 -57 -10 9 -4 -45 13 41 6 30 -36 21 -21 30 -41 28 8 -8 23 7 35 51 -30 48 -5 -5 -43 -13 10 1 29 15 0
$$ packed form
5020C6m2j6Q9k6pk2oJk2J9k8K6j7K0N3o4N9m2j6rL8k3J4nk1L2mj1L5PJl9k9J2
5054gm2P7l9J7K8qn9J8L5l4K9m1J1j0K4RkO7p3qJ4Nkk0R5p9MK4rl1L7m8K4J4l
5089A7jm6j7L6rP7l0l2rqJ6ML5k2k8L7n5M1L2n3L2L0o1K0m7JK4%POj6k2K6m1N1
5124eoJ6l1L6j9J1j1j3O5n3L5nk4Mj3O3l9rk1j3J9kM7l0J0j0%l3JK6J0O6o1K7
5158C8l5rJ6J8l1L8m8l1J5K2J4K1J7n3RrkoN4n1K8%k3j4J9k2K4kJ7l1Pkk5M9o
5193FN3l6on3K0k4M7%qk5j6N2J0m4O9J8n7L0qq0K7j7J9J4k3M8Ro7R0n6k3M5n0
5226c6Qj7O7mJ3MJ4j4k6rl1M5Nj6J5Pj6J0L8llo6RK0o%L4j7m3L3pj2J6J0J8r7
5262e7M7J9j3m1N8K8l5K4o6N7m2N1p1O9k0j6L1j6K8J6q1P8n3%l8L0K3rK8j4j5
$$ plain form
5293 0 -13 -22 4 21 -13 33 -24 -42 19 -40 -22 36 24 30 38 31 -29 27 28 9 47 51 -23 19 29 -13 43 4 -20 37 5 -12 -5 2 28
5328 28 53 21 22 4 -6 12 45 23 32 8 -15 22 38 39 37 23 -23 9 5 -39 25 49 52 -28 3 9 -25 16 21 23 6 20 50 43 0
5363 0 10 -25 41 52 19 11 -1 10 54 44 43 53 -16 21 -5 18 54 48 54 34 25 -36 -6 49 15 40 -12 15 31 5 33 42 39 16
5397 16 -9 -10 -3 8 23 27 29 36 19 20 41 -10 -36 18 58 39 -8 -20 38 46 12 39 21 30 -16 -20 -45 0 26 -37 9 16 36 -22 -36
5432 -36 5 18 10 12 -9 9 -5 35 51 37 29 36 -6 1 10 -4 38 -34 18 -14 9 28 20 24 1 17 -1 14 -5 -29 28 35 25 -25 31
5467 31 -13 -9 -40 9 38 14 -6 16 -13 -8 0 5 -9 28 -35 -22 -4 -12 27 -10 72 0 -36 -8 -56 1 28 34 -54 -34 -52 1 -7 11
5501 11 42 17 22 -28 5 -52 -4 43 -8 -14 -18 45 13 26 21 -18 -20 -17 -34 -36 -5 -44 -12 -2 -4 4 -11 -21 13 -35 4 -16 -40 -34 -5
5536 -5 -9 -17 16 11 -54 39 -8 -44 -16 31 -32 -43 15 -7 -20 -9 -19 -20 -23 -42 -28 10 -56 -12 40 5 10 -23 -12 -10 -20 30 -47 11
$$ packed form
5293@j3rK6J7l4M6n7j8O1n9J8N8j2OQpo0N6Jj9L8Mp4M2J0m2N6l9k4N7l2j7PPK6
5328B8K5l2Jj8j0J8L3k2Rk4k3L7J6Jkj4m6L2mm4O4K4Lq0L1Ol4M1NKj7J4L0pm3
5363@J0l5O6J1l3qj2J1M4j0jJ0o9L7k6K3L6oOk0ro1L0N5l4K5n2K7J6k6K8Rlk3
5397A6k5jPJ1J5MKPj7JK1n1k6N4M0j9m7j2N8Ql4K7j8Rm6mk5M5K6o3M6PK0n8j4
5432c6M1J3qKk1J8j4M0J6j4qPm2PRj4M2p2N2l2K3J9qMk3J6j8J5j9k4N7Pj0n0N6
5467C1m4Ml1M9K9k4k0K2k9NQNj4L7o3J3J8qL9l7Q2p2l6K8m8N7K7Oq8K0j8N3qJ8
5501A1L1k5Nn0L3n7M8M7n1omO3l2J3nl9kLj7kL1l9L2J0kQj5j0L4m8L9k0k4OK9
5536emqL3no5R3m7l6K8M7o3j1N8k2j3J1j0jlj9J4L8o6M4N2l5Nl3J1Kj0N0p7N8
$$ plain form
5570 11 -45 -51 -51 -40 18 59 25 18 -43 -53 -49 -7 4 -19 5 1 -32 -20 16 -2 -7 19 0 -5 -51 -21 5 43 61 33 31 -6 -5 -3 5 -40
5606 -40 21 -2 14 -10 -25 3 15 17 25 -10 -13 20 -23 -21 7 6 -1 10 -28 -51 35 -2 0 30 1 24 5 -4 -60 41 38 55 23 -4
5640 -4 -36 -14 40 12 -3 -22 -10 34 -24 29 11 38 27 -12 1 -1 -34 -20 6 13 18 -18 2 32 -6 4 4 -36 -30 -5 -2 23 36 -22
5674 -22 22 29 -21 17 16 26 -14 3 7 -27 15 -45 18 -12 28 47 10 8 -15 23 -5 -2 9 69 42 -5 22 9 24 3 3 -5 15 -19
5708 -19 40 40 16 30 5 14 -14 6 -9 23 23 11 5 40 4 48 -14 -8 50 41 -9 44 -42 -21 6 5 25 0 1 3 29 14 2 -25 23
5743 23 41 -17 -28 11 -24 26 10 34 -26 12 1 18 -26 -30 -31 -8 36 -38 -6 13 17 50 52 24 25 10 3 -25 16 51 16 -7 16
5776 16 -5 -5 3 -18 -9 1 -31 12 4 4 26 3 -1 -1 -24 -2 17 12 32 8 42 -17 21 -23 18 -5 17 8 12 16 -15 43 9 -5 21 -8
5812 -8 -2 29 22 -15 65 -19 33 -34 -1 -20 4 38 24 35 -26 35 27 -21 -12 -3 8 19 -14 35 7 30 20 58 -36 -35 8 -19 17 18
$$ packed form
5570A1n6o%J1N8M1l4po1j0MM2J1k3K4ml3J2L6j8nK6j9nm6L0K6L8J8k8kl7JKQm5
5606d0O1k3J6k4j5K8J2KQl5lL3m3KK8jpJ1l8k3Q6l7KL0k9K3j9rn6J01lJ7l2k7
5640dl2K2N4k8j5j9J2M4n8N3j8K7j1l9J3kl3J4K6PNl6K0L0l8J0%m0OK5LK5J3n8
5674b2M4Pn0L8jJ0m0J7Ml4M2o0O3l0M0J9l7kk3L8k8LJ1O0k7m7K7j3J5k1%qK0l4
5708a9N9%k4J4k5Rk8K0j5L2%j2oL5l6M4o2ON8rn0N3q6K1K7jK0k5JKK6j5j2k7M8
5743B3J8n8j1L9l5N0j6K4o0L8j1J7m4mjK3M4p4L2J9ML3Kk8Jj5pk8M1L5l5k3K3
5776A6k1%Qk1RJ0l2M3q%K2k3m%k3K2J9nK0k4L4n9L8m4M1k3K2rMMl1N8l4j4K6k9
5812hOL1pl7Q0q4N2o7L3j9K4L4j4J1o1O1qm8RRJ1J1l3M9k8K3j0L8r4JM3k7L6J
$$ plain form
5846 18 56 -9 11 -43 -32 -14 -10 -7 47 -33 23 5 3 -13 -4 28 34 57 -30 32 10 21 -9 12 2 -9 42 -26 -39 33 34 43 5 11
5880 11 -41 -25 -13 1 20 -19 -12 -1 -5 5 -10 20 8 6 38 1 16 -7 27 38 27 10 -30 -9 -22 -5 -9 39 -2 38 -17 -48
5912 -48 23 7 19 28 5 -3 -17 7 -1 11 -29 0 -33 -17 -18 21 22 -19 -17 -30 -13 23 -5 31 21 44 -6 7 -35 -29 -15 27 38 18
5946 18 -22 -12 -14 -27 -33 64 -1 -47 -34 13 3 -54 -2 43 18 -40 -20 30 0 61 24 -9 68 -27 38 34 29 -34 -7 19 4 10 4
5979 4 -50 -10 -17 24 -23 11 -34 -9 15 2 14 7 -10 19 5 -11 17 -15 -3 -6 -10 -1 -19 7 18 9 -23 3 -30 29 -10 -71 17 18
6013 18 -34 3 -5 16 15 -4 -12 -11 4 7 10 14 -5 -2 39 10 30 -42 28 7 -8 -5 -45 -18 -6 4 5 4 17 6 29 -7 2 -5 34 -23 6
6050 6 12 -12 8 33 -27 -18 -1 28 4 47 25 8 29 45 29 -37 20 3 11 40 24 -11 4 -4 24 -2 13 29 16 8 10 63 10 -6
6084 -6 -29 8 40 5 47 -40 -18 4 -5 63 34 -8 61 0 -40 18 14 20 12 29 25 -3 -1 49 31 20 -18 -24 78 17 38 -16 36 8
$$ packed form
5846A8L8o5K0n4J1J8MLN4q0N6j8kj6RL2OK3q7O2k2J1l0K1j0j1N1o8j3P2JRl8O
5880A1n2J6J2J4J9l9PJ1mJ0j5L0j2kL2l7J5k3L4J1j1j7m0K1j3J7mM8m1M0n5l1
5912d8P1j6J2Rk3qj4K4qJ2m0K9l3J6jL9Jm1Kj3J7L6k8L6j0K3n0J3m2OJ4M2J1k0
5946A8m0J0kj3oR7o5m6J3M7j0n7N2M5k5n8K0N0l0O1l7l3P7r5O5mno3K7K6j5Oo
5979Dn4M0pM1m7L4m5K5K4j3J2pj7K9j4j6K8l2J2lmRj8K6J1rl2K6l3N9l9o1Q8J
6013A8n2L7qK1jj9qJJ5LLMj9LM1k9K0p2P0k1j5Lm0K7J2J0JjJ3j1K3l6RpL9n7K9
6050FOk4K0K5o0RJ7K9k4M3k2j7K1J6j6o6N7j7QK9j6l5J5qK8k6J5J6j3qKN3n3j6
6084fk3L7L2l5M2q7K2K2rO8k9m2O9o1m0N8mOqJ7mk8KN0j8j1l8oJ02o1K1n4N2k8
$$ plain form
6118 8 -3 -3 -27 -10 -7 2 22 4 20 -7 7 26 -8 13 39 34 -12 14 -64 29 0 61 45 14 25 -1 30 -28 -21 8 2 54 -12 10
6152 10 6 21 11 6 -13 -41 -3 -15 11 30 4 51 43 40 39 48 8 1 18 -4 3 -4 -37 5 -25 17 48 -15 0 -27 -20 -37 -20 -19 11 -4
6188 -4 11 -16 16 -1 30 -48 -29 5 16 -24 -1 58 -39 -6 -25 6 28 17 -21 -5 9 -45 39 -28 -27 61 30 39 -14 21 -26 -38
6220 -38 27 -28 -26 3 38 -3 23 -80 -44 -16 17 -21 -4 -1 -20 5 4 26 50 12 -1 9 -18 16 33 -5 -25 1 -23 -18 -15 21
6252 21 17 7 20 -23 24 -67 -11 -14 25 17 40 11 4 -23 2 -9 14 7 39 11 19 -11 19 17 19 7 -11 -5 -57 40 26 1 18 22 -4
6287 -4 29 23 6 31 -4 6 -13 21 -31 -14 18 23 68 -3 -50 26 -85 4 44 -22 22 -15 15 -2 2 21 11 -6 -27 -2 -35 -14
6319 -14 -22 15 21 -77 -31 -10 0 40 64 -6 -8 3 39 -12 -41 -19 -51 -12 -18 6 -19 -14 -41 -5 -15 14 3 -34 24 7 -20 22 2
6352 2 13 -14 7 1 34 7 1 -31 10 8 -21 -27 -20 -7 1 9 31 28 -15 16 25 20 9 19 -24 -14 -31 1 6 6 30 -12 -7 37 28 -3 14 15
$$ packed form
6118Hj1%k4J7LRK0j8J6k7J4J9l4K1K6nm6K6p8R3k9O1j6l1J1k6L1n8PK9oN2o6K2
6152A0mJ5j0nj9k8L8j2K6J9k6M7qljRm0pJ7k2Ppl3M2l0M2L1o3J5k7Pj7J7JL0j5
6188dJ5k7L2j7L1p8J9L4J1m0K3N9r7L3j9L1K2j1l8J6J4n4Q4o7JQ8l1Rn3L5m7j2
6220c8O5n5KK9L5m1K6j03L6K8L3l8J7Lj9K5jK2K4l8j3J0k7L4J7l8k0K6k4NLL6
6252B1mj0J3m3M7r1N6lL9qK3k9pk7K5j1K3pL2k8Ql0L0kKj2j8On2R7j4k5J7Mk6
6287dL3oj7K5l5J0j9L4n2J7L2NM5p1m7P6j11Q9M0o6M4l7L0j7MJ9j0j7k1K5l3K1
6319a4qL7Or8M6K1J0M0K4p0kJ1L6n1k9K2l2L9oK4k5Nk7L6j0K9j1l7N8j7k7M2k0
6352BJ1k7K1oL3k7ol2M1kk9oPJ3QQK2lm3L1Rnj1J0m3J0j7L2N%K4m2NM4rl1J7J
$$ plain form
6390 15 -33 -27 2 9 21 -19 8 -22 26 -16 20 16 50 22 16 -15 -61 -11 3 -19 5 24 -35 5 15 -16 -7 11 51 -10 -29 11 20
6423 20 4 -2 55 -8 -3 -15 5 8 -6 3 5 32 44 25 22 0 41 26 1 28 14 12 51 5 38 16 -34 0 -1 -22 9 -3 34 35 32
6458 32 7 9 -24 -13 2 30 11 13 -32 -32 -4 20 20 0 7 -6 -35 21 -6 6 48 -3 39 10 -42 -10 -2 30 32 45 -32 20 -42 4
6492 4 7 9 12 5 5 75 -2 3 59 -15 -15 -20 -3 18 10 7 64 33 -12 31 23 19 36 22 -7 27 18 7 8 -2 63 42 -1 30 -23 38 41 38 -3
6531 -3 18 21 -38 25 22 16 -3 -39 -11 -3 -29 14 -28 -17 8 40 -19 7 -8 -20 22 -8 21 6 -35 -29 32 16 28 26 -7 -15 5 -20
6565 -20 25 21 6 49 45 2 15 33 -36 -19 2 36 32 -15 43 -46 36 42 56 -2 19 32 -6 17 22 -2 34 3 1 26 29 33 18 13 32
6600 32 -5 14 -29 -18 4 30 45 26 -29 -27 -12 -25 28 -36 -3 -3 16 18 5 -1 -10 12 41 -22 -31 -41 -15 4 19 -1 -19 23 5
6633 5 -39 -19 -22 1 -17 -27 13 20 30 14 -5 -24 -8 -19 -24 -2 -5 25 -9 -13 -20 -23 -1 15 -6 -22 -49 -37 -15 -3 20 16 -42 39 30
$$ packed form
6390A5m8OK9PJ2m0K7l0M8m2L6mL4k8ol1m6N0J4k2K4J9n9M0J0l1RJ8M0o1j9M0R
6423B0j6oN7o3Nj2K0Lj4RKK7J2j9lk2M1j5k5K7j4kL9m6L3k2n0L4jk1L1j2L7Jl
6458C2k5Kl3J1J5K8j9Km5%K8K4%k0Pj3k9N6k7J2M2n1M2k9n2L2QL2KJ3p7N2o2M6
6492DLKLp%P0p7NN6p4%nJ7K1qlN7l1m5M3qmJ7j4k9L4rj1Jj0O5k1m3L1n3O1Llm1
6531cK1Ln9O3loj9l6K8Qk6M3m2J1K5L2n9K6j5j2M2l0K9j5m1OO1j6J2kl3qK0k5
6565b0M5mj5M3mm3J3J8o9J7K1L4mm7N8q9Q2OJ4n8K1J3l8K3Nk4L6l1kK5LMj5nJ9
6600C2l7J9m3J1K2K6J5j9n5KJ5j3N3o4L3%J9Kj3orK2K9o3rj0K6J9J5k0j8M2j8
6633Em4K0lK3j8j0M0PJ0j6j9j9J6j1nK2lL0l4mplK2J6k1j6k7J2K2J2K3mn8Q1r
$$ plain form
6668 30 -12 -34 -23 -10 14 7 -4 -17 25 -24 -7 4 -7 -20 16 -4 -16 -16 -52 44 -19 -22 -31 13 -10 -23 -2 -6 30 8 -22 4 -30
6701 -30 -5 33 -14 3 -32 -35 -13 -6 14 7 28 18 -8 -7 -4 -21 -28 14 44 -22 13 -23 16 -25 -1 17 -15 -10 25 -58 -36 24 55 16
6735 16 -14 -8 -16 -19 10 -16 55 -14 15 -25 -17 -30 -11 53 -49 0 -21 -11 55 9 4 24 2 -34 4 -10 -57 0 20 21 29 14 -67
6768 -67 6 -10 36 -12 8 -6 4 -35 15 11 1 28 -7 5 23 -28 -23 -9 19 31 17 11 -17 -28 -13 52 27 10 26 -36 -27 25
6800 25 -9 13 32 -4 18 -8 -36 6 38 10 6 -27 22 81 -2 6 17 27 -7 28 18 15 14 26 47 -6 33 43 23 -12 10 13 -2
6833 -2 7 -1 46 2 -5 -6 16 25 -5 12 10 8 11 24 -11 4 19 -18 15 31 10 42 15 54 14 23 19 3 61 49 31 34 -22 -38 25 -12
6869 -12 4 -4 50 -10 -22 -11 -6 -3 45 10 16 42 4 27 20 -13 -39 27 -8 -6 58 -14 6 2 4 34 -14 15 -5 -38 1 -49 14 15 -29
6904 -29 22 16 30 51 -10 -33 15 -2 16 6 20 48 44 -14 -6 11 0 68 36 -22 -4 42 -4 21 -17 32 -22 -26 34 41 12 -1 27
$$ packed form
6668C0m2k2J1J3K4pj1j3M2m9J7J1j1j3L6k0j2%l6R6o3lrM4k3j3K1mL6k2l0K6l4
6701c0K5L8m7J7l5lK2PK0pK1j0k6JLj7pM2L0o6L5l6L9m1K4J8l2NL5q3K2O0L1l9
6735A6l0OqlK9k6P1o9K9m0Qj3J9O4j02M9k1J0O6m6nK0k2l6L8j4m7N7K0JQj5q1
6768f7P3j6M6m8K0j4J0l9N0mj0K7l5J2J8n1NJ4K8J2j4ok8j1J5O5k5j7J6o2RN2
6800B5l4K2J9l6K2k6k8M2L2k8ml3M9N9q3QJ1J0l4L5j0ljJ2K1n3L9J0k0l5K2Lj5
6833bRqM7m4pjK2Rl0J7kkLJ3l5J5J5l7L3J6k1L2k7L9m0Rmj6N8j2j8Ln6j6O3l7
6869a2J6qN4o0j2J1NLM8l5OK6l8K3pl3k6O6l5KO4p2K0mKL0m8K9k0l3L9n0O3Jm4
6904b9N1oJ4K1o1k3M8j7J8j0J4K8mn8QJ7j1O8l2n8J8M6m6K5l8M9n4mO0Pk9j3K8
$$ plain form
6937 27 -2 -4 7 -28 -2 -7 14 -13 24 -19 9 -6 9 30 24 27 23 7 5 -13 53 34 -24 -27 5 36 -34 29 -32 -12 -4 -36 -39 -22 26
6972 26 0 22 -16 47 66 -27 -5 -8 -33 33 -30 -49 -9 -11 -8 -9 -3 16 -4 -31 -30 0 -35 39 -13 26 -4 9 35 -39 -17 20 26 -30
7006 -30 -15 -44 -15 25 -31 -25 23 14 10 1 10 -44 17 43 12 53 0 -3 38 69 -25 3 15 0 -10 -33 24 9 50 24 -38 20 -14
7039 -14 -42 -21 -12 -33 25 26 -39 12 38 -7 -10 27 -33 -17 54 33 -38 47 7 -15 12 -14 -6 -12 -19 30 -15 -32 55 6 -30 10 -34
7072 -34 21 20 -13 -3 -20 -53 29 5 -34 1 13 -47 0 -9 38 -29 6 17 -25 -6 4 -8 40 25 -2 23 25 39 7 25 31 18
7104 18 -21 41 -14 26 50 54 17 -14 41 -36 15 3 6 59 -32 20 -30 -14 -12 4 44 17 -4 -61 -17 -40 -7 18 4 -4 54 4
7136 4 39 -1 31 43 25 21 -11 -20 13 7 -14 -14 -21 -7 4 -13 28 22 -21 29 -48 -15 -5 4 3 -3 8 24 10 18 0 4 23 24 6 42 7
7173 7 0 -27 -3 -10 -15 14 68 -8 7 54 54 5 14 16 3 2 -15 35 33 -18 84 39 11 40 -9 -10 -11 -3 -10 22 -13 40 5 41 57 19
$$ packed form
6937B7k9kJ1l5K6nK1k7L7m3K8j5J5K1oLmj6kj8O6j9n8lL2L1p0O3o1K0Ql2lJ7M8
6972B6k6K2l8O3J9r3K2lk5O6o3j9M0kLjOJ9k0k7JL0l5P4n2L9l0J3K6p4K2L7On6
7006c0J5k9K9M0n6OM8rmrRn4O1K6l1M1n3lM1L1r4K8J2j5j0k3N7j5M1k6o2N8l4
7039a4k8K1Rk1N8Jo5N1K6m5lL7o0J6P1k1p1Q5m0k2K7k6QopM9m5j7Q7m9l6M0m4
7072c4N5jl3J0j7l3Q2k4l9L5J2o0M7rM7o7L5J1m2J9J0j2M8j5k7K5KJ4l2J8Oj3
7104A8l9O2n5M0K4Ml7l1N5p7N1j2LN3r1N2n0J6KJ6M0k7k1n7M4k3L3K5j4qN8n0
7136DL5m0L2J2j8ml2rL3ok1%pJ4J1j7M1om3N0p7L3J0RjoJ1J6j4Qj8MJ9Jj8L6l5
7173Gpk7K4pnK9N4p6J5M7%m9RKj3jj7N0kn1J02m5k8K9m9jjQpL2l5N3l5L6J6l8
$$ plain form
7209 19 9 -14 58 -3 27 29 -6 -2 -19 9 -5 -12 41 -19 6 39 -7 1 -14 14 -16 -24 16 19 19 -9 41 20 4 26 7 -17 4 -53
7243 -53 4 -14 15 48 -17 -3 35 -39 -10 7 3 1 -18 60 16 4 39 -12 -9 19 36 14 1 11 4 8 26 -7 -39 -10 37 26 12
7276 12 13 29 -25 -7 34 24 29 43 2 10 21 22 -5 21 -21 48 -15 20 26 25 10 20 9 -40 62 20 29 -7 43 15 -6 51 -14
7309 -14 18 -25 35 -21 49 30 -9 54 9 8 32 18 36 36 12 21 17 26 22 -22 -15 -9 16 40 -37 19 -1 14 1 8 0 1 5 26 55 2
7345 2 -32 -3 10 -29 6 -13 0 -32 -22 -28 -7 -23 24 22 -46 -59 7 46 -22 -22 4 14 -5 23 -12 -9 26 4 10 -23 2 -13 -18 14
7379 14 24 36 31 51 -25 -33 -11 5 -10 -12 19 -4 -13 21 0 -2 -17 37 6 -11 1 -26 10 -28 19 11 -15 2 -12 25 4 1 -24 -14
7413 -14 6 -35 -21 -26 33 -20 5 -33 -1 9 1 -13 -14 19 -35 9 7 -2 -64 -22 -25 23 20 10 9 -13 21 -14 -20 -17 -38 -30 -25 -10 -35 28
7449 28 -26 8 10 16 -19 -1 5 23 -30 20 -11 -9 14 -24 2 -16 -28 -28 -21 -20 19 -24 -66 -28 -23 -12 -33 -33 -6 -4 -1 22 -32 6 -41 -16
$$ packed form
7209A9j0k3P2o1L0Kl5Mj7K8j4pN3o0K5L3m6Qj5K8l0qM0L%k8N0k1j6K2j9k4K1n7
7243e3N7j8K9L3o5J4L8p4K9J7mkj9P8m4j2L5n1LK8J7k2j3J0pMJ8l3l2K9M7j1j4
7276A2JJ6n4J8M1j0NJ4m1QJ1Jk7K6m2O9o3L5Ojj5J0j1m9J02m2Rl6N0k8k1N7o5
7309a4L2m3O0n6P0j9l9O3m5jK4j4J8%k4RmRmm4POK5K4p7N6k0J5j3PqJMK1K9n3
7345Bl4K9J3l9L5j9J3l2J0oK1j6M7ko8j3O6L9o8%K6J0j9K8l5LL5k2Ol3K5j5nL2
7379A4J0J2nK0p6qK2J6j5kL1k3rL4k1kj5N4l1j7J2k7L6l8M7qk6J7j4L7k1lk5J0
7413a4K0m1J4nN9n3K5l8L2J0qj4jL3n4M4kro2M2lM8lj0jk2L4l5oLk1QNJ5k5O3
7449B8n4L4KOl5J8OJ8n3N0l1KK3l8K6j8j2%PJL9m3m2L8NJ1k1%K7KLK3n4L8m7K5
$$ plain form
7485 -16 -61 5 -37 -22 -21 -9 20 11 -9 -1 12 12 -16 -51 -31 28 -11 28 -29 9 -47 8 -10 16 -10 -26 9 -94 -26 24 -6 -27
7517 -27 -9 -19 -3 -36 14 7 -12 -31 -15 -19 -39 -23 11 -7 11 -9 32 -34 -6 -22 -19 -17 -41 3 -30 28 9 -22 -10 2 25 -11
7549 -11 12 -6 -53 4 44 7 -1 7 -24 14 53 -15 -23 -7 3 20 25 13 58 -6 -34 -19 6 4 19 -8 51 24 2 1 47 26 -32
7582 -32 -9 8 34 -24 -13 -1 26 17 22 -10 -10 12 72 16 34 24 12 -2 18 25 13 31 -1 46 -6 11 -12 1 -25 21 11 38
7614 38 -14 -10 -19 -6 24 -35 69 46 44 5 26 32 9 -9 26 8 19 2 -15 49 -3 1 7 20 7 35 37 -21 41 34 64 45 48 23
7648 23 -54 -5 16 -25 -7 16 0 35 -3 29 32 33 -4 -9 8 22 12 50 47 31 10 23 -57 -15 22 53 -7 -9 25 -15 37 19 53
7681 53 0 36 17 5 40 37 3 3 10 25 20 44 0 -26 -9 -14 32 32 2 3 10 19 61 4 -30 14 13 -11 3 -33 -10 46 19 -7 5
7716 5 2 23 25 -33 16 -49 -25 -19 -26 -24 6 -2 -2 -21 42 4 -30 60 38 13 -2 7 25 13 29 -7 37 11 -1 -26 -25 0 -5 -15 5 0
$$ packed form
7485a6m5O6m2J5JJ2K9rk0QJ3%k8l5K0N9l9L9n7L8n6N5j8K6k6j6L5j03O8N0l0k1
7517b7J8j0J6l3N0pj9j9J6mk0J6L4j8J8k0M1o6K8j6LKk4M4l3N8j9l1J2J2K3l6
7549a1K3j8m7N7M0l7qQl1L8L9o8qJ6J0J7Nj2M5o4k8J5K5kJ5k7N9k7k2jM6k1n8
7582c2K3J7K6n8J1J2K7rNl2%K2O0n6J8j0j2j4K0Pj2J8l2M7n2J7k3J3k6M6j0K7
7614C8n2MrJ3L0n9J04k3kl9K1Ok3j8L5j8J1j7j7O4n2MOJ3j3K8Kn8O2pL0j9Lk5
7648B3p7M9K1m1J8K3j6L5l8L2LJl7nJ7J4j0L8lj6k1J3q0M2L7L1o0kL4m0N2j8L4
7681E3n3L6j9j2L5ll4%PJ5nK4m4k6J7nM6%l0JPRM2n7l4M4jk4J4l6K3N6k7k6J2
7716ElK1Kn8M9o5K4OpKL0q%j9O3l8l4R0k2k5j5RJ8j2J6l6M4k6j2k5JK5nj0K0n
$$ plain form
7752 0 0 25 -14 9 -14 -57 -20 -10 10 0 30 -20 1 20 2 -1 -6 -7 59 18 61 -15 -21 -5 -37 -12 -25 16 8 -5 -31 13 40 14
7786 14 -13 41 -19 8 53 -5 -10 17 0 33 2 -39 -2 -35 -8 14 24 53 -21 -30 39 -38 -8 23 -52 -38 20 -12 -14 19 -5 -1
7818 -1 -17 32 -13 9 10 -19 15 -29 -16 -9 -17 -36 -1 23 -31 -34 -6 -5 8 2 13 10 7 0 -9 2 6 9 -74 25 20 -25 -15 -5 7 13 34 -21
7856 -21 -55 -14 -23 0 2 31 48 2 -29 -26 -2 -14 -3 14 -27 5 -21 50 1 -23 -1 -19 -34 27 21 1 -32 7 -7 -43 21 1
7888 1 24 0 -15 -3 -23 -16 -35 12 -20 4 7 -19 9 -5 -19 -55 -26 -25 11 10 -9 -9 -47 -20 -34 -26 -8 4 2 -6 17 4 -7 -17 -5
7923 -5 -13 6 22 9 10 4 5 4 -24 -2 -25 4 -7 -8 38 26 19 38 31 -15 5 30 -24 17 -20 1 41 53 -2 25 27 -29 15 -17 -16 -37
7959 -37 -24 19 6 -14 -24 -29 16 4 54 -13 5 -12 43 27 -3 7 -19 26 21 25 31 23 -18 34 9 30 34 -7 3 -13 62 11 -19
7992 -19 -10 24 -58 19 23 -15 -16 -21 -29 -60 -20 43 8 39 -10 17 18 31 41 -7 46 -51 25 25 10 -4 34 24 35 29 -7 24 46 62
$$ packed form
7752@%K5l9K3k3m3L7J0K0j0L0n0K1J9j8lnjO6m1M3p6oJ6l2K5j3M1qj3k6M4K7k6
7786A4k7N4o0K7M5n8nK7j7L3l1m1L7l3K7K2J0K9p4rO9p7L0L1p5J4N8l2kL3k4M
7818aj6M9m5K2Jk9L4m4J3Pqj9L5K4n4lK8JJ3oJ1llprJ1MLq3R9nm5J0J0J2OK1n5
7856b1l4M1rK3KK9J7m6l1LK4j2J1J7m1L2k6P1m9k4K2j8j5O1ok0l3L9j4l6O4k0
7888AK3k4j5J2k0Pj9M7l2K4Lk6K8j4j4l6K9JL6jj9%l8K7j4QJ8J2kqK3j3j1j0J2
7923eqJ9J6j3JoJjk8K2k3K9j1jM6j2pJ9pm6K0K5n4M1l7K1M0J2n5K7Kn6M4l2Jk1
7959c7J3M3j3k0j0nM5j2N0o7J8j7N5j6l0J0k6M5nMOqm1N2k5K1Mm1J0j6P5n1l0
7992a9RL4q2P7Ml8jnql1M0O3l5L1m9K7JJ3J0m8N3r7P6%j5j4L8j0J1ol6L1K2J6
$$ plain form
8026 62 85 28 22 3 10 -48 -27 85 -10 31 -21 14 33 34 19 5 30 26 30 8 -7 15 6 -4 -4 29 -31 19 -20 53 -6 -12 7 -22
8060 -22 0 -10 -4 -32 -14 32 -28 24 14 -7 11 6 13 5 -2 13 -38 74 20 -12 -20 6 3 -9 0 57 9 11 -12 0 -10 -47 36 -8
8094 -8 -15 11 -4 1 5 -10 0 29 -5 -1 3 -14 -18 -7 21 3 -41 -15 -41 51 -7 -3 -22 4 1 -11 18 -16 44 -19 39 -11 -37 -12 3
8129 3 6 -7 8 1 -1 -8 -30 26 5 -6 32 -11 -17 -8 37 14 -16 -21 17 -18 27 -23 -34 -42 3 7 7 -24 -31 9 23 0 6 -20 13 66 2
8166 2 -30 -3 -48 -28 31 -4 -34 -5 11 -15 12 14 -35 28 -3 -37 6 42 18 -16 -10 -12 14 -38 -53 -5 -8 -29 24 35 -54 24 -18
8199 -18 -14 1 -4 28 -15 -64 -30 6 21 0 -32 -65 20 32 -64 29 43 6 -25 -8 -30 -74 23 53 14 -7 -27 -7 2 30 -19 12
8231 12 1 -9 -14 -3 -5 24 20 14 3 -6 21 -1 8 9 6 -25 15 -37 -3 -40 -22 25 17 7 -5 -5 -19 2 -30 19 1 -8 -14 18 -49 16
8267 16 -38 6 7 -39 49 -17 6 0 2 19 -19 -16 -12 3 -19 35 -62 -11 5 -25 77 -17 11 6 -46 16 12 20 31 51 -18 8 -31 2
$$ packed form
8026F2K3n7oj9Pn8K1J12r5M1n2L5J9Jj5j4K5mMk2j5K2rj0%L3o0N0l9P3n9oJ9k9
8060b2K2j0Ok8J8M6o0N2j0k1J8nPqpJ5n1J12n4l2qK6lj2RN7m8Kk3J2j0l7Q3m4
8094hpK6j5NMj5J0K9l4MMj7mJ1K8j8m4K6k6R2n8Mj9K6lj2K9l4O0o3N8n0k6K5J5
8129CLj3J5pkpk2N6k1j1L8m3oRM5k3l0nL8l5M5n0j1qM5M%l1pM0J4k3Ok6L3N3o4
8166Bl2K7m5K0N9l5l0K9J6k6K7Km9O3l1l4M3L6k4l4OkK6n2j5M8lk1N3J1q9P8m2
8199a8MJ5nL2m3m9L4L6J5k1l2l3Q5J2r6R3J4l7l1J7k2m4R7L0l9k1k0K0RK8m9L1
8231A2j1j0nJ1kK9moj1rK7k2RJll1M0n2L4l7J8M7qj0j2%j4K1l2M9j8roL2o7O5
8267A6n4M4Jm6Q8o6K3oKJ7l8LMJ5k2N4r7N1J6l0J02r4K8nn2O2mQJ1K0o9K6l9L3
$$ plain form
8301 2 38 -22 19 14 24 39 -25 39 15 -18 -21 18 7 26 -14 4 34 15 -38 26 5 2 1 -41 31 55 -8 36 27 18 14 -4 17 -8
8335 -8 -73 -56 -28 -26 -30 -7 -3 33 11 18 28 8 -21 -3 33 27 10 26 -9 -1 26 11 -3 67 -13 30 -16 19 35 24 3 25 40 -54
8369 -54 23 5 -15 28 19 26 -7 2 -14 44 4 8 -12 -29 27 6 30 -9 54 25 -6 16 22 -5 74 -15 -15 -7 32 -20 7 4 35 -10
8403 -10 22 26 18 22 10 3 45 17 16 25 15 47 12 36 26 23 -7 17 12 48 32 49 -2 14 -9 -7 -7 44 31 9 26 -37 -25 3 14
8438 14 40 -10 1 2 23 -17 33 7 6 -13 -1 42 7 51 11 25 4 0 16 3 17 -7 45 15 2 13 -6 27 -25 -31 29 -50
8470 -50 37 -2 47 -19 17 -12 8 55 -25 41 -5 31 47 -9 27 2 23 40 -21 0 -6 29 -7 21 9 4 -12 -13 -37 -22 15 32
8502 32 -6 7 -7 -11 -13 8 32 1 -2 -25 14 -3 -22 12 34 32 -3 19 43 -1 20 3 34 55 7 59 41 16 11 2 19 -30 -9
8535 -9 -22 34 -24 54 8 34 39 -41 1 17 15 31 -13 -17 -23 -20 0 46 19 -27 -14 -39 7 -52 29 -10 4 14 21 15 -25 -18 4 3 -18
$$ packed form
8301BL6o0M1nJ0J5o4O4k4l3lL9j1J9m0J8L0j9n3O4k1ljm2P2K4o3M4rrmj8K1k5
8335ho5J7K8KmK3ML6k2PJ0k0k9J8L6oj7J6l5QK7j5j4P0q0M3m6L5J6j1k1K2J5r4
8369e4P7j8k0M3rPl3Rj6N8m0Mk0j7N6k1K4l9O3k9l1K2Ok7P9q9%QL9n2K7lL1m5
8403a0L2MqMj2pM2k8jRj0L2l5K4j0ll0K4nL6j6J7n1J6k3K%N1j3k2J7o3J2K8J1
8438A4K6n0J1JK1m0N0k6jj9J2M3l5M4m0J4k1mJ6j3J4k4N2l0j3J1j9L3n2oO0p9
8470e0Q7l9M9o6L6k9K0M7q0O6m6L6J6n6L6k5K1J7o1K1oL5l6K8j2nj6jk4J5L7J7
8502C2l8J3j4mkK1K4l1lk3L9j7j9L4K2kl5K2K4m4K1j7L1K1m8N2j8k5nrJ7m9K1
8535ij3N6n8P8m6K6Nq0M2J6kJ6m4moLK0M6k7m6J3k5M6n9Q1l9J4J0Pom0PK2jk1
$$ plain form
8570 -18 -34 13 -48 2 -9 -27 16 -75 43 13 32 39 14 16 -1 8 27 46 -2 -32 0 -13 13 23 1 -9 3 4 8 -44 -27 -23 -6
8603 -6 -44 33 -5 13 2 1 -5 8 -8 5 -9 36 25 -6 28 -25 -48 10 -6 -31 -6 -25 -7 2 19 18 -44 -16 0 -12 -40 38 -2
8636 -2 -1 3 7 32 11 -19 -8 -33 -5 -14 26 11 15 33 5 15 -35 20 -25 -12 7 -6 -4 -21 -4 -16 -7 -13 2 26 16 40 1 13 11
8671 11 6 9 17 -20 5 12 -1 2 62 13 -3 -56 -27 -21 31 13 -27 -8 1 -1 -2 2 16 -2 45 2 -22 -17 17 10 0 -45 29 34 27 -10 16
8708 16 29 21 8 -35 2 -4 -5 -3 33 -4 1 28 36 14 6 -21 12 24 -11 5 -22 -3 1 26 -11 21 -17 25 6 14 10 -20 24 -31 5
8743 5 -9 1 33 0 13 16 12 25 -39 -14 -6 8 -21 -14 25 -12 19 41 35 -15 28 25 50 95 5 28 35 31 21 14 -37 13 12 17 16 5 36
8780 36 42 25 5 5 26 39 -19 30 -22 3 36 -11 35 48 8 9 -28 33 -43 -33 10 17 -1 17 27 -12 -10 -25 58 33 -41 22 -40
8813 -40 15 32 -8 29 33 6 12 16 35 7 28 54 9 -23 3 -10 -10 28 -32 2 24 -10 -30 -2 1 -12 -14 23 -2 -20 15 12 31 -15
$$ packed form
8570a8j6M7o1N0j1j8M3r1J18l0J9Pk5Kj7RJ9J9m8l0L2j3K6J0k2j0J2JMn2J7MJ7
8603fl8P7l8J8j1joJ3j6J3j4M5j1l1L4n3k3N8j6k5K5j9J8RJ7jo2K8J6j2k8P8m0
8636bJMMK5k1l0J1k5K8rM0j5MJ8k8J0n0N5m5J3J9j3Kj7J7j2RoJ5K4j0K4l9J2k
8671A1nLQl7K5Pj3LO0m9j6n3K9ON2j8m0J9RkjMJ4j8M7m3k4NL4pj0m5P4Npl7K6
8708A6J3qj3m3L7ojKL6l7NK7Qk2qk7L3J2l5J6k7J9MK5l7L2l8M2j9Qml0M4n5L6
8743Ej4J0L2l3J3LmJ3o4K5QJ4k9PL9l7L1K2on0M3lK5M5r0K3Pmj0pn1N0jNjj1L1
8780C6Oj7k0%K1J3n8M9n2K5L3m7M6J3m0Jl7O1p6J0M3Pj8J8J0l9Kj5Q3k5p4O3o2
8813d0N5J7m0L7Mk7OMJ9k8K1K6m5l2K6j3%L8o0L4K2l4k0K8Lj3kL7k5j8L5lJ9m6
$$ plain form
8847 -15 24 46 -23 15 19 23 32 -19 14 32 38 24 38 30 11 -10 44 -14 23 29 -4 -22 22 54 -1 -8 -21 -1 -20 38 6 -18 9 -4
8881 -4 4 29 30 -32 65 -4 -24 10 -3 -26 39 -40 -34 -12 22 43 -7 18 13 -1 22 -27 27 42 -7 -18 -19 2 -7 -24 -33 -11 -5 -8 -34
8916 -34 20 13 24 -30 -13 23 6 -52 -3 -1 33 -18 26 -15 4 19 -20 14 -28 37 -42 14 12 -11 -13 -9 -40 -13 31 31 30 12 -22 20
8950 20 -5 1 21 -38 -4 -16 -16 4 -11 20 23 -13 -2 20 21 -1 33 -22 1 4 -22 -13 -23 12 -52 16 7 -22 -3 -15 14 -38 -11 -30
8984 -30 24 26 -11 -39 -39 -1 -4 -21 -6 -27 10 -68 17 -18 1 18 -11 19 -10 25 -11 0 -3 8 -27 -17 7 -35 32 22 -35 3
9016 3 -48 4 -4 4 15 -38 -12 35 -3 -8 22 -18 25 2 1 37 25 -31 17 -3 8 50 15 33 40 13 11 23 43 -17 -7 26 -4 18
9050 18 -22 3 -5 39 30 10 41 17 2 -16 59 -32 2 -6 18 1 -29 -26 5 36 -1 -4 8 1 57 -14 -9 7 46 -21 6 98 -19
9083 -19 17 25 -35 12 -15 47 -2 -5 5 22 4 -21 17 -4 46 -19 34 0 33 37 12 19 -2 16 15 -16 -8 21 46 -22 -11 3 -35
$$ packed form
8847a5L9K2o9L8MMRn1L3J8Oj4J4qj9k1N4n8L7Ol3j8M4L2n5pj3K0j9N8l2k4K7j3
8881dQK5Jo2R7o9k0L4j3k3O5p9OK2L4K1n0K5nj4K3m9N4J5m9j1jK1rj7rK2Olk6
8916c4N4pJ1n4J7L6j7n8M9KL4n1M4m1J9J5l9L4m2O5p9N6kk3kMl1K7M4%jj8l4M2
8950B0k5OK0n9L4j2%K0j5L1Ll6J1K2Jk2L4n5K3Lk6Rj0L5o4O8rk9J9j2K9n2K7j9
8984c0N4Kl7k8%L8lj7J5k1L7p8Q5l5J9J7k9L0k9L5l6J1lJ1l5J0K4m2O7j0n7L8
9016Cn1N2qQJ1n3K6M7l8nL0m0M3k3jL6j2n6M8k0J1M2l5J8Pk7kJ2K0o0J0L3l0K2
9050A8m0K5qM4rk0L1k4j5j8P5r1L4qK4j7l0LL1L1l7lJ2pN6p1NJ6L9o7K7R2j17
9083a9L6Qo0M7k7O2m9lJ0J7j8k5L8k1N0o5N3l4L3Mk5Pk1J8jl1QK9K5o8J1J4l8
$$ plain form
9116 -35 19 32 35 9 28 -7 -11 43 -7 -3 29 55 44 -9 1 17 0 37 35 28 31 8 17 9 4 -13 4 -5 28 5 33 -5 -13 13 -1 23
9152 23 31 -24 50 31 -19 66 32 21 -2 17 14 29 -9 13 57 36 7 40 34 14 34 16 38 52 4 -17 16 54 83 -29 15
9183 15 -29 0 40 -13 -1 19 14 15 10 -4 27 44 55 -12 43 20 20 50 12 -9 5 18 -21 20 8 7 52 -6 -20 7 11 19 24 29 9
9218 9 20 13 42 17 22 20 23 13 25 7 11 42 40 40 -19 -11 35 39 45 49 16 17 30 48 45 -15 11 1 -21 -11 -1 26 -2 -37 -3 26 7
9255 7 -26 7 -7 65 -12 25 -34 42 37 17 0 73 39 -20 60 -14 29 13 28 15 2 43 -25 -26 -25 -7 14 25 -14 -7 34 -28 -36
9288 -36 0 0 -18 -41 41 -30 3 -21 11 9 -27 19 -16 6 1 15 -40 -21 0 1 -14 -8 7 -26 -7 -32 49 17 4 -8 -6 12 -32
9321 -32 20 2 2 -13 47 -27 -17 2 -4 14 -41 17 -21 22 37 -11 -4 -15 -24 46 33 39 -10 3 -5 -26 42 -23 -22 -21 8 -48 -44 56
9355 56 -20 13 2 35 -9 -9 -11 21 -17 -20 15 -12 -21 19 -27 -5 -35 13 -19 4 -26 5 -12 -2 27 -15 12 -10 -3 45 -12 30 16
$$ packed form
9116c5N4J3Lk6J9l5mN4n0ML2K6j1n3J0J6j7L7kpLk3Rqnj7J7rL3k3K8l8qK6j4K4
9152B3Qn5P4j9n0Q5l4j1k3J9lJ5l8K2M4k1k9L3ok0K0j8K2J4m8k1L3L8K9j12M4
9183A5m4K9M0n3J2K0nJnj4L1J7J1o7N5k3%L0l8k1J4J3l9M1j2jM5n8j4K7MQNNk0
9218IJ1pK9k5NkLj0J2j8ML1k%n9QM6MOMl3JJ3J8lo0K6j0k2J0J0K7k8l5L4K9j9
9255Gl3L3j4P2p7L7n9P6nk0j7P3l4n9Q0p4M3j6J5j3j3M1o8jJJ8K1J1l9PM1o2q
9288c6L6%j8k3Q2p1L3k4L2kl6M6l5K2nJ4n5J9K1Jj5OJ5l3J9k5Q1l2j3j2KJ8m4
9321c2N2j8%j5O0p4J0J9oJ8n5N8l8M3J5m8Pj1rP0j3Om9J3qk1O8o5JJK9n6MJ00
9355E6p6L3j1L3m4%kL2l8lL5k7rM0m6K2l0M8l2K3l0L1j7J0K9m2K7k2PM8n7M2j4
$$ plain form
9388 16 -45 1 -47 -4 -14 9 1 17 1 34 -14 22 -16 2 13 -14 -49 12 -24 -7 30 3 14 -8 -12 28 32 4 20 11 -22 6
9420 6 0 -26 11 1 63 -6 -9 1 -1 -17 38 1 -28 28 1 11 -15 -3 -26 -31 -42 21 -22 17 0 -26 -5 15 -14 -35 10 -11 20
9453 20 13 -41 -8 -23 25 -37 -36 -29 -22 -24 23 43 18 29 0 40 34 -2 19 1 38 -4 -8 11 -3 -30 8 26 11 60 28 -9 27 -8
9487 -8 5 9 -10 -25 -31 48 19 20 4 5 25 -52 3 -14 12 -11 22 -33 -29 5 27 22 15 22 -24 36 27 37 -10 -13 -18 -12 -32 -10 3 16 2
9524 2 22 7 27 26 -28 38 26 -4 20 0 23 10 10 14 16 9 -28 -12 9 -26 37 24 0 -9 17 5 20 -11 5 -9 0 24 22 30 0
9559 0 36 1 23 11 10 46 -3 26 -19 5 39 -20 -6 -11 -11 -3 -44 40 2 1 17 9 5 6 45 -1 42 20 14 2 34 30 -10 10 11 16 -3
9596 -3 1 -63 30 45 -36 7 -18 17 9 19 52 -3 10 23 47 -57 7 51 43 -19 6 -4 2 15 41 -14 1 43 1 11 -26 5
9628 5 5 18 18 52 10 4 -9 -19 10 -18 87 9 12 31 41 10 6 68 -10 -29 77 14 18 -27 -11 13 -21 17 18 -15 14 -25 -39
$$ packed form
9388A6o1M6m8M3j0K3qJ6j6L3m8L6l8J8J1k7l5O1l6J7L7k7J1k2mM0Mk8J6rl3K8
9420Fok6L7j0O2o9lJ0kj6N5l7k9N6k7J0k6J2k3nj1O3m3L9j7k6K1K0k9k1M5k1L1
9453B0pn4L3j5M8o2JPPkM7K0k5J1k9M0ol6K1j8L7m2mJ9j4k7L8J8j5M9l2l7L6l5
9487hJ3Mj9j5oP9k9Jj6JK0p7N5j7K6k3L3n5ML4K2npPm6O0rJ0m7lnOk0K2J3J3j4
9524BK0j5K0jn4O6j2l0K4k0K3j3%MKpl7J6K1l5O3j3k4rK6j2J5l1J6j4RK4kQl0
9559@L6l5K2j2jL6m9K9m5K4L4n9J4n%Qm1Q4l8jJ6qmJL9m6M3k2oj2L2mm0K0JNj9
9596cMo4R3J5q1M3k5L5qJ0L3n5J3J3K4j04O4M4qo2K5j0OJ3K6n5J5M2m2J0l7L1
9628E%J3%L4m2oj3j0K9k8J05p8LJ9J0l1mO2p8j9J06o3Mm5J6K4l4L8Jl3K9l9j4
$$ plain form
9661 -39 -21 -11 -5 -37 -33 3 26 -23 -46 -9 23 5 -27 -8 21 50 43 27 -20 13 -27 -44 23 -14 18 13 -25 21 -18 27 25 13 1
9694 1 -8 -38 -20 34 4 10 4 1 -16 -10 -34 1 40 -41 12 54 27 40 -20 10 19 52 -24 -15 17 21 81 -25 -26 -7 34 -37 -15 34 3
9729 3 16 14 15 21 18 19 3 -6 24 -14 -40 -8 19 3 -9 -16 -8 15 -11 -6 -8 -26 23 -19 -10 -37 -21 8 22 6 27 -18 1 11 -16 -19 16
9766 16 -8 -15 -2 26 22 3 20 -40 19 -35 37 59 -11 49 16 16 -37 -39 32 9 57 13 19 16 1 41 14 -12 -6 18 -63 19 8 -24
9800 -24 5 2 -6 4 -5 52 28 -23 -4 29 37 -19 1 7 22 -7 13 0 -15 38 8 -16 42 -9 10 -26 -9 26 -1 39 52 3 3
9833 3 2 -30 19 26 18 -2 32 6 -24 1 -10 -14 35 17 -1 -13 27 -22 20 9 -16 -19 -33 24 -23 17 34 3 0 1 15 -1 -50 -19
9867 -19 5 16 -7 1 27 31 16 -8 28 45 39 -1 18 33 7 24 19 4 -2 -13 60 24 14 -13 31 76 31 47 30 32 -11 7 35
9900 35 -29 -9 -64 -22 27 13 21 11 15 28 -3 -4 11 35 -8 10 -26 60 18 18 49 38 27 61 42 -4 70 -4 15 71 -20 -30
$$ packed form
9661c9J8J0Ol2ML6K3m9k3L7L2j8l2J9K9K9pj6m7L3m0j7O7l7L2nl8M6l9M5kj2j2
9694Arl0J8N4l0Oolj7Ok4L5L9q1N3M2k7J3o0L0RL3p6RL2MO0j06jJ9M1p1K2M9l1
9729CJ3kJOlJj6rL0l8k6L2K7j6j2pQK3k6Nkj8M9m2Rk7J6K9J4j6K1m5J9J0k7lL5
9766A6k4pJ3K8mj9J7o0N9n4P2K2p0O0l3%n3kP1k3M8m4Olj5M0k7k6OK4q1Q2j1l2
9800b4K9lqJ0rN7k4n1J9L3Qn6K0OJ5k9K0j3j5N3l0k4N8n1J9l6J7L5k7M0J3m9%
9833Cjl2M9Pqk0L4k6l0K5j1mM9j8j8j2M0m9M2j1k5lj4N7m7M0J7l1lJJ4j6m9L1
9867a9K4J1k3QK6Mj5k4L6J7om0J9J5k6J7nj5oj1P3l6j0k7M4M5m5J6j7Km3J8K8
9900C5o4K0n5M2M9j4Qj0MJ3l1jJ5K4m3J8l6Q6m2%L1j1j1L4j9m6P4p4J9N6r1j0
$$ plain form
9932 -30 -24 18 -24 11 49 -19 55 -11 -19 8 14 3 20 17 -12 13 34 16 13 -31 26 48 39 38 -11 12 -10 28 -3 -2 -13 -26 30 14
9966 14 -7 56 14 37 -3 9 21 -33 -14 21 -33 -17 -13 -6 55 29 41 31 38 18 3 6 -26 41 22 -6 51 43 -22 2 38 60 5
9999 5 -23 -1 25 9 -5 5 22 -18 24 -14 10 37 -2 -13 -10 6 -63 8 -10 8 -6 35 8 21 20 -23 2 -26 18 -27 60 17
10031 17 12 26 -5 38 -7 8 50 -52 -25 -30 13 26 4 4 39 23 -9 42 5 -25 -3 -15 27 15 -5 -13 -10 -27 -13 -26 -29 1
10063 1 -15 -42 7 20 6 -47 -41 39 13 -23 17 -38 9 0 8 -5 -38 34 -41 -45 -26 -50 4 -4 35 -11 -5 -9 18 -6 30 28 -15 15
10097 15 -40 -35 -48 8 -16 -33 -27 19 -32 -12 -13 -16 -44 -13 -34 -22 -1 -28 37 -34 -6 -8 51 -36 -20 -31 -12 -16 -35 -1 2 24 -23
10130 -23 -11 -35 -10 -45 -31 31 -6 28 -22 -31 -12 12 -26 -33 -3 -2 6 -26 -3 16 -37 -87 -4 -9 -32 21 -7 -12 -19 -44 31 -14 -21 -21
10164 -21 -28 24 17 -48 -33 2 -52 -7 20 -24 -2 -51 22 34 48 -67 -3 9 0 2 1 18 10 6 49 30 -8 8 -7 9 -3 18 24
$$ packed form
9932c0OM2m2L5L8o8P4o6qK7Oj1J7lk9K5K1j8lm4N7K2rjm9K3k2L8l1Jj1j3N6j6
9966A4k1O3m2K3m0J2J2n4J9L5n4J6MPO1k6J2j0Pk0j5Ll2O7j9k8N7qo5K4L6K2n5
9999Ek8K2K6j6j4J0J7m0M2l8K4K7l9j1LJ6o9P1j8J8j4M1k7J3jm3K5k8M4m5Q7m3
10031A7nJ4l1M3m5J5M2j02K7nM3J3k2%L5j6l2N1l7l0K2j2M2j2k0qLj7J4j3lL0
10063Aj6k7M9J3j4n3OQ0k6l6M0n5M7rQj3l3P2p5mJ9k4N4qL9m6OmK7k4L6km3L0
10097A5n5Nj3N6k4j7OM6n1K0jlk8L1k1J2K1k7O5p1K8kN9q7J6j1J9mj9L4LK2m7
10130b3J2k4K5l5J4O2l7L4n0rJ9K4l8pL0JQl2K3J9n3n0Q3nk3N3k8npk5P5m5p%
10164b1pN2po5J5L5n4M5K7m4K2m9P3J2J4j15O4J2rKjJ7qmM3j9l8J6j5J6j2K1O
$$ plain form
10197 24 6 31 3 -13 50 26 13 -9 7 31 -17 22 -4 13 14 12 14 -23 11 29 31 38 -5 -25 -28 22 18 -3 12 33 42 -23 9 -16
10231 -16 31 6 19 11 1 25 7 13 -15 -2 -1 -15 14 2 -27 25 49 33 -9 -17 16 1 12 0 -16 31 -12 52 19 19 24 0 10
10264 10 -42 33 26 -11 26 6 36 -19 5 -25 -3 9 -6 -18 10 44 23 3 20 7 29 2 21 27 29 20 46 -25 -9 7 26 26
10296 26 28 9 13 37 13 -20 39 6 17 5 19 30 50 30 0 4 37 -3 19 30 1 15 39 -11 -24 3 42 22 17 7 43 12
10328 12 0 -4 40 20 1 40 -8 -9 -8 47 42 -12 21 25 14 -2 -21 5 37 42 22 54 2 34 -23 9 0 -14 29 -3 -27 50 -25
10361 -25 -7 -2 9 -3 -19 43 34 6 -14 31 20 3 54 13 21 34 35 35 42 -3 39 29 -30 -5 31 32 40 55 -25 26 -17 -1 -48 8
10395 8 28 16 -52 0 2 16 10 5 4 -12 21 -31 -27 -27 50 12 4 21 51 3 25 4 19 9 -2 6 -16 14 31 -12 25 17 -15 -22 13
10430 13 9 -10 8 -7 37 15 -68 41 6 6 -60 2 -13 9 33 11 23 -13 39 -25 -51 1 24 27 48 13 -26 -15 -25 -31 -8
$$ packed form
10197B4j8K5k8j6O3k4j3k2J6K4m8L9k6J7JkKl7L4J8KPm3k0lN0mk1J5K1Ro5L2k5
10231a6M7k5J3qj0K4j8Ok8J3Jj4K9j2k9N2K4j6m2qL3j5J1j2j6M7m3O4l3%Nk4J0
10264A0n2P5pl7L7k0L0n5K4l0K2J2j5j2K8L4k1k0J7j3K2k7J9OKrK6p1J6J6J9%
10296B6Kj9MK4k4l3N9l3J1j2J4J1K0k0l0ML3m0K2J1k9J4K4n0j3K7L9k0nj0L6l1
10328A2j2mM4k0j9L9m8jJN5nn4L3Mj1j6j9K6L2Nk0L2n2L2n7L2rj4M3l2k4P7p5
10361b5J8NJ1j2j6O2rk8k0M5j1j7N1m1QJ3J%Pm5M2j0n9K5L6JQJ5q0N1m3J6m7N6
10395HK0j2o8N2KJ4onjj6L3n2M%P7l8qJ7L0m8K2k1J5j0j1Qk2L0J7m3L7ql2pL5
10430A3mj9J8j5M4k2q3J09l5%o6O2j5K2K4k2J2l6N2o4k6N2K3LK1l5l9J1j0oK3
$$ plain form
10461 -8 -45 29 -49 7 -2 -21 33 -25 23 -8 1 8 26 8 7 24 -20 14 -13 0 -19 -4 0 -40 15 -21 -13 43 -5 -33 2 18 -24
10494 -24 -20 1 -40 -40 0 -2 -66 -34 29 -6 -14 -22 -20 13 -2 -35 -25 -35 47 -45 -56 18 -48 -6 2 21 -44 -18 23 -59 40 -10 -32
10527 -32 8 16 11 -32 9 -17 -20 -34 24 -6 30 33 -7 -20 28 -16 -19 3 -24 15 59 3 43 42 -3 1 -23 13 -10 17 -5 29 36 -18
10561 -18 -2 60 59 -46 16 4 -21 -22 -39 29 -13 -13 -12 15 15 -52 -18 24 -19 15 -10 -4 10 28 19 -12 -12 3 -4 -30 7 38 29 -23
10595 -23 16 20 7 -48 -24 9 0 4 5 -43 -16 9 -69 3 -7 10 2 34 26 41 -11 2 25 40 -5 2 19 26 6 34 -10 4 30 43
10629 43 17 -7 26 -2 25 11 30 1 19 50 37 25 -25 -7 12 -20 42 43 22 50 -13 20 14 41 -16 46 0 -13 -11 8 -19
10660 -19 30 34 6 -14 21 15 18 -15 4 24 -23 41 2 -2 24 9 -29 22 -21 -17 -45 32 23 -39 -48 -20 42 -34 18 -4 31 27 -14 -11
10694 -11 24 -3 24 -18 -1 -9 16 10 0 13 14 -58 18 -34 -5 -25 3 7 -30 12 22 27 8 -5 29 -5 18 10 -3 6 -10 25 -32
$$ packed form
10461hl7P4p8N6rj9N4n8M8l1RPJ8j8jJ7m4L4k7J3j9J5Mm0N5l6QN6m8k8L5J6m2
10494b4MK1m1%M0ko4L2O3l5qqKL3j5l3J0j0Q2r2j1P4o6M2QJ9o5K6M1q2R9n0k2
10527c2M0Qnm3M1k6lj4N8l0L6Lm0j3M8m4lK2k7L9M4n6M0jm5Mk4L6k3K7k2L4Pn4
10561a8J6O2jj05O2j2k5jj7O8m2%JK7%o7L4M2m3L4k5OJ4J8rl1%J5pk6L7L1rn2
10595b3L9Mj3n5K4L3rMJm8K7K5p8P2j0J7qL2qJ5n2J3K3J5m5PJ7Pk0K8m4J4K6J3
10629D3k6k4L3k8K7j4J9k9J8L1j3j2n0J8J9l2O2Jk1K8o3L3oK7n7O2m6j3KJ9k7
10660a9M9Mk8k0L5oLl3J9K0m7O4l9mK6j5l8N1m3Mk8P7ro2rK8O2p6N2k2L5mm1L
10694a1L5k7K7m2J7qK5oj0J3Jp2P6n2K9k0K8Ml7M2J0Nj9j3L4l4K3qj3Rj6L5n7
$$ plain form
10727 -32 19 31 28 -51 -7 2 4 -4 39 27 -30 -16 39 -8 9 -8 37 35 17 -3 -8 -26 -26 -19 18 -62 -2 -13 61 -6 5 34 -11 25
10761 25 17 6 8 3 -12 -20 -11 -4 -52 7 7 -17 -23 -28 -1 -74 -11 8 -48 8 -24 -2 -27 52 21 6 9 15 43 10 -35 25 27 -15 -42 -14
10797 -14 -24 24 -33 -21 -9 -37 -21 -32 -5 16 28 -30 4 -3 12 18 -9 4 15 34 -15 -18 23 -9 12 20 7 25 13 6 14 1 -29
10830 -29 14 8 6 44 -36 10 -7 -13 47 2 -22 -33 34 38 -5 -9 -32 -24 6 15 20 -40 -28 -28 1 -12 -4 4 -8 -34 28 27 -11 -8 -9 -19 2
10867 2 42 -3 -31 22 -2 0 -56 -12 28 -45 -38 -16 -51 -32 -7 -28 6 -28 -10 -9 -40 25 -47 39 -35 -47 16 20 -24 -17 -5 -24 -18
10900 -18 -3 16 -13 -66 -3 -3 19 -18 2 18 -22 -19 19 -20 -40 -5 11 -10 -26 -23 -48 7 21 -3 -15 -1 16 -15 -25 -13 9
10931 9 12 -1 20 -19 -3 -22 12 -2 -9 -39 17 -3 19 33 -39 27 -14 -8 -7 -2 -1 4 4 51 3 2 16 -13 -20 17 -3 15 -19 -4 -20
10966 -20 7 -22 0 -21 -37 -14 -2 27 -11 -1 -9 -23 -11 30 30 16 21 -64 -25 51 27 10 -13 -43 -9 24 -29 57 12 28 85
$$ packed form
10727c2N1J2lp9M4RKqM3j2n7J4N5m7J7j7M5kj8k0nj8%PL7q0O0j1P4o7J1K9m5L6
10761B5qj1Knj5qRPm8N9%k4onK7p3O3J9n6N6l2K2k5P9l1j5LOK8l3m5O0Km2k7K8
10797a4j0M8n7J2J2k8J6j1K7K1J2n8L4pJ5Ok7J3J1J9m9lM1l2K1Qj3J8j2pQj3l0
10830b9M3okL8q0M6j7oO0m5k4j1O7Mm3mk3QL0RNo0J2%K9j3QQj2k6O2jl8Ljj0K1
10867BM0m5k8N3k4Kn6M4M0p3PK2l5J9K5k1L4l4J8Jl1O5p2Q6p4j2O3Mm4PJ2j9O
10900a8J5J9k9n3O3%K2l7K0J6m0LL8l9k0L5J6k1j6Lk5N5J4k4j2J4J7l1j0J2K2
10931ILj3K1l9J6j9L4j4pl0N6k0K2J4p2O6m1OJNJN%M7m8jJ4k9pL7k0J8l4J5j6
10966b0K7k9K2k1j6K3J2K9l8J0qj4J2M1%j4Nq5L9P6k4j7k3l0L4L3n3Q6m5J6N7
$$ plain form
10997 85 -5 33 6 -10 0 77 -1 18 -8 1 30 -7 32 -5 -11 -8 -16 7 -21 0 -13 -9 12 -15 51 -32 35 -4 -15 -13 -2 33 9
11030 9 -30 -5 62 2 -6 2 67 -9 12 -7 32 4 9 8 4 -24 -21 4 39 -12 7 -5 21 -9 -3 -19 21 16 -11 4 -12 26 -2 30
11064 30 -22 -3 -16 9 -20 9 -29 72 -16 81 -9 -22 -25 31 42 2 -1 7 56 13 37 50 5 33 16 -17 35 12 35 37 14
11095 14 -3 21 -25 16 -1 16 53 -4 29 46 61 15 19 14 22 4 -10 16 20 -12 47 13 -5 5 -7 25 32 30 24 -23 30 0 -21
11128 -21 -21 42 -8 -35 -9 -20 16 -33 -3 17 -14 38 18 -6 -30 3 -14 -26 16 -11 -18 -23 -7 -38 -21 2 -13 14 20 4 15 34
11160 34 27 10 34 4 60 -19 -29 -24 -23 18 12 9 17 0 13 -10 17 -8 8 26 -9 15 -36 -20 -2 -4 -8 7 -14 -39 1 -38 -47 39
11194 39 6 40 22 -32 25 -3 -3 -3 2 -34 -3 -7 -10 30 0 22 3 62 7 -2 12 7 -32 3 41 27 -34 15 12 -9 22 12 -23 0
11228 0 -4 -31 -8 10 -6 -29 23 -1 -21 -3 -35 -1 45 -47 -29 24 4 -20 -43 -30 -23 21 -22 -3 -3 -7 -2 28 -16 3 6 12 -50 -21
$$ packed form
10997H5r0L8k7j6J0P7p8J9k6RK9l7L9l7oLqK3k8K1j3MK1k7O6q3O7l9j1KJ1L5k4
11030Il9K5O7o0qQO5p6K1j9L9k8Njmk8LK5L5n1J9j2K6l0Oj6M0nk7J5j6L8k8L2
11064C0n2J9j3K5k9K9l8J01q8R7r0j3lN6J1m0lQM9m3K4J3m5K8j7l3N2k3K3Kk3
11095A4j7K4m6M1j7J7L7n7L3J7J5m6MnQj8j4K6Ml2N9l4j8J0j2L2Pkom7N3l0k1
11128b1%O3n0k7K6j1L6m9L0K0l1N2k0k4k4L3j7j2M2k7pnJ6l1J7K3j5K7Oj6J1J9
11160C4pj7K4l0N6p9j0NJM1olQj7J3k3K7k5J6J8l5K4n1J6J8kmJ5k1k5M0l9rQ6
11194C9l3L4j8n4N7k8%%Nl6L1mlM0l0K2j9N9n5rJ4nl9L5L8j4o1M9lk1L1j0l5K3
11228@mk7K3J8j6k3N2k4k0J8l2L4M6r2J8N3k0k4k3J3PM4m3J9%mNL0m4J9LOo2K9
$$ plain form
11262 -21 -15 -19 12 23 21 -33 54 36 -47 -26 -22 31 -3 64 35 -9 4 4 8 23 35 27 14 24 4 -27 -9 -3 -5 -3 -25 -26 -38 4 16
11297 16 -34 24 4 -2 -9 -1 13 19 -17 -49 -29 -43 0 -40 8 -17 -25 -39 21 -13 -32 -21 9 26 19 -14 28 0 -17 -16 -14 -11 -1 8 9
11332 9 19 -38 37 12 -4 -35 -14 27 2 -7 -26 2 16 -27 -31 -3 -6 -7 -28 -63 28 28 -37 1 -60 9 6 56 8 10 -1 -13 26 48
11366 48 -14 -25 2 43 18 8 7 36 -30 34 10 -29 7 32 40 -17 5 -32 -3 -16 15 45 7 11 28 4 -31 -21 29 -15 5
11397 5 -9 -14 14 21 -4 12 -30 0 60 -15 11 0 -3 0 6 -4 26 -2 17 5 -4 18 -33 10 4 21 10 10 23 50 -5 10 -17 24
11431 24 13 1 37 36 7 -22 -8 -29 16 54 -30 29 -34 25 -21 -52 -18 -26 -35 7 11 33 3 21 -31 14 -12 1 7 -22 -18 7 28
11464 28 1 20 51 37 43 10 1 3 44 8 -13 0 -3 -25 56 -33 33 25 1 17 3 26 -16 36 6 52 -10 9 33 -25 17 42
11496 42 -5 -17 9 13 13 13 26 -5 21 -2 5 7 -3 37 53 2 24 23 39 43 32 41 9 40 20 -9 -7 -28 -19 1 14 -33 1 -17 -44
$$ packed form
11262b1OmL1J1kn4Q7j8q3K1MN3l4O7k9m4J3%MJ5J2qj3J0k0l1J8OkKk2jj2M2J2
11297A6n0N8k0opQJ4Ol6l2K0j4M3m0M8k5qj4O0l4j9J1L0J7pl3M2k8j7JKLJ0RJ
11332IJ0n7P5k5j6l1K1M1k5rj9K8J4m3mK8ljk1l5R1%o5L8o1O9lN0m8Kj1j2L9K2
11366D8o2j1K7M1k5j0jK9o6O4k4l9L6K5Qn7K2l7K9j3L1L0l8MJ7k4l5J0N0m4K0
11397Ej4nK8Pk5J6m2L0O0p5K6j1lLOj0L0k8J9j2rK2n1M3oJ7j1%J3K7n5J5k7M1
11431B4j1j2L6jk9k9J4k1M5L8q4N9o3N9m6l1L4qrM2MK2l0J8n2M5k6J3Ok9MK5K1
11464B8k7J9L1j4Ol3rKM1l6k1J3lk2Q1q9O6qk4J6j4K3m2N2l0M6o2J9K4n8M2K5
11496D2m7j2K6M%%J3l1K6k3PKj0M0J6n1K2jJ6Mj1Rl2L1k0k9Kk1RK0J3m7L4j8k7
$$ plain form
11531 -44 -5 -34 41 1 57 52 -26 40 2 1 24 -8 21 -13 -5 59 -14 15 1 -6 12 -5 -14 52 -8 2 12 23 16 4 -17 1 13
11564 13 19 13 27 26 20 24 -32 -5 -16 4 -32 15 22 -12 31 23 -12 17 -33 -27 8 -15 5 -43 26 33 26 2 -4 -9 -10 23 -7 42 -27 35
11600 35 2 -34 32 -29 -20 0 25 -2 -50 31 8 58 0 -27 24 4 35 -18 14 -13 25 -44 31 0 -7 36 -15 -8 -20 20 -22
11631 -22 -42 24 -30 3 33 -1 17 7 -47 -15 15 3 9 32 -22 20 11 27 14 -2 -14 10 40 -26 3 7 50 34 -9 16 -38
11662 -38 -9 -54 24 54 1 -12 -24 30 -2 -17 4 -17 -5 19 33 -22 -13 64 41 17 30 -3 12 -4 0 26 -2 12 7 4 -18 -1
11694 -1 -11 -31 -15 -31 42 9 53 26 -18 19 -20 4 37 7 -29 38 23 2 -14 43 9 7 -3 29 -40 -31 -31 11 -5 -11 -5 0 45
11727 45 -81 17 0 0 47 4 24 23 -9 -8 21 -54 -23 15 -17 -14 28 0 22 23 65 -7 6 41 14 1 46 -7 -18 13 0 3
11759 3 -3 -5 -20 -5 6 18 -18 14 28 11 37 7 19 24 33 6 19 -7 13 20 37 2 -28 5 14 8 1 23 60 39 -22 -17 9 13 -24
$$ packed form
11531d4L9k9P5m0N6np8O6l8jK3l2K9l4QO4p3K9j4pJ8j7rO6o0J0J0J1pj2k1J8J2
11564A3OoJ4joMn6K7j1K0l6M7Pl4M3ql5K9n0OL5k3K0m8O9Ppk4onjL3l0M9o9O2
11600C5l3l6O6o1RK0K5k7m8Q1k3N0n8k7N1k0L1n3L2k7L8o9P5l1pM3n1Pj2M0m2
11631b2k0O6n4L3L0l4J8j0n4L2L0j2OK3n4M2rJ6j3j6j2K4L0o6K9MM3j6m3K5n4
11662c8K9m5P8L0n3j3j2N4l2j5K1k1J2K4J4n5RP7k3k4J3l3J5j6MK6k8J4nlk2J7
11694aj0k0J6j6P3l3M4k7m4L7l9K4L3l0l6O7j5k1j6N7l4kj0L2o9R%M2j6oONM5
11727D5j26R8j7%M7m3K0jl2JK9p5L1L8l2LM2k8K2JM2p2J3L5k7j3M5n3j1L1j3L
11759Cokj5J5J1J2l6L2J4j7K6l0J2NRk7J3k6K0PJ7l5l0L3RopK2L7k1o1NK6Ml7
$$ plain form
11794 -24 41 27 34 17 21 51 -18 -16 25 -6 11 25 23 -22 16 -1 -7 4 29 56 13 12 13 16 -3 32 5 46 62 -22 19 4 -17 26
11828 26 -15 40 51 50 20 18 4 25 29 -17 20 40 -24 22 22 -3 0 38 35 59 18 18 -35 18 -17 19 -12 14 14 -15 0 -30 -7 37
11862 37 8 24 27 -11 10 11 9 -25 -35 0 30 -1 9 -14 39 39 -4 52 26 8 34 21 9 -26 58 -2 -1 6 35 0 -11 11 -32
11895 -32 -23 -18 5 20 -26 40 -5 -28 14 -24 -17 24 37 20 -2 -20 -22 -1 17 -19 -17 18 6 27 6 22 -1 7 38 -6 22 7 -11
11928 -11 41 29 -32 24 1 -3 0 6 31 21 18 27 -8 -6 -13 -49 16 10 -12 10 16 11 7 -20 9 -6 -29 -9 18 29 -19 -30 3 0 -8 19
11964 19 -10 -76 -12 4 -12 26 -13 33 -23 6 -17 -38 29 -32 20 -11 0 -36 22 -68 11 51 -6 23 11 31 -20 10 8 45
11994 45 -23 -6 4 -66 -4 2 -12 16 -22 7 22 12 -11 -69 18 -8 -24 19 -7 14 -19 -31 10 -4 -7 -1 6 -30 31 -21 16 34
12026 34 2 20 10 -9 23 38 -20 -5 -36 25 2 -25 8 -7 -18 -44 4 -12 -17 -17 -12 -7 -43 3 -12 -2 -10 19 -51 65 -19 -43
$$ packed form
11794b4O5j4Pj7ML0o9KM1l1J7J4km5L8j7oJ1K5K7m3jJLj9L5k7M1J6q4M1j5k1M3
11828B6m1N5J1jl0kj4K1Mm6L7K0o4M6%k5LL8lK4m1%n3N3l5L6l1K6%k9J5l0K3M4
11862C7k9J6Ll8K1Jkl4j0L5L0l1J0k3N3%m3N6k6j8K6j3j2l5Q4o0JPK9l5j1K2m3
11895c2RNK3J5m6O6m5k3M2l8PM1J3j7k2j8kK1J8l6KL5j2K1k1J6k3QL1m4K8j5j8
11928a1N2j2o1N6k3mLOK5j0lRl5Kpl6O5ok2K2Onmk7K9j5k3K0K7J1m8j1L3lqK7
11964A9k9o6O4J6j6L8l9M6n6K9k3k1O7o1N2l1J1l6N8r0P9M0n7K9j2K0n1L0kL7
11994D5o8J7J0p0O2Oj4K8l8K9J5j0k3n8Q7k6j6M3k6K1l3j2M1j4lOPl6O1n2L7J8
12026C4l2J8j0j9L2J5n8J5l1O1k3k7L3j5j1k6M8j6n%NNl6M6j5J0qK9p0J16q4k4
$$ plain form
12058 -43 23 4 -18 -17 6 -1 28 -1 -24 -14 -21 -21 -37 3 0 -20 -4 4 -34 -10 26 0 -25 17 -35 -8 -22 9 26 17 -7 23 24 -80
12092 -80 -14 -31 3 13 4 -18 22 8 -17 -1 -3 -10 -3 15 -20 -57 -11 16 20 -6 -14 -17 -21 -16 -49 -21 -7 39 27 33 29 -2 -4 1 -22 -22 21
12129 21 24 24 -5 -19 -16 -12 2 8 3 -11 17 -7 29 -2 39 -16 -54 6 -17 -17 7 -14 3 12 33 8 -23 3 -13 13 8 31 37 19 10
12164 10 -38 29 18 10 3 -21 18 8 -2 26 32 13 -58 -8 -6 16 -5 -16 16 35 41 4 14 33 30 16 -19 -11 -5 41 11 2 3 14 -2
12199 -2 56 38 -13 33 35 7 9 2 25 56 32 -1 -7 22 34 28 -8 47 67 -27 25 9 5 -3 34 -31 -23 8 14 25 40 2 34 -5 43
12234 43 8 -10 8 -4 24 -8 37 19 22 28 -20 -9 0 25 -5 24 80 -7 -26 -5 26 12 -29 54 4 22 -5 -35 18 18 -5 -26
12266 -26 -3 9 33 3 -22 39 13 21 36 6 28 -26 60 -36 22 8 7 5 9 -15 12 7 35 20 14 62 43 0 24 22 3 5 -19 19
12300 19 -30 4 24 -20 -28 17 2 8 -7 16 4 1 16 17 17 -14 0 -42 14 16 38 22 2 19 0 24 -25 -21 21 2 6 20 20 1
$$ packed form
12058d3O6j9k2JK3pK9k9k3J0p%j6M0lk0J6Ql8K4L6k6k5M2n2K7j4L1J7rk4L0Jj04
12092h0O6j7L4J0rk2M0j4k5J6kpPJ8l5l7M6K7Mk6qlmNl3K8J4M6j2Oml1kNk3%M3
12129B1L%k9j4LMJ4Onj4K8k4L6l1M1n5l8O0k3%K4k1J7RK1k5l1K6j6K6nK3Oj8r
12164A0m8O7j1qpk4L9j0j0K8Oj9p1N0KK2k1j1L2J9Ol7J0J9lj4l5QOM6l0rJJ1j6
12199bN8j8n1M6Kk8KpK3L1k4l3oK9J2ol6N5K0r4N2j6mqL7o5QL1OJ1J5l8L2l9M8
12234D3l5j8J8j2K8l2M5j8LOm8J1RK5l0K9N6q7j9K1L1j4m1Q3n0J8k7l0N3%k3k1
12266b6K3J2K4l0k5O1k6QJ5l0K2n4Q6r6N8j4jkMk4K7nK8j5oM8j9m3K4kj9Kk4L8
12300A9m9L4K0m4qM5j5Oj5K3j2lJ5J%l1J4m2N6KK2j6k0J7j9K4m9MM2j9MJ4%j9
$$ plain form
12334 1 22 41 22 23 -34 -12 -18 -6 -4 -2 -9 -16 -8 -21 61 12 24 41 -6 8 29 25 -22 56 2 -12 17 16 10 13 -13 37 -3 9 14 -15
12370 -15 -14 -11 -17 8 25 -43 20 15 13 17 -9 -29 13 -19 43 -20 -10 24 11 37 -6 9 -36 -31 50 -12 17 -30 -8 -2 -13 18 45 -25
12404 -25 5 14 21 -42 20 -33 26 -40 -12 1 -35 24 -42 0 10 26 -13 -18 -4 12 9 -63 56 1 25 -23 0 6 30 49 29 18
12436 18 -3 17 25 -3 -13 -34 2 -12 -5 28 25 17 -27 -15 -40 -48 7 -47 -8 24 -9 4 -2 -17 -24 19 13 -29 18 14 0 -2 -16 -18 -35
12471 -35 -1 39 2 -13 -7 -20 -7 8 -20 -4 11 25 -25 -8 33 24 3 -40 -1 -15 11 -44 26 18 17 -6 32 0 -8 19 37 25
12503 25 -5 -28 -21 -22 26 -35 -1 -41 -19 14 21 14 58 -14 -1 -20 -1 15 -6 1 -24 -10 -2 28 -22 -5 -61 12 19 -5 -79 21 6
12536 6 -16 16 -29 33 36 74 3 5 -44 19 -51 2 11 -1 14 28 24 -9 14 34 -14 0 -9 -1 -26 -27 -1 -6 20 12 0 6 -21 6 4 30
12572 30 -13 10 19 28 -44 35 -8 15 24 43 20 -26 53 -13 24 26 -2 -13 -11 -24 57 -17 30 -2 19 24 20 29 62 25 33 15 -19 15
$$ packed form
12334AK1J9j9Jn7K2oJ2KKppQj3Q2m9J2J7m7J4K1mm7P8n4j4K9joLk6N0m0J2Nk9
12370a5JLoK5J7o8O3nkMk6k0M2l2O2o3J0L4j3K6m3J5m5NQ1o2K9m7K2Oj1L1K7p0
12404b5L0RPo3O2n3N9o6K8J3l6N9o6M2J0J6l9nJ4J6lp2J19n5K4m8K3OK4J9k0j1
12436A8k1K0Qk8j0k1L6j4PL3lqm4J2k5qN5n4L9L2l3J3oj5pM3om2M7mj4kj4kj7
12471c5L4M0l7j5Oj3J3J5k8J6J5J4n0J7M1rk1m3L9j4K6n5P0qjk3L8l2qK7J8j2
12503B5l0k3PjM8o1L4m0K2L3PpM4p2J3j9J9J6k1Pk5J4QL0n0J7n6P3Pk4p4J00j5
12536Fk2L2m5O2LL8p1Km9O3p0N3Rj2J5J4ml3K3K0m8J4rQk5jK6nK6qj2Ok7K7kK6
12572C0m3K3RRp2P9m3K3RJ9k3m6P9o6L7Kk8j1Kj3Q1p4M7l2K1NmRL3l7Qj8l4L4
$$ plain form
12606 15 -36 -14 -58 18 43 16 24 3 1 -5 7 9 10 8 5 -12 22 11 0 17 -8 21 -33 -2 9 22 25 38 12 17 -15 -15 15 -5 40
12641 40 21 -15 8 -9 32 -48 -1 4 -15 38 29 37 7 27 -48 -4 3 -10 13 -5 22 21 0 65 -5 26 -42 -20 29 -7 3 -13
12673 -13 -2 -21 -13 25 33 -24 -13 4 16 38 11 -30 -15 11 3 36 32 29 -8 -8 0 3 10 -10 57 4 9 17 -19 -28 -3 27 -22 -15 -6 10 -37
12710 -37 -61 -68 28 -2 -18 16 -44 19 -16 -39 -27 15 -51 -25 -21 2 42 -42 -36 -24 -58 -14 -21 -3 -59 -39 8 -47 2 1 39 -47
12742 -47 24 -3 1 -11 -8 25 -27 -10 -11 29 21 -4 30 17 -14 0 14 -29 34 -18 22 45 -23 -24 -8 -30 -23 11 -20 -29 10 -17 -43
12775 -43 -13 37 -1 6 1 25 -22 27 -6 31 -12 23 -8 2 -3 -3 -20 -20 45 -46 -1 -9 8 -10 28 -10 -21 34 -15 -28 15 -12 -4
12808 -4 -20 25 16 5 23 -2 21 12 6 -4 -11 -12 15 -1 -8 7 -5 37 -29 -1 -6 14 -29 -35 17 -53 14 -7 30 -13 -19 8 -10 10 -29
12843 -29 -23 5 -20 10 -3 24 11 -9 -2 53 -33 34 -7 -16 10 -11 29 -10 39 1 -33 6 4 18 -10 38 26 14 -39 -15 28 -26
$$ packed form
12606A5n1K2m4P6K5k7Qk1koJ2KJklj7L4j1j1J7k5K9n4L1J1J3LJ3k6Nl2%L0k0M5
12641D0j9l6K3j7M1q0M7Nj9N3rQl0K0p5M4Pj3K3j8K7jk1O5p0L1o8K2M9l6J0j6
12673a3J1j9QL8Qn7J1J7J2K2k7m1J5K6qL3mll7%QLPk0O7n3NQl6rK5L0m9PRJ6m7
12710c7k4pR6l0j6L4o0O3l5k3J2M2o6K6MK3M0q4OJ2l4M4pJ8n6K0M7n5M9jL8q6
12742d7P1k7Mj2LL3n2J7jM0qk5L4j3l1J4J4m3O3n2M0K3o8jJ6k2PL4l1rL9k7k6
12775d3L0N0l8PnK4m7M9l3L7m3L5l1J0n%j7%O5r1M5qJ7j8L8l8j1N5m9j3M3k7Q
12808dj6M5rj1J8k5K3roj0pjK7j6pJ5j2M2o6K8nK0m3oN2p0O7k1L7m3oK7j8K0l9
12843b9OK8k5L0j3K7j3k0PN5q6O7m1rK6k1M0l9M9l8l4L9kJ4k8M8j2j2n3K4M3n4
$$ plain form
12875 -26 20 -32 -13 22 -2 20 24 -43 -69 31 14 18 17 11 -4 -20 -12 22 14 -21 28 1 -5 30 13 -26 -28 -21 7 11 1 -4 32 40 -7
12910 -7 -21 14 13 23 24 31 5 2 -21 -9 8 29 5 -7 9 19 -9 22 5 15 -8 -16 -3 48 18 11 8 -10 49 1 11 -5 5 -2
12944 -2 -24 8 43 8 49 23 45 26 29 33 -11 22 -6 44 -33 -12 17 7 1 -14 76 -17 19 75 21 20 1 38 10 16 5 -9 16
12977 16 10 69 72 23 32 -58 11 -18 20 -16 -25 -28 18 46 28 10 -77 20 -7 -35 -13 40 79 -4 -16 -23 -15 2 -25 -42 -3 33 -4
13010 -4 50 -15 54 48 6 49 14 14 2 11 -18 -17 39 12 37 49 -19 37 -40 14 -31 38 24 33 20 8 -9 25 27 -7 21 10 33
13043 33 1 -33 1 13 24 -26 12 -1 27 -9 28 19 -6 17 16 2 -1 -21 -13 2 -17 -12 16 24 -13 -16 14 49 22 64 -21 1 -6 -20
13077 -20 10 37 46 -32 -14 -11 17 -5 -4 11 -22 16 -14 0 -8 -30 -2 -10 -39 -35 -19 17 32 -17 33 -12 -18 -24 -36 -23 -16 -35 6 28
13111 28 -9 -25 -1 40 -13 6 -11 -37 -21 -9 -21 56 12 -12 -20 33 -24 -15 -13 83 -28 -19 -10 -6 13 -12 -37 30 -21 16 -11 -18 32
$$ packed form
12875b6M6n2J9L5k4K2Mo7k6J00j7Mjoj5j6QL4ql5M9k7oL5j7l9kPK8Mj0nL6Qm7
12910gj4L5jJ0JPk6lk3J2J7K1k4j2J6J0k8L1j7J0k3qJ3N1l0plj8N9m8J0j6J0p
12944bk2L2L5l5M1k6K2j9LMm4L3k8N0p7K1K9j0oj5R0r3L6N6n4jj9L7k8Oj1j4K5
12977A6oN9Lm9Rr0O9k9L8l6rlM6K8j8j8q7R7k7k8K2N3L9q3j2pQJ7k7j7L9L6l7
13010dN4o5O9om2M3l5%j2Rk9JN6k7K5J2o8N6p7N4m5O9j4Rj3j2j7L4Kl4K8j1K3
13043C3l2l4L4J2J1n0L8j3K8l6L7rk5K3jj4lk0QJ5j9NK8Ql7lL0L5k7M2q5K2pj4
13077b0L0K7Rp8J8LK8k2JJ5l3L8l0J4qk2K8qk9MJ6L6J5m9N0m5ooj2J3Pj9M1K2
13111B8l7j6K4M1n3J9j7k6J6J2j2P7m4k4qN3n7RKR6j11RRMJ9k5k5O7n1L7k7pN0
$$ plain form
13144 32 -52 19 -41 29 -2 -48 25 -1 -42 27 -32 20 -4 32 7 22 10 6 2 6 10 23 -30 -35 -1 -9 -16 6 -56 3 -67 -29 -22 -28
13178 -28 -26 -56 16 -54 -13 -46 -10 -19 3 29 -14 16 -7 7 14 -25 16 -12 -19 -6 34 -15 -26 -53 32 -27 10 -19 15 -11 -4 37
13210 37 -18 -26 0 -4 9 -10 11 33 17 -17 -9 -4 30 27 -60 -14 -6 -29 34 -25 4 1 -13 -23 -2 38 38 32 2 13 -20 3 -30 -31 14
13245 14 -43 -29 -2 -10 -28 -19 -46 -23 -15 12 25 -34 -6 1 33 8 -10 27 26 10 39 -17 -15 -3 47 5 0 -19 -22 47 -6 18 -17 27
13279 27 -19 -1 -12 14 21 37 -9 -47 -29 22 -24 -64 11 26 -11 1 -17 -1 -5 4 -14 16 15 -42 -11 -12 26 -27 -2 -3 -24 -25 -27 -1
13313 -1 3 -38 -32 -34 21 6 7 11 -8 3 73 -7 25 2 -48 39 -52 -5 13 -29 -20 -28 -5 -17 28 24 -54 10 -16 32 -14 -12 9 -26 45
13348 45 2 -9 5 22 -14 2 20 -13 37 -17 -16 40 25 39 1 -4 28 15 30 18 -15 11 12 -27 -11 -1 -22 -35 -22 11 1
13379 1 -22 7 6 9 38 17 -4 26 36 1 32 -5 25 17 -7 16 32 2 -28 -18 -1 22 -31 20 41 -19 47 32 -5 -20 -24 -9
$$ packed form
13144C2q4P1o0P0l1m6P3k6m1O9n9N2k4L6k5J5j2mmMMJ3n3nL4qpK2o2N9p0L8Po
13178b8Kl0P2p0M1l3L6rK2K6m3L0k3J4Pl9M1k8pJ3M0m9j1k7Q5n9L7k9L4k6PM1
13210C7n5qK6mJ3j9K1K2j6l4QNL4lq7M6Qk3O3n9K9lj4j0K1M0%ol0J1l3K3l3jM5
13245A4n7J4K7qj8Rk7K3QK7J3n9K8PL2k5j8L7jj6K9n6KJ2N0m2nj9lO9n3K4l5M4
13279B7m6J8j1K6PJ6m6l8J8N1m6m0P5J5l7J2j8J6mRj8L0jn7L1jL8n3K5jk1jkK6
13313aMm1OkN5j5JMj9J1P0q0L2k3n0Q7r1M7J8m2RqK3j2M5mp8O4k6M8m6KK1l5P1
13348D5m3j1J4J7l6J6J8l3N0n4JN6j5J4l8nL2j3J5j2l3K6Jl9J6J0k1j3J3L3j0
13379Ak3K9jLK9k1k1L0J0l5L1l7L0qk4K3J6l0l0J0J7K3n3N1K1o0O6j5l7j5mJ5
$$ plain form
13411 -9 13 -43 -33 -10 -17 1 1 -8 -28 0 -2 -25 -4 6 -17 29 36 -29 4 -13 -18 39 34 13 8 26 -30 -11 11 13 -58 -24 1 -27 27
13446 27 -8 -34 11 -1 -38 -52 23 -46 -19 44 -20 27 -21 -16 1 -2 11 -19 14 4 -21 2 -13 -36 -30 -49 -10 -5 17 -35 -21 6
13478 6 -27 -37 33 -1 -13 20 -4 -21 -10 28 7 -9 -29 -24 -64 20 -15 6 -32 20 -11 23 -4 13 47 -2 24 8 -5 20 21
13509 21 22 -18 5 5 -3 23 -7 30 -17 -6 -12 -20 31 -20 9 -16 10 -3 -18 10 -24 21 2 16 0 -5 4 1 3 -11 9 -1 -28 -1
13543 -1 -13 14 18 -29 52 -5 -6 23 -9 47 18 -25 -6 -3 -4 -11 -5 -9 -9 17 -28 6 -5 -32 14 -13 -4 -17 -27 18 18 11 -2 -22 2 49
13579 49 7 -2 29 0 26 -10 -43 19 28 1 13 32 -42 -13 1 4 14 -14 4 -10 -6 -21 10 34 -7 -33 4 -62 14 13 12 -43 -37
13612 -37 -17 13 -6 47 25 29 -6 39 -19 8 76 41 -1 8 0 11 2 -54 -21 35 4 -7 26 -7 -32 -34 11 12 -16 -23 21 14 -17 22
13646 22 16 -16 13 26 27 36 -9 12 1 -21 -1 46 25 2 -12 -31 30 -9 -14 31 -8 -9 -29 -9 -35 21 38 11 36 21 42 51 1
$$ packed form
13411iK2n6J0K3pJ8%rk0K8kk3K1J0k3M6Po5L3j7nN7nk1nJ8n6J9K2Kp1L4K5k8N4
13446B7l5k6M5j2l7j4P5o9K7O3o4M7m8NJ7lJ3l0L3j0k5K3j5k3Oj9L9NK2n2J4K7
13478Fl3j0P0l4j2L3k4j7J1L8k1j6k0Nm0Q4l5K1l8N2l1L4k7J7L4m9K6j6j3K5J
13509B1Jm0K3%qK6l0L7m7J1oqN1n1K9k5K6j3j5K8l4M5j9J4j6nRlKj4K0j0k7K7
13543aj2K7Mm7Q1n7jK9l2N6k9m3J9LjpOm%K6m5L4j1k7M6k7Rj3j0M5%pj3k0K4M7
13579D9m2rL1k9K6l6l3O2Rk7J2J9p4K9J4LJ0k8J8j4Mj5L1K4m1k6L7o6P6jjn5O
13612c7K0L0j9N3k2Ml5M5n8K7O8l5m2RqJ1rn6L3N6l1j1L3l3k5kM5Jk8pM4pl1L9
13646B2ol2K9J3JRm5K1j1k2K0M7k1k3j4j9O1l9nM5l9jk0K0k6N6J7k7K5j5K1Rn0
$$ plain form
13679 1 30 -44 13 18 -8 -1 15 7 -28 -11 -20 1 -6 18 8 26 0 -1 -12 -29 -12 11 -1 4 9 -15 -12 13 37 27 44 4 0 10 5 -16
13715 -16 3 6 -20 48 18 57 -35 35 39 0 7 28 71 44 -15 -35 3 9 65 38 41 -2 39 2 15 -10 -7 6 5 12 28 25 0 79
13749 79 -23 -18 61 15 41 17 33 -2 4 -5 -5 11 25 -1 49 19 20 -5 -5 4 0 44 30 -19 26 36 -5 -5 21 16 89 4 -8 33
13783 33 6 -34 26 5 22 10 -1 54 18 47 14 25 -7 6 30 7 -19 20 41 2 27 7 21 37 11 -9 9 -15 17 45
13813 45 67 2 5 25 21 35 21 27 28 1 19 7 -21 61 -45 -17 24 -10 26 -24 23 1 17 -40 -16 24 -13 -45 -11 3 14
13844 14 16 -10 15 -18 -41 -6 -4 -6 -28 29 -1 18 -21 -20 -45 38 -8 11 -18 16 -39 2 -15 -28 -20 -9 -11 19 -15 -2 41 10 8
13877 8 -13 -6 36 53 -44 53 -4 12 50 29 -2 -2 -17 6 -11 34 5 0 7 -9 -18 -19 9 -9 24 -70 24 -14 1 3 18 -16 -35 -7
13911 -7 0 11 -23 -26 -8 -9 2 15 13 13 -12 -2 -13 5 5 2 -16 3 -60 12 -92 11 21 0 21 -53 36 -25 0 -1 -25 2 -28
$$ packed form
13679AK9p4N7Nk6PJ6ql5J7rK1pK4j0J8k6jj1j7J7K3j2NNk4LK5K4j0J7m0mJ0nk1
13715a6J9Lk6O8l0L9r2P0Ml9PK1M3k7n9k0L8ON6k7Lm3M1l7J3k5LJ3jPJ6lk5P9
13749G9j02NP9m6K6k4J6l5Or%J6J4k6N0l0Jk5%RmM4j4m9M5J0m1%K6nP3q5j2M1
13783C3k7m0O0k1J7j2j1N5l6K9l3J1l2J3K4k3k6L9K1l9K5k0J4J6k6k0J8k4L2K8
13813D5K2o5LK0mJ4j4OJk7J8j2k8Q2j06K8M1l4L6n0M7k2J6n7K4M0l7l2L4J4J1
13844A4Kk6K5l3k3L5Kkk2N7l0J9l9Jk5Q3m6J9k9L4n5M1j7j3QJ1kL0l4J3M3l1k
13877Hk1PM2J7r7R7n7J6L8k1l1%j5K3j7M5k9nPj6rjK8j8L3r4R4l8J5KJ5l4j9K8
13911gPJ1l4lJ8jJ1J3k%k5J0j1J8%lj8J9o3P2j04J03J0k1K1p4Q9o1K5jk4K7l0
$$ plain form
13944 -28 -32 -16 -21 4 -30 -15 4 10 20 10 -24 1 11 4 15 9 24 -35 16 40 -11 14 -16 19 -1 -28 -8 -20 20 -79 11 -15
13976 -15 -25 -45 -3 -17 -14 -38 32 -18 -24 -14 -17 -8 29 -18 -53 46 -6 12 -25 16 -7 -50 -17 24 -8 20 0 -33 -11 -28 -6 44
14008 44 -27 -61 -6 15 -6 -28 1 -10 -23 -33 10 25 -4 2 45 -9 -2 -27 16 11 -25 9 26 -36 -2 -7 -22 -49 36 -21 22 44
14040 44 0 4 -58 15 1 -7 4 14 12 31 -11 -10 28 12 -5 -16 -12 19 -14 11 -6 -16 1 8 14 -26 -26 2 -33 29 21 15 1 11 15
14075 15 8 19 35 41 9 39 14 50 -14 -8 14 -12 4 30 11 -23 12 24 13 -2 14 -24 49 -2 13 23 5 5 26 3 -44 -39
14107 -39 -55 -28 3 -1 23 12 41 -19 39 18 -48 -21 -16 17 -35 36 10 3 25 -40 43 -27 16 11 12 8 -14 41 9 -7 5 15 37
14140 37 -47 46 -32 7 -1 11 49 39 15 6 10 32 11 20 14 20 -8 18 -4 38 -33 2 11 28 29 -17 16 -10 37 51 -39 28 31 43
14174 43 39 12 54 -28 34 -6 -19 6 25 33 -55 2 16 18 18 -19 5 -12 25 -37 43 -4 44 2 17 29 -23 4 -15 29 30 21 -24
$$ packed form
13944b8mJ6nK5l4J5J9OJ0j0l4K5J0pJ1oJ5n9N1K4n1K5l0L5k0k7K0j2M0r9R0k6
13976a5j0k0M2j4Lk4P0n0oJ0lRL7m7l5R9n2J8l7M1k3m3L3M1l2K8k0l3K2j7K2N0
14008D4p1l4N5K1k1k2K9j1j3j0M3J5k9OM3n4Pk5M3nl6L4J7o2L4nj5k7Q5n7M3K2
14040D4m4Mo2P3j4qJ1J0kJ9m2JL8j6j7j1ML1l3K5j7j0J7POm0%K8l5O2qoj4J0M
14075A5pJ1J6Ol2L0k5L6o4OK2k6J6K6j9l4L5J2j1j5J6l8P3n1J5J0j8%K1k3m7N
14107c9j6K7L1mK4j1K9o0N8k1o6K7NL3n2P1k6pK2o5Q3p0M3nJmk2N5l2j6J2J0K2
14140C7q4R3p8L9qJ2L8j0k4rMK2k1RoOk8K6k2M2p1L5RJ7Jm6L3k6M7J4r0O7LJ2
14174D3mk7M2q2O2m0j3K5J9Qq8N7J4K%l7K4j7L7o2Q0m7M8m2J5J2n2K7j9M4Jrm5
$$ plain form
14207 -24 22 -3 20 16 22 12 10 -8 8 16 -3 -12 6 13 9 -28 3 -8 -41 7 33 -3 30 21 29 1 3 -1 18 17 -28 -49 10 1 5 48 -20
14244 -20 33 16 40 21 30 -37 27 36 14 10 5 5 2 10 43 -45 7 23 2 14 10 -5 -14 4 41 -32 -11 -8 -26 8 1 -23 11 8 -1 -4 8
14281 8 5 18 -16 15 -23 -20 13 17 -40 -8 -1 -7 -27 -31 -30 16 -46 20 -6 5 33 -19 31 30 23 33 35 -43 -3 18 -32 30 -18 -18 11 -19
14317 -19 -5 10 13 1 3 28 -1 1 -8 0 48 -19 3 3 -13 9 47 2 -11 -5 24 50 -29 17 -6 1 18 36 -11 24 49 -21 -11 -7
14351 -7 21 -7 18 5 -1 49 44 5 -1 10 16 31 -10 3 7 7 3 -44 30 28 20 23 -17 -8 -36 9 -16 -7 -19 15 -8 -24 -10 50 -19 -29
14387 -29 21 -32 -16 36 34 17 40 -36 11 0 1 -2 -35 10 22 -11 -9 2 7 -7 -18 15 1 3 38 -38 23 27 -2 -9 -38 6 13 18 21
14422 21 2 8 -46 6 -18 18 -7 -23 -3 3 1 -15 7 1 5 -16 29 22 -40 7 37 -5 -35 0 10 -30 -9 34 -22 -4 36 18 18
14455 18 8 9 3 40 -2 -13 -24 -36 29 -10 -12 6 12 35 -7 20 -20 5 23 -8 40 -1 22 -5 -7 51 12 -17 -23 18 -4 -19 -30
$$ packed form
14207b4M6k5K3mOj0kj8J6Qj9rJ8Pml7L1j1l3M8K6l6L3rQk8KmJ9jm5k1N9rMM3o8
14244b0N3j7K4j9Ro7O4Rk2mn%lQL3q8N2J6k1J2mj5rJ8L7p3K1Lj8L4pk4L4lrlJ2
14281HlJ3l4L1l8LL3Mn7L2Pok0mJM6o2O6k6J1K8n2N0jpJ0Kp8M0K1n0O2m8%K9l0
14317a9J4J5Lj2KK5k9KrQM8o7K2%j6K2L8m5j3OK9K6p9M6k3PJ7J8m7L5K5p0J0M
14351gK8k8K5j3oN0nl9oJ1OJ5m1J3M%mm7P4kqLm0Rk8M5k5Rj2L4k3j6J4O0o9j0
14387b9N0n3J6N2kj7K3p6M7j1Jll3M5J2l3KJ1Nj4j1L3j4KL5p6O1Mk9pk9M4PNL
14422B1j9On4N2k4L6k5j6K0Okj6K2oMk1M5po2M7L0m2l0L5J0m0K1M3n6J8M0j8%
14455A8j0JoL7m2j1j1j2O5l9kJ8OK3m2K7m0K5J8l1M8m1K3k7kN8l9k9oM1k2j5j1
$$ plain form
14488 -30 -1 43 37 50 12 -3 5 2 22 19 7 6 53 -26 10 -59 1 4 1 34 3 -13 -11 -6 23 6 14 24 15 35 -21 -13 15 40 20 -10
14524 -10 -12 -17 -29 40 16 20 40 41 -4 2 0 35 4 -6 26 7 31 -14 -35 26 20 10 28 18 -7 24 23 5 36 16 22 -29 -5 46
14558 46 44 -23 -8 -21 23 3 15 33 -1 3 51 16 9 7 8 -15 -7 16 2 -14 17 -11 34 13 44 6 -17 26 0 67 -11 -30 -8
14591 -8 31 12 -7 12 -18 41 0 1 5 -10 18 24 7 44 -13 12 4 -7 -47 -25 9 -13 17 -13 20 -8 33 12 26 10 -49 -19
14623 -19 10 -30 -2 -14 23 -34 1 11 -14 -1 5 -29 20 41 2 47 5 10 31 2 -61 -54 -41 -13 21 33 -5 6 20 17 -12 1
14655 1 -1 -13 6 20 -53 3 -30 -19 -25 17 -23 -48 -3 7 3 29 14 2 21 12 31 18 -1 -36 -19 -12 -22 -15 11 -4 -54 -23 -60
14688 -60 11 -9 10 3 8 -1 -23 19 -28 4 -36 27 36 12 37 -59 4 -3 -37 44 16 -51 -21 2 28 35 45 -26 24 15 17 46 20 2
14722 2 21 13 32 -2 -13 0 -12 23 -33 1 2 -25 -21 -26 27 16 -36 -5 -39 -2 0 28 18 -26 6 17 -25 5 -16 47 7 -20 -20
$$ packed form
14488c0K9M4oJ3l8j5QlK0lj2jM7p9L6o9O0LlL3l1j6KNK9j7QJ0rK0n6QK8K5k0l0
14524a0knj2O9k4MK0Jm5OkL5l1j0L2j9K4m5k1O1oj0J8j0k5L1jj8L1k0On1K4N1
14558D6ko7J5j3M4k0J2J8l4MM8l5pkJk3QK3j4j6L1k8M5k1L1l8k3M3k6O7p8j9K2
14591hL9j9j9J9l0N9m1JMj5K8Oj7L7n7K5qj1m0K2L4k2L0l0L3k8M1k1J4j6n9L0
14623a9K9m0K8j2L7n7L5J0k5J3Ol4M9K1l9M5m2NK1k9o3PJ3K8L4J2l8J1J4lk9J3
14655Akj2J9J4p3N6l3J1oM2m0k5M5J0mK6j5j2J9rJ9j3j9l5J7Pj0PK6j5n0L1l7
14688f0P1k0J9pNrk2M2m7L2m0O3Rk4K5r6O3pl4Q1k8o7L0K3K6PJ0p1N0rKK9k6j8
14722BJ9qJ9l4j1J3j2L5n6L4Jk7MnN3j1n2L1l4L7KK8j0m4L2J1m2L0k1O3m0k7%
$$ plain form
14755 -20 -19 -2 10 -21 20 -51 -23 5 6 11 -17 5 5 37 36 10 -18 22 -8 7 -19 -6 26 51 -44 -14 -36 8 -2 31 -7 37
14787 37 -9 -36 -3 1 4 -4 17 -5 46 14 69 -24 -5 17 -14 12 0 11 18 55 15 39 -14 4 48 33 11 42 69 -6 -3 41
14819 41 27 -8 10 -5 68 20 6 5 -30 -9 35 7 -32 2 24 14 10 -12 6 -6 31 17 24 -13 -3 53 41 -1 35 18 17 38
14851 38 20 24 19 66 11 16 -29 20 -27 -16 13 59 1 19 -21 -7 1 16 23 -17 32 24 3 13 14 48 -10 -3 10 39 22 28 -24 55
14885 55 -25 -5 17 1 11 -47 -24 -8 49 31 34 52 0 -22 0 58 8 21 30 64 7 13 -17 49 30 19 -11 25 -13 0 48
14916 48 35 18 34 3 58 -11 16 -11 -10 16 23 16 22 22 -10 -5 -14 24 30 4 -3 40 3 24 -5 19 37 23 20 15 4 2 7 51 -4 16
14952 16 23 2 23 21 23 0 19 13 25 42 2 -17 -22 9 23 42 -11 1 43 -22 23 -6 43 19 -16 20 5 -1 25 0 41 25 36
14985 36 26 10 13 18 6 11 8 11 67 12 10 -3 3 21 -23 58 7 -20 8 18 38 58 -6 -40 -3 -16 -16 50 54 -14 1 46 40 31 24 17
$$ packed form
14755b0JJ7J2l1M1p1K8K8JNk8K2%L2jk6k8M0l0J5k6J3L2K5r5L0k2M4j0L3l8M4
14787C7m6k7L3MLqK1k2N1l2N5r3J9K2l1K6j2J1PL7m0K4n3J8M4j5k2L1K7p5LM4
14819D1j4l5J8j5P3m8j4jl5K1M4k8l9L4K2j0mk2J8j2L7j4Pl7J0N6j2m2L6j7jK1
14851C8j8MnM7n5Nm5M9m7J1K9M6n8J8m0J4QJ5Pm0M9qk1J0JL4n8PJ3K9j7On2P9
14885E5q0K0K2j6J0n8K3J6N7j8LJ8n2k2K2N8n0J3RL4n7Ol0O6j9j1l0L6l8J3M8
14916D8j3j7J6l1N5o9K7k7JK6PpO%l2NrL8Ok6pM3l7K1k9K4J8j4lnj1kNM4n5K0
14952A6Pk1K1kKk3J9oJ2J7m0j9nL1J4J9n3J2M2o5M5k9M9k4l5L6j5oK6k5M1j6J1
14985C6j0j6LNj2NlLN6n5kj3OJ8m4Q1n1k7K8J0K0K0o4l4L7j3%O6Mo8J5M5orpp
$$ plain form
15021 17 36 23 7 34 25 19 -6 -13 -16 -19 41 -51 1 43 8 35 -26 -9 34 22 -39 -34 -3 0 0 -15 20 -18 -15 -5 2 -13 10 -24 8
15056 8 -9 -13 -13 41 -6 8 -28 3 -7 4 4 -31 23 -4 -9 0 -49 -7 38 16 -7 -15 -23 -10 34 40 -14 -22 33 12 20 -32 -27 -10 -23 -7
15092 -7 9 -26 -50 -8 16 -22 -26 1 37 -14 -12 9 44 9 -25 17 -10 34 42 18 -5 29 -21 -16 -56 25 21 35 25 4 14 0 19
15125 19 -15 -9 -38 21 7 10 -12 39 22 -16 6 9 -16 -30 -9 6 11 16 70 30 5 -40 -38 15 9 5 44 29 1 14 15 -47 -3 -5 -11
15160 -11 -8 17 35 -18 9 35 30 13 -39 -6 -5 28 12 -17 58 -16 22 -1 -38 35 -2 4 -2 34 -40 15 13 -11 -12 -4 -8 10 5 -32 35
15195 35 -17 5 -32 -14 5 3 28 -25 -20 16 35 -7 -11 8 -11 15 -48 22 21 19 11 25 -10 6 6 -11 1 -4 11 44 10 3 43 -21
15229 -21 -3 13 31 -49 -23 13 -10 -13 -1 -21 -3 -38 43 -10 1 41 40 -4 -11 44 -5 24 46 -20 -23 5 -33 50 0 -6 6 42
15261 42 64 -10 8 52 48 47 -8 8 11 32 46 1 9 -8 21 20 -31 -14 -17 16 32 48 23 43 8 6 8 29 11 41 2 -19 -34 9
$$ packed form
15021A7J9j3j6K7rok5pllO0r2N2M2l5K7o1J7M3j2o1NL1L%j5L5l8LJ0Pj5K3l4L2
15056Hj7m%N4m7J4l6L1j0J1%l5N4k7nRm9M2M5k2k3qqJ3M4On4qN5k1Qn2NJ7j3J6
15092gJ6l5k4M2K4l8mK7L6n1KK1L5l5l4M2k7M4Qk4k3L4n0Nm0Q1mJ4j0k1J0j4J9
15125A9l4Ok9N9j4Lk2N1j7l8K2Lk5j4K1J5NNN4m0k5m5KN3omL9j5k8J3Jo2M4ko
15160a1LK5J8n3K7K6nj7n2L3JL3j6k9P5p4L8k3l7P3l7OoL6p4N5kk4jQmJ8nl7O7
15195C5n2K2l7J8J9kK5n3NL6J9m2mJ9j9K6o3P0jkqJ4l5J6%j7J2nJ5L3l4pM0o4
15229b1J8J6J8q0K6L6k3lJ2k0J8l5Q1n3J1M0jm4pN5m9K9K2o6lK8l8Q3n0oJ2L6
15261D2K2p4J8M4mjn5J6LK1J4m5Qj7K9jn1J7lL3J6J6k5K0l5kKK1j8L0l9k1j5M3
$$ plain form
15295 9 21 -28 14 -9 -6 35 21 14 -1 13 26 -18 20 41 32 6 -42 -63 33 -1 12 -1 0 -19 -39 24 -4 -33 17 -39 17 8 -5
15328 -5 -24 6 -14 11 -27 20 -28 -7 -19 -24 3 31 -21 28 -26 -27 6 26 21 30 30 18 11 41 -34 7 -5 -3 -23 -21 36 29 -19 -31 -24
15363 -24 -20 -10 -43 10 -22 -37 -34 -33 -6 32 -20 50 17 22 10 -56 -8 -14 -41 24 -5 -21 -21 -30 -3 26 39 -17 24 -33 27 -7 -50
15396 -50 14 -31 -20 -37 -16 0 -5 25 -29 20 -1 -43 -21 17 -49 6 31 13 28 -6 -21 38 4 4 -3 12 9 -27 -49 -24 -5 -36
15428 -36 7 20 1 -51 -57 -1 11 -3 -20 -29 -12 4 -37 -37 -43 -18 -6 12 -11 -7 13 9 -8 -10 18 5 -14 49 -13 -11 -8 39 -19 -19 6
15463 6 -22 -11 -23 23 -11 4 4 -2 3 -24 12 -36 -11 1 -7 12 -47 -1 11 18 -4 -21 -10 -6 -21 -7 17 -13 -21 15 6 -28 51 27
15497 27 -22 -24 -21 -11 -2 1 -6 4 -18 -10 -33 -9 -35 17 -45 -19 36 -37 -22 -44 20 -43 26 -8 25 -3 -14 -12 20 19 25 -24 -7 0 -23
15532 -23 10 -13 -38 -21 -2 -27 25 6 21 16 -15 -6 -6 -14 14 -4 -31 32 -20 39 -25 -20 19 12 -3 -12 12 -8 -12 -32 17 44 1 26
$$ packed form
15295IJ2m9M2k3LM1j4pj5J4J3m4L8K1rk6m8k1R6l4J3j3Jj9k0O3k8k9N0n6N6rj3
15328ej9L0k0K5l8M7m8K1j2nK7K8n2M9n4jL3K0nR%j2pL0p5M1j2Kk0KN7pm8j2P
15363b4MJ0l3N3l2j5LJK7L8n2P0l3Nj2o6M8ok7O5k9j6%rK7K9J3n6M1n7O0l4m3
15396e0O4m5J1j7K1J6nL0n4M9k1m2K2L8o6N5K5j8J5l4j5N9l4%pJ5ll6k2K5J9l1
15428c6M3J3j9n2oN6J2j4j7rJ7J6m1%oK5J2J8k3MK0mj7kK8j3j9O3o2KLM7n8%K5
15463Fk8J1j2M6l4J5%oNk7L6m8K5J2qJ9n9M6J2Pk2j7J1Mj5J4K4l0qL6rl4P9k4
15497B7m9kLJ0RLpJ0k2Qk3K4k6N2o2K6N5p3J5k2O4o3O9l4L3k8j1KL2jOm9J7Pk3
15532b3L3k3k5J7J9k5N2j9J5nl1R%qK8j8k7O3n2N9o4NL9pj5rK4k0mk0M9K7m3K5
$$ plain form
15566 26 -3 -6 -11 25 43 30 24 -28 32 -29 22 -23 34 1 9 5 -15 3 40 -13 -3 6 12 -20 19 42 14 -13 29 36 -29 14 -39 50
15600 50 -6 8 1 23 42 28 22 14 -13 0 12 16 52 22 58 -3 -20 -4 -7 2 19 23 22 -19 34 21 36 3 12 -5 16 -17 22 45
15634 45 49 33 26 90 32 43 40 -6 18 39 -5 -17 8 26 21 14 18 29 -6 29 61 -14 -4 -24 -14 -4 21 -14 36 0 31 -32 -12
15667 -12 26 48 11 6 -24 -47 -33 -42 6 18 40 -7 25 30 -10 1 8 29 27 22 28 30 46 -1 36 -1 30 2 -27 -11 -62 -2 -23 34
15701 34 -2 9 14 4 4 -48 47 13 -36 13 -19 36 -10 -30 0 -33 -8 -29 -9 36 16 -10 15 9 15 -21 1 31 -13 -38 30 2
15733 2 -24 -34 -15 -5 29 33 35 8 43 36 -37 21 -2 3 -16 31 -11 20 -6 15 -8 -23 7 16 37 34 3 -6 -17 -31 6 19 -31 -40
15767 -40 1 -51 -6 12 16 -46 8 11 -19 28 -19 28 -36 39 22 0 10 -53 8 -16 -34 -17 -11 9 -13 -11 28 25 -48 -40 -10 12 16
15800 16 -12 22 49 -36 -10 33 18 6 -11 -5 -6 21 -8 -20 -5 9 24 4 26 -36 13 -2 -38 -20 20 11 18 -31 27 -21 -5 -20
$$ packed form
15566B6k9lnL6J8j3on2O0o1N1m5N7l3Qmk0J8L7n3J0ROl2L9K3k8k7M2Po5M3n3Q9
15600E0n6J4pK2J9j4oqk7J3J2ML6l0L6o1j7J6lRJ7Mjm1N3j3J5l3Rj7K1l3L9K3
15634D5Mj6pO4n8J1lm6K4K1m4j2K5J8npMJ1l5L5L2p5J0k0J0J0K5l5N0l6L1o3K0
15667a2L8K2l7nl0k3J4rM8J2K2m7L2Nm0J1PK1knOKJ6m7L7l7L1k8k9J6n1O0k1N7
15701C4l6J1Nj0%n2R5l4m9M9l2N5m6k0L0l3K5k1K0M5k0k6K5oOl6K2L0m4k5O8k8
15733Bk6j0J9J0L4MKk7L5pp3N8k3Nj9M7m2L1k6K1k3j5L0RK1ll1rj1j4L7J3n0r
15767d0M1n2M5J8Mo2N4Ll0M7m7M7o4P5j7k2J0o3O1k4j8J7OK0k2KL9lp3QL0K2M
15800A6k8L4K7q5K6M3j5j2j7OjK7k9j2J5J4J5k0K2o2M9j5l6J8M0rPm9N8m8J6j5
$$ plain form
15832 -20 -29 -19 1 5 29 21 3 -23 -32 -23 29 -58 21 -35 15 -40 -40 -28 11 -29 37 -41 -10 -3 -11 5 -31 7 5 15 -41 34 5 -22
15866 -22 -14 -18 -4 -36 -7 -26 -2 -9 -2 10 -11 -40 -26 -3 -13 16 -3 -22 -11 1 -5 10 31 0 -51 -55 16 19 -22 7 -23 -9 5
15899 5 -2 2 -37 -12 -17 -40 -26 -34 -33 -7 40 36 -25 -30 1 -4 -6 13 -27 -29 -46 29 -2 37 -11 9 -31 6 -32 -11 65 -3 -1 -8 11 -19
15935 -19 1 -25 -58 3 -44 -47 -45 13 12 -16 -8 4 32 -24 27 -7 -20 -4 23 42 19 -17 2 1 20 21 47 -43 -18 68 -39 56
15967 56 71 15 10 31 -21 -16 -34 3 31 -25 22 19 -34 38 28 12 -8 1 -5 44 -18 31 12 1 -24 12 -13 -37 -16 -3 19 28 -19
16000 -19 22 56 46 -3 -7 -22 10 -8 10 26 -34 34 -22 11 29 46 12 0 18 7 42 13 -4 12 -14 -2 6 31 -45 -37 -36 -17
$$ packed form
15832b0rJ0K0MK4qj8k6rRN2q7P9n6N0n5%J2L9m0O6p8L1PqJ6l6L8kJ0n6P5k9k7
15866b2QmJ4l2K9j9K4pPJ2k1k9J4K3j0K9j9j9J1J2oJ5K1l1n1mP1Lm1K9l0J4J4
15899EpMl9K5nk3J4qJK6M7mo1nL1nkJ9m0kj7P5l1L9m8K0m0L7l8K1P6o8KpJ9l0
15935a9K0k6l3O1m7lKN8jk8QJ2K8n6N1l4j3J6K7J9k3l6J9jJ9JK6r0K5Q6j07R5
15967E6J5n6nK1n2Nj8L7K8n6M7ln3P2j0j6k0RoM9o2M9j9j1k5L6k5k4K1J3K2Rm7
16000a9M1L4j0m9mj5L2j8J8J6o0O8n6L3J8J7l4j2J8j1L5k9j7J6k6J2QK5p6QJJ9
$$ [...]
16383G
##END NTUPLES=NMR FID
##END=
