##TITLE=31P_DE-80H_X3
 64 sc D2O
 26.2.2025
##JCAMPDX= 6.0         $$ Bruker NMR JCAMP-DX V2.0
##DATA TYPE= NMR FID
##DATA CLASS= NTUPLES
##ORIGIN= UXNMR, Bruker Analytische Messtechnik GmbH
##OWNER= root
$$ XWIN-NMR		Version 3.5
$$ Mon Feb  9 11:29:51 2026 Russian Standard Time (UT+4h)  Yarkov@DPX200
##.OBSERVE FREQUENCY= 81.013821
##.OBSERVE NUCLEUS= ^31P
##.DELAY= (6, 6)
##.ACQUISITION MODE= SIMULTANEOUS
##.ACQUISITION SCHEME= undefined
##.AVERAGES= 64
##.DIGITISER RES= 17
##SPECTROMETER/DATA SYSTEM= spect
##.PULSE SEQUENCE= zgpg30
##.SOLVENT NAME= CDCl3
##.SHIFT REFERENCE= (INTERNAL, CDCl3, 0, 243.863)
##AUDIT TRAIL= $$ (NUMBER, WHEN, WHO, WHERE, WHAT)
$$ ##TITLE= Audit trail, XWIN-NMR		Version 3.5
$$ ##JCAMPDX= 5.01
$$ ##ORIGIN= Bruker BioSpin GmbH
$$ ##OWNER= Yarkov
$$ C:/Bruker/XWIN-NMR/data/yarkov2/nmr/P31/2/audita.txt
$$ ##AUDIT TRAIL=  $$ (NUMBER, WHEN, WHO, WHERE, WHAT)
(   1,<2026-02-09 11:28:45.92 +0400>,<Yarkov>,<DPX200>,
      <created by zg, POWCHK disabled, PULCHK disabled
       configuration hash MD5:
       00 E9 B6 7A A2 85 ED C7 34 08 36 98 17 FE 4E 26
       data hash MD5: 32K
       59 7A 75 42 13 46 A1 4A B2 2D 2F B8 E9 4B 84 C0>)
$$ ##END=
$$ 
$$ hash MD5
$$ F4 12 59 E3 3C F3 DF B9 2F 67 67 94 74 82 69 7C
##$RELAX= 
##$RELAX= 
##$RELAX= 
##$RELAX= 
##$RELAX= 
##$RELAX= 
##$RELAX= 
##$RELAX= 
$$ Bruker specific parameters
$$ --------------------------
##$DU= <C:/Bruker/XWIN-NMR>
##$EXPNO= 2
##$NAME= <P31>
##$PROCNO= 1
##$TYPE= <nmr>
##$USER= <yarkov2>
##$AMP= (0..31)
100 100 100 100 100 100 100 100 100 100 100 100 100 100 100 100 100 100 
100 100 100 100 100 100 100 100 100 100 100 100 100 100 
##$AQSEQ= 0
##$AQ_mod= 1
##$AUNM= <au_zg>
##$AUTOPOS= <>
##$BF1= 81.014009
##$BF2= 200.13
##$BF3= 200.13
##$BF4= 200.13
##$BF5= 200.13
##$BF6= 200.13
##$BF7= 200.13
##$BF8= 200.13
##$BYTORDA= 1
##$CFDGTYP= 0
##$CFRGTYP= 5
##$CHEMSTR= <none>
##$CNST= (0..31)
1 1 145 1 1 1 1 1 1 1 1 1 1 1 1 1 1 1 1 1 1 1 1 1 1 1 1 1 1 1 1 1 
##$CPDPRG= <waltz16>
##$CPDPRG1= <>
##$CPDPRG2= <waltz16>
##$CPDPRG3= <>
##$CPDPRG4= <mlev>
##$CPDPRG5= <mlev>
##$CPDPRG6= <mlev>
##$CPDPRG7= <mlev>
##$CPDPRG8= <mlev>
##$CPDPRGB= <>
##$CPDPRGT= <>
##$D= (0..31)
0 1 0 0 0 0 0 0 0 0.06 0 0.03 2e-05 3e-06 0 0 0.0002 0 0 0 0 0 0 0 0 0 
0 0 0 0 0 0 
##$DATE= 1770622125
##$DBL= (0..7)
120 120 120 11 120 120 24 19 
##$DBP= (0..7)
150 150 150 150 150 150 150 150 
##$DBP07= 0
##$DBPNAM0= <>
##$DBPNAM1= <>
##$DBPNAM2= <>
##$DBPNAM3= <>
##$DBPNAM4= <>
##$DBPNAM5= <>
##$DBPNAM6= <>
##$DBPNAM7= <>
##$DBPOAL= (0..7)
0.5 0.5 0.5 0.5 0.5 0.5 0.5 0.5 
##$DBPOFFS= (0..7)
0 0 0 0 0 0 0 0 
##$DE= 6
##$DECBNUC= <off>
##$DECIM= 4
##$DECNUC= <off>
##$DECSTAT= 4
##$DIGMOD= 1
##$DIGTYP= 9
##$DL= (0..7)
0 0 52 120 120 21 21 25 
##$DP= (0..7)
150 150 150 150 150 150 150 150 
##$DP07= 0
##$DPNAME0= <>
##$DPNAME1= <>
##$DPNAME2= <>
##$DPNAME3= <>
##$DPNAME4= <>
##$DPNAME5= <>
##$DPNAME6= <>
##$DPNAME7= <>
##$DPOAL= (0..7)
0.5 0.5 0.5 0.5 0.5 0.5 0.5 0.5 
##$DPOFFS= (0..7)
0 0 0 0 0 0 0 0 
$$ [...]
##$SUBNAM1= <"">
##$SUBNAM2= <"">
##$SUBNAM3= <"">
##$SUBNAM4= <"">
##$SUBNAM5= <"">
##$SUBNAM6= <"">
##$SUBNAM7= <"">
##$SUBNAM8= <"">
##$SUBNAM9= <"">
##$SW= 400.765351723535
##$SWIBOX= (0..15)
0 1 3 0 0 0 0 0 0 0 0 0 0 0 0 0 
##$SW_h= 32467.5324675325
##$TD= 32768
##$TD0= 1
##$TE= 0
##$TE2= 300
##$TE3= 300
##$TEG= 300
##$TL= (0..7)
0 120 53 12 22 120 120 120 
##$TP= (0..7)
150 150 150 150 150 150 150 150 
##$TP07= 0
##$TPNAME0= <>
##$TPNAME1= <>
##$TPNAME2= <>
##$TPNAME3= <>
##$TPNAME4= <>
##$TPNAME5= <>
##$TPNAME6= <>
##$TPNAME7= <>
##$TPOAL= (0..7)
0.5 0.5 0.5 0.5 0.5 0.5 0.5 0.5 
##$TPOFFS= (0..7)
0 0 0 0 0 0 0 0 
##$TUNHIN= 0
##$TUNHOUT= 0
##$TUNXOUT= 0
##$USERA1= <user>
##$USERA2= <user>
##$USERA3= <user>
##$USERA4= <user>
##$USERA5= <user>
##$V9= 5
##$VALIST= <valist>
##$VCLIST= <CCCCCCCCCCCCCCC>
##$VD= 0
##$VDLIST= <DDDDDDDDDDDDDDD>
##$VPLIST= <PPPPPPPPPPPPPPP>
##$VTLIST= <TTTTTTTTTTTTTTT>
##$WBST= 1024
##$WBSW= 4
##$XGAIN= (0..3)
0 0 0 0 
##$XL= 0
##$YL= 0
##$YMAX_a= 1370
##$YMIN_a= -721
##$ZGOPTNS= <>
##$ZL1= 120
##$ZL2= 120
##$ZL3= 120
##$ZL4= 120
##$ABSF1= 60
##$ABSF2= -190
##$ABSG= 5
##$ABSL= 3
##$ALPHA= 0
##$AQORDER= 0
##$ASSFAC= 0
##$ASSFACI= 0
##$ASSFACX= 0
##$ASSWID= 0
##$AUNMP= <proc_1d>
##$AZFE= 0.1
##$AZFW= 0.5
##$BCFW= 1
##$BC_mod= 2
##$BYTORDP= 1
##$COROFFS= 0
##$CY= 9.86611175537109
##$DATMOD= 1
##$DC= 1
##$DFILT= <>
##$DTYPP= 0
##$F1P= 182.462994727601
##$F2P= 168.069089081705
##$FCOR= 0.5
##$FTSIZE= 0
##$FT_mod= 0
##$GAMMA= 1
##$GB= 0
##$INTBC= 1
##$INTSCL= 1
##$ISEN= 30
##$LB= 1.5
##$LEV0= 0
##$LPBIN= 0
##$MAXI= 11.51145
##$MC2= 0
##$MEAN= 0
##$ME_mod= 0
##$MI= 1.244541
##$NCOEF= 0
##$NC_proc= 0
##$NLEV= 6
##$NOISF1= 0
##$NOISF2= 0
##$NSP= 1
##$NTH_PI= 0
##$NZP= 1
##$OFFSET= 243.8632
##$PC= 1.4
##$PHC0= 1706.409
##$PHC1= -1.240479
##$PH_mod= 0
##$PKNL= yes
##$PPARMOD= 0
##$PSCAL= 0
##$PSIGN= 0
##$REVERSE= no
##$SF= 81.0140731611343
##$SI= 65536
##$SIGF1= 0
##$SIGF2= 0
##$SINO= 80
##$SIOLD= 65536
##$SREGLST= <31P.CDCl3>
##$SSB= 0
##$STSI= 0
##$STSR= 0
##$SW_p= 25641.0256410257
##$SYMM= 0
##$S_DEV= 0
##$TDeff= 0
##$TDoff= 0
##$TI= <>
##$TILT= no
##$TM1= 0
##$TM2= 0
##$TOPLEV= 0
##$USERP1= <user>
##$USERP2= <user>
##$USERP3= <user>
##$USERP4= <user>
##$USERP5= <user>
##$WDW= 1
##$XDIM= 64
##$YMAX_p= 0
##$YMIN_p= 0
$$ End of Bruker specific parameters
$$ ---------------------------------
##NTUPLES= NMR FID
##VAR_NAME=  TIME,          FID/REAL,        FID/IMAG
##SYMBOL=    X,             R,               I
##VAR_TYPE=  INDEPENDENT,   DEPENDENT,       DEPENDENT
##VAR_FORM=  AFFN,          ASDF,            ASDF
##VAR_DIM=   16384,         16384,           16384
##UNITS=     SECONDS,       ARBITRARY UNITS, ARBITRARY UNITS
##FACTOR=    3.08e-05,      1,               1
##FIRST=     0,             0,               0
##LAST=      0.5045964,     0,               0
##MIN=       0,             -721,            0
##MAX=       0.5045964,     1370,            0
$$ Real data points
##PAGE= N=1
##DATA TABLE= (X++(R..R)), XYDATA
0@%%%%%%%%%%%%%%%%%%%%%%%%%%%%%%%%%%%%%%%%%%%%%%%%%%%%%%%jLj2J9j9J8
61Hj9K5l3N1q8o65J160n02l17l13M7J04L52L54K36J57M1j56k67l35l03j99N3K09
85d00L59L51K87Qj11k45l30k95j88l0J89K45K63K28K24m3j21k68k65l54p8P0J65
108c39L74K80K05K1j35k69k12k63j55j5J08K25L28J59K49Kj91l51l24j49j40R6
130d96K29K99L10J26N7j09k56k46k58j58oJ50K17K66K79J66q6j97k74l04k20k8
152e39R8K79K45K27J20K7r0k50k92k69j11K0J53K67L77K58N8j21k20l24k25j89
174e01jK4K97K63K07J98K3j19k72l02k21j76L9J89L38L26J51K9p7k19k91k31j29
197d55n8J40J71K92K34K06j0j64l02k95k77p8J41K18K45K76J46Q2j43j66k92k66
$$ y = [0, 0, 0, 0, 0, 0, 0, 0, 0, 0, 0, 0, 0, 0, 0, 0, 0, 0, 0, 0, 0, 0, 0, 0, 0, 0, 0, 0, 0, 0, 0, 0, 0, 0, 0, 0, 0, 0, 0, 0, 0, 0, 0, 0, 0, 0, 0, 0, 0, 0, 0, 0, 0, 0, 0, 0, -1, 2, -10, 9, -10, 8, -11, 14, -19, 32, -56, -721, 439, -63, -380, -693, -646, -542, -190, 164, 400, 557, 598, 442, 175, -160, -463, -662, -609, -400, -41, 310, 597, 605, 494, 249, -81, -376, -564, -594, -405, -160, 103, 331, 555, 512, 391, 123, -142, -496, -574, -504, -339, 35, 315, 520, 541, 406, 137, -75, -338, -493, -508, -400, -175, 153, 312, 561, 563, 372, 21, -303, -452, -592, -496, -267, 32, 342, 468, 525, 416, 160, -86, -344, -502, -508, -358, -141, 125, 404, 570, 484, 287, 13, -291, -511, -539, -441, -162, 83, 310, 430, 457, 367, 117, -175, -444, -555, -535, -382, -115, 262, 520, 578, 457, 237, -87, -312, -501, -502, -478, -181, 82, 289, 487, 510, 391, 119, -183, -404, -580, -541, -352, -14, 312, 463, 492, 415, 196, -95, -326, -455, -513, -373, -202, 90, 324, 530, 520, 356, 54, -241, -518, -596, -455, -237, 8, 284, 430, 512, 369, 203, -89, -355]
219c55j36k8J19K33L13K12J53l6k00k39l25j87m5P9K41K51K26J31N3q0k25k06
241e1k65k02K9Q3K57L24K21J11q6j35l11k39j64r0J67J86K39K31J49Nm7k51l03
264a42k03j53K8J54K88K52K13M0j11j46k83j71k09l5P8K03K75K08J80nj11k47
286A03k47k18j35O6J41L43J76J46P9j56j20k32j58k15j1J04J80K73K08J35j3j68
308B81k31k59k02k9R6J39K12K18J36P7r6j11l03j91j67m1J52K15K85J62J23l9
330D27j59k10k54j64j05P9J96K19K31J25M8r9j93k36k03j71j3K03K49K03J89O7
352D29j0j97k35j94j62o3L0K25K42K13J53L1j63j83k48k18k7J6J76J65K11J92
374C83JKj82k16j89j57o5R0J99K95J69Q3k2j30k22k27j55q3Q9J20K70J68J53K2
$$ y = [-355, -491, -519, -400, -167, 146, 358, 511, 475, 275, 36, -289, -476, -521, -442, -201, 50, 276, 407, 460, 380, 155, -51, -316, -518, -489, -406, -149, 175, 396, 507, 421, 286, -25, -264, -428, -518, -351, -165, 74, 305, 454, 459, 412, 161, -142, -345, -498, -470, -316, -28, 224, 437, 477, 366, 220, -63, -234, -443, -478, -400, -197, 78, 286, 466, 461, 350, 103, -144, -362, -497, -431, -290, 53, 229, 375, 454, 298, 178, -54, -212, -427, -438, -334, -154, 119, 327, 462, 449, 281, 50, -209, -411, -440, -344, -205, 7, 225, 361, 438, 342, 231, -72, -263, -430, -471, -319, -104, 181, 343, 466, 427, 268, 58, -196, -360, -465, -386, -190, 29, 260, 385, 433, 334, 141, -95, -298, -469, -482, -279, -30, 173, 362, 429, 419, 222, -13, -207, -369, -432, -402, -177, 65, 278, 431, 462, 299, 116, -132, -350, -377, -361, -185, -20, 191, 383, 384, 386, 204, -12, -201, -358, -423, -333, -134, 161, 330, 413, 391, 261, 39, -188, -343, -426, -337, -217, 53, 221, 374, 396]
398C96m9j92k23j76j41j1J24J63K44J87N9Mj25k58j66j99k5N0J77J78J78K03l
421C95r4j56k32j87r7o0J75K21K03J27J33j05j52j30k29j37l0M5J58K32J44J52
443C76j6r8j44k58j47m1J0P3K37J84J48N2m6j02k39j87j67j3R2J69K35J24J20
466C62l7n7j83k23j83o5Q1J07J79K31J39L3r5j24k43k11p7RN8K35J82J38J41p2
490C25j38j62k12j13l4pJ89J80J72J23J1p2j38k12j43j07k3J21J79J62J79O2l7
513C05j35j70j97q6o5K2J70K41J84M1O7j20j35k20j49r9N0P7J77K05J26P0q4q8
537A87j79k33j40M1Q3J34K04J57N3Lq0k02j70j48k5K3R7J57K01J27O7n6j52k23
561g4j38j37J8Q3J80K02J33O4m3n6j49k80q2n4N4O9K20J90R5P6j22j49j90j40
$$ y = [396, 347, 155, -68, -244, -385, -396, -272, -109, 135, 322, 381, 385, 260, 2, -164, -363, -388, -338, -161, 17, 195, 398, 395, 301, 145, -87, -274, -371, -431, -256, -35, 168, 295, 428, 323, 171, 41, -188, -325, -355, -310, -152, 80, 224, 376, 360, 262, 118, -140, -287, -328, -318, -245, -8, 176, 324, 376, 330, 228, -11, -198, -365, -378, -286, -117, 118, 242, 362, 325, 268, 85, -138, -321, -386, -305, -198, -19, 212, 351, 384, 289, 165, -78, -289, -366, -357, -299, -64, 118, 256, 397, 325, 187, 25, -187, -300, -334, -341, -152, 28, 200, 323, 334, 262, 124, -88, -231, -338, -361, -240, -61, 101, 280, 342, 305, 170, 0, -197, -283, -348, -326, -156, 85, 269, 310, 377, 257, 122, -98, -247, -346, -296, -219, -42, 163, 289, 359, 275, 187, 8, -225, -365, -324, -241, -107, 97, 254, 307, 310, 230, 28, -142, -290, -315, -292, -195, -38, 163, 290, 357, 301, 149, -74, -212, -349, -331, -248, -68, 134, 267, 331, 288, 232, 83, -197, -279, -333, -279, -210, 10, 200, 295, 371, 249, 100, -90, -230]
585b30p5n7J54J80J57J16Q6k1j01j77k01j38K3K9J46J50J77P6N5j03j76j60j63
608b53l4m5J13J62J84J05J11o2j33j89j68j13rO5J94J51J27J18n5j70p7j33j29
631b40q0J5J57J30J65J59L4q5j07k74j10j12J8J18J14J85J53R4q8q1j31j68j19
654b53n8M6J02K28J32R2K0j07j63j28j50q8M0J18J36J09J27R7o0q8j46j46j52
677b92k8K3J66J59J82M7M5j21j65j14j45m8MJ26J01J76J26N8k8j08j63k09j18
700c26nP4J76J46J45L8Mo7j77p1j69n9K4N4J94J47J35J6m9j20j91j16r9K0J08
725a68J02J49J16Q2j9n6j70j52r0j05O2J03J60J31J04Q6r3j38k24q4j16L8R9J20
749f3J48J48K5oq1k05j24j16p7Q6J35J78J95M2k2r4j20k09o9j9JO4J40J86R0L5
$$ y = [-230, -305, -362, -208, -28, 129, 245, 331, 310, 209, 32, -169, -307, -284, -255, -109, 41, 218, 294, 349, 246, 70, -90, -253, -287, -332, -219, -57, 127, 232, 343, 281, 148, -41, -209, -322, -331, -266, -72, 79, 206, 324, 269, 99, 22, -111, -240, -320, -305, -148, -18, 147, 306, 340, 255, 148, -126, -236, -348, -330, -212, -98, 87, 240, 334, 246, 165, 34, -134, -253, -311, -265, -163, 65, 197, 289, 309, 202, 39, -89, -239, -327, -287, -169, -33, 76, 203, 300, 240, 152, 6, -140, -292, -320, -297, -131, 28, 210, 257, 302, 181, 16, -98, -243, -291, -287, -161, -60, 116, 242, 300, 272, 164, 1, -208, -326, -331, -257, -81, 65, 210, 248, 252, 185, 8, -63, -232, -291, -267, -213, -19, 128, 263, 279, 230, 110, -81, -197, -296, -276, -168, -66, 83, 199, 281, 262, 206, 36, -116, -206, -311, -249, -146, 14, 145, 249, 335, 242, 104, -120, -204, -320, -282, -183, -63, 85, 233, 258, 252, 171, -34, -158, -274, -351, -265, -130, 48, 243, 285, 263, 169, 49, -160, -229, -248, -247, -183, -43, 143, 233, 268]
775B68J1j31j73j69n3l4K6J70J65R8N4Lqk04n9j76k6m2J30J28J13J11O6Qj26k12
801f2j12r4J3P2O3K12Q0L2J8j04q1j33p6q3oJ35J32J48J23J6j08q5j50j38k1l1
827b40N8R9J54J00O0ln1j71j55n9o7L9J34J37J56P9J9j02j35r3j34l6l4R4P6J48
853G3J19O5j3q8j54j48j05k5L3J89J29P1N3N1p8j17j12j20j1p4J11J37J14Q3O4
878B47k7l5k23j20p7J1R1N2J17Q5J25k1q1o9j27j10n9j7Q6J30R9J18N5n3j29p0
904bj58n0NL9J40J10Q9K2j0m5j14j37m6n1j5R7J13J49R0No3j12j01q2k6l9O2R9
932c1J12O9N3J0q3j05j09o7n4L3P5J14R0J38m2n2j07n3j50m7J1K4J35P9J21M0
958B04Mq7j01j08j10k3Q3O7J00J08P4m0k8j26m8r6l7j1Q0M2J36R3K6n7l2r8q1
$$ y = [268, 279, 148, -25, -194, -247, -281, -255, -85, 80, 178, 232, 235, 227, 23, -36, -212, -238, -280, -150, -22, 91, 202, 268, 276, 150, -62, -174, -268, -255, -183, -120, 92, 172, 204, 222, 118, 37, -96, -172, -255, -261, -126, 6, 154, 277, 293, 185, 100, -50, -188, -209, -240, -182, -83, 71, 171, 231, 228, 177, 6, -149, -208, -275, -236, -102, 35, 191, 270, 289, 187, 52, -41, -175, -211, -245, -151, -75, 73, 192, 257, 244, 156, 2, -146, -251, -276, -243, -54, 75, 146, 199, 250, 172, 55, -57, -177, -188, -262, -151, -14, 100, 183, 247, 220, 185, -38, -158, -235, -224, -133, -81, 36, 121, 246, 225, 144, 75, -52, -162, -221, -238, -152, -22, 77, 195, 250, 197, 68, -2, -160, -210, -205, -166, -26, 84, 173, 195, 185, 140, 26, -111, -157, -208, -223, -126, -13, 136, 226, 231, 168, 56, -45, -127, -153, -192, -130, -31, 81, 150, 203, 213, 130, 25, -84, -151, -205, -172, -97, 17, 107, 245, 203, 151, 44, -9, -159, -206, -195, -171, -36, 43, 164, 204, 208, 121, 20, -88, -198, -221, -138, -71, 29, 137, 211, 171, 143, 17, -31, -127, -164, -175, -95, -53, 83, 176, 202, 145, 113, 15, -66]
985f6q5o7M4J14O9O6P8J1j7n9j62p7ol3M2J11J90kL2j8o3p0j35p9L4K8P0O0J30
1014A40QN4j43k9j16m3q2jQ5O7J78L6ol5j7j09j24k1kRP3J19Q5M0k7m5p1j00p2
1043a49L9n2P0J39Q9K9l1m1l1p9j23rqM0Q5J03O0J5M7r8p3p7j16L2L5L3N2R9R0
1072A70K0r5Pj18o6n0nO5P3P4K9K8j0Rj67n2k7l2O6N6J4J06pK1po0j03k4n4l6
1102a75J02L9O4P0NK6p6m1r8ql3M8L6M6R1k6N0pq2p0n3m7j7R9M0Q0M8nK5j04k4
1133Co8j6ml7N5J21M6K5K1n3r8l0j8l5j8J5R0L2J12n7nj8j12Nl9k0N6K4M5P0K3
1164A15m4j5m4o0m5k2O6kL5O3O4J0o2j6l3r5ok3J6K9J31L5Qk1k2n0o4pl0QL8O8
1196B5QK2O8n3m3jp7k3l1K0O9NP3k8K9m4k9K1q2k2N8Mk6J26j3J1qm0l9p7Jj1Q5
$$ y = [-66, -151, -218, -174, -60, 9, 75, 153, 164, 147, 88, -74, -151, -157, -190, -148, -37, 153, 151, 183, 165, 102, 32, -103, -182, -148, -120, -50, 10, 140, 148, 202, 59, 30, -86, -129, -211, -212, -127, -60, 118, 154, 148, 113, 96, -13, -137, -158, -160, -151, -78, 41, 126, 166, 139, 94, 23, -77, -149, -110, -162, -92, 47, 136, 165, 134, 93, 62, -17, -140, -149, -157, -117, -32, 71, 131, 146, 193, 95, 22, -55, -171, -139, -104, -71, -19, 80, 170, 190, 95, 102, -16, -82, -132, -137, -72, 1, 75, 104, 132, 122, 131, -36, -88, -115, -147, -81, -25, -11, 95, 88, 109, 102, 42, -61, -85, -139, -175, -73, -34, 30, 100, 105, 131, 55, 14, -84, -92, -125, -77, -41, 5, 96, 70, 120, 113, 31, -39, -92, -139, -156, -57, -17, 63, 111, 106, 131, 27, 3, -65, -81, -85, -122, -67, 54, 100, 125, 146, 93, -5, -35, -53, -88, -106, -91, -1, 31, 143, 86, 81, 63, -49, -44, -83, -103, -47, -23, 22, 92, 115, 71, 56, 12, -48, -93, -115, -49, -51, -16, 47, 111, 121, 59, 43, 10, -85, -91, -114, -98, -69, 62, 97, 105, 84, 62, 12, -52, -59, -89, -81, -43, 25, 33, 55, 123, 70, 27, 26, -51, -74, -105, -85, -16, -11, 62, 34, 63, 19, -10, 11, -71, -93, -35, -31, -57, 69, 56, 67, 59, 19, -20, -97, -96, -107, -22]
1229b2KN4OL9j4m5m3J3q6L6k0L1L6M1O5Lj3o3m6l5m5K2J00o4R9K6Nj8l2K0q5j8
1261e1JJ4j9R4L9m3L4m5om6J8l2jk2QO1K5Q1l2jp9n4Jk9N3mL2%O8J3l9n1l9L0
1295b1l0J8l3M2K2O9k2j8k9M2n0m3j1J6M6K6L9m0J7l5L8p6L2m3K6M0o5N5N1Jm2
1326B2pn3kMK8l6L4K5Nj1K4o9N4o7K6j6Km9R4M9j4ok8JJ4n7knK3J0k3P3nmJ5j5
1362C4j00Q7o2J5J1J2j3J5M1k4m0rO7m3k1J1L4NqJ4j8N9l3n8j5NlM3k8O8n9K1
1394HJJ3p1L5lk5N8n8M8RL8n3plKkMlj1J7LK3oj5J2j5K1k2l2M3j3qL3m2M3np1
1431e4O1l1J0L9l4j6M6l1J8Lm1J7L3k9j9K1K3K0k7k8K7rl0N7k7lJ3j2J4Nj8K2
1463B0k0k6l3Q0rJm2N4J2o8JJ2J1Qj7J4j2J5Nl5KNK7K8l1J0k4nM1k2q3O9PK3j2
$$ y = [-22, -20, 34, 40, 79, 65, 20, -23, -10, -96, -60, -80, -49, -13, 28, 93, 96, 83, 20, -26, -61, -106, -84, 16, -48, 51, 77, 82, 64, 32, 52, -33, -51, -50, -36, -55, 39, 78, 35, 69, 24, 18, -28, -10, -42, -43, -65, -57, 4, 29, 110, 78, 77, -2, -56, -55, -84, -31, -35, -3, -3, 65, 78, 39, -12, -51, -21, -51, -33, -66, -24, -2, 67, 45, 27, -2, 40, -10, -53, -64, -48, -2, 24, 63, 23, 40, 5, 43, -33, -1, -44, -18, 22, -43, 12, 63, 64, 22, 15, -38, -40, -36, -8, -44, -10, 15, 20, 9, 33, -36, 18, -49, -23, -39, -37, -86, 8, 57, 43, 37, 9, 10, 24, -33, -35, -40, -17, -7, -30, 43, 38, 34, 49, 34, -66, 21, -41, -26, -15, -3, -16, -1, 40, 16, -24, -33, 34, -9, -30, -19, 15, 20, 12, 26, 8, 67, 34, -24, -39, -34, -37, 6, -22, 46, -13, 8, 9, 22, -49, -14, -17, -42, 16, -42, 6, 15, 53, 0, -7, -10, -8, -10, -6, -9, -20, -3, 0, 23, 17, 2, 14, -1, 20, -2, -34, 9, -4, -12, 21, -21, 22, 17, -54, 7, -24, -14, 25, -9, -25, 21, -10, 8, 11, -30, -13, 20, -9, -28, -7, 16, 36, 9, -19, 8, -1, -31, 26, -1, -4, 9, -3, 11, 16, -2, 20, 0, -26, -59, 21, 12, 13, -29, 25, 37, -31, -30, -18, -7, 1, -16, -2, -14, 1, 6, -29, -27, -22, 5, 33, 2, 12, -12, -17, 24, 2, -81, -12, -5, 18, 6]
1498FpJ5j6M8p8J9PL6m6Lk2M2M0n8M7ll8Pj0Rj8L0Mj3%nL7k1L9pn1k6rL4pN2J8
1535E8q1N2%l3nk4L2n1L1N0n0K8k2Lk4O3l7qPl2M1K1oKJRl9Nj6j7L7j5L3mm5N2
1571A6k3Pj4K2l7M4n3K0J0k2O8n4L6P%j4l8NJ8pJ9K7pj6Op0O7k0PNJ1j2l2N7l8
1606elK1n0QJ7j0j7M1N6k7j5NnLn2j1J6N4k5J9l8M4k9%j8j5j1k0M2O5m2OM0k2
1640B2L4q1K0m2k0L4K0M5nL1k3L9m0j8m2k3O1n3P1kl5M9ol1K0k4k1mO5m3NJ4j7
1673@jl3R2m0o6OK4L3k4L6L7j9rK3q4oJ6L8l8pL8j2Q5k5k8k6l7j1J5pRL3k0M4
1707C6rRk5j4n3K4jkN8k6K2LLMl7J6j6l2QoL8M1pL2Rq0j7j6oM3%mL3NJ4l6M9p7
1745a7J3n7L7l4N9L8k5K3jkl1k9K1l7M5KJ6m7O4K8qj4m4j9l1K0J0kO6j3j8K7q
$$ y = [6, -1, 14, -2, 46, -32, -13, -6, 30, -16, -13, -35, 7, 47, -11, 36, 33, -5, 2, -8, 1, -17, 13, 17, 4, 4, -1, 36, 15, 54, 47, -4, -30, -39, -5, -12, 40, 58, -23, 29, 29, -4, -9, -33, -1, -52, -21, 29, -21, 7, -15, -12, -36, 27, -10, -18, -11, -43, -2, 19, 13, 15, 16, 25, -14, -9, -25, -42, -5, -20, 13, 9, -36, 16, -7, 0, -14, 8, -29, 15, -38, -18, -8, -30, 38, -16, 20, 27, 27, 13, -25, -20, -2, -9, 10, 37, 30, 14, 20, -50, 17, -3, 4, 9, 20, 8, -24, 33, -5, -8, 13, -37, -29, -12, -22, -39, 2, 58, 31, 16, 21, 16, 19, -33, -44, -28, 26, 1, 20, -18, 26, -3, -3, -21, -36, -47, -67, -25, 40, -2, 4, 44, 22, 56, -25, -5, -47, -67, -33, -13, 32, 27, 58, 35, 74, 34, 16, -26, -49, 12, -41, 30, 28, -7, 42, 36, 5, 25, 1, -20, -24, 41, -2, 3, 17, 0, -1, -34, 58, 18, -48, -42, -18, 15, -9, 27, 64, 45, 36, 59, -25, -31, -15, 23, -15, -22, 16, 4, 89, 64, 36, 10, -27, -38, -23, -30, -21, 12, -8, 36, 27, 36, 11, -3, -56, -32, -33, -35, 23, -3, 19, 22, 25, 29, -8, 8, -8, -40, -32, -38, 0, 41, 34, 66, 75, -5, -22, -38, -44, -1, -1, -5, 28, 33, 47, 11, 60, -17, -4, -61, -24, -58, 1, 39, 14, 37, 36, 34, 3, -26, -5, -42, 3, 5, 21, -26, 38, 66, 58, 44, 0, -19, -50, -30, -20, -22, 44, 31, 13, 40, 32]
1778C2q9O5m3J1J4k7Q7k2K3L5m1m3k4j7n3K2M4K3M1mP8q4K3l9o1j6K0L8k5N7J7
1809D2Kl5M0o9j1Mj4j7P7m4M1QRk9M5p4j2L3j5j9RM0kR1n1m0Ro5j4K2L0NK3K9
1843D8pj5k6M1r8K9Nm0K8M7QL8k8L3m8k9m7L9m2L5M9J2POJ6k0o0K3l0l4L8K4q
1876fJ3K5j4M7o2pok1p1Q9JlqP6Pj3m3k6l9J0j3K4Q5j1J1Ll4M2o9m0k6K4PO7J4
1911C3L4mo3L1n6K0l6j8M8l8M6Q2l5K3j4l9L1j58N7PM9k6K9O0j1K0l8pp2J3m6
1942g8J3N3J4R5m9J9p8mPj2m3J1JQP1M0k2kj7l7J7p6K6Lj6O2K4N2j3p4k0j3m8
1975h6K7kL3N5L9j6M1j3o7k6k1m7K0L4K3%N6K1J8j01K1l4k8J9K1L9l5K6M6J1q5
2006a1L3n8J3m2K6NLR4k4j4M0j1Pp8Km5M8k7O5M6j4K9l6p7l3OoJK0K4Q1n7N5l7
$$ y = [32, -57, 8, -35, -24, -10, -37, 50, 28, 51, 86, 45, 2, -22, -39, -92, -70, -26, -3, 38, 34, 112, 28, 51, 12, -49, -65, -45, -7, -32, 25, 42, 44, 9, 49, -20, -31, -27, -41, -58, 19, -25, 16, 24, 33, 4, 49, -25, -37, -4, -19, -38, -29, 11, 9, 100, 49, 9, 18, -47, -61, -39, -9, -4, 19, 48, 41, 26, 0, 41, -57, -28, -23, -63, -35, 12, 20, 58, 30, 63, 15, -14, -61, -22, -64, -29, 20, 32, 39, 45, 61, 41, -19, 4, -26, -60, -22, 2, -6, 7, 32, 18, 65, 3, -4, -10, -31, -102, -13, -12, -15, -23, 53, 60, 47, 4, -22, -61, -51, -64, -40, 45, 34, 45, 48, 14, 56, -13, -53, -79, -55, -48, 19, 33, 67, 63, 0, 31, -25, -5, -41, -59, -11, -49, -3, 79, 44, 67, 53, 14, 45, -113, -56, -49, 0, -26, 3, 63, 52, 72, 34, 27, -45, -32, -78, -65, -12, 2, 97, 48, 67, -11, -15, -8, -20, -63, -52, -51, -43, 28, 68, 46, 44, 27, -10, 7, -69, -43, -40, -56, 6, 30, 82, 69, -5, -25, -38, -86, -59, -61, -28, 27, 66, 50, 91, 78, 11, -15, -36, -83, -63, -29, -6, -6, 50, 71, 89, -12, 9, -25, -53, -34, -13, 26, -9, 17, 63, 74, -11, 22, -36, -23, -65, -39, -34, -31, 63, 39, 25, 65, 54, 61, -17, -15, -60, -12, -39, 26, 72, 58, 87, 51, -26, -59, -53, -59, -58, -38, -14, 67, 10, 65, 28]
2040B8J5j8o3pk6J2RK9L6K9J2k1r0N7n0J6j2kpP7K8l3P3p8j5nr3kO3j5P1K2j4
2073B6K8l6j5o1k2J8J4j5M0R0j0Pk5l2j7rp4jO3J9O1k1O4n8OK3r2p6mN8RK4P7
2106E9j0Krk4j8q3J9j9M7N1J6j2O2k5m6k5k4j8j4jN8NK6O4J3l0j7n3n3rKj3J03
2139B4oL6L9k5n2Qn1m4K8l6O0P6KK3j6l3J4q6oj6MlL2J00p1R9m9mn6m4mn9O7J2
2173c7K5O9nK2k1l4n5m9lM7L1OL3O1K1l3j0o5m8j5njK4L0N1N5J1p4j5n6j3J5l6
2206g4L8pJ05k0O8j3j10K6m9j9k0L2jM4P2L3k6o5K1j13oJ7JM6K0L6M3Lm6l8j5
2237a7j4k8k9P2J2N1L7l5k6Qk2q3L3j8L9j0R7l4OM5o5%q4K0n1O2LJ6P4j5J0J8
2269G2jm6n9lj3K0j7L3M0M9J6p2K5q6j4jj0K3NM8M9PjQn1q3%n4M3P9j1K6K0J7
$$ y = [28, 43, 25, -38, -45, -71, -59, -50, -21, 15, 44, 56, 35, -55, 2, -48, -32, -44, -46, -53, 24, 52, 19, 92, 14, -1, -6, -99, -101, -38, -53, 18, 40, 26, 54, 18, 3, -58, -80, -62, -48, -63, -23, 67, 57, 64, 39, 7, -10, -19, -93, -94, -31, -12, 49, 28, 92, 34, 40, 63, -29, -105, -109, -51, -42, -18, 59, 49, 51, 42, 18, 0, -83, -64, -83, -36, 15, 31, 19, 81, 56, 10, -15, -39, -57, -71, -72, -14, -9, 17, 81, 94, 64, 47, -6, -59, -68, -66, -79, 24, 18, 54, 93, 68, 16, 24, -27, -71, -43, -79, -19, 57, 59, 82, 66, 33, 47, -39, -45, -61, -57, -60, -28, 72, 1, 100, 51, 47, -9, -53, -57, -116, -49, -37, -12, 57, 52, 74, 53, 19, -36, -85, -88, -41, -10, -4, 29, 90, 111, 78, 68, 3, -45, -60, -65, -66, -42, -12, 39, 94, 105, 31, 16, -40, -53, -38, -74, -36, -43, 62, 42, 110, 97, -13, 13, -36, -55, -75, -43, -44, 0, 72, 105, 79, 14, 35, -78, -84, -67, -66, -20, 0, 36, 79, 82, 36, -2, -17, -31, -59, -88, -16, -4, 47, 84, 49, 23, 31, 9, -74, -41, -59, -20, -30, 67, 33, 39, 84, 19, 19, -65, -45, -96, -34, -31, -15, 59, 44, 54, 72, 71, 25, -34, -37, -50, -30, -47, -14, 26, 75, 91, 19, 44, -42, -56, -57, -67, -44, -39, 9, 58, 65, 64, 72, 21, -62, -62, -116, -73, 6, -5, 21, 41, 58]
2303E8rm8qp5j7M5L8J7oN6N0p8K8m3k9j2k8K9J1N7K2k5L5p0Ol2k9k3j9J16qP8
2335H7l4J4k3Rq1Qm0%K0O1J4L1jQk8m3j9o7M1K2n0O3K7M3J3p4K9l9j9j9lJ4j9
2368e5O7K6LQk4k1q5L1rM4j3N7N6mJl0l8J5j41O4PK5j9R6kK7m7k7mp5%k3L3RR3
2403D5K5l7L7o5l1k4Pk0J2M2j1N5mL0J1q6qm5K2Jk1O7J3L4o5J00n8op0J7j9j0
2435f2J6P1K0rK4l7Pm8K8o5l0M8M0L1K0l2L7J8j03l6L7n4M5l4P4L1J0Q1q0j0k7
2466A1m0j5K0k0nO7j6O2k1l5K2r4Mj4mM6N2M3n7M1k8j2l8l6OK2jJ5Q1%Rj4l0k2
2500am7K5o0P2J4MJ2J6J5J2n6l8l6PK2j5K5M7j9J03p9Lp5L1j5l0k2M6N1K7pk5
2532Glj7jj1o7M8L7RM7l4L2m8O4p6o8k0Q2J6n1Q7k8N0o1K7m9j4j1j0M8m3J3R3
$$ y = [58, 49, 1, -7, -82, -99, -54, -16, 1, -5, 51, 101, 23, 51, 8, -21, -33, -61, -32, -21, 36, 58, 33, 68, -2, 4, -28, -57, -80, -99, 17, 9, 87, 53, 67, 44, 53, -28, -20, -60, -60, -40, 21, 35, 66, 65, 73, 45, 2, -17, -84, -43, -21, -71, -8, 19, 62, 75, 1, 30, -9, -28, -47, -50, -36, -55, 12, 38, 41, 49, 25, 4, -81, -50, -59, -15, -28, 29, 85, 81, 82, 52, 14, 29, -112, -48, -41, -16, -35, 61, 59, 86, 39, 12, 8, -67, -67, -90, -57, -48, 45, 70, 33, 70, 5, -26, -50, -43, -63, -51, -9, -20, 35, 31, 61, 72, -14, -22, -67, -45, -44, -65, 2, 15, 49, -16, 84, 26, 20, -50, -33, -52, -62, -46, 25, 45, 36, 60, 23, 30, -18, 10, -55, -85, -37, 3, 34, 54, 22, 59, 77, -26, -62, -25, -79, -34, -68, 6, 37, 47, 128, 48, 38, 11, -29, -44, -24, -44, -49, 18, 2, 64, 43, 8, 30, -64, -60, -74, -78, -32, 20, 63, 6, 47, 19, 7, -31, -67, -61, -39, -40, -25, 56, 56, 65, 51, 21, -1, -48, -23, -83, -11, 3, 7, 19, 35, 50, 62, 6, -32, -68, -61, -39, -54, -29, 18, -1, 102, 23, 26, -49, -18, -33, -63, -85, -39, 12, 39, 32, 7, 4, -13, -14, -25, -92, -44, -7, 2, 49, 15, 47, -1, 63, -13, -81, -101, -19, -3, -54, 33, 5, 55, -6, 21, -28, -42, -53, -63, -15, -58, -45, 48]
2564D8mk0J5K3m3m7j7oM8j5j0P0j4O1q0n7j4JqORK3M2oNJ3m1J1p2JL6L1J7NL9
2599E0j7K2l0l0o3K4k4L7j4N4J3L6j6m6l5L8m6oqj0R8QL%n3MK2k7n0J2OK9J3L5
2633B9L8ln6Lr9K8k7P0lK0rM2L6n1n3Qj6rl5N0PL4J1K0jm9L4n9N6n9j1J5J7N8
2667C6K6p3O3n4m8QJj9N4L0l0J1RMqK2n9J7j0l2N2K5J7Pl3rMmk8p9Q2J4M3qJ6
2702D7Ml2l1K0k8l0L3j9K6KM8J4l0l4L4m8k2j5M2N0r3P7k0K6rk0%J0j2k7J4ML3
2735A4J2QqK2n8l4lK1l3M5pJ4j9P8k4l3J4l9Lk6L1k0M6K1k2J7m7L3k5Lj8n6Q1
2768ik7M0j3P1k2l4op8M9j3ML5K6k1L6mj9j5j2k0qj1N1n1J3Q0l5K1p9J6k3M8k8
2801c8N8j5okM5jm7Pn0K1J0l4M6N7k2j0Nl7J8k5J6k0qK9NM2o4N1J1n4K3o8R5q1
$$ y = [48, 44, 24, 39, 62, 19, -28, -45, -51, -3, -18, -28, 42, 28, 89, 9, -48, -62, -61, -69, -63, -54, -31, 11, 5, 10, 23, -18, -7, -79, -78, -42, -11, 6, 11, 50, 33, 55, 25, -5, -68, -44, -68, -31, -45, 9, 22, 58, 42, -4, -39, -1, -47, -53, -61, -71, 27, 35, 38, 38, -15, -11, 11, -16, -66, -54, -48, -19, -6, 29, 67, 64, 8, 11, -88, -60, -87, -17, -20, 0, -9, 33, 69, 18, -35, -27, -43, -52, -87, -37, -30, 4, 15, 35, 34, -15, 19, -40, 16, -43, -54, -39, -22, 36, 62, -11, 52, -2, -50, -42, -41, -60, -6, 24, -6, 5, 14, 18, 10, 32, -27, -10, -20, -52, 0, 25, 42, 49, 16, 7, 11, 7, -21, -100, -18, -4, 39, 31, 47, 51, 19, -12, 8, -20, -50, -17, -36, -10, -8, 40, 54, 24, -10, 24, -24, -46, -61, -19, 31, -62, 15, -5, 21, 12, -8, -8, 2, -10, -37, -23, -19, 14, 26, 34, 26, 48, -10, -44, -47, -26, -59, -14, -21, -7, -26, 52, 28, -5, 9, -30, -27, -53, -22, -42, 4, 25, 3, 20, -27, 6, -19, -16, -34, -90, -9, -36, 4, -9, 62, 40, 6, 0, -78, -29, -42, -38, -3, 23, 2, 38, 34, 15, 0, -12, -32, -40, -51, 0, -51, -38, 42, 7, 28, -51, -35, -58, -10, -38, 20, 5, -1, -3, 42, 41, -6, 1, -49, -28, -18, -52, -6, 51, 29, 19, 24, -13, 5, -20, -4, -24, -32, -3, 2, 44, -20, 31, 42, -12, 11, -57, 38, -43]
2835d3N0J2m2N4l8K4j3km5J1PJ7M1l0K0mj8P6r3L2l2J7qk6O6j4K6n0j9M2k5j1
2867a8J8k9mMK1L9j5Rj3J1m2Kkk9O1l4nj5L7J4k3M6n2Qj6Lj3N5J7n5K9k1J7j1
2901fmPj3l8J6L0oN2oj8j8q6R9m8QpO1NnK9o6K7n1M1m5lL9KJ9jKk4L4j6m1Rj0
2938c2K2K1L7o0J8l3O5n1OJ2k8mL6mkkL9j1m9L3J9m9k5L6KKQk8J3M3o2M2ppk6
2973b6j2LJ0K4k0J4qj2Pj6J7M4k8J7rKJ8K6n7NLo0M2M6k7Nm7J08m9Nk2k3lk6K2
3008b7J0J7J1K0l8k3M6m4J9j4OOJ0M7o3J7J3j1M0p4J4k6L2rK3N1l0l7prkL0m1
3041d3L2kL6Km2J7Qk1N8k6o3N0ll5P9k2j9J1k1rK1L1n7Kk0qL8M2l8k6QLl6M7l2
3076c8NK2L5j9L6r3O5k0j3%J4OKL8m7N5l9m4L7k3N5l6kj2j0O2ok0k2M9m3%K2q
$$ y = [-43, 7, 19, -23, 31, -7, 17, 4, 2, -43, -32, -25, -8, 33, 3, 23, 19, 1, 77, -16, 16, -16, 1, -7, -33, 33, 19, 45, -5, -24, 18, -7, -18, 0, -29, -33, -29, -8, 31, 16, 25, 12, 23, -19, -17, -19, -48, 13, -21, -26, -41, -4, 10, -13, 33, -19, -11, -27, -24, -37, 18, 35, -20, 9, -12, 5, -6, -10, -3, -16, -54, -38, -8, -14, 38, 32, 14, -4, -90, 9, -39, -31, -38, 23, 28, 23, 52, -14, 13, -38, 3, -42, -45, -6, -4, 15, 14, 16, -8, 26, 10, -31, -22, -32, -10, 11, 48, -12, 6, -27, 38, -13, -7, 5, -23, -27, 9, 5, 3, 1, 40, 29, -20, 13, 32, -17, -42, -6, -4, -2, 6, -22, -9, 34, -28, 14, 7, 0, -26, -38, -35, -25, -1, -21, -7, -15, -27, -20, -36, -19, 25, -3, 14, 5, 7, 25, 51, -6, -1, 2, -58, -16, 30, 3, 8, -39, 69, 20, 25, 3, -20, -23, -49, -27, -17, 0, 11, 31, -7, -30, 16, -28, -9, -23, -17, -11, -1, 46, -17, 0, 13, 2, 42, -32, -18, -44, -12, -21, 2, 53, 23, -14, -21, -30, -32, -2, -43, -11, -13, 23, 25, -17, 0, 8, -13, 45, 19, -44, 6, 3, -32, 47, 25, 6, 17, -4, -13, 8, 39, -18, -16, -36, -44, -6, 36, -2, -28, -20, -17, -53, -6, -38, -33, -11, 24, 5, 41, -52, 13, -7, -20, -20, -6, 0, 2, 40, -7, 48, 9, -35, 2, -21, 34, -2, -4, -16, -26, 36, 30, 10, -12, 37, -6, -6, 16, 8]
3110Hj0j8LK5lk3JK1j0K5m3k1oL2K0O4m9m0J1M3l4J5k7L0j6qpj6N3nj7PK4m0k1
3145c2K3k6MNP7n4k8O0k7Rl0L5n0L4J0L2k0j1l0jN4q0oK0M9l7K0j8L7k2J0J6q
3178A5Qn2mM6m0K3J0PJ4p5O9j1J3p2P2m1NJ2j5j9M2JOk5j1l1K8%QM4q4O0m5N3
3212A1k5K9QJ5m6K9n5j3N3Mj7l4PK6O7p0k9L8M5l6L4n8M4m6MprL8k7K3pJ9K7o0
3246a8lK1M0j9o2J3J6K6m7K3K4l1lpJ1J1j3K3J6l8J2J4k0nK2l6lj4JN0k8Q6n9
3279Col4K6K8m5O2j5j8K5l0K2J1k0l0J4O6j06O3j8Qj6J8k3J6p0L8J1qrmL1K1l9
3312b8P2o3l1K7L5j1qQK3Om4K6MRl8N9l6l2L5j1jn0K9Lj9K1J8m1K5l7J2K6K9l
3346A4l7L1m8kL1l4K3K1M4o3J6%j2L5l7k2L1K8q8L0K5J2m4P6k8Mj0PL0p2Ml3Q1
$$ y = [8, -2, -20, -17, 8, 5, -18, -17, 4, -6, 19, -24, -45, -51, -19, 1, 65, 16, -24, -13, 30, -4, 11, -16, 14, -2, -10, -17, -33, 20, 15, -2, 5, 29, -11, -32, -9, -35, -31, -26, 51, -3, -31, 29, 2, 11, -19, 16, -34, 0, 10, 42, 22, 11, -19, -20, 34, -46, -52, -32, 17, -20, 0, -18, 19, -3, 7, 23, 15, 23, -29, -33, 13, -27, -4, 6, 13, 27, -48, 21, 10, 23, -49, 23, -18, -13, -1, -16, -35, 7, 8, 14, -11, -22, -53, -25, -25, -17, 27, -57, 3, -42, 11, -14, 15, 23, 38, -8, 21, -34, -47, 6, 10, -7, -41, -34, -8, 59, -11, -40, -2, 43, 7, 41, -17, 27, -19, -15, -22, -31, 7, -20, 3, -4, 15, 42, -18, -21, 0, 40, 21, -41, -28, -12, 14, -33, -10, 14, -17, -20, -27, -16, -5, -18, 5, 21, -17, -5, 9, -11, -16, 6, -30, -33, -47, -46, 4, -24, 62, 3, -3, -37, -11, 17, -28, 34, 19, 1, 26, -4, 18, 29, 9, -21, -7, 59, -47, 16, -2, 6, -10, 8, -15, 1, -69, -31, -20, -28, -37, -41, -10, 11, -28, 44, -19, -50, -23, 12, 1, -7, 1, 24, 30, -14, 12, 16, 25, -13, 46, 10, -22, 13, 2, 1, -49, -20, -17, -36, -15, 3, -38, -13, -50, -38, -12, 17, 14, -23, 8, -40, -42, -11, -45, -22, -1, 43, -20, -4, -4, -16, 19, -18, -40, -9, 19, -69, -39, -14, -2, -46, 30, 2, 6, -4, 3, 33, -39, -35, -68, 13]
3379A3p5K5L3K0l7j2P1p4J5Rj6J9l5M4J2MMjOp0N0n9J2NM6K8k7J9k6l4oL8rKN1
3414D5q2N1j6loj2K6m2O6o6J5M9%oJ1m4pJ4j8J5l0J2J5M3n9K0KKmpJ1l5N2L7o2
3449a3M1o4M0j1pqj1K1m9O5n5O6j1jJ4J0j2J3on8J6LJ9K8l0%j1J8RnJ5p0M4m7
3483d7N4kJ8m5Q6l1j4l9Mj1J4mO4j9k0Pj2Lo7N3m0K9k8M1L8n8L3J9ol4J9j2K1
3516A4qj9L4jnm6P2o3J2k7mK7L8m3K0jJ1J9pp0RK3J0L5Kk2k5J6j1L0l5k2KL7l3
3551c1K8J8j4OL0J2q5M0m0K2j7Qj3M9n7O6Lk1k5J2oj9M8n3Q2L7p0J0J7k3m9J2
3583b3k2J5J4L5j7mkJ1Ll7RqM2l6M8J1n9L6J5n4Lk2j4j6O6J2K5Jk4j5M5Mm8J3
3617Gk1J6l3K1j8J8L6j3pLk1j6qj0L8N0n3L5nNl7J4k0Nj5O0j2k1L8j7l9M1k7O
$$ y = [13, -62, -37, -4, 16, -21, -33, 38, -36, -21, -12, -28, -9, -44, 0, 12, 16, 20, 19, 25, -45, 5, -54, -42, -37, 9, 37, 10, 29, 3, -31, -37, 1, -8, -6, 45, -37, 14, -2, -5, -11, -23, 3, -39, 27, -39, -24, 25, 25, 19, 30, -14, -21, -7, -25, -10, -40, -28, -13, 30, -29, -9, -7, -5, -9, -16, -5, -40, 12, 49, -13, 28, -36, 4, -7, -14, -22, -33, -12, -61, 4, -51, 15, 4, 3, 17, 27, 15, 28, 22, -36, -20, -17, 2, 30, 0, 0, -11, 7, 16, 11, 26, -44, 0, -47, 7, 5, 23, -22, 64, 33, 19, -20, -16, -27, -13, -17, 47, 28, 8, 15, 3, 6, -61, -8, -48, -19, -47, -6, 32, -26, 7, 26, 20, -14, 5, -7, 14, 6, -13, 21, 20, 15, -31, 41, -22, -10, -37, -41, -14, 24, -19, 1, 0, 11, 30, 23, -47, -38, -15, -5, 30, 32, 10, -15, 1, -10, 20, -15, -37, -35, 2, -31, -3, 15, 1, 7, 37, 49, -36, 4, -36, -14, -31, -23, -36, 13, -44, 22, 25, 4, -21, -9, -15, -34, 14, -39, 43, 80, 10, 20, 37, 14, -35, -23, -45, -30, -16, 19, 2, -2, -4, 7, 10, -27, -18, -26, 16, -20, 28, 39, -20, 16, 31, -23, -20, -42, -56, -72, -6, 6, 31, 32, 8, -7, 38, 42, -6, 7, -14, 2, -31, -10, -28, -10, 26, 13, 6, 9, -12, -28, -36, -46, -8, 42, -11, 24, 19, 24, -13, 1, -19, -14, -29, 31, 19, -2, 36, 19, -20, 21, -6, 0]
3651@k6K7L4k8jl7K4j6N1j5l8K4j3m1K9K0K0rnpJ1k0j3qJ2MQk6L2O5k0n3K4m0
3685c1kK3k1J9NK5jj9L4%k8Nkj7K3%LM5Jm2m4L0q2P6om5L0k3O0pJ4m5J7J9p2O
3721e2K4j8M3J7m3N1m0J5MjPl3NL3O0n8K8q5NpK0K6j3LL1l3N0km4J3l7L5n2J6
3755c2oJK7j5JP4j8m2kKk2J1nJ6J0J1Qk7L0%K7q9M8q6Q8poK0ML4n4j5M0q5L9J2
3791hj6O8m3M6nk1m0Kk4mK2j9N9j8M4M1j05%J6J7m2j8OQM2j1mJ7j3k4Rmk3L3k7
3826c9K7L0K2K8k7k9Kj0m2J4J1J5J4OK8l5nn2K3j5kMj7K9K6J8J6o5PL1n2K5m1
3859e5M0K6J0k2j3Q5l8k2k6j7L0k3JK8pJ4j7J5J7o1j0l3M8K1K8l0K4K3p4K1L9
3890B2j9m4MkqK2%M8J9l1k3jo1pM0NK3L5jj6PLn9L0l2O2m2J0J5j5J1M3%p5O4k4
$$ y = [0, -26, 1, 35, 7, 6, -31, -7, -23, 28, 13, -25, -1, -14, -55, -26, -6, 14, 5, 0, -7, 4, -16, -29, -37, -25, -21, -13, -39, -7, 58, 38, -15, 9, -31, -33, -10, -31, -12, -7, 18, 17, -2, 32, 32, 4, 9, 7, -10, 13, 13, 16, 61, 62, 20, -24, 6, -76, 0, -6, -51, -21, -44, 16, 9, 23, -22, -5, 14, -58, -52, -28, -46, -3, 14, -29, 22, -18, -3, 1, 0, 7, -26, -21, 12, 72, 14, 42, -43, -38, -45, -25, 1, -12, -9, 22, -11, 39, 37, -7, 6, -31, 4, -48, -32, -38, -37, -10, -25, -24, 50, 32, -10, -12, -10, -32, -21, -26, -10, 0, 11, 19, -8, 22, 22, 49, -40, 8, -78, 10, 3, -3, 17, 21, 55, 1, -14, 26, -59, -20, -8, -24, 44, 1, 47, 42, 21, -19, -17, -41, -45, -23, -42, 17, -1, 43, 84, -21, -21, -5, 12, -30, -48, -42, -34, 8, -3, -7, 10, -3, -27, -18, -22, -45, -12, -39, -12, 18, 40, 68, 41, 12, 14, 4, -38, -24, -13, 2, 16, 22, 50, 15, 10, -42, -19, -34, -36, -32, -49, -20, 6, 24, 40, -25, -18, 13, -39, -14, -55, -15, 11, 21, -1, -14, 71, 33, 11, -15, -32, -2, -25, -24, 4, -3, 11, -6, 9, 26, -35, -45, -78, -30, -9, 19, -11, 13, 36, -38, -17, 22, 3, -41, -37, -39, -47, -25, -25, 23, 42, 11, -12, -13, -74, -81, -41, -36, -13, 22, 21, 5, 12, 15, -44, -14, -46, 16, -26, -16, -1, -16, -5, 38, 38, -37, 27, 3]
3926Cm5kL3j6Q9l6%K5p4nk4K9k7L0l0N1J5M0j5m0J1k7j3rK5L5m2M4j4Jj1lJ4m9
3960c7K7k0j6j0O1krJ2J3j7oon5L2j9J4L1kJ5lj0k0Qm3P2j1nJ4K6m9M0Km4L9j6
3995Fn1K6j1N2j4j2J3l3L7o1L8l7K1jJ8K9lM2r3M5n4ML6mLn0M9N4q1M6m2K6j1
4028a3k4j8lL6j8K4K4K9k3%j8l2Kj1M3K1m4K7qLLmp0O3j3J0JJ0L9l6O6l1l3m1
4062c9oK6m9O2Mj5K6LjL9q6j7J2j8L0rL8j9m4Q0l6j3l3L8k1O7m4J0L5m9R2k4l6
4095Cpl8MrL6rnK3L8j6j1M3m0l3jL0m7M8j8KM1J1n0nLLn3O2J0OPj9pk2M7n1M6
4132B2m1k8J4L1k1M6m6M5j2j8nj5l5M6l0J7K8J4Jp0L3QK3m4J8rJ2L4k9%J2qm0
4165d7mOPL7kRk5P1n7K1qm2L3J3k2j1K1OO%L3k4Ln2%j1K4k9P4nj7Rj2K7l3kp4
$$ y = [3, -42, -44, -11, -27, 62, 26, 26, 51, -23, -28, -52, -23, -50, -20, -50, 1, 16, 56, 41, 1, 12, -15, -28, -37, -12, 23, -19, 25, 11, 12, 1, -2, 12, -37, -10, -30, -46, -56, 5, 3, -6, 6, 19, 2, -4, -10, -65, -33, -52, -38, -7, -9, 6, 3, -7, -27, -19, -62, 10, -1, -6, 8, 34, -15, 25, 27, -17, 22, 6, -45, -19, -30, 22, 8, -4, 9, -24, 13, -48, -10, -47, -26, -27, -9, 20, 17, 59, -34, 11, -43, -39, -3, -7, -4, -54, -5, 49, -32, 14, -28, -2, -13, -37, -55, -58, -22, -40, -16, 8, 37, 14, 14, -4, -36, -34, -45, -2, 19, -25, 2, -6, -3, 0, -4, -74, -11, -24, -14, -13, -3, 36, 0, 66, 35, 2, -39, -45, -19, -68, -6, -2, -17, 9, 12, 11, 50, -36, -53, -41, -59, -29, -38, 0, -19, -63, 17, -19, -32, -65, -27, -48, 19, -25, -15, 20, -29, 63, 39, 3, -4, -42, -38, -47, -11, -20, -25, -2, 36, 20, 9, 52, 12, -21, -22, 8, -39, 9, -9, -7, 34, 45, -5, -10, -7, -4, -57, 5, 15, 21, 28, 9, 2, -20, 27, -24, 22, -19, -47, -33, -2, -23, 23, -23, 22, 10, -8, -13, -28, -63, -17, -47, -30, -2, 12, 13, -57, -24, -16, 7, -37, -19, -28, -16, 18, -11, -11, 1, -7, -47, -51, -45, -38, -1, -3, 6, -19, 52, -5, 16, 8, -34, -1, 12, -10, -21, 0, 6, 12, 12, 45, 21, 24, -28, -28, -39, -15, -44, 30, 25, 8, 17, 5, 32, -1, -3, -77]
4202g7QM0R3n7PM2o4L0%p6L8k4M1k2M3rNK6j4l6l9RM9l3M2l0M0j3j1J4j7lk9O5
4236C8p5M0nL4Jm7nL2Ln1k9NNL6K0rL9k6M1k6j8k9L9j7Lj1N4l1J5l6R9o9k8j8
4270b6J0PJ6QK7Nl9k2QPk8M6k7J9j4l4N2k1K5K9m7k2PLL3l5Q5m1K5n2j4K0m3J8
4304a5j0NJ0K3m6L4L3%m4J5k0Jj3M1L8Pm1%Nk0j8L0o8N8Nj0K8qj5k6J1J3K0o1
4338c8m2RN3N4Kk4L6m8K0Po9K2qk1M2nlO0l5rk1j5j0K6J6rJ0jL3j2l2J0%k6N6
4373B8q2M2j5J0J4kJ5l8O8n3l4J0M7j2K2Lj5Kk4%K0k9J5j9K7k5M0J0m7M3o3K0
4405b2k3O2q6Q6o2N3K6No3J7l0K0NJ8k8kK7L2k8j4J6j5N4q2L6k8Qk9Q7j4j3j4
4437amJ6k5J3j9J0J7K3m5M9o4j3O2J9j07P5n4N7J4J0l8M0l2L3m3k2J8l8J8J9n5
$$ y = [-77, -69, -29, 64, 7, 14, 56, -8, 22, 22, -54, -16, -40, 1, -21, 22, 13, 18, 44, 30, -6, -45, -36, 13, -20, 22, -8, 32, 19, 8, 22, 5, 2, -27, 38, -37, 3, -2, 32, 33, -14, -19, 13, 16, -35, -64, -59, -54, -18, 2, -7, 32, 6, 47, 21, 3, -26, 13, -4, -1, -12, 42, 11, 26, -10, 89, 20, -8, -26, -16, -9, 7, 15, 42, 47, 8, -14, -6, 1, -27, 19, -8, 11, -3, -37, 15, -6, 19, 48, 1, -21, -14, -11, 22, -13, 72, 31, 56, 4, -10, 10, -33, -15, -25, -20, -10, 13, -33, 1, 34, 34, -10, 5, -15, -14, -27, 14, 52, 59, 18, 18, 23, 3, -15, 15, -53, 5, 10, 0, 28, 20, 5, -21, -10, 3, 23, -38, -80, -71, -18, 36, 38, 14, 50, 2, 22, 29, -40, -18, -26, -47, -5, -10, -13, 47, 12, 3, -18, -33, -43, -17, -1, -10, 0, -1, 32, 20, -12, -2, -2, -28, 28, -54, -12, -27, -17, -3, -5, 10, -28, 40, -13, -47, -37, 10, -2, 20, 23, 8, 10, -14, -14, 6, -23, -8, -27, 0, -25, 15, 25, -22, 21, -42, -22, -45, 17, -69, 17, -45, 8, 34, 39, -24, -7, -37, -17, -12, 6, -22, -24, 3, 35, 7, -7, 9, -6, 48, -34, 2, -26, -18, -47, 40, 26, 13, -1, -5, 11, -14, -1, -20, -10, 7, 30, -15, 34, -30, -43, 19, 38, -69, 6, -48, 9, 23, 33, -5, 35, 3, 36, -7, -29, -11, -49, -31, -12, -67]
4468f7N4l1j0L9J5j6k5M0n5L6N6k5nrK7n1M7k7k3qJ7RnL9J4j3k6rJ2m1L5nm6K4
4502c3K4K0K2l6K7k4Jj2rN0q6M8m0N2j5J8Qj9M4j00N2J0m2N0mLR%p5K7Pk5L8m1
4536e1R8l9Jj0l6M4pl7N2n6L4Mj3L9j0lLk3Pnk6M7n0L5J9l5k7P4j3j9kj4qM0l3
4571b0L6j6J7l5M5m6kOj5J8QJ8j6j8J9J8j9m2L2K0lm3L3M1n0N8k3n4J0K9m3Mj4
4604d7O1KoQL0m1j4j3RJ3qj6QnK1M4p8L0J4m8JL5k9L4l9M8Ol7Q8p6J2j1J2j6Q
4639@lL8k9j3J8k1J2Pl4k5%L8K6J8Qk7L6n2nM8q0O7p6nL2oN1k0m5j6R6j2n3N3
4673B6p6N8jLJ2m0M4lk7l1L1%l6K3O2j2rJ5l2Lp6K6pN4m0O6jj5l9nM0n8L7oOk
4709a0k3K8L4l4K4k9K3kQj1j9L7J0qk0J5j8k2Nk1QM0Ll1L6KK4l9J6j7n8K9M1m2
$$ y = [-67, -13, -44, -54, -15, 0, -16, -41, -1, -56, -20, 36, 11, 6, -3, 24, -27, 20, -7, -30, -38, -21, -12, -17, 22, 36, 23, -3, -12, 0, -41, -6, -11, -57, -33, -9, 11, 33, -3, 24, 0, 1, -11, -20, 30, -56, -8, -48, 4, -11, 7, 15, -4, 40, -60, -8, 2, -40, 10, 6, 9, 18, 18, -57, -30, -23, -48, -10, -51, 47, 8, 9, -1, -37, 7, 0, -37, 15, -41, -7, -3, -16, 23, 13, 10, 13, -10, -3, -8, -34, 13, -37, -2, 17, -18, -45, 29, 16, -3, -5, -19, -27, 13, -20, 16, 0, 17, -18, 27, -19, -21, -15, -30, -12, -4, 14, -2, -20, -1, 17, -2, -44, -12, 8, 5, -38, -5, 36, -14, 44, 21, -33, -23, 6, -37, -33, -47, 14, 16, 10, 18, 48, 7, -7, -20, -11, 2, -6, -22, -14, -19, 2, 46, -32, -2, 12, -36, -35, 0, -29, 5, -34, 14, 20, -17, 71, -5, 7, -4, 8, -8, 0, -3, 35, 6, -7, 11, -10, 2, 9, -25, -50, -50, -12, 14, 32, 40, 13, 49, -3, -8, 40, -40, 27, -49, -54, -22, -28, 23, 3, -42, -58, 38, 26, -27, 26, -50, 8, 7, 10, 22, -18, 26, 23, -4, -35, -4, -4, -40, -17, 45, 33, 24, 39, 7, 10, -66, -40, -47, 7, -33, 33, 32, 17, -22, -27, 13, -45, -8, -14, -8, -10, -33, -5, 29, -5, 19, -10, 13, 11, 19, 8, -11, 26, 36, 28, 8, 23, 5, -17, -12, -33, -25, 15, 18, -13, 23, 25, 49, 10, 26, 9, -49, -20, 21, -21]
4743b1L4k3M6n9J3Rk0J8Ll5N4jj2M2o9M4j1m3J0M5o9M0j3K8L3l3k8K9m4nM5n3
4775d6K5mL6K4o2pN6l4Nl2NL3j9L3Llk2J3L1m7KK0l3l5M1k5N6l3M3j1j2j5L0m8
4809c2K5NJ3K4Po0K8n7L2jNK6no4M4J9J8l1K7k4j0k0K8rk8N9n4J2JR1o9j9L8l2
4843a3l4M8o4P8k0N3p2L4lNj8n1M8qk5M4K8k0k6K5J5ll2KJ6j4j4O5km1j5orj6
4877d5J1%J1l3M9MKJ4j9lJ3%k4M0m1j0K6K0NL6n5%pk%j5N6m1jK8l6M2k8pL9m3
4913a4k5K8N9o9%k1L0J2nk4N0j6k0L5k5L4j2n5N2k6JN4n5N1n1oK7K7m0N1k6K0
4945D1j6m5L7j5l7L9M6n3L4m8oK6j4J9l1M4l5P3on5K3k1l6N0on2O1j2L0nrj3j7
4978ik0OJ2Rj0K0j3KNJk6LL0m2K5J1Kj5LJ9n1Q1j9j1l2k4N1K3j1m8mJ0oN1j3l
$$ y = [-21, 13, -10, 36, -23, -10, -1, -21, -3, 0, -35, 19, 18, 6, 48, -21, 23, 12, -31, -21, 24, -45, -5, -18, 10, 43, 10, -18, 11, -33, -38, 7, -46, -21, -25, 11, 35, -27, -34, 22, -12, -7, -39, -34, -1, -20, 13, 16, 13, -9, 4, 35, -12, -10, 10, -23, -58, -17, -42, 14, -19, 24, 13, 1, -14, 16, -32, -7, -2, 11, 35, 42, -18, 10, -47, -15, -16, -11, 15, 10, -54, -10, 9, 27, -4, 23, -1, -11, -31, -3, -12, -40, 19, -35, -23, -22, 69, 0, -19, 19, -13, -47, 1, -63, 15, -5, 48, -24, 10, 7, 12, -6, -57, -9, -17, -42, 2, 30, 10, -16, 9, 24, 21, -11, -9, 7, -7, -21, 44, 42, 1, -14, -20, -29, -45, -34, -34, -23, -56, -7, -3, -1, 13, -6, -9, 4, 4, -20, 20, -21, -31, -5, 15, 20, 56, 1, 1, -6, -8, -8, -23, 33, -8, -9, 19, -17, 25, -3, -10, 29, -14, -39, -11, 48, -21, -21, -42, -12, 0, -5, -29, 21, 5, -15, 20, -5, 29, 17, -38, 14, -12, -11, 43, -12, 39, -12, -18, 9, 36, -4, 47, 21, 41, 25, -20, 17, 2, -35, 4, 50, -3, 31, -17, -23, 3, -11, 8, -23, 21, -14, 59, 53, -2, 21, 0, -36, 14, 8, -44, 17, 5, 35, 30, 21, 8, -9, -29, -23, -11, -2, -12, 8, -5, -3, 2, 3, -23, -20, 10, -32, -7, 4, 6, -9, -6, 13, -38, 43, 24, 13, -19, -43, 8, 31, 20, -28, -32, -22, -28, 23, 10, 7]
5014GJ9o9L1M0k7K2K0m0jnM8n2jK7l3L8m9L7%J6n4lJ0L5pJ2k2KRJ6k9OkkJ9m4
5050b6O1o2M8l6K7mJ5j1L2m1Ko7M1j2rKK0LJ1j1K2K6k7Kl0N4l4%N9m0m7L6rjK4
5085A8m2J3N8k2l0J1jLkj5jOnM9p4N6n2O5l6NJ9j0j4rKn8N5K1l7K6L5m9M1n3N8
5120C1q2M9JM0l9J2ql2M4o4P6m3j1M3m2N6l8J4k2J6l7N1l9N6n7QKL1K4n0J4n5
5152e1R0m5Pj7pK3j3j4M5no7J6P0p6N2J8l9L0k4j1j6N3m9N3j7J5J6qj2p8N8j5
5184a8P0o3K0J4l0J1l0M2k1QK7q1K7M1n1L2l7L3j7P6q9j5L9l8M5K2k7K3n1K7Q
5215cLk8K3L1j6k0j4J1J4l0K6Qk6L1n2K7j6MRj7M8l4J2J1K0k4j6j6K7J9j9LJ7
5248A3K1J5m3j6l0M6J6Ml8J3mnk5J2Q4q3kK7m2K1K1l4m0O1L4n8L3RJ0l9j7K7k4
$$ y = [7, 26, -43, -12, 28, 1, 23, 43, 3, 2, -3, 45, -7, -8, 19, -14, 24, -25, 12, 12, 28, -26, -29, -19, 16, 9, 21, -1, 1, 10, 26, -3, 3, 1, -1, 18, -26, 35, -27, 21, -15, 12, 8, 23, 12, 44, 3, 5, -62, -21, -33, -42, -40, -20, -17, -6, -17, 5, 31, 4, 6, -24, 30, -4, -4, 55, 15, -32, 4, -5, -6, 18, -24, -11, 47, 25, -5, 6, 5, 8, 6, -9, -10, -4, -9, 40, -34, 22, -30, 35, -1, 4, 23, 13, -1, -10, -8, -66, -11, 10, -27, -1, 34, -15, 26, -27, 31, -51, -2, -1, 39, 0, 12, 4, -28, 16, -48, 28, -15, -26, 17, -25, 31, -7, 7, -15, 1, -36, 15, -24, 32, -25, -17, -15, 16, 40, -10, 4, -51, 39, -6, 1, -16, -23, 0, -13, -27, 18, 13, -54, -38, 32, -44, 8, 26, -13, 17, -7, -18, -34, 19, -30, 23, 6, 21, 37, 29, 17, -61, -3, -18, 52, -11, 9, 23, -7, 4, -26, 16, -5, 3, 30, -51, -24, 17, -34, -2, -39, -6, -23, 53, -36, -51, -12, -50, -5, 17, -10, 13, -38, -11, -3, 0, -28, -5, 26, 10, -10, -24, -13, 1, -29, -3, 5, -21, 10, -42, -15, -31, -27, -18, -35, 13, -21, -9, 2, 22, -2, -18, -34, -7, 12, -7, -4, 13, 34, 49, 6, -10, -40, 6, 22, 26, -12, 1, -3, -8, -33, -21, 63, -20, -22, 5, -37, -16, 5, -29, -69, -8, 26, -32, 1, 10, 20, -19, -36, -9, -33]
5281c3M3j6L9m1L2j5j9L7n4M6J5n7MQJ5l6M8n2Q1l3LLp0O4j0PJ6p9Q9n5Qk0O0
5314B8l8k2PNlQ1Qj07RMK8NM0m0nj5J0L5k1l3L6Ln9K1N3m0JMj6J5j4M6l5M9o1
5349b1L3M3j13K8L0j7M0J5k5M3m8lj0%K2Qk3nOom1O6j9jm0N0k5oL4o1P4j1l4J0
5383gJJ9j5l0L6nMJ9j5J3l%j4K6o5O2k3J7l5k0N6j9J3q0M0M1J1qp4M5L8nj9J6
5417B0l3K8kjJk4jNQj7MlL1k7l6L6oJ6M1l5k0K3k7qJOJ9oj4K7qJ6j9O8q6P2p4
5454b5%K5qN0n5N9j4j2l5K6n6N3J0l1OoJ0O1r3Q3p2M2l0k7O1k0QK9Mn6ML3k9k4
5488b9L1j1L0o7M7J1o6P3m6JK3j0qM5%l9kO9n8k2rO0l9qL1pM3k8k0jK8k1k2jJ5
5523gokK9j5k3O7n3j9O5p9J7K4rKN0l4J2j4K0M4k6m4rll8K6N1j3J0Jn7J0J2kQ
$$ y = [-33, 10, -6, 33, -8, 24, 9, -10, 27, -27, 19, 34, -23, -19, -11, 4, -32, 16, -36, 45, 12, 15, 18, -52, 12, 2, 9, 25, -54, 35, -20, -12, -32, 28, -10, -32, -25, -20, -23, 58, 66, -41, -32, -28, 0, 5, 45, 5, 0, -15, -5, 30, 9, -24, 12, 15, -44, -23, 30, -10, -9, -5, -21, -6, -20, 26, -9, 40, -21, 12, 55, -58, -30, 0, -17, 23, 38, 13, 56, 8, 5, -5, -5, 17, 25, 2, -3, 3, -3, -44, 22, 3, 2, -38, 12, -13, -19, 15, -46, 28, 17, -17, -7, -6, 13, -2, -32, 4, -1, 3, 22, 7, 20, 17, 17, 3, 29, -36, 26, 3, 20, -15, -35, 21, 2, 15, -65, -25, 16, 27, 19, -55, -10, 28, 23, 4, 20, -13, 15, 13, 12, 13, -11, -12, -7, 1, -16, -12, -15, 16, -11, -47, -11, -17, -1, 40, 5, -15, 8, -19, -27, -26, -20, -1, -7, -21, 6, -2, 14, -5, 63, -23, 49, -25, -25, 0, -8, 42, -13, 46, 32, 20, -15, 11, -45, 8, 18, -13, -7, -13, -3, 58, -35, 48, -24, 18, -12, -39, 22, 2, 10, 39, 43, -13, -9, 24, -5, -29, 2, -9, 21, -46, 1, 12, -54, 19, -27, -26, -3, -13, -21, 24, 24, -15, -17, 52, -6, -28, -37, 23, -16, -24, 7, 0, 43, 15, -5, -6, 22, 1, -21, -22, -7, -13, -15, 14, -1, -24, 43, -10, -29, 36, -43, -26, -2, -11, -9, 41, 7, 19, 5, 25, 69, 43, -1, -10, -13, -51, -25, 26, 13, 23, 24, -33, -23, -11, -13, -5]
5558eL5n2K2pJ5k0LRJ4K9m1qK8m7P8m3l9K7j0Pj2k0J2K9l2L1K6JRp8K9k9k5J03
5592C9n9M4j2k1J1j7J7k7J7k0KJj0K8M6q9K3P3j2o6nnM3Qj5k8O3j5k9Ml4L7RP
5626H%%Rk6j0L4rl7qN8J8o0K9n9Q2l1k2N9Pm8n0N1K1p8J17o6N0m8M5k9j2Okn6
5660e7L6L5Mj9Pj4nqK1m3j1K1RJ2JN7l7Qmk2k1JJj2M9l8J5N3k8l2L7Qk7mPK1j7
5697Dk4l4O5lOk8j3L2k1L5l7qL4J6m1j9M2Lk4j4mL8qMk4NK9l5N5Po8mM3l9k1O0
5733Imj7Jk7O5l4Mj9J8mQJ6m0L3Rk3jK1l4L1m1K6ol6L8OnL7p6O4j9m7P4l7LRJ
5770CJPj9K0qJ7j1m9M0n9O0J2j6K0k2n4K1N4o3K9J0MRJ1l9Mrk2M4K3L1o1M8k5
5804A1L7l4m1M5n7L1Mk6M6L4mm5kj9k1K3QK2k9NL3Rj5j1j2m7P5%o5L0J%K7k1n
$$ y = [-5, 30, -22, 0, -7, 8, -12, -9, 0, 14, 43, 2, -6, 22, -25, 53, 10, -29, -2, -12, -5, -17, -37, -25, 4, -28, 3, 29, 30, 39, -39, -10, -39, -64, 39, -20, 24, 12, -9, 2, -15, 2, -25, -8, -28, -26, -25, -35, -7, 39, -50, -27, 46, 34, -32, -37, -42, 1, 9, -6, -34, 29, 14, -15, -11, -45, -8, 1, 8, 8, 8, 17, -9, -19, 15, 6, -31, -39, 19, 37, -23, 6, -53, 29, -2, -24, 35, 42, -6, -56, -5, 16, -62, 55, -11, 39, -9, 36, 7, -5, 1, -1, -57, -21, 14, 18, -1, 6, -8, -13, -21, 0, -43, -54, -33, -24, -12, -11, 46, 9, 17, 13, -9, -30, -29, -28, -40, 9, -29, -14, 39, 11, -21, 16, 24, -3, -7, 0, 21, 4, -20, -54, 11, 8, 14, -14, -27, 5, -16, 19, -18, -26, 8, 24, -17, -36, 6, 9, -15, -29, -33, 5, -3, 1, -23, -18, 11, -24, 31, 38, -30, -34, 9, -30, -51, 9, 5, -12, -11, -38, 27, -7, -3, -22, -4, -8, 0, 16, -24, 9, 18, -5, -6, 15, -19, 12, -29, -3, -9, -45, -7, -1, -6, 31, -45, 19, 0, -47, 27, -10, -7, 2, 3, 4, 11, -8, 12, 4, 21, 10, -39, 1, -58, 2, 14, -2, 18, -4, -58, -37, 17, -46, -17, -7, -3, 6, 17, -22, -18, -27, -49, -5, 18, 49, -12, 36, 11, 48, 14, -27, 18, -39, -8, -4, -30, 16, 50, 46, 1, -1, -20, -41, -18, -10, 12, -17, -12, 21, 30, 15, 4, -8, -55, 20, 20, -45, -15, -14, -14, 13, -8, -13]
5839a3Qj3RM8m5k2J2j4M2k3J1l1K9Pr1Q8j0k3M8k2L4l8qn%kJ6J9n8K4%PK9J2m3
5874a8K9ml8J2OK2J4l1rj6J7K3j6m2j1M6l5L5J9pJ1pk2L3m2L3l6M7j1j0l6K4J3
5907gNj8k4K4KJ6kLJ3K0m8K5j8J9pk5M2o9L5j7RQN4l6Ql4j4M6l7M4m5K6kqM5l4
5943al1K1k5K4Nl0K6jL4l8J1ok5K9l7N6k1LoOJ0j7nk8Q6j10L9L9l4L1k5MNK5k6
5978a2J8k5J3l5P4k5m0jJ7jk4K0J1L5l5l6L4L6j3j0Mj3RLj0J6Rk9k1K8Pj2M5k8
6012IJ3q2N1j3k7N4L1o6J7J3j2Pk4L3j7K0j3j0K0rj8k6M4M2l0Mn6N7n0O4ro4O7
6045B0m7L2Mm4K1K9l5OOQJ3j7K2j5j4j5j2K9J5m8Q0p6J1L0m6N6j3k4K3L1l5RL7
6078D1p2L2j6QJk9Qk7L3L2j5J2l1L7Op7L9L4Pl5O3m0m1J3N4km1J4qL3j9kkm8L3
$$ y = [-13, -5, -18, -9, 39, -6, -28, -16, -30, 12, -11, 0, -31, -2, 5, -86, 2, -8, -31, 17, -5, 29, -9, -17, -22, -22, -24, -8, 11, -47, -23, -23, -16, 13, 25, -18, 11, 7, -31, -19, -13, 9, 23, -8, -17, -33, -16, 7, -9, -51, -62, -16, -51, -16, 3, -4, 7, 0, -22, 11, -31, 2, -34, 13, 2, -8, -44, -20, -7, -2, -20, -44, -20, -18, -2, -4, -1, 12, 32, -16, 9, -9, 10, 3, -22, 20, -49, -14, -31, -22, -14, 40, 4, 12, -22, -36, 10, -27, 17, -28, -2, -4, -12, 33, -1, -32, -11, -36, -12, -7, -37, -11, -12, 22, -16, -5, -11, -36, -7, -44, 12, -9, -6, -12, -6, 4, -13, -18, -46, 40, -70, -31, 8, -26, 5, -20, -16, -11, 14, -12, 6, -19, -6, -41, 33, 8, -32, -33, -16, -17, -41, -21, -10, 25, -10, -46, -12, 24, 11, 1, 5, -8, 1, 4, -6, 10, 19, -10, -31, -3, 4, -8, 37, 9, 22, -60, -9, -22, -49, 5, 36, -30, -13, 0, -12, -5, -29, 4, -13, 7, -6, -16, 4, -5, -23, -49, -5, 37, 7, 11, -45, 12, -38, 26, 17, -47, 20, -27, 5, 9, -35, -14, 15, -20, -14, -8, 0, 13, -4, 18, 3, -11, -26, -38, -9, 6, -42, 38, -38, -27, 3, -43, 13, 0, -24, -1, 30, -5, 4, 41, -31, 1, -15, -7, -6, -35, -27, -54, -21, 11, -4, 8, -23, 14, 20, -57, -18, 16, 23, -12, 51, 11, -30, -17, 37, 35, -6, 8, 0, 33, 14, 12, 10, -38, -5]
6113ej7j6O7n4K0l1L2J8l9M9mj7j8l1M1l6L2k6O0n6L4k2%OK3QK2l5%Lm0L1K0k9
6147a0j9J5K4n0K8j2k7P3l3L1j2k1K8rm3L4l1J7Lj7J3k7O2l5J5J0l3O2o2M9o6
6178d3NL7K0J4k8L1k9n5L4MmqK1K3j5J3o2M1J3Lqj1J6jL2n3JLK2k9K9n4M7l7K
6213b6O3q9K9J3J2k5NM8j1jk0LJ0qk6N6n6O3k9k5O1l6j5J0j9J2M5qj09M7nN2n1
6246c0L8NK9m9k7O2l3JN6m0no8Q9j9mM2j3m0j0Qj6L7l2L2j1K2k5J6l3j0%N2n8
6279c4L3M1l2j8K3Qk7Pm9N0MR%n6J5k2N2j5OK8l5Nk5K6qLPL2l8Nj2%nJ5j3k9K7
6316b2L4j5lj1OnJ3k0lj8J1K6qJ5K1m0K4LM3r7K6L6j9n7J6L3KM9r0RJ2N7l9l2
6350d3L7j3L8k0l2L7J1j5q2J11l8J8j9L6Mq5O1j5K1o1P6l7K0J5n9P1m7J7l0J2
$$ y = [-5, -22, -38, 29, -25, -5, -36, -4, 14, -25, 24, 20, 3, -15, -46, -5, -41, -9, -35, 25, -31, 3, -19, -19, -13, 10, 18, 40, 5, 5, 8, -32, -1, 19, -10, -29, -14, 10, -40, -12, -24, -51, 22, -11, 20, 8, -13, 15, 6, -37, -3, -34, -17, -14, -31, -18, -45, 17, -18, -3, 7, -26, 36, -26, 23, -43, -38, -1, 19, 33, 5, 36, 7, -48, -14, -10, -14, -22, -1, 22, 7, 20, -42, -1, 12, 15, 7, -4, 12, 11, 43, -10, -9, -6, 16, -13, 16, -38, 9, -28, -26, 37, -52, -23, -10, 2, -23, -18, 30, 19, 18, -2, 1, 11, 3, -23, 33, -23, 40, 11, -14, 47, 11, -4, 6, -13, -1, 44, 36, -73, -26, -31, 21, -30, 8, 13, 42, -7, -34, 28, -5, -4, 52, 12, 7, -61, 28, 9, 5, 47, 34, -6, -16, -8, -24, 13, -19, 13, 2, 24, -1, 15, -18, -28, -28, 24, -34, -1, 40, 8, -10, 13, 21, -6, 1, -48, 2, 6, 15, 15, -41, -26, -48, 4, -11, -5, 23, -12, -7, -32, -6, -14, -11, -4, 28, -10, -5, -17, -17, -22, -7, -20, -49, -22, 12, -3, -6, -17, -11, -16, -3, -23, -26, -44, -33, -7, -15, 0, 21, -19, 5, 8, 51, -46, -20, 16, -3, -60, -44, -11, -9, 40, -50, -41, -29, 28, -11, -43, -6, -19, 19, -1, -33, 4, 15, 0, -82, 29, -9, 9, -10, 26, 30, -55, 6, -9, 12, -49, 27, -10, 10, 25, -34, 37, -10, 7, -23, -11]
6380a1Ok4kK4J9m0L1K5j8MJ0qnk3L0l0j7JPM8n1L8mj8JJJLnj4OM0k8L2n7K6l1
6417c3J6N6m4jL2k7J2l3M4m2Q9p5J3j3k3N2m1J3l7N3kl7K3qlk1N0Ro6K1J1mL1
6450A5p4Q8n5J2m1P8j4j1LNm4K6K5l5KL0l2M8rl5J9J3ql9O0k8M0k0k5J7j2k4K6
6483Am9K5k7M0J9KoJ5j0n8M7L5l5pqL5l1j1M1o2L8M2j8kk3Ok3J8mM8m4k3O2n0
6517a7L0l0j1mL4lmnK0Kk1J7PjqKJ3k3j0J2k3K5kj5L2j6Mpjl5J0lNK5j0PK0j6
6555@j3J4j5pK2k8M0%k7mL2%l2P8r1K8l2L1NJ7l0JJ5j1j7qL0Qj9K9l9lJ4QK8q1
6591e7N6J9ok0L5oj5Rm2J7J1k9M8J3l5PO0r0M3k7l0K8nl4M8J9l5L7j0K0o3M7k1
6624hJ5o1jK8J1L6l0J0oJ2L1q8L2j3K5QJ6l0L3no5%J5k1M3J5j4k3J3m5N3J3K3
$$ y = [-11, -5, -29, -31, -7, 12, -28, 3, 28, 10, 14, 24, 16, 11, -12, 18, -12, -29, -28, -21, 27, -24, 14, 10, -8, -7, -6, -5, -2, -7, -21, -15, 25, -3, 29, -28, -2, -33, -17, 39, -5, -6, 26, -1, 11, -22, 22, -20, 69, -6, 7, -6, -29, 23, -18, -5, -42, 11, 9, -28, -5, -13, -16, -37, 13, 22, -44, -23, -12, -16, 15, -59, 29, -26, -14, -55, 23, 9, -2, 1, 6, -38, -12, 13, -22, -20, 10, -22, 26, 17, -18, 1, 14, 6, -33, 27, -1, 39, 19, -6, 11, -1, -25, 1, -48, -23, -50, -10, 9, 11, 5, 20, 10, -48, -1, 34, -1, -8, -16, 19, -12, -23, 18, -44, -6, 36, 18, 16, -7, -1, -24, -6, -10, 38, -6, -29, 33, -17, 13, -17, -28, -32, 2, -1, -5, -10, 10, 12, -9, 8, 15, 14, 6, 8, 21, -2, -12, 0, -23, 2, 0, -15, 17, 1, 5, -2, -3, -38, -28, -31, -26, -1, -11, -4, 16, 0, -13, 1, -14, -21, 1, -27, 13, 13, -14, -18, 14, 14, -18, 60, -31, -3, -35, -4, 1, 18, -12, -11, 4, -7, -24, -32, -2, 6, -13, 16, -23, -26, -12, -4, 24, -57, -1, 18, 12, -8, 27, 21, 6, 15, -27, -10, 1, -28, 20, 33, -2, 5, 65, -25, 18, -9, -39, -11, -16, -50, -2, 17, -18, 19, 9, 29, -34, 13, -8, 7, -54, -55, -27, -16, 20, -10, 0, -6, 6, 37, -51, -19, -32, -7, 1, 17, -13, 20, 15, -50, -50, -35, -56, -13, 2, -12, -35, -22, -67, -14, -1, 22]
6657B2J0l2k8N7rrl6j3N4k8j1RkM4m2J9j2m2N1l1L7l7J4J3Ok6P3m9qJ6K3r4M0
6690b1L7m5J9K1m1O3k7J9jl1M6p2K9k9jRL5rl0K5mOM3m3j4j4K5j2J5L6m4L2k5
6723cPl0OmM7l0pK0J1pk0kQMmNk7J2L4M9p9j1M9nl4K4k4k8L6j4M1%o4K9J1J3j9
6760fK0m2K6K1qlj1k7L4l8J7k2N3k7j4nM1K7q1N3j6J5m1J1K4j8M0l4pL5o2K2M5
6793B2k8k8J5lJ8K0J3m2QK8n4K9k9K8j3J9J6k6j3L5LK2n8L1K2n1j9k4K2J4j7N4
6825A4K0j8k7M3j9NpJ6Nk2OK0l5Ql3KK5j4K4j1J6k3pk3M0l4OJL1M8r0M6k7N7o3
6860b0k1O6m9L4qJL8Lm8L0K7n2J5Pkj8J2j5J6j3l0L7j1J4j1mk2K2L2o5L9L3l9
6893bL1m2K9n3O4j2k2j4lP0m5j5J8J5J1k1Kk0j9K8O4o2%K5n6J2J4j2L7l5K7qM
$$ y = [22, 32, 0, -28, 29, 20, 11, -25, -38, 16, -12, -23, -14, -16, 28, -14, 5, -7, -49, 2, -29, 8, -29, -15, -2, 4, -22, 51, 2, -6, 10, 33, -61, -21, 16, -29, -10, 11, -30, 33, 6, 25, 24, -7, 39, -33, -4, -33, -34, -25, 10, 1, -29, -4, -8, -2, 41, -2, -16, -30, -5, -17, -2, 34, -10, 22, -3, 4, -26, -20, -24, 23, -7, -14, 6, 17, 10, -10, -12, -4, 0, -4, 1, -26, -14, 20, 69, -10, -21, 28, 23, -11, 13, -11, -39, -3, -17, 24, 24, -40, -11, 0, 13, -6, 14, -28, -2, 19, 11, 8, -3, -30, 4, -34, -17, -39, 14, -13, -27, -32, 9, 36, -45, 8, -8, 7, -34, -23, 1, -17, 23, -11, -18, 17, -45, -23, 22, -6, -34, -19, -22, -4, 16, 29, -13, -5, 23, -31, -2, -31, -3, -16, 3, 19, -7, -20, 15, 18, 40, -18, 13, 35, -16, -35, -59, -37, -23, -40, 14, 34, 16, -11, 32, 13, 18, 11, 27, 32, 10, 16, 36, 1, 9, -24, -22, 3, -11, 13, 2, 18, -5, -12, -35, 5, -29, -23, -22, 9, 57, -33, 13, -14, 43, -20, -41, 25, -24, 10, 2, 3, 41, 44, -4, 26, 53, 1, 16, 23, 21, 3, 15, 0, 16, 3, -27, 10, -1, 13, 2, -2, -24, -2, 30, -35, 4, 37, -2, 29, -13, 16, -37, 27, 15, -7, -21, -24, 46, 1, -14, 4, 19, 30, 9, 11, -9, -28, 0, 64, 2, 2, 27, -29, -17, -3, -15, 22, -13, 14, 6, 10]
6926A0k7K2MQll4N6j7k6n0J5O2n7L6K5J0l2KM4l3k0OK8n3RL7j8l1O5j7M4l3m2
6959a0jJ3k8P6k7j9KNkrl9O1RKk9j8J8rM6o4N4k7K4j9l0RJ3Jk7rK8j0L3j6lm2
6995d4J2K9L0l7J0L0j9J9l0l0L8o0N7J4j1K4n6K1jK5j5j1N7m5J3m5PklJ5J6QJ5
7028C1oj8k1OK3k1N0n1Lrlk5N8Mj8K9oomPpl6kL1m3J3M9m4J5J0n1K5J6Nk1JJ1
7065eJM9l4J1j6n3Q3n7M0J2j7k2j3L1k9k1L9J2nn3M1j3RjL2o9K4M5n5MP0o6O6
7098D0k4l0mPK7o6K8L9jJ4k7oJ3m6K6J8l7mL7j1N6n9J7n1J2M9m1N1n2Rk9M1l5
7131c9K6m0L8L7j7Rl9j5K8M6j7jk1j8J5oKL8Jk9L4m8L2l5j0K5pL2k3Jj4rL7l3
7165b0K8k4K7j3k7J1l6N1nK4l4KK7n2NL6j0K0q1L5PK4l2M0l4JN2l4K0k2k1QNj7
$$ y = [10, -17, 5, 9, 17, 14, -20, 36, 19, -7, -57, -42, 20, -37, -1, 24, 34, 2, 4, 48, 15, -5, 1, 29, -24, -15, 22, 4, -27, 38, 21, 65, 32, -10, -11, 2, -26, 50, 23, 4, 6, 11, 9, 0, -39, 22, 31, 33, 4, -14, 4, -5, 41, -23, 31, 4, 28, 9, -21, -12, 1, 2, -25, -34, -6, -16, 17, 1, -2, -44, -32, -3, 27, -10, 0, 30, 11, 30, 0, -30, 8, -52, 5, 19, 8, 32, -24, -3, -4, 21, 6, -5, 52, 7, 20, -25, -18, -20, -23, -8, 8, 16, 31, 25, 7, -14, -8, 15, -6, 44, -7, -4, -13, -16, -41, 17, 21, 3, 32, 26, 20, 16, 23, 16, -20, -22, 9, -34, -21, 28, -16, -1, 9, -42, -17, -1, 4, -17, -16, -5, -4, 45, 11, 22, 6, -47, 36, -21, 19, 31, 14, -8, -21, 10, -19, -40, -1, 11, 6, -47, -6, -19, -10, -11, 21, -48, -24, 21, -34, -30, 40, -26, 40, 16, -14, -18, -11, 16, -50, -22, 17, 16, 30, 3, -3, 10, -36, -10, 8, -29, -33, 4, -7, 49, -10, 7, -44, -32, 17, -24, 27, -25, -16, -45, -4, -39, -13, -53, -15, 22, 5, 14, -25, -40, -12, 34, 17, 16, -5, -23, -8, -14, -12, 26, 27, -2, 32, -16, 16, -19, -29, -4, -11, 21, -2, -1, -15, -24, 13, -20, 8, -16, 11, -2, -29, -18, -54, -3, -8, 16, -18, -16, 11, -41, -36, 0, -10, 10, -71, -36, -29, -5, -37, 3, -31, -30, 22, -12, 8, -14, -35, -27, -22, -39]
7199c9QL3Rj3rJ9m4K6J8Ql1r%L0j1l6K7N9p3L6KmrL6n6M9n0M9k5J2l3J0Rnj8L1
7235Fj2j8N1m0K2j0RJ2j0n2Q6n4j0M2m4L4k5j0LJ3kMJ3J1j6l9P5o0L0mJ9J9n0
7268gqL1k3P0r2K2l1L1J7J6j1J8n9M6K1l6m2NL8j2k8L0K8l3J6k3K2l3L7l4J8k6
7300c2%K4qN8p1K0K5j7QMK7k4m9O0l1L4J3m9Rn0N6kl2K5j0J3J0l2L9k8L0M0m4
7333A6J1p4M9K9Nm0J8m8J0J5M6l8Nj1Qk2PrL0l7j0M6M4k5pm1l2P0Qj3l6P6m0k6
7367a6K7n8L0m8P3J0j1j0l2K5J9j9j9j6N0nMn0P7m6j4J3m9N7l7K2M1p2K7L6k5
7398a6J9l0N2l1L4j8L2q5L9lj8N1o0O1j8j5mn2P8kJ7J9j6Pm6mj4NkL2j9Qk2Mj5
7433c2O9o4P3m2K8l2k0L3m8L7rLJ6n7O9n1N5o6N7l6l5R8o0M0nl4J7j9L3Om2K9
$$ y = [-39, -31, 2, 11, -2, -11, 8, -36, -10, 8, 16, -15, -24, -24, 6, -5, -41, -14, 45, -28, 8, 10, 6, -3, 33, -23, 26, -24, 25, 0, 12, -21, -11, -2, -7, -25, 6, -6, -24, 27, -13, 9, -1, 8, 20, 10, -42, 44, -10, -20, 22, -22, 12, -13, -23, -20, -7, -9, -5, 8, 19, 3, -36, 39, -21, 9, 5, 24, 43, -7, -15, 16, -7, 63, -29, -7, -38, -7, 10, 26, 15, 33, -26, 20, 41, 5, -37, -32, 6, -6, -34, -4, 24, -9, 7, -16, 6, -27, 10, -24, -6, -32, -32, -8, -16, 42, -29, -9, 16, -1, 7, 11, 38, 14, -35, 25, -6, 28, 41, -8, 1, -49, 7, 5, -27, -2, -12, 1, 11, -21, 18, -10, 20, 60, 16, 27, -47, 2, 31, 36, -4, 14, -34, -24, -9, 37, -1, 4, -7, 1, -21, -14, -23, 7, -30, -40, 6, 50, 25, 18, -23, -55, 15, 23, 10, -26, 50, 10, -16, 11, -47, -17, -65, 8, 18, 7, -3, -35, -10, 9, -10, -29, -45, 5, 0, 4, -46, 31, -15, -29, -16, -65, -8, -45, -23, 18, -54, -27, 9, -16, 3, -27, 25, -6, 28, 10, 42, -43, -4, -7, -25, 26, -34, 27, 9, -6, -10, -62, 16, 14, 31, 50, 34, 41, -5, -9, -23, -18, -20, 12, -7, 1, -21, -17, -32, 37, -27, 46, 4, 32, 0, -20, 13, -35, 2, -7, -4, 12, -45, 24, -27, 28, -38, 19, -17, -52, 46, -14, 26, 21, -13, 4, -15, 18, 24, -18, 11]
7465A1K8m1k5L2mL6l3L0o8M7k9M6Om2M6l9l4M1k2qK4m1K5JnPK8l4j7L3j8j4mK9
7499hk8M4Qo9P6n9M2kj9J8KJ7l7Rj9J1MKl9O3k5K2k9j7L7k4M0Mj2l4M9q0N9k4
7533a8J3N%K4j8l5J2J4Kj4J1k3k3N0oRk5J1K2m1LJ3L6pJ2rkK2m7J6okk9JJ8rO
7570a4J1K0M0q7%K3L7k6j2J4K6m5j6M6k5pK1pJrRk0K8k0OJ0N5q6O7l7jnJ8j0k5
7605b0L9j8jLK8m5J2K2j4j9K0L4m2j1K8k1kL8l2l3K5K0OL1r2N1rK6m8JM4k7L3
7638B7n1N5o1L5J1k5J8l3LL0%j0J9K7o4M3o2K6M4n8J6J8Lk6O0m6J4l0j9P3p8O5
7670B4j1j4J7l3L8lNm6M9o0L3l0N2Nm3J6LM0q4L5J8j7M8k8j1m2N2nk4JJ3omlL2
7705A7l2RJn9L2M5k7K2l2J8n3M3oM2l6k7N4m2ON1m2j7kN9j9J7k1%j9J0mnKM2j4
$$ y = [11, 39, -2, -27, 5, 1, 37, 4, 34, -34, 13, -16, 30, 36, -6, 40, 1, -33, 8, -14, -22, 2, -39, -14, -13, -18, -11, 17, -17, -34, -1, -19, -33, -37, -8, -36, 8, 16, -53, 23, -36, 6, 4, -15, 3, 5, 22, -15, -6, -25, -14, -10, -8, -47, 16, -9, 13, -16, -33, 4, -20, 20, 24, 12, -22, 27, -53, 6, -18, -5, 0, 0, 24, 6, -29, -17, -3, -1, -15, -4, -27, -50, 0, -6, 3, -22, -11, 11, -30, -27, -14, 22, 15, 27, 18, 16, 38, -9, 7, 1, -1, -30, -29, -11, -20, -14, -3, 17, 57, -30, -30, -7, 30, 4, -8, 6, 32, -13, -29, 17, -8, -15, 6, -1, 0, -9, 0, -20, 8, -12, -6, 4, 59, -27, 40, 3, 2, -3, 15, 5, -20, 19, 1, 0, 3, 31, -14, -2, 20, 6, -13, 7, 41, -1, -12, 16, -5, -7, 31, -1, -34, -9, 11, 17, 48, -44, 7, -2, 24, -24, -23, 21, -6, 27, -24, 31, -30, 5, 16, -9, 9, -24, -21, 9, 9, -1, 18, 45, -19, 24, -38, -12, 32, -26, -10, 8, 11, -15, 45, -1, 13, -17, -36, 37, -41, 24, 13, -1, 16, -17, 21, 18, 23, -23, 26, -34, -1, -31, 21, 26, -17, -1, 2, 42, -42, -7, 11, -6, 42, 14, 3, -39, 13, 8, -16, -15, -2, -8, -12, -15, 17, -15, -6, -5, -64, -32, 13, -14, 8, -24, -6, -59, -16, -22, 20, -16, -43, 11, -31, -25, 26, -16, -33, -35, 24, 5, 22, 1, 1, -18, -8, -12, -17, -15, 27, 13]
7740A3Pk4J4lJ0Nl8j3L6j1j1j6L4K3k9k6NN2p5M1J9mok6L6kjo6M9m4M0j9l3O0
7774cj2J2J0j2j2l5N0J0m9K5NlJ0J6j5l1M9n9N8l8LJm0M6J9K2k3k6L3j1rm0K8
7807b1lN3n0l0P1j8j0J3lpJ9j9L3j1m6J9K5l7k7M5K7j0j6mLoj9K0Jj7kJ0j0qq
7842d3Q7l8qr%k7J3M4Qn0J5RJ2L6m3ML2o6j2L5J2j5o8M1N7Lj5oj5JJ8MNk2pK3
7878A5J7l8m3L7J0l2RjL5Qn2K1QL3l2J1K6q5M3k3J1J2Pk8K3j2j8J3jQ4q3j8L4
7911iqKJ5l2PJ4J4l7L0j8Q5m3j2l8L7qN7p8RN3n4kk8M6Nm5M0mk2J5%J9m1pL0k5
7947c3O2k3J5j9N3l4k9k5L2k0RNK8k8NJnK8k6J1ok6K2kk3J4k6O7k9oL1J4j9No6
7982d3M2L5o2P5l5J7n5mN3p1J5jN9k1J8n7K6N6q1J7J8k3O%K5n1L2Rnm1N7No3J03
$$ y = [13, 20, -4, 10, 7, 17, 22, -16, -29, 7, -4, -15, -31, 3, 26, -3, -29, -24, 28, -47, -6, 13, 9, 3, -23, 13, 11, 10, -56, -7, -51, -11, -30, -63, -3, -15, -3, 7, -5, -17, -52, -2, 8, -41, -16, -11, -14, -4, 12, -3, -34, 15, -44, 14, -24, -21, -20, -60, -14, 5, 27, 4, -22, 11, 0, -9, -49, -21, -24, 29, -21, -51, 20, 2, -8, 5, 2, -5, 14, -5, 28, 17, -29, -10, 15, -22, -49, -4, 23, 13, -3, -7, -4, -10, -29, -9, -8, -25, -27, -17, -27, -35, -43, 44, 6, -2, -11, -11, -38, -25, 19, 27, -23, -8, 1, 13, 49, 6, 10, 42, -24, -36, -1, 11, -4, -72, -31, 26, 29, 14, 8, -7, -6, 12, 16, 21, -1, -8, 15, 32, -6, -49, -12, -2, -34, -25, -26, 9, 17, -35, -14, -6, 27, -5, 6, 32, -53, -10, -33, -22, -10, -3, -31, -8, -20, -38, -25, -26, 58, -25, -43, -9, -17, -15, 0, -32, -25, -11, 3, -34, -4, -22, 63, 20, 8, -30, 7, -1, 56, -22, -13, 40, -14, -16, -44, 2, 7, -38, 2, -2, -24, -9, -9, 10, -31, -38, -8, -33, 29, 6, 21, 2, 55, 21, -8, -33, -1, -21, -12, -7, 21, -7, -2, -1, -6, 22, -4, 7, 1, -25, -3, -5, -28, -14, -40, 27, -2, -8, 23, 37, 18, 23, -43, -1, 34, -28, 47, 12, 29, -26, -30, 23, -48, -33, -34, 25, 4, 22, -35, -9, 47, -34, -17, 1, -22, -16, -16, 9, -42, -10, -1, -6, -47, 10, 15, -48, 55]
8016E5j01O1k6N2m3m7J19j12K4rM5l9J2K8k6L4m7L9j4j3l7J5N7m1L8q0J9k4M6
8045a5j4K1J8k7J6l7N7l2k4K1L2Jn1LM1K2m6Km1J8M5k3J6m0J9K6Jl9M9j1jj4M2
8078C5k6kl6kK6qJ7K8j4l7L1k8Nqj2J4J6L5n6M7j5k7J9J1k3nL7j4k6K1j7NK9o
8112A4K9k5l7j5P6o4KK3J3K2k5j8Qk5KnM4np8M1L8pNk3J3pomkk4O2n0K9l8K4j2
8148b5k7L5M2m3J9k9M6j9L9k5qRNJ2l3J9p1K6L4k6OoM1l1J2k1j2P3n1K4l6K2J2
8181A3nK1r3L0NM2j5l0k1J9M3nL2l2o8J5j4P6j5nKOk3QJ7J7n0J0M4l2OK4qm0R
8216a7K9mo3J9J0K6l7N8k2K5k6oJ4k4K0LJ8k0Oj0J2mK5o0M6l0moj1K8J9l9J8K3
8250A6J9m9l8L8K2K3n7K2K2J8n9k8Q5p2K5j7J9L5m9P9m8k0jkK1J1j6l8O5o2K5
$$ y = [55, -46, 15, -11, 41, -2, -49, 70, -42, -18, -27, 18, -21, -9, 19, -7, 27, -20, 19, 5, -8, -45, -30, 27, -14, 24, -56, -37, -61, -15, -29, -8, 10, -17, -1, -38, 19, -13, -37, -16, 16, 17, -34, -31, 10, 32, -14, -12, -53, -35, 10, -13, 3, -37, -18, 8, 9, -30, 19, 8, 7, -7, 35, 9, 7, -29, -31, -5, -13, 4, 32, 18, -19, 12, -16, -11, -19, -31, -17, -1, 34, -22, 25, 10, -17, 2, 13, -10, -15, 22, 8, -18, 3, -14, -9, 20, 14, 43, 18, -19, -34, 42, -22, -20, 3, 16, 38, 13, -5, 3, -22, -20, -25, 19, 14, -64, -23, 15, 8, 13, -10, 3, -4, -10, -14, -16, -40, 22, -28, 1, -37, -13, -25, -52, -17, 25, -18, 1, -28, 18, -1, 38, 13, 5, 14, 19, 31, -2, 17, -54, -28, 6, -20, -14, -20, 21, -10, 2, -19, -31, 42, -9, 15, -21, 1, 13, 8, 29, -64, -34, -29, 13, -2, -32, -53, -34, 9, 4, 36, 4, -64, -49, -63, 13, -2, -7, -5, 1, -22, -14, 3, 20, -30, -20, 24, -8, -2, 22, 14, -26, -17, 12, 8, -55, -36, -26, 0, -37, 21, -1, 24, -2, -8, 6, -18, 2, 5, 23, 3, 9, -1, 11, 7, 32, -28, 18, -12, -16, -22, -33, -5, 14, -25, -7, 16, 35, -14, -52, -14, 8, 31, -26, -4, 18, 36, -23, -51, 34, -38, -13, -30, -11, 24, -25, 54, 6, -14, -15, -17, 4, 15, -1, -39, 26, -36, -11]
8281a1L9l5K1qKk3K3l0J6M5n3MkqK7mnmK0kMj1LK7m3J7j5lL4l1N8r2NJ5J6j2J3
8318cJL2k6RJ3o6J0PN5j5K1k5j6k4N6n2jkJ2LK%k4L9np4J02n3PK4qMJ1k5rL1o2
8355e1J3O9m2J4j8oK6K0n6K3K1k8jK6K7n2j2K4L8j4k5NM4k0m6NJ9M2k8n6NK4j1
8388b1O4o8M1Kk0kk3M9l3k4K0Qm5N3K0L9j8k1m2j3M5qplK8l7k5O8k6j6oML2Rj3
8423A1l1O2m5K2k7j4R1n9n9L6M6m1J1k4RoJ2jKnL4k4L9l1K9k3m3L7j2j8L6%j7
8456cJ0J1r0O8M1j01P5k9L6l6N5k5K6l8mRk7J3k7J2N1l6K1onL0l0l4M7k6mJ3J0
8489Gj1k9K9m0J3J5J3j0J8J9l2M7j6n1L0j6%J5pKqJ2J8k6K7m8J3J5J2J0m9j3O0
8522A9nJ8k9L2o5J8K7J4l4L6p6L7Mnj2nNRM8m7K3J5km3J4j4%LJ2nKnJ6llplQM1
$$ y = [-11, 28, -7, 14, 6, 8, -15, 8, -22, -6, 39, -14, -10, -12, -20, 7, 3, -2, -6, 14, 12, 16, 5, 8, 35, -8, 9, -6, -9, 25, -6, 52, -40, -35, -20, -4, -16, -3, -2, 30, 4, 13, 26, -40, -30, -23, 32, 17, 38, 13, -3, -27, 29, -23, -24, -26, -14, -11, -9, -9, -33, 6, 1, -73, 29, -24, -17, 7, -1, 3, 14, -11, -20, 11, -51, -38, 31, -11, 3, -15, -21, 5, 25, -31, -8, 13, -15, -16, 10, 37, -15, -27, -3, 35, 21, -4, 1, 45, 25, -21, -16, 3, 45, 17, -39, -34, -10, -21, 43, -25, 16, 18, -2, -4, -27, 22, -11, -35, -15, -7, -52, 1, 21, 60, 42, 21, -21, -34, 11, 3, -4, -7, 21, -16, -41, 27, 1, -15, -21, -17, 15, 24, 11, -20, 42, -3, 19, -8, -22, 69, 10, -49, -13, 33, -8, 3, -21, -12, -18, -6, -7, -5, -10, 24, 0, 39, 8, 37, 14, -29, 8, -4, -22, 14, 14, -3, 7, 18, -72, -4, 37, -64, 11, -18, 18, -18, 37, 12, 38, 0, -4, 5, -22, -9, -36, -24, 27, -9, 12, 6, 1, 31, 1, -33, 14, -12, -16, -3, 7, -4, -33, -4, -44, -31, -16, -3, -13, 5, 24, -8, 39, 23, -28, 2, -14, -14, 1, -6, -4, -12, 0, 18, -8, 19, -29, -16, -1, 11, 21, -28, -41, 19, 14, 32, 3, 35, -30, -12, 15, 29, -5, 31, -45, -8, -4, -9, -21, -26, -21, -12, 36, -11, 12, 27, 25, -18, -4, -18, -18, -15, -3, -8, -6, -11, 5, 2, -1, -8, -11, -3, 38]
8561C8m4k6rPL4Nk8K0J0Ol1L8k1j7m2Q6rm8L6k3ROqK9j7Lj1j3%L5qQk5PL6p3M0
8598@j8j1N3q5P5K5q1QPJ9J2k1K9rN0j01M7J4j7Ll9M7o2O1j0k1L6l4K5j0J8Nj6
8631aJ0m9L2Nj0J0rL6j7J5j6J2j8l0ML9J4l6L7m3mjPL5ol8%K6m4M0m3j5L5j3M0
8666Dn6M9mj0Q9o6J1j2l3OJ2J0l8Q3m3mjL6k5m2M6J0l3L6j1l2mJ9J0l2QK4K6j7
8700A6m3K1nNj0L0j8j8j0J3L6pJ7m9j3N5j6m0M9Nm1JL3k2k7N1Lj6j6J1k1O2p4
8733c8K0K1pLk7M8l8KL8%n7K3J0qkM8J1Kk4nLm2J4l3O2k7rQl6M8j2J7l6O4o1k9
8769d9P3m5k1M6k8K6L0kk5J9Pj7ol1M5jjLm5J3J6MMQj2j3%Ol0L1k8N1n4J7Oj3
8805a6L3k8M5m8O2o4M0n2j0M7k1Pk7M9L2p0N0m4J8Rj8KoK4Qqj3K6l8okj5j2J6
$$ y = [38, -6, -32, -41, -34, 0, 5, -23, -3, 7, 13, -18, 20, -1, -18, -60, 26, 17, -31, 5, -18, -9, -3, -11, 18, 1, 4, -7, -20, -20, 15, 7, 15, -10, -3, 33, -40, 0, -18, -29, 24, -61, 14, 39, -42, -34, -27, -8, 4, -17, 12, 3, 53, -48, -1, 13, -4, -1, -40, 7, -55, 6, -4, -25, 11, -23, 2, -8, 10, 15, -1, 9, -40, -8, -3, -13, -3, -12, 24, 7, 22, 6, 18, 0, -30, -26, 13, 27, -9, 28, -15, -19, -20, -13, 22, 16, -22, -22, 4, -40, 0, -43, -58, -23, -36, 4, -52, -3, -7, -17, 72, 6, 17, 5, -28, -22, -10, 0, -38, 45, 2, -2, -3, 33, 8, -34, 12, 22, -11, 25, 14, -18, -22, -3, 7, -25, -17, 7, 33, 16, -27, -6, -11, -6, -16, 14, -4, -22, -32, -19, 17, 10, 27, -22, -35, 20, 4, -36, 13, 18, -23, -22, 11, -11, -38, 13, 16, 0, -16, -5, -26, 36, -38, -18, 3, -4, -1, -28, 20, -18, -16, 22, 22, -35, -12, -2, -10, -12, 36, 47, 49, 25, 20, 23, -19, -5, -38, 24, -3, -12, -4, -40, 8, -4, 13, -23, 41, -20, -49, 24, -21, -42, 4, -24, 2, 32, 30, 5, 24, 31, 14, 8, -23, 22, 21, 20, 23, -22, -9, 7, 11, 15, 23, 11, -2, -2, 4, -26, 5, -23, 28, -26, -9, -3, -16, 17, -11, 34, -14, 48, -16, 24, -28, -38, 9, -12, -5, -32, 17, 49, -21, 29, -15, 3, 12, -6, -4, -10, 14, 22, 14, 1, 27, -11, -17, -19, -34, -46, -30]
8839c0NN0l6k3O2Pk8rnMK2k9M6k4k8j6N2j7pJ1o6J02k7%Lk4J1J2m3K9K7l9qM4
8873B8k6%K0j3m0L1M4jl9L6j6n0J12j05N2m9L5Pk1M4m2l3L5OJ1pOk1L7l0k5K7
8905A3jjm8M0J7k5RRmj5M0j1o9K7M6p1P0k8N3m6k5J8j3j1qM7rol2J6j1O9n8N1
8939C3j1j3m0M9J4n8N0k9L5Kn2J1J4l0L6J2L6o0J8j7j6L7K8k1k2j8JK7n8L6N4
8970D8r0kJ5K9KJ5qJPj7M6p6K6QqlJ2j8L6m2L6K4j6j7qk5J8O0m4J2n6N4l2K6j1
9005BMKm5M5K0l9j4k6O1m1K2M6j5K3o8M1K5p1k3O9m5M4l0mJ8Qlk9K9jJ7j2Kj1
9039ALk8NO1j5j2m3K0J0Kj0Rl9P2n0J5Rj2Qm1J7J2k0o4Q7m0L0N1o3K8oJ0l5j7
9073d5J10p2N0p0J1K6oK3n3MM2j6j1k3M0m4M2o5K7JPJ3nJ8K3l1l0K2Omk4M4pj1
$$ y = [-30, -25, 25, -11, -34, 28, 35, 7, -2, -7, -3, 19, -10, 36, 12, -16, -32, 20, 3, -4, 7, -59, 43, 16, 16, 19, -5, 6, 18, -25, 4, 31, -8, -16, 28, 2, 2, 22, 9, -31, 0, 44, 43, 4, 40, 24, -26, 86, -19, 33, -16, 19, 26, 5, 49, 7, -26, 9, 15, 26, 19, 25, 4, 41, 11, -14, 13, 12, 11, -37, 3, 20, -5, 4, 13, 9, -6, 34, 23, -46, -19, 27, -44, 26, -2, 51, 5, -20, -2, -15, -26, -34, 13, 4, -2, -34, -18, -29, 40, -18, 33, 22, 9, -31, 18, 32, -26, 24, -5, 30, 32, -20, -9, 5, -25, 11, 23, 59, -1, 17, 0, -16, 21, 49, 28, 6, -12, -11, 16, -42, -6, 48, -42, -44, -29, 0, 2, 17, 9, 10, 17, 0, 46, -30, -4, 4, -4, -7, 5, -13, 23, -19, 17, 41, 25, 8, 0, -25, -7, 53, 9, 21, -35, 19, -13, 13, 2, 6, 8, -37, 8, 28, -11, -25, -51, 10, -31, -9, 37, 22, 45, -23, 18, 43, -28, -51, 18, -27, 17, -13, -17, 1, 9, 6, -23, 6, 5, 22, 10, 12, 1, 4, -24, -19, 42, 27, 15, -28, -8, 2, 4, -6, 3, -36, 36, -14, 1, 10, -2, 6, -35, -18, -6, -26, -90, -3, -43, -13, 38, -25, 3, -3, 7, -28, -45, 65, -7, 43, -27, -16, 10, 4, 27, -26, -22, 20, 4, -7, -30, 10, -34, 8, -57, -30, -29, -22, -9, -14, 4, 27, -4, -34, -12, -6, -10, -34, 10, 3, -8]
9107hk2J8j6N1l1jKJm7j1P0Lk0ml1L5pM6o1P2m5j2JMN6n0K9l2K1n6QK3L0k1K9
9142B4k9j5rRN3j6q4K2M5j2l2L0M2l9j1M3m2rM0j5K3lqp8P5k4J4qnK9k5jl2L8
9176a0Jk2N2L9l1k3J6m0NN3p7M8j0m0L0K0pNKk6K1Rnj9K3L9j11QP6o2M6mNOj6
9211Aj6K5J4l8K1Pj1koJj0k3J8K6PmJ0j5MK4j8j4j6M5Ln9K2j5lK2Rj6J5j6j5N7
9247C4n3L9Mp3O3m1J5P2p3j2M0L1l6K8k1k1L0o8J4M0j1OK0%l4M7l1K4m9QmL7j3
9280A2LLnk9nNM0k3jPm9Q4j5Mrl4nJmJON8m5j4%J9rK4j8K6l8j6Nj4JM3j7K7k2
9319cLj1J9m8N1oL4m9J0j2Jj3J3K9ok9M5n9ON0m4M5k9L7n8K6J1j6K1k1j6L3n6
9352d2L7l4M3j7J9K7k8J0j8K6p5L1M5o6L4j1jKJ6l7M1jj4L9j2rkkL7m7%j9J1L3
$$ y = [-8, -30, -12, -28, 23, -8, -9, -7, -6, -53, -64, 6, 9, -11, -15, -46, -11, -18, 28, -33, 39, -6, -18, -17, -13, 43, -7, 22, -10, 11, -45, -37, -14, 16, -5, 24, -5, -20, -29, -20, 33, 17, -67, -45, 0, -12, -44, -14, 28, -11, -22, 21, -21, -30, 10, -5, 18, 15, 7, -71, 4, -20, -6, -14, -19, 10, -15, -16, -48, -10, -9, -31, 21, 60, 29, 6, 22, -18, -13, 40, -37, 11, 1, -39, -9, 11, 4, 9, 11, -15, 6, 15, 10, -9, 14, 53, -58, -50, 26, -36, 10, 6, 11, 17, 1, -15, 10, 24, -14, 7, 14, 3, 1, -5, -4, -14, -37, -19, 7, 14, 10, 20, 5, 9, 33, 15, 1, -15, 30, 33, -26, -4, -19, -22, 0, 9, -7, 8, -8, -23, 34, -19, 20, 24, -49, 14, -27, -12, 60, -13, -25, 15, 46, 10, 38, 17, -4, 26, -42, -28, 12, 1, 7, 27, 27, -7, 40, 9, 33, -16, -8, -12, 25, 12, 15, 18, 13, -16, -21, -16, 24, 1, 0, 7, -42, 42, 27, 31, 22, -12, -17, -16, -20, -19, -13, 45, 0, -14, -14, 5, -4, 20, 2, 28, -10, -26, -21, -35, -34, 9, -8, 19, -3, 0, -11, 8, -40, 11, 5, 39, -10, 0, -12, -11, -24, -11, 18, 12, -17, 28, -31, -25, 25, -19, 26, -3, 34, -24, 2, 13, -3, 18, -3, -19, 14, -42, -5, -39, 4, -13, 6, 33, 5, 15, -3, 23, -52, -21, 24, -42, -8, -19, -20, -18, -2, -39, 2, 1, -13, 26, 14, 5, 3, 1, 38, -9, -9, -28, -17, 16]
9386A6m7K5J7m4OK0NJ7J3l3RqJ4o5O1J5k8PLnJ4q3P9M1o7M4l8KJ0J4m6M9j2mk
9421aL1j4qm0OPJ9k9K5K5o1K7nj6L0j5oJ2M9r0N3k8O8lJ0k3l9M3pk0Ol1K4QLj
9457Ik0oj2K0KnP2k5n2L4k2JM4p1J9PM5j9o3L2n0N7m2L8N1o1O6n6M%K1j7J2pL7
9492D3o8MN2k0J2k2KjpJ7k1%m9M9lL6j1N2k9n0J4j1J9l0N1k8KJ4j8Nk3K9kk1m
9527a7QRRj2M9m7J7Rpj2OJj4K1l5J1k7P5l5j2Kj3L9j2qnJ9K0p2M6Om7L8L4l8k2
9563a6MN1p1L1j5O6r1P1p4P4k6L3l2k5jJ6M3n9M2j8M4k1o4L1kK3P%mk1N1k8L3
9596E2Om7k1K8j7K1K7k0j0m0N8p6K4LM0Rk7J0lj4OLj0K8k5Ol7J6Kj4k0M9m3L2
9630dj7K3k2J4j6j2M1k2M5k1K3k4ML7p8M8l8L0mk8M1m7Ll3L3K4M4k3k3Kn9K0L2
$$ y = [16, -31, -6, 11, -33, -27, -7, -2, 15, 28, -5, 4, -4, 10, -55, 6, 21, -7, 0, 3, -2, 12, -71, 8, 49, -18, 26, -12, -10, 0, 14, -32, 17, 5, 1, -1, 30, 16, 8, -32, -26, -19, 0, -29, -4, 21, -40, -13, -18, -34, -4, -19, -25, -13, 36, -54, -1, -29, 39, 36, 46, 23, -16, 27, 20, 0, 6, -25, -1, 7, 10, 9, -11, -17, -29, -9, -7, -12, 60, 35, -17, 17, -5, -4, 40, -31, -12, -5, 40, 21, -42, -10, -60, -3, -45, -7, 44, -17, 49, -7, -3, -3, 18, 1, 13, 6, 43, -25, -21, 31, 11, 23, 1, 3, 2, -5, 12, -9, -9, -58, -9, -12, 24, 13, 65, 36, -14, 0, -11, 8, -22, 29, 1, 3, 17, -1, 4, -19, 10, 8, -13, -17, -9, 0, 9, -3, 46, -1, 16, 25, 18, 6, 12, 13, -1, 20, -15, -4, -31, 44, 9, -3, -1, -14, 25, 13, 5, 0, 19, 39, -33, 13, 19, -28, 10, 44, 6, -16, -12, 39, -32, -1, -16, 50, -41, 30, -44, 30, 4, 37, 5, -20, -21, -5, 38, -21, 21, 3, 47, 26, -38, -7, -9, 14, 21, 21, 17, -4, 47, 19, 52, 58, 11, -10, 18, 1, 22, 49, 29, 19, -21, 37, -39, -15, -12, 28, 37, 10, 20, 17, 3, 9, 12, 2, 30, 5, 11, -26, -10, -8, -22, -42, 7, -36, -4, -21, 2, -20, -6, -22, -34, 7, -15, 30, 9, 32, 8, 12, 49, -29, 19, -19, 11, 7, -21, 20, -27, -24, -57, -24, 0, 44, 21, -2, 0, -59, -39, -7]
9663gjl1J5L6oj9K1k2j0N9k6npj2j0QL1lok6M1m4K5L8k3n3L4pL2j1Nll6MJ4K0
9699A5j0j9LK3%lj3J4pnJ6l3J7L4k0Nnj3j9J2nO1j5m2K2n8K7RK1j8m9N4j9L9k1
9734bPK4p3N1Qk2j5J1j9j5M9K1P%Om5l3Q0n9L3mlL0m5j8J4J1%lk6K7l5pQ1p8M1
9770aPo2O0K2%lo7L6K1l0J2Mj9jO6n9Jl3O4pj4j3JL4Pl5kJ0J5jmMm7P7m5Ql7O
9808b5J2noK8j5RK1k6jK2jJ3j3J6mm7Jj9N4J3k0MQj4l3M3j7Ql1m7L9oK2J3j0J7
9844CJM0J4o1Lj5J2k6K7Kj0O8n5J3k4k4K3k9N0l2J1J4l0J9j1M9j7J0l0k3Kj4L
9877c7M1J6l5j3K9k0lQJ1NK3l8OJ0j1L2l3lrK6l3K9ol0N3n0%N3k7L3o9O5j0rK3
9912B7m0O0o2L0Jm9K9nL5l3pprM4n6N0K2NRl1L6q5L3k6QM3koqk9M3l4k1N5j8m
$$ y = [-7, -8, -39, -24, 12, 6, -13, 8, -14, -24, 35, 9, 4, -3, -15, -25, -17, 14, 11, 5, -21, 20, -24, 1, 39, 16, -37, -3, -10, 22, 11, 16, 13, -23, -19, -5, 15, 5, -14, -11, 12, 12, 9, -4, 10, 3, -2, 14, -19, -2, 32, 12, 17, 12, -1, -20, -8, -13, 48, 33, -9, 13, -45, -18, -9, 12, -6, -55, -1, -20, 19, -2, 5, 29, -44, 7, 15, -7, -22, -11, -30, -45, 4, 25, 32, 32, 38, -7, -40, 40, -19, 14, 10, 7, 37, -8, -26, -12, -1, -1, -4, -30, -3, -38, -45, 36, -42, -1, 6, -56, 4, 26, 26, 23, -44, -8, 13, -17, -5, -1, -20, -21, 45, -14, -13, -46, 18, 11, -3, -16, -15, 19, 26, -9, -11, -1, 14, 13, 9, 13, -34, 43, -2, 6, -31, -25, -13, -18, -24, 4, -11, -2, 19, -7, -8, 14, 13, 26, 13, 29, 25, -22, -21, -40, 14, 27, 7, 11, 19, 5, -28, 15, -2, 6, -25, -72, -33, -39, -17, -4, -14, 3, 4, 44, 58, -3, 0, -15, -3, -29, -2, 0, -10, 58, 3, 16, -8, -32, -9, -38, 12, -20, -9, 5, -25, -6, -17, 32, 15, 25, -5, -28, -26, -40, -37, 4, 20, -15, -28, 1, -19, -22, -14, -3, 2, 25, -13, -7, 3, -8, 24, -9, -12, -21, 5, -28, 1, -5, -35, 18, -32, -32, 21, -6, 27, -42, 23, 13, 4, 27, -13, 47, -15, 15, 16, -33, -4, -9, 26, -7, -14, -21, -30, 14, -42, 8, 30, 35, 44, 13, 49, -36, -3, -29, -21, 22, 20, 14, 6, -23, 20, -14, -35, 20, 2, -2]
9948blJ1l2M5k8Rj1l4P5n0N4j1l8J4n5L7M4l4L1rj8mLJ9jl2nJ2J2K0k9N5K8o0
9982A3j4Rn2MN3Om9lK1QKjl9O7n1K9J9l0j5K2J8J5j9om4L6k7qMM9k9q4Q2M0n6
10017c0O2p7L3Lrj1P0l9J5m8J5Pj2M1J1Ml9PpMk6nJ7K3k7K3j8k3L6j0K4k3j4J4
10051iK4l5oK9J7J0m1K3Qk9K4l1%K6nnk2jN7l3K4m5L4J3pl8NOorM6rjj8K2l2O4
10088E0m7n3O4m6O3p7K8L2J2l5qk1N2k6K4K8p3O7l4Qk4k0M8J5l4J8k3K0M2n1J5
10119A4j7O3q9N2qk7L9Kj8Lp1M7K8n1M5o9Q0o7M6k3L6J8l7j0pM0k9L3n6rN9K1
10151C8j9l4L6m0L3j7Ok0j1L4j6K8l4J9J3m3OK4pl4rN3n8N7l6K9K2j7kj1L2k3
10183aj1J4ml6K9J3k2J4J4k2on6O1j3O2n3OJ3MOokk3L7kk7j7K0J3k0jmOL3l8l1
$$ y = [-2, -5, 6, -26, 19, -9, 0, -11, -45, 30, -20, 34, 23, -15, -1, -56, -19, 25, -9, 22, 13, -5, -9, -6, 13, 12, -20, -25, -13, -1, 19, -10, 45, 73, 13, -1, 8, -44, -40, 13, 19, -30, -33, -12, -4, -2, -3, -42, 25, -26, 3, 22, -8, -23, -1, 17, 32, 13, 7, -37, -1, -28, -36, -32, 17, -12, -96, -14, 26, -30, 32, -45, -12, -9, -18, -29, 41, 2, 17, -31, -16, -9, -21, 20, 31, 35, -4, 3, -4, 0, -26, -31, -14, 9, -18, 5, -13, -36, 0, -10, 14, -9, -23, -9, 15, -20, -26, 3, 20, 30, -11, 12, 20, -9, 15, -16, -16, 10, 5, 0, -22, -23, 34, 1, 25, -20, 14, 27, 20, -18, -13, -7, -13, -22, 24, 15, 14, -4, 18, -14, 50, 3, -50, 14, -32, 31, -46, -18, 14, 26, -9, -17, -38, 14, -12, 12, 40, -33, 34, 0, 8, -16, -36, 12, 27, -7, 11, -12, 8, 50, -1, 14, -3, 60, -29, 23, 15, -12, 27, 29, 11, 14, -57, -10, 18, -33, 12, -57, 23, -44, 2, -21, 15, 33, -4, -14, -21, 19, -10, 23, -33, -42, 17, 38, 19, -15, 21, -19, 14, -3, 3, -17, -28, 6, -10, 18, -16, 3, 16, -27, -21, 3, -4, -38, -47, 6, -52, 5, -31, -2, 20, 3, 1, -10, 22, -1, -12, 2, -2, -38, -9, 4, -18, -4, 10, -12, -18, -74, -13, -26, 36, -17, -11, 2, 6, 12, 6, 4, -19, 18, 16, -11, -28, -8, 5, -15, -16, -20, -14, 19, -19, -50]
10219e0Q1j7KnK1k9j7O1lm4K9j9KJ0qqm9M3lPK4j3Pj3j0l0M9m3QK8J6p3L4J0K3
10254B1J5n8K1j2K7pk1M6m9L2j1mkL2j8n9J6%J0j1K5K7k0Pjk8O2o6L8l1J7NlK
10288Bl0NJ7J3ql8L4L4n3K9L5kn3MK0J9j1Lm2j6Q4k5l0L7l0k5M1ql7lj6J4J6M5
10322B5Nn3M5%k4j3j4L0rk9K2KL7j1l0j2J9ON9l7M6l6j4OJ5m9J1l5K3JmN7j1l1
10356cj1L2k5k5M7l0K8n7QM2J5l7J5J4k1NqJ1j7mL3K0k1oM8p1l8O9k1j2J6pRr
10390a1jJ0Ol0k1K2j3L5j1J2J4j7pj3K1j1Qk3K0L7Jn8K6j7N1Kl9k1K1L1l8nQJ4
10424CJ4m1M8j2j0k7L8J7k5Lnrj3K4j5Rj5MJ8j4J4j1K2j4j1j1OM5k8jpmM6j0j9
10459Ik0j7M2l6J0mJ7jj6K8p1M5K9j3j5J7k5K5k6PJ9l3L5Mj9jJ5j2PK0Lp3MM0
$$ y = [-50, 31, 14, 16, 11, 32, 3, -14, 47, 44, 0, 29, 10, 12, 22, 14, 6, -43, 0, -3, 4, 28, 15, 22, 9, -1, -31, 18, -25, -17, 11, 27, -46, -12, -2, 21, 36, -22, -1, -13, 14, 7, -14, 32, -17, 15, 4, 0, -2, 30, 12, -47, -31, -31, -21, -32, -7, 20, 0, 7, 6, -22, 40, -26, 12, -19, -2, 3, 0, 2, -28, -23, -6, 7, -1, -39, -5, 29, -24, 5, 40, 38, -15, -11, 9, 28, 17, 20, -22, -38, 46, 21, -9, 28, -2, -27, 14, 6, -31, -34, -50, -36, -20, 25, 30, -23, 22, 22, -2, -15, -29, 1, -8, -37, -15, -13, 24, 13, -17, -29, -10, -4, 55, 18, 64, 28, 14, 20, 35, -14, -3, -38, -15, -14, -18, 39, 28, -3, -14, 18, -7, -32, 15, -15, 13, -44, -36, 6, 21, -16, -1, 13, -8, -3, -11, 0, -17, -21, 12, 32, 11, 5, 53, -18, -56, 13, -8, -20, -4, -11, -2, -11, -12, -2, 4, -26, -47, -25, -38, -3, -14, -2, 12, -5, -12, -25, -4, -15, -7, -30, -10, 27, 28, -30, -4, -21, 30, 32, -7, -28, -7, 24, -14, -19, -11, 3, 17, -24, 24, 12, 2, -25, 13, 30, 5, 8, 3, -6, -19, 5, -10, -1, -16, -12, 6, -8, 6, -5, 17, 3, -8, -19, -13, 32, 4, 3, -4, -8, 38, 28, 9, -11, -28, 14, -22, -12, -16, 1, 0, -16, 12, -59, -14, 15, 2, -13, 4, -21, 4, -22, -15, 4, -29, 6, 10, -9, -10, 5, -7, 0, 20, 23, -50, -46, -6]
10493fNm5J28p6lJ6k7Nn0M1nj3J8m2K7N8j0k9j5J9l6J1J8KP4m9k6k1J9Q5j28Q0
10525B5l1k6L0k0K5Qrjk2kkM3j8k7J2pL8J5m0pL2l0PqKK3o2O5J7l2NL6l6Nl4n
10561c1L6pQj1Jkk5M8lk6j9K7Qm3N9m1K3J1j7M0l7oL8m9NKM6o5k8L9LK2oM9n5
10596fnK6k9J0l6K5K0j7Rm7O1k2kK8l0PM9l1j2L6l8l0K9oJ0M1k9j3PL0m2n3P5
10629A5MJ0n6J8J0j9LJ2joRj3J3M4k6j9JM5k9j0m2N8J0j9J4km5K1j3M0k9j8JL1
10663A2K6j0m2oK5k9L9K2j5m9Q0n6l8P6mp0%JO4k6K2k9j2K2k4K7kj4M4m4RJ7j1
10696Ej1j1K6j9K5jm5JJ6oL0qk1J4K5l1jn3P0K7J0q0J8L2k7J8pQrJ3l3k7P2k4
10730dJ0pJ9Mj1J4k1j2kj8K3rj2JQL5J4j9j6j3J9L2n0M5M%k6K7n0J0K4m9M5J8
$$ y = [-6, -1, -46, 82, 6, 3, 19, -8, -3, -53, -12, -17, -30, -12, -54, -27, 31, 21, -8, -23, -4, -40, -29, -11, -9, 65, 16, -10, -31, -12, 73, -55, 25, -6, -32, -2, -22, 3, 11, 2, 1, -21, -23, -25, 18, 0, -27, -15, -22, 16, 31, -9, -16, 16, -14, -7, -15, -13, 10, -52, 13, 30, -2, 3, 39, 3, 8, -26, -31, 5, -2, 6, -5, -4, -6, -31, 17, 14, -12, -31, -4, 4, -39, 20, -21, 2, 13, -4, 36, -1, -7, 31, -18, -13, -11, 35, -30, -58, -19, -16, 6, 0, 49, -6, -11, 15, -14, -4, -40, -15, 5, -12, -3, -50, 11, -11, -13, 15, -15, -8, 41, 10, -2, 34, -4, -34, -5, -11, -1, 40, 11, -2, 5, 35, -7, -60, 15, 19, 29, -27, -9, 1, -18, -15, -3, -4, -10, -1, -14, -1, 43, 17, -2, -1, 44, 15, 5, -37, 21, 31, 12, 26, 24, -21, 0, -13, 27, -2, -20, -19, 12, 38, 28, -14, -20, 5, -24, 15, 37, 22, -27, 53, -3, -41, 35, 31, -39, -39, -38, 26, 0, 22, -7, -19, 3, -21, 6, 4, -10, 34, -10, -1, 16, 5, -6, -17, 9, -10, 15, 14, -31, -30, -14, -20, 10, 2, -19, -5, 20, -11, -12, -65, 5, 32, 42, -38, -20, 12, -15, 3, -4, 4, -5, 8, -25, -52, 20, -4, 6, -1, 18, 22, 11, 25, 4, -8, -10, -28, -5, -14, -26, -25, -17, 18, 32, 13, -3, -16, 3, 35, -15, 30, 34, 34, 8, 35, -15, -5, 19, -30, 15, 33]
10764C3k7k0J8j4J2J2PM4o7ML1km0qJ0J2k1M1l3J7l3j1M5l2N8m5JL9k1l4L1l7
10796c0J4M4n1K1k3J9j7N8m5L8o2j9Q9q3K5rJ8J4k8O5j5l4RNJ6l8J7j4M8k4l7
10827b9J2NO2k7m6K9o4O8j0nlqM8k4j2Nk0pK3L7k2k9rL7L6p0J6J4K5Kj1oqJl8
10862b8L3J1PrpJ3j5L2o6nR0r8O4Ql2Mj2J0MJ4j1J3k9k0L0L5k1n6P1pl0K1j0J1
10896A5l0j2J5J0K4m9N3l1Ll3nM3j6nj1M7j7k2j4L4mRj1L3m2pkLJ5K1K8l9Ol6
10930b7LL5l4j3M8rjJ4l5LlOPkJ2m7L4jj9J9NrL2o9L4k6P0l7j4L0m1N4Mm6J9J4
10966A0j9L0m9L2K1j8PJ2n3R7o1j8J7j0L7m5M7m2m8K4PP6p6mL6j6%K8L1p8M1j2
10998DqNk5L3n2M3l1k6K3kPL9k8L5k3qj3M8l4K4k9J7J4%qj8L2o0J2J0l6K2O2k8
$$ y = [33, 6, -14, 4, -10, 2, 14, 21, 65, -2, 2, 33, 31, -9, -17, -7, 5, -16, 25, -8, 9, -24, -35, 10, -22, 36, -9, -8, 31, 10, -24, 7, -30, -16, 28, -23, -2, -25, -6, -23, 35, -10, 28, -34, -53, 36, -47, -22, -31, -13, 1, -27, 38, 23, -11, -2, 3, 19, -19, -2, -16, 32, 8, -29, -17, -12, 50, 23, -23, 6, -58, 10, 0, -5, -8, -16, 32, 8, -4, 1, -19, -26, -3, 34, 12, -17, -26, 11, 47, -23, -7, 7, 32, 34, 23, 17, 9, 10, -28, 5, 16, 23, 14, 7, 20, 5, 37, -29, -34, 56, -42, 22, 30, -2, 2, -10, 0, 4, 18, 7, 20, -9, -29, 1, 36, 15, -41, 30, 23, -7, 14, 4, 15, -15, -27, -12, -2, 22, -27, 26, -5, -2, -35, -40, 3, -13, -18, -29, 18, 1, -21, -35, -1, -5, 4, -7, 26, -16, -23, -25, -22, -7, 14, 42, 3, 9, -27, -24, 11, -23, -36, 12, 3, 2, 16, -19, -16, -19, -13, -6, -8, 4, -43, -9, -10, -29, -10, -5, -14, 18, -51, -17, -43, 27, -10, -24, 6, -35, 19, 23, -23, -4, 10, -9, 21, -28, 4, 25, 7, 14, 26, -27, 70, 9, -9, 8, -2, 35, -10, 37, -5, -53, -29, -22, 54, -22, -26, 10, -6, -6, 22, 53, -25, 16, 4, -4, 1, -24, 9, -43, 0, -31, -57, -34, -36, -29, 10, -18, 17, -6, -14, -27, 21, -13, 11, -18, -1, 13, 13, 5, -13, 19, -41, -29, -19, -55, -33, 29, 1]
11032ARqJ1j4Mj0%J0j6J4k1K0L8l5l7M1j6kK6m2P0n4K0K0l1k4J9j2j9L9j5J5J6
11065A7RJ1j2mm8K3J2jn7O7Oj6k6knM3ml6nn4N7J2jm9N6K5l6plJ8PL6n8K9Qn0
11101c8M7j3M5%n2L5m9L3l6M1l2K3K1o7NK0mJ7L3l6qk2L5m2M4K6m8L4J2j1Mk0
11133cj1J8j1l4NL7k8K7L2k4M7n9LJ2J2m8L0jJ9J3p8M7nOJ8n2J2M6kj6k9M4k6
11166AnooJK4k6k7J1L5m1%P2k9J1m1k6N7om2M9rLrrL0n2J5K8K5n1oJK5K2m5L3
11202GL0l8k2J6j6J1LL1Ok9l1O2J0pm3K0j0k8M5j0jJl5M3m1L8l5k0L5Nn0K3J0
11235b0JJ3K7Km7pL0%%L7m2j0N5m7k4K3qJ8j8L2%l8oRJ2npQL7j8K2k2k1Rk1MM7
11272B5k1l3K5j0rL5ol8N3k4l4RK2L5l0J4Ol1kKOPPLj9J4l8J0Nk6N9o6N3l2K4
$$ y = [1, 10, 2, 13, -1, 3, -7, -7, 3, -13, 1, -20, 0, 38, 3, -34, 7, -9, -11, 15, -27, 43, -11, 9, 29, -2, -26, -7, -19, -38, 1, -14, 1, 17, 26, 37, 25, 21, -27, -4, 8, 7, -50, 17, 23, 7, -19, -21, -26, 17, 13, -23, -28, -82, -25, -13, -14, -63, -7, 18, -18, -25, -28, -10, -3, 33, -25, 4, 12, -38, 9, -4, 41, 41, -11, 24, -25, 8, -28, 13, -19, 4, 25, -42, -37, -17, -21, -4, 29, -7, -15, -37, -2, -44, 0, 26, -22, 12, 24, 13, 17, -3, -14, 4, -7, -41, -36, 1, -27, 0, 32, 8, 55, -4, -1, 11, 23, -25, 5, 4, 23, 36, -42, 5, 0, 6, 24, -28, -16, 30, 28, 12, -17, 27, 1, -4, -10, -16, -15, 9, -17, -44, -33, 2, -39, -39, 33, 4, 15, -26, -52, 5, -1, -43, 6, -3, 0, -9, -18, 12, -40, -25, 3, 28, -23, -29, -28, -3, 19, -26, 7, 37, -1, -23, -7, -23, -12, -9, 22, 28, -1, -32, 30, 40, 33, -10, 10, 0, -28, 17, 7, 6, 7, -28, 15, -26, 12, -23, -43, -8, -3, -53, -30, -20, -19, -6, 21, 23, -24, -31, -1, -1, -1, 36, -6, -16, 39, -8, -32, -9, -17, 1, -17, 15, 15, -23, -29, -20, -8, -13, -20, -12, 25, 7, 29, 7, -14, -5, -26, -22, 25, 4, -29, -4, -14, -23, 12, 6, -32, 21, -3, -37, -28, -6, 29, -1, 13, 19, -12, -14, -12, -6, 1, 8, 11, -8, 6, -32, -22, -17, -43, 16, -50, 3, -29, -5]
11307eK5nm0K0j4J8kl1K2mK7j9Jrj9N4j2pJ5k4j0J0pK0j6LRk9L7l7L9m7J8rRr
11343b8K5J8rl3L6MMm0M6n1J7j4J3L3j3j5J4j1QK6m6L6j6k0kl5O0l0l0NJ7M4n1
11376c8K5lK0kJj8Rj3K0KJ6p0M7oKK0m2J3Qj5M4n8j4L2M2l4KO9o1rL2n5QJ3JJ2
11412@jk0J2M6nj1m3L0j2K9nK1l8k9PPL5J8q0RK9%l6rJ7rN3o6N7L6m3MJ4j7LK8
11448C1m1PK8jj6l8L3j7%M4k0J3m7K7qL9o7QN3k5j9OJ9j1J7j3oONK3q8O8J2m8
11482b6M5m7M6j7l7O8jLm3K6kk0L7k6K0j5k2J7LoK1m5P7m5qJ9Nl1o8P2K6l2l5
11515d1O4j4RJ4l6J2k5pkJ2NK0NK9k9J3l6l3J8J1NL1j5K9m0l2K4oM7l0J0J6k7
11548AJ2J2j5rLL6k8jj6J9j9LJ6%%n0J7OJj1kL4j6KJL4l7J3Lm2QO9r2M7J6k4j1
$$ y = [-5, 20, 15, -25, -5, -19, -1, -3, -34, -12, -16, 11, -8, -7, -16, -35, 19, 7, 0, 15, -9, -19, -9, -16, 4, -12, -9, 0, -29, 8, -29, 10, -37, -19, -28, -19, -28, -3, 15, 6, -27, 9, 13, 17, -23, 23, -28, -11, -25, -12, 21, 8, -7, 7, -4, 4, 30, -16, 20, 4, -16, -18, -53, 7, -23, -53, -48, -31, 13, -38, -13, -16, 4, 2, 3, -15, -6, -19, 1, 3, 19, -51, -4, -10, -8, 12, -30, -17, -9, -24, 20, -38, -52, -20, 22, -12, -10, 59, -2, -11, 21, -34, -26, -13, -12, 0, -1, -21, -9, 37, 32, 21, -22, 8, -4, 25, 20, 41, 3, -26, -19, -12, 23, 41, -39, -30, -1, -1, -37, -46, -29, -38, 15, -51, 6, 42, -1, 3, 17, 0, 3, 31, -10, -3, 25, 24, 8, -30, 3, -14, -14, 30, 10, 23, -24, 3, -5, 34, -33, -25, 28, 3, -16, -10, 9, -2, 15, 2, -4, 2, 7, 30, -58, 10, 22, -26, 19, -28, 18, 1, -36, 32, 31, 34, -9, 17, 15, -5, 32, 6, 26, 11, -11, 6, 9, 3, 24, -21, 56, 11, 3, 22, 27, -4, -72, 0, 26, -6, -41, 23, 9, 18, 32, -4, 8, -17, -24, -26, -14, -9, 11, 16, 45, 16, 29, -7, -40, -22, -11, -6, 25, 10, 39, -1, -33, -9, -15, 32, 2, 12, 28, 1, 13, 25, 10, 1, 4, 40, 12, 11, -5, 14, -5, -2, 14, 14, 14, -36, -19, -13, -12, -23, -25, 9, -7, -5, -4, 30, -7, 6, 9, -33, -25, 44, -48, -1, 15, -9, -20]
11585b0K3j0j1PnN0k5kK8n4K5P5r4K0o2J06l3Ln5N1l9L1Nl2j6M8j2J9k7pL3mj
11618A5NK4l1j4K2J9j8l0j3J4pO8l2j3l9M2m6N0Qk6OJ7j7o7R2l8M5k9MOk8K7M2
11651E8k9k2j0J9Lo9O8k7pK1j8QK7m8K8k8N4o9N5l0L0rj3NK6l1PRJ1l7L4l4L1
11684A3m4L1J2m8PL0m8M8ok7L0jQn0j1N3k5k7L4oNJ1Jn8O3K6Mo3N7lp1M9j2j9
11718c7N7%o4J6N3m6K9K3k5J2j3j3M7k9n9P2J3p8J2J4pK0Rl2K7J0l2M8j4Qo3K6
11750a6rK8K5k9J2j6L6n4NkN4k1l8k7P0k0j4L9j8oNMk5J7k2R3m8l4N8l6l9kM6
11783A6j4j2J5j8npJ6j9J5m1O0l2J3J2J8KLj1Qk4j1K7Om4N1j5J7k7oJnL6Jm5q
11818b7qK2j0K5Mk9K7k1K5rl0L7l4ML6m8Q9n8mLj6jlK7k0j9O0p6N6M0n6N2j7j7
$$ y = [-20, 3, -7, -18, -11, -16, 34, 9, 7, 35, -19, 6, 81, -13, 7, -55, 51, 18, 21, -34, 17, -22, 9, 14, -18, -34, 14, 2, 21, -6, -13, 20, 16, 15, 20, 44, 13, -1, 21, 40, 22, -8, -21, -7, -14, 54, 22, 9, -30, 12, -34, 16, 24, -2, 4, 21, 4, -63, 29, -9, 36, 7, 11, 17, -11, 16, 58, 29, 7, -3, 16, 19, -50, 18, -9, -16, 5, -13, -5, 22, -26, 2, -26, 28, -41, 14, -16, 14, 5, -8, -3, 23, -8, -1, 8, 19, -18, 16, -18, 13, -31, 0, 12, -36, -29, 1, -47, 1, -5, -32, -2, -3, 5, -45, -56, -3, -28, -55, -21, -27, -22, -11, -10, -68, -5, 21, 25, -38, 19, 16, -55, -6, -18, -37, 20, 20, -44, -28, 25, -21, 8, 31, 6, 18, 5, -8, 39, 10, -49, 23, 36, -42, -30, -16, -23, -3, 6, -26, 1, 11, -21, 27, 13, 21, -42, -16, -25, 3, 28, -1, 11, -5, 31, -23, -18, -20, 34, 13, -25, -52, 18, -2, -16, 23, 5, -1, 4, 8, -17, 0, -22, 71, 23, -11, 47, 11, -28, -30, 16, 2, -10, 5, -13, -18, -25, -9, -28, -13, -54, 6, -26, -13, -1, 17, 19, 22, 11, 19, -5, -16, 11, 17, -27, 24, 9, 26, -1, -7, -6, -11, 25, 26, -19, -27, -35, -13, -23, 2, 6, -23, 4, -17, 8, -1, -31, 6, -28, -24, 12, -36, 53, -5, -9, -6, -22, -23, -26, 1, -19, -38, 22, -54, 2, 42, -14, 38, 21, 4]
11852Dj7j1M7o0L1K1n3K4N7l4j4j2lj5K3M7p1KM6j8L1k1j0J3J7n0K7%n2K6K0L6
11884C1pkk4Lk3Nj2L3Rm0K3n5P1Qk1kj1nk0K8J2Pl0j6j5M7jJ0qj3J9j2L0%k3Q
11920Dk6J7J3j4K5o6O9j6%lMJ4kj2m2J8lK8J3Pl0m0L5L3n4L2k4K2K2k0L1n6L0
11953Ik9K0J2p1M1L3j2j6J6K4o2N5k5J3j4pJ2l1Q6j02M9k2j2N1p7Q2lm2N6m6L1
11984A9n3Q1m9m5N3k1MMj2K0J7l6LJ8jj4j6J5K0J2qOl4JK5jLkJp0N5K3l8J2oN2
12020C8o2M7j8Ol1J1k1M7k1J5k2K2qQk2oqlj9M1L0l0O%Ml8k2Q1m1N4l8o1P0Jr
12055Al5PL0j3k6L5K2n1L8l7M7n1P0l2j9L8PolNl7L5l3K7j8j9L4On5K8J5kpjr
12090ilQJ8k7k2K0L8Qj4m6P0n1PnqJ2k9K3l4M3Mj8J5k5M6l0J9Mj3KJL3l0Qm1q
$$ y = [4, -13, -24, 23, -37, -6, 15, -38, -14, 43, 9, -5, -17, -20, -35, -12, 35, -36, -34, 12, -6, 25, 4, -6, 7, 24, -26, 1, 1, -51, -25, -5, 31, 24, 22, -2, 1, -22, -17, -29, 4, 13, -27, -4, -59, 12, 20, -1, -3, -14, -19, -39, -11, 1, 8, -22, -38, -53, -6, -7, 3, -5, -18, 1, -11, 19, 19, -4, 4, -22, -5, 8, -6, 19, -47, 22, 6, 6, 3, 7, 21, 19, 7, -35, -17, -20, 8, 21, 28, -2, -42, -7, 26, -28, 4, -20, 2, 24, 4, 35, -21, 9, -20, 0, 12, -59, -18, 15, 3, -13, 3, 27, -35, 20, -5, 8, -6, -13, -1, -32, 54, -48, 1, -21, -33, 18, -59, 23, 20, -22, 34, -12, 19, -34, 47, -2, -47, 6, -15, -11, -7, -19, 1, 18, -18, -15, 3, 2, -12, -28, -13, 7, 19, 11, 17, -17, -16, 9, 8, 11, 9, 10, -60, -5, 18, -20, -8, -14, 38, -24, 23, 5, 11, -20, -9, -30, 17, -4, 11, -11, 11, 3, 11, -11, -17, -25, -28, -47, -6, 24, -6, 0, 0, 4, -34, -56, 25, -16, 38, 0, -61, 9, 10, 1, -34, -27, 3, -10, -36, -1, 21, -30, 8, -29, 18, -33, 37, 5, -14, 24, 31, 25, 22, 27, -10, 25, -8, 19, 1, -18, 16, 22, -33, -5, 10, 8, 1, 0, -9, -12, -4, 14, -13, -35, -15, 23, 31, 17, -29, 41, -10, -3, -8, -16, -4, -33, -10, -44, -1, 3, -15, 0, -25, 21, -9, 10, 14, 1, 3, 4, 37, 7, 15, -26, -34]
12126c4N4l1k9P8Jm4k8nM5k8K1qNJ4j2L4k9o6M1N7n2K2J1n5L0Oj5J2j9J0j2M5
12158A9L6p3O2j8j4Kk8K4K6mok2m%rJ7l4M6j8j6O3n4L6j3j8j3J0J9l1J5Pk8N1
12191C0j3l3M6nj9k6J7J0K4j9o3M3jK5k3qPk5K1Lk1J3QJ3RlJ0k8J1k0K4l4M6n
12225A4J8l8N1o5J7%MJ8l2J7mJ3Qj3k3j3L8j8Oj0J9j6J0k7N1k4Nrk4L4NMrMm0
12260b9N6q3P2m1J1K6k6J7l6N4J6l2kJJ7%nK7k2k1nJ0k4L4n8P4l0j5L5k7nk1J9
12293a3k5L4Qj7KJ7J1Mj8n0J4K3Lk3M9n7RL2j7L2K1k4k0JL0J2j6o7P2p3J8J7l1
12326d2L3j9K7K5Mlk0jl1J7j3M2o8qO2l4L2K1l4KNj7QL2k6L6l2NQjj2Ql3L3k2
12361a6K9k3LK1k7J2Mn1M9J6Jp1O6n1LM3k4j6L2oM0k7l1M9l1nL0l0J5j9Ml0L0
$$ y = [-34, 20, -11, -40, 38, 39, -5, -33, -38, 7, -21, 0, -8, -3, 11, -1, 33, 4, -62, -21, 36, -16, 6, 17, -38, -8, -2, -17, -5, -24, -14, -26, 19, 55, -18, 44, 26, 12, 14, -14, 10, 36, 32, 26, 4, 0, 0, -9, 8, -26, 20, 2, -14, 49, -5, 31, 18, 0, -13, -3, 16, -15, 0, 7, -21, 30, 17, -16, 30, 25, 6, -20, -3, 7, 31, 12, -51, -8, -9, 16, -7, -15, -8, -33, -12, -9, -30, -17, -9, 4, 13, 10, 20, -8, 3, -17, 7, -27, 19, 14, 32, -6, 45, -20, -3, -3, 1, 19, -13, 4, 0, 13, 21, 8, -15, -28, 10, -8, -2, -12, 7, -9, 1, -26, 25, 1, 6, -3, -27, 7, 12, 16, 7, 11, -29, 27, -56, 16, -25, -14, 12, -14, 3, -33, 21, 37, 5, 3, 4, 21, 21, 16, 43, 21, 0, -5, 5, -19, 15, -43, 31, 1, -14, 21, -6, -11, -32, -13, -38, -4, 4, -13, -11, 6, 17, 21, 3, -47, -33, -10, -7, -30, 19, -38, -29, 3, -14, 18, 39, 15, -5, -4, 26, 38, 22, -45, 27, -46, -28, -11, -42, -9, -28, -1, 24, 28, 25, 5, 4, -27, -10, -23, 19, -49, -57, 5, -29, 3, 24, -10, -8, -3, -20, -12, 20, -6, 30, -2, 3, 11, 10, -2, 6, -27, 6, -16, 13, -10, -7, 14, -13, -1, 3, -48, 1, 17, 18, -53, 13, -38, -35, 8, -16, -32, 0, -6, 34, 7, -24, 25, -6, -11, 19, -11, 4, -15, -11, -41, -11]
12394a1ll7N3Jl3K0k0K1K4l5K3M9q8M5Kqk4K8l1M4k8J0M1qm0kM6m8P6l5kk2jl1
12428b4nM5jm0pRO5l6Lk3j7M2K6n9j2L7j1L8m0lK0n9O1l3M2J3Lk0m1N4k1j5jk6
12462c6O9n6K6%l0L9JL%l7J2Jn8O3K7l4kj1K5Km7M4k7N8On2k2L7j5Pj5PK7K0l
12497B9o8L5mLj9L2j9l8M1L5nl8NMPM5n2R0q9n6M4K1lk5J5k3O1m1J2J0l6K5MK6
12531B8o0N8J8n3L3n4NK0K5m8J9K0q2O9rL3m2NO2n6J8k6nKNPLK4J4j2j%J6oqm9
12567b7k8M1M2l9kNj6j0L5Rl3N6l1L7q4K7J0k9J1M1j2jn0j2M6j5%Q1m2Po5M9J0
12600A1k4N0n0L0k5J6m3K1kK2OK7j0n7j1R7n7K4k2J6l1qRL4rl9N7m3J5K2o4K4
12632a4M8k9mJnl7N2qk1Rj2K7rJ4o1M9K8k7k7j5K6L0k0oj8M5l3K6l1J9J3l4nJ3
$$ y = [-11, -14, -51, 2, 3, -30, -10, -30, -9, 15, -20, 3, 52, -36, 9, 11, 3, -21, 7, -24, 20, -8, 2, 43, 35, -5, -7, 39, -9, 67, 32, 30, 8, 7, -24, -29, 16, 15, -25, -32, -23, 42, 6, 9, -14, -31, 11, 37, -22, -34, 3, -8, 30, -10, -13, 7, -52, 9, -24, 18, 31, 34, 14, -27, 27, 6, -9, -10, -36, 33, -23, 3, 3, -27, 12, 13, 16, 16, -21, -9, -8, -66, -3, 24, -10, -12, -23, 2, 4, -43, 1, -26, 32, 38, -14, -36, 1, -14, -7, -22, -15, 12, 32, 29, -39, -4, -8, -5, -24, 8, -11, -49, -8, 27, 22, -16, -11, -7, 0, 45, -7, 83, -6, -62, -18, 3, 0, -25, -10, -33, 28, -13, -1, 9, -27, -2, 2, 28, -32, 26, 44, -9, 24, -30, -25, -5, 20, -28, -9, 11, -71, -2, -11, 22, -20, -15, 47, -9, 9, -17, -22, -20, -15, -8, -5, 19, 33, 21, 20, 20, 36, 30, 22, -27, -55, -14, 28, -11, -13, -8, -24, -34, 1, 10, -23, 33, 2, 39, -45, -18, -8, -37, -26, 15, 3, 2, -48, -60, -14, -29, -29, 52, 10, 17, -48, 1, 11, -13, 37, -13, 17, -8, 8, -35, -14, -16, 6, 12, 39, 29, -28, -39, 58, 1, 25, 3, 19, -12, -20, -11, 23, 14, -25, 32, -11, 4, 26, -38, -14, 34, 5, 1, 2, -3, -40, 12, 4, -17, -8, -20, 7, -2, 12, -49, 0, 28, 1, -26, -41, -15, 15, -5, -11, -29, 16, -17, 9, -22, -3, 10, -24, -29, -16]
12666a6L7kk4J8k5N3m6lL2l2L6m1OK7m2L4Pk9l6K3KO1pm4K3k9M4K2o4K4k2K4m
12699Gj6L6p5N6K3L6q4M7j9o2O5n2M3j8L0k4J6j1l8O1kj8K8Qn0j6M7j00M6%K0
12730a6L2m7N5n9O1l6K4j0k0M8m0l5L4lJ6OJ9l8O9o7k3K9L3n1oj2O9n3O2k5l7
12761b1%J2L6n6M7Nl7l3K5lN1k2Kk2O9o1J3ol2M4jk9j3M8l5M0j5J2l4k9O8j7j4
12794hJ0lojK0rQj7n5P2J8rl1L2k7k8K9mqJ7J5nmJ2k7K0QJ0j1jl1KL0j2l5N0j5
12831FJ1l7M7l8K2J0J4m3L7qk7K7j9OK8o0J4L9ljn9L2N1j4o5L5kj7Kk1J6L9n8
12864c6N1l1J0j8QK5k2J9k3OL3J4l2L1l1l9N3jjk0k5N4k4J9n6MJ1K4l3M0Pk1n2
12897e6J02o9J9L2m5MJnK5J5n7KK0Rlk0K3KRKl8k2P7Pk8K1J2o7M6Qk7L7l1rJ1
$$ y = [-16, 21, 19, -5, 13, -12, 41, -5, -8, 24, -8, 28, -13, -7, 20, -22, 12, 19, -10, -46, -23, -21, 40, 33, -11, 12, -17, 27, 49, -15, 9, -13, 11, 7, -9, 27, -48, 8, 31, 67, -17, 30, 11, -51, 14, -38, 5, -13, 17, -7, 9, -2, -40, 21, 19, 1, 29, 37, -13, -29, 18, -82, -36, -36, -16, 16, -31, 24, -35, 26, -10, 14, 4, -16, 32, -8, -43, -9, -12, 4, 10, 29, -9, 60, -7, -30, -1, 32, -19, -25, -37, 32, -21, 41, 16, -21, -21, -9, 27, -29, 18, 23, -14, -47, -22, -25, 26, 4, 6, -16, 53, -8, 5, -1, -33, 11, 10, -19, -32, 16, -19, 21, 6, 18, -16, -45, 23, 6, -8, 2, -1, -7, -8, 12, 3, 11, -6, -61, 11, 29, 20, -11, 21, -6, -34, -5, -9, -17, 0, 15, 10, 6, 18, -9, 11, 19, 29, 18, 17, -14, -12, 18, 6, -29, 21, 6, 17, -20, 27, -11, 11, 21, 35, -8, 29, 21, -6, 21, 2, 8, 36, -24, -10, 29, 26, 25, -34, -2, 49, 35, -30, 5, 3, -14, -12, -33, -17, 22, -36, 15, -16, -6, -24, -16, 9, -13, 6, -17, -11, 22, 36, 4, 35, 4, -35, 18, 17, 16, -4, -29, 25, 1, 20, -36, -32, -21, 3, -30, 10, 17, -4, -56, 46, -23, -4, 28, -17, -13, -12, -17, 8, 23, -34, -32, -12, -3, -6, -26, -3, -1, 8, 10, -28, -50, 27, 34, 6, 27, 39, -28, 18, 26, -1, 36, 5, -4, 7]
12932GROk9j3J8Jj1lM4l2K7o9K5K3pMPL4n8mNM7k4n4J0L6k7K8L3n8j4P3n5j9L4
12967fK5j7Mk6J1l1K7J2RL4m4nK1n3K9j6Rj0J3M9qj0l4L5qn5N1j8%l3K6L9j3l1
13001b4j9J7j7L9Qj6L2n7MK7l2M0k8L1j2k1K9K1k1j2L2l5J9l2K8QJJ1n7N0k4r
13033a9L0m0O7m4L3j8l9L2l9N9j9p4Q2m8O9k3J1m1%M8l4L3j5l6K6l7L5j3k5M4
13063EJ5k1ol5P3np6QN4J2l1l0L5k3QM9n5N8p8L1OJ4k2QK2o8N6K2n8M6j6J6Jl5
13097b0k0O4n2J3L7o7K2K0%k9M2k1jKL2rj9J4j9K1K1j4oj9RJ0l9K0J7k0LJ1lm
13131dM1n7Lj4K4oJ7J4j8k7N8l5OK6k5m5K1K9n0N3J3m4l6Q8m3m%k8kJJ2pk7M4
13165b2K0Okj3QokM3m9L7p7M0Ol1J2K0K4r4R0k0K5k2k6L0K2m1J3L2Rm8j%J0k7
$$ y = [7, 16, 22, -7, -20, -2, -1, -12, -15, 29, -3, 24, -45, -20, 3, -4, 0, 7, 41, -17, -21, -16, 31, 7, -47, -37, -1, -28, 0, 33, -25, -39, 34, -21, -40, -6, 19, 2, 6, -20, -9, -40, -13, -1, 8, 42, -2, -7, 14, -39, -10, -26, -17, -27, -14, 35, 27, 17, -17, 18, 10, -45, 6, -12, -12, -45, -19, 20, 7, -24, -43, -26, -43, -4, 4, -12, 20, -37, -33, -6, -38, 2, -26, 5, -7, -28, 1, 22, 1, -11, 21, -14, 5, -27, 1, 9, 10, 21, -36, 14, -10, -19, 11, -29, 38, -6, 27, 9, -30, 2, -37, 22, 3, -71, 11, -37, 32, 9, 20, -21, -21, 27, -7, 26, 11, -25, 1, -36, -1, -14, -39, 5, 20, -1, -7, -42, 31, 26, -50, -42, 12, 24, -7, -37, -2, -25, -17, 32, -23, 35, -43, -12, -6, 8, -14, -6, 16, -52, 4, 26, -32, 14, -2, 14, 15, -20, -40, 24, -28, -15, 22, -45, -23, -3, -3, -32, 10, -11, -12, -10, 22, 13, -6, 8, -11, 10, 31, 17, 11, -8, 1, 11, -28, -8, 9, -11, -8, 3, 0, -4, 37, -20, -17, -31, -7, -13, 4, 18, 0, -27, 31, -4, 2, 28, 3, -42, -21, 8, -42, 11, 24, -20, -56, 32, -11, -15, -15, -43, -45, -44, -32, -39, -66, -22, -2, 4, 2, -11, -3, -9, -11, 32, -17, 20, -57, -17, -11, -42, -30, -10, 14, -80, 10, -10, 15, -7, -33, -3, 19, -22, -9, 23, 32, -16, -17, -17, -7, -34]
13199c4N6o9NL1N%L0n1J6J3j2kJ7k0%K9l1j1JM1l0K7m8J7k8P2o0L9j9K4k5j4Q3
13232E2n7N1q5M4l2L4QJ0j5k7k1M5lMk7L0m0K9OJ4k7joM0l9P6n6M5o9j5M6k6R
13265cNl0L3K6n9L8k4K6pJ9n8L1nopJ4k1J3m3N4K8m2kK5n0J5K8lj6K4K3m9K6J8
13299B1m3K5M5p8L4M1n9L0J1l2qmL1k4RK2j0RK4m8m2L6Jj5J3NK4k1K8m9J7J7n
13332Epk2J5LM4j2n1M9m3P6o7M7n2%NQjN9j2o9L2K0n2NRL1m7O3m3QK0nl9jK4J9
13368A9%J4m3J8J0KK2m0k0%K2n5Q7m4M2k7Ok6jNrJ4j1J0L5n3M2jk9k4K8J3J9o
13402A9l0K5l8K8o7K2O2l9L2j5L7k1k1L0k4j9kK0mL0l2Q0j05O2n4M4j8j7N7o2
13432b0qL5OK8l1mk0L2n9NK6l1M8j1QQ%K0j7Lj6K3l9J0M4k4J0k5jK9pjj1n5L2
$$ y = [-34, 22, -47, -42, -11, -6, -6, 24, -27, -11, 2, -10, -12, 5, -15, -15, 14, -17, -28, -27, 14, -16, 11, -37, -20, -48, 24, -36, 3, -16, 8, -17, -31, 52, -5, 46, -39, 5, -27, 7, 15, 25, 10, -17, -38, 7, 4, 8, -19, 11, -29, 0, 6, 20, -7, -8, -14, 26, -13, 63, 7, 52, -17, -32, 14, -12, -3, 2, -28, 5, 31, -28, 10, -14, 12, 5, 24, -34, -3, -8, -14, -21, -7, -28, -15, -58, -4, 24, -18, -20, 5, -45, -30, -2, -5, -21, 3, 26, -23, 3, 21, -22, 3, 48, -30, 4, 45, -14, 16, 27, -5, -13, -17, 14, -10, -1, 21, 11, 20, 44, -4, -46, -10, -9, -24, -11, -6, 18, -3, 25, -24, -7, 10, 5, -2, -24, -9, -6, 38, 26, -25, 24, -19, 57, -10, 37, -15, -15, -10, -2, -3, 56, 44, -25, 7, 27, -25, -20, -11, 20, -27, 36, -7, 1, 21, 16, -23, -24, 0, 19, 19, 33, -10, 8, 18, 20, 42, 2, -18, -18, 4, -51, 36, -8, 34, 7, 13, -13, -14, -9, -18, -4, -15, -5, 30, -23, 19, 18, -11, -35, -7, 6, 25, 19, -11, 14, -24, 4, -63, -41, 21, -18, 14, -1, 36, 15, -6, 24, 0, -19, -21, -1, -5, 25, -7, 73, -32, 30, -24, 20, 2, -15, 42, -20, -28, 7, 13, 41, 10, 6, -14, 18, -41, -36, -10, -41, 7, -4, 4, 12, 12, 32, 15, 18, 2, 25, -14, -4, 40, 16, 26, 1, 0, 29, 22, 21, 10, -45, -13]
13467a3K6K5r5L8J6n2O4k7j9K9K4k6J4j2L3L7j02L2L5lj3Om2lMJ2j5K2J6k1K1
13498A1Rm3L1k3J7J3nk1%M5k1o1L9M1l5Qj9%j6M4%L1p6OPJ0K9l0L8j7Nj3j8K2
13532Hj6K9j3J5J6l6l9K5jL7m7L6k1lJkN5l1ml3j4K7K8l1M3j9J2m8LJ2K1j0Ok0
13566a4K9p3K6O1l9K5j3M%j6M2j0J1k8ql0J8L3J5m2J0l4M6k4pl3lN1lL2l9M4n3
13599b2L0j3j6PLJ3n2O5j9MM3j8l3M2k1J0m2Q5o8nnJ3rM1k0k8L5m2lM4l7L5Ok5
13633bj8L6m4M0J9l9NM7j4q4O8l2jmOok0L5j1OK7ll6M3k7k6Q3p9j3K9L7k6J3r
13667@j7M7q6L1K1J2j7N5p8K5K1n7Q2p8M2LK2k3n8O7Rm5L5m9j6RM2jJ4j5nnk4
13700c7N0j9L9m4pL4l9J9Kk1K6m1L0jM4l3l5L0M3qm1L8n4O1m9L1l4K5m0K1JK6
$$ y = [-13, 13, 38, -57, -19, -3, -55, 9, -18, -37, -8, 16, -10, 4, -8, 25, 62, -40, -8, 27, 24, 11, 17, -25, -28, -24, -12, -27, -5, 11, -10, 11, 20, -23, 8, -15, 2, 15, 10, -11, -11, 34, 13, -48, -9, 32, -3, 5, -14, -14, -30, 14, 14, 45, -31, -25, -18, -8, 21, -9, 29, 12, 17, 4, -14, 8, -8, 21, 8, 23, 39, 3, -36, -11, -12, 25, -22, 14, -7, -10, -9, -11, 44, 13, 9, -24, -38, -11, 17, -14, 29, 10, 22, -26, -23, -11, 10, 0, 6, -14, 15, -58, -32, 29, -10, 15, 2, 6, 6, -10, 32, 22, 33, 5, -3, -33, -15, 18, 33, -9, 1, -33, 13, -11, -18, -51, -54, -3, -6, 26, -13, 31, -22, 8, -5, -21, -14, -11, 2, -50, 15, -4, 0, 43, 25, -8, 34, 13, 23, -19, 66, -2, -7, -12, 1, -8, 33, 13, -15, 20, -22, -25, 19, -18, 17, 23, -2, -20, 16, -28, 12, 31, -8, -3, 44, 30, -54, 14, -18, -19, -23, -17, -23, -43, -8, -19, -13, 14, 11, -25, 18, -9, -35, 48, -31, -44, -15, 22, -4, 9, 0, -17, 30, -56, -25, -4, 8, -9, 46, -32, -7, 14, -43, 39, -39, 3, 6, 28, 5, -53, 14, 23, -22, 13, -36, -52, -43, -1, -2, 12, -3, -8, -13, -37, 13, -6, 33, -11, -18, 16, -23, -4, -2, -23, 3, -38, -8, -9, 35, 2, -33, -3, 40, 32, -9, 29, -25, 36, -13, 18, -16, 9, -31, -10, -9, 17]
13732A7l9L5nk3P2n9L6j3K3o7N0m1LK7j8K8k5rK0J4j9l4N2k6j2J3onj9mL6k6j2
13765c6K8J8j0K5k1MJ8l7L8n5K7nj7L2j9OJ7n0L9l1J0J1Pj3J3krL1k5M3n9L5J5
13798B8m3M6m4K9j9lLJ0j7OMl2K5j7K1LpJ0kJ6l7J5K4o2M3m3J4M9J1rl3k5N0L5
13832D9n2kK9n0M4j4J6m0K7j8N2l2j4K1k0mj8M6K5j0l4J0l8MJ2J6m7M5j5j4J3
13863a3K2j4l6M6o3R1j5Jrk0J3%K6j3j9KPl4N6l5J2n5M2pKM6n6K%j5M4J5Pk6%
13898Dk0l5Q2q9K9L3j9K8J7j5l8K8mJ4k3KPm4RL4j4L2l4K4o0O1LqjLo8O1%m3L5
13933iM0m6RO0p0L3l4K3rJ7K8o6mL4Ql0M1p3NM4j1K1o4P6j2k3NlK6k4J8Jj5K1
13967A7Op4L7JQJ5L2k6k0m7K6PkK6lj5k0K3k6J12q9LM8j0o3K7K8Ro2QpL9j1K9
$$ y = [17, -22, 13, 8, -15, 57, -2, 34, 21, 44, -23, 27, -14, -11, 16, -2, 26, 1, -8, 12, 26, 7, -27, 25, -1, -13, 0, -6, -11, -30, -34, 2, -24, -36, -8, 10, 0, 25, 4, 8, 26, -11, 27, -28, -1, -6, -23, 9, -10, -4, 13, -37, 2, -29, -19, -8, -1, -14, -1, -3, -12, 19, -6, 37, -22, 13, 28, -15, 31, -13, 16, -3, -6, -3, 7, -10, -4, 0, -32, -7, -24, -3, 0, -7, 3, 1, 17, -20, -5, 19, -43, 0, -43, -29, 20, 31, 22, -11, -36, 14, 49, -3, -5, 24, -26, 18, 4, 20, -20, 7, -11, 41, 9, -5, 16, -4, -8, -26, 20, 45, 35, 1, 11, -27, -23, -11, 5, -42, 3, -12, -26, -13, 9, -5, -41, 5, -58, 33, 18, 19, 10, -10, 3, 3, 29, 16, -3, -1, 6, -28, 28, -7, 5, -50, -8, -15, -13, 33, -23, -21, -21, -36, 8, 23, 30, 4, 4, -16, -51, 31, -58, -29, 4, -15, 13, 30, 15, -23, 5, 1, 15, -8, -6, 1, -43, -34, 0, -14, 18, -16, 8, -52, 9, 12, 4, 3, 6, -62, -1, -1, -44, -9, 31, -15, -6, 54, -16, 17, -17, 6, -3, 14, 42, -24, -28, 6, 14, -16, 25, -48, -43, 1, -10, 11, -53, 23, 11, -12, -7, -10, 16, -8, 10, 11, -4, 17, 23, -51, -14, -13, -5, 10, 42, 16, -4, -51, -25, -18, -20, 6, 3, -12, -32, -9, -35, 77, -12, -9, 39, 29, -34, -7, 21, 30, -32, -24, -31, 8, -3, 26]
14001B6K3p6K5kJ7n%j9J2k6O9k5ok6K3j2j0JJ1K7l8l0P4m1QQK9r1M7j4L1k2K9
14034A7Qn2N2k8qJ9j7Jj9J5K8l2jl0Q8j2om3K7J1k9L6o2M8J7o6P0n8qK4pjrJ9
14068hpL0J0ok1Mj5K7j7k6J1kL6k1J6Rm8M2k6M1j1kJ5m4J4JL1m8K0lj2L6Kl8K9
14103A9k4K5p0M5Rm0M6LNl1j8K7N8n0j9j8O1J6o4KJ4k3J1K5J2Jo0J3K8j9L0l1
14135a7O0q2N6l1rJ9J1J5n1oL2K9j7l3mJO3k8l4M8j3l0j2K9n8J6N3n7P4k9Qo5
14167f2N1N0o4O7n1j8RK6k7J0L7p7K6KM1rJ4pj8L5l3j2Q5q7O0o0J5k5J7K8JqK9
14200D5n8J0J1l8OL6rl8M2mJ8j1j5K1j3L2o4K4NJj1rL2%K3po9L3PlJ2oKL5m0j1
14236a1K4QOm0lk3k6J07l7Ljj3k8L8K0o5K4L3j6j9J4N8l2k2L8o8M7k2K5nj1l7
$$ y = [26, 49, -27, -2, -4, 13, 8, 8, -11, 1, -25, 44, 19, 13, -13, 10, -2, -12, -11, 0, 27, -11, -41, 33, -8, 0, 8, 37, -54, -7, -21, 10, -12, 17, 25, -27, 25, -3, -11, 8, -9, -8, -27, -12, 16, -16, -17, -47, 41, 29, 23, -20, 7, 18, -11, 25, -37, 11, 28, -38, 32, -26, -34, -10, -17, -18, -27, -8, -15, 15, 25, 19, -2, 2, -13, 14, -3, -29, -18, -20, 16, -5, 11, 20, -28, 14, -12, 29, 18, 16, 31, -13, 1, 2, 33, -15, 5, 2, -10, 26, 28, -10, 19, -5, 20, -50, -5, 4, -36, 10, 13, 18, -13, -31, -4, 54, 4, -15, -33, 28, 44, -20, -18, -4, -27, -16, 9, 21, 22, -38, -25, 3, -16, 14, -17, 43, -39, 17, -14, -23, -4, 7, 22, -29, -35, -3, 26, 9, -24, -28, -27, 36, 8, -26, 22, 9, -21, -33, -4, -62, -46, 7, -50, 24, -5, 3, -62, -11, 39, -25, 42, -9, -27, -18, 8, -19, -9, 28, -49, -23, -21, 20, 11, 25, 18, 0, 35, 2, -10, 75, -12, 48, -12, 3, -22, -5, 23, 24, 16, 45, -13, -3, 8, -30, -24, 12, 3, -35, 7, 3, 21, 10, -5, 16, 3, 35, -29, -5, 0, 1, -10, -19, 13, 13, 36, 29, -40, -7, 0, -3, 9, 3, 5, 40, 0, -11, 13, 21, 27, -13, -16, -39, -65, 42, 5, 8, 7, -6, -34, 4, 24, -41, -17, 16, 0, -19, -5, 53, 21, -1, 37, -31, 16, -6, 19, 14, 3, -34]
14268c4Qkj1N9j7l6L0O5n6k6Qj4j0K8k2L2k8L8rL0k3k8K5k0N4j5l1l3J0J8J5R
14300A4nol3L9l0L3lkl6L8m0K6LKmj5K9m9J7j3K2J8M%lK0n5M7l6J0L8p9N4m%J0
14336A1Mrp2R1l3M1q0M9Ok5K9m7L7jKJ9n9K9L5l5jJ1k4QJ0m4R4r5O2Nk8Nl3L6
14370bJ7k3L2n2j8L6LRl0K4K3j2J5J5o0K9qm2O9mp5N9m1N1qm3K2k9K7k8Q9o1j2
14403b8jRj6PMK8k6K6Oo6M4RJ6l0K9m9L7l5O7n8l4O5J5k8p1J09n7KK5j3J7Kpm
14437fK1k3n5P1oJ9l9Mnj9M8J2Lk6k0rL9%j5j1L0m1%K2K1qJ5k9MQj8OJ9m2L0k
14473bl1K3J7m4J3K8oJ4n5P9j1m7qJ4j9O8k1l8J5j1KK1M6n4P5n2l0k3N0n5K0K9
14505Gl9O9j9k1qm6L6J8Kj7M1n0L0k8J2j3m5P4J0j6J9n6K2j6L5ll3J4k2M0Mm0
$$ y = [-34, -26, -28, -39, 20, 3, -33, -3, 62, 6, -20, -12, -26, -36, -8, -30, 2, -26, 12, 3, 33, 10, -18, 7, -13, 41, 26, -5, -38, -28, -10, 5, 14, 9, 3, -30, 9, -21, 12, 9, 7, -29, 9, -31, -5, -2, 0, -4, -19, 10, -39, -22, -35, -13, 5, 9, 9, 6, 26, -29, 18, -18, -8, 30, -49, 5, 1, 1, 11, 15, 6, -66, 25, -8, 33, -47, 2, 8, -17, 12, -35, 2, 1, 3, 22, -37, -8, 27, -8, -9, 2, -22, -14, -4, -48, 46, -49, 13, 18, -10, -5, -38, -2, 15, -8, 24, -28, -46, -10, -7, 2, -28, -4, 19, 7, 22, 37, -23, 6, -2, -44, 25, 21, -54, 5, -36, 15, 7, -36, -14, -43, -16, -44, 45, -16, -28, -29, -20, -36, -29, -25, 3, -23, 3, 9, -57, -13, -4, 12, -18, 11, -38, -1, -36, 31, -27, -61, 4, 19, -9, -80, 29, -28, -26, -1, -14, 3, 5, -2, -6, 15, -8, -63, 8, 2, 21, -18, -14, -19, -38, 10, 22, 25, -1, -21, -30, 9, 9, -6, -17, 13, -28, -28, -6, 15, 7, 22, -7, -3, 5, -13, -7, 12, -30, 0, -2, -33, -10, 7, -37, -24, 4, -2, 12, -43, 36, 25, -22, -30, -16, -35, 33, 12, -26, -11, -22, -20, 1, 47, -7, 68, 16, -14, -37, 13, -42, -22, 7, -32, 37, 18, -3, -11, -57, -21, -3, -1, -18, 23, -27, 3, -25, -13, -26, -71, 3, 13, -3, 16, -40, -18, -34, 1, -2, -35, -21, -43, -3, 1, -39]
14537c9M2j8klK2PL8p8k6K1J5J1Ml0K6k0ON1k9LJ1n2J9j5N8n8K0l7P7k5qplL8
14571A9m5k5N2k2PJ1L2l0JK5jj6J1Pl8Mpj7M5J0m9ON0j9m3M6o8P8p0M6oM2n2p
14605b3M4k2L0J5k5j3Nm8K7Rl3O9m7m9M6ML3k9Rl5L6j4Rk6nJ8M1k9j3nL5K4k7
14638A1k0k2K1L0Kp2M6K6J0k5k0L8Ql8J7q4J04n4NRk6qoN9ol3O1l5Oj2k1%J4j2
14672b7LM1qK5m4O0l5l9N5m3K7npj4J6L1k4%lJ2k2J4K5o0J0j5J0Mj2K2LM3n1K2
14706A4m8J0oM3%k0j7J8J0k9M0J5n9M1k4Rm5L8j0k0K7J5K2j5l0OPk2NMN9o7K4
14739eJ8l0jM8l0K9p9Q3j3m7J4mK8m3K4k7L0L5n3M5jjm8QQK5m6QL7k5PJ2Lm7N2
14774A4mj3Kk2J9j6J5j2l0N3%k4kN5oj00P2l7K3M0m7K4J6j4j5kL0rlm4N1k0j3
$$ y = [-39, 3, -15, -17, -20, 2, 9, 47, -31, -57, -36, -21, -10, -6, -36, -10, -30, -24, 27, -2, 1, 12, -40, -21, -36, 22, -36, -16, -53, 24, -1, -9, -16, -19, 19, -26, -51, 1, -21, -14, -3, 29, -1, 0, 25, 24, 8, 19, 26, -12, -8, -15, -32, 13, 23, -26, -20, 30, 11, -32, 14, -54, 24, -46, 0, -6, 36, -16, -23, 21, -1, 29, 44, 19, 6, 11, -37, -10, -1, -34, 35, -12, -61, -15, -11, 22, -7, 2, -33, 3, -11, -2, -28, -33, -15, 26, -3, -16, -21, 14, 38, 11, -9, -31, -10, 20, 22, -50, -4, 22, 32, 7, -13, 25, 33, -5, 12, -72, 32, -22, -17, -8, -34, -42, -48, 11, 5, -28, 33, -2, 4, -8, -29, -29, -15, -27, -24, 17, 9, 34, -10, 50, 15, -24, 31, -12, 15, 10, 3, -11, 5, 36, 12, 12, 9, 21, -1, 13, 38, -22, -12, -27, -17, -13, -25, -3, 0, 43, -8, 14, -34, -24, -30, 13, 13, -7, -24, -6, 4, -25, 15, 30, -29, 12, -12, -3, -48, -10, -20, -40, -13, 2, 24, 9, -21, -15, -8, -30, -25, -21, 38, -29, -5, 13, -17, -18, 30, 0, 29, -50, 33, 20, -27, -13, -17, 11, -32, -8, -35, -5, 30, -23, 22, 21, 20, -28, -20, -12, 13, -33, -25, 12, -13, -6, 6, 9, -38, 14, 10, -3, -1, -23, -4, -20, -5, -17, -47, 6, 6, -18, -20, 35, 29, -71, 1, -36, -13, 27, -20, 4, 20, 6, -9, -11, 19, 10, 7, -37, 14, -6, -19]
14807a9K0j4M3n6L3k4j4K8l2O8p0L5K2l9%lQ4m9m7M3m2lJ2pN1rl8MJ4J3J0m4L5
14840Epm1L5M4m6j3L0k2Mj0K8ROqkn9N7m4J2MnNk2K1K5K7o4L5M0l7j9K0o6O8o
14875D%mm5J9j4J9l2R3o1P2m4n5P6rK1k4j7k7N0j3k9K4j5L8jkl4LM3p8N8j8l4
14908c6K5%K6m6L2mRnM0m9J3k6j5J1k0M8j3J3k5j8K8kj0%K4j9M4m4L3nlK7r3Q8
14942B8p5M0oJ7k2kL0pJ3j2Ln1J3L3m1P2k9nj3j8M9j7l1K3L3q1N9rj3oRj0k9M9
14976fL7m9N1p0N2p9Q8k3L9l2lpn9J10p8NRJ5Qm3M1kJ1k5M7n8J4J4kJ3k5K9Mk9
15010cok0k0M2k5K9oK7oRj8K0o7PM9m8N5l0L8n9P2n9OM1l9L2ppm9O5j8J4l5Kr
15045b3JM8o0M3l8L6nm1N7qNk6k8P8k3l2%J5qkJ4j4K4k4k3N9m2L4J6l5m9L4j2
$$ y = [-19, 1, -13, 30, -26, 7, -17, -31, -3, -35, 33, -37, -2, 20, -19, -19, -22, 62, 13, -34, 9, -33, -36, -24, -31, 20, 11, -27, -23, -9, 4, 14, -30, 5, -2, -43, -8, 36, -10, -23, 7, -15, -11, -21, 7, 16, 22, 14, 12, -47, 10, -34, -22, -18, -23, -18, -40, -19, 6, 33, -31, 4, 44, 7, -12, 8, -58, 10, 4, 4, 0, -45, -26, -40, -21, -53, 40, -21, 51, 7, -48, 28, 19, 40, 16, -1, -28, 22, 9, -20, 4, -11, 27, 26, 24, -10, -7, 36, -42, 16, -2, -36, -11, -11, 15, -31, 1, -3, 6, 1, 41, -8, 5, -21, -36, -25, -45, 3, -10, 3, -22, -40, -12, -14, -24, -24, 0, -19, 25, -19, 14, 9, 6, 33, -60, 28, -47, -7, -13, 4, -18, -20, 10, 3, 16, 4, 7, -44, -31, 2, -39, 33, 4, -1, -14, -32, 17, 0, -31, -8, 25, -56, 3, -6, -19, -25, -16, -26, -55, -6, 31, -18, 33, -37, 15, -64, 24, 1, 40, 8, 5, -2, -61, 49, -29, -24, -15, 0, 8, -35, 6, 4, 15, -10, 37, -21, -7, 7, 5, 18, -7, 22, 26, -3, -9, -29, -49, -7, -32, -3, -9, 18, 12, 21, 3, 23, -44, -37, 12, -36, 19, -11, 27, -32, 40, -19, -13, 28, -11, 21, 14, 7, -42, 23, 5, 19, -16, -14, -23, -22, 26, -34, 9, -29, 7, 2, -39, 18, 10, 15, -11, -39, 39, 16, -16, -16, -1, -9, -11, 3, -11, 13, -11, -34, 25, -17, 17, 33, -2, -51, -17, -29]
15078b9L3J2l6L5k5J9l1mJ9j6k5K9MK1j7L0m0K8j4loJ7qKk5RJ9l5LL8rj2KL2J3
15113C0p5L8k9M4J1k4j3pk8P8n7N4k6K9ro8N2j7J5n1L2K1k4L5q%J2J0m6KL0o1
15145e0P3j3ql0LO6o8L9J1k7M4m3K7p6N4m1QL9N5o2RLl2j0K3N4m7j3kJ5k2NP2
15178E6o3m9P5Km6jJ8kK0k4PN6j1n4QL5k5j1l7N1k9K2J1K8l4j4K1jk6l3J7rM5
15211Cl4M4j6NRol2RnL2k6OM6l7%J4j5oJ5k4nM0m9N8m2k7O5n6M0l2L1m4K9J2J7
15246A9j7j9N2m7pK0L3n3MO4pk0oL2J8m6m4K1QL5j5J%m9K5LQj2J3M7o6J4QJ2j9
15281A0J3m6M2Moj1K9k4k2M0q3Q2Ok3j5J8rLn5O8J9m6L2n3O1l4%K4p0M6kK2l8
15314a8L3K1pKl5J7l3L8l4N5m3qJ9j3N9n8L2p2L7J5o7R0n9M5l1L3j5J2M2l6l7
$$ y = [-29, 4, 16, -20, 15, -10, 9, -22, -26, -7, -23, -48, -19, -15, 6, -11, 19, -21, 7, -7, -10, -16, 1, -7, -5, -30, -21, -2, -37, -34, 4, -5, -17, -15, 17, 30, -45, -7, -36, 8, 19, -5, -18, -25, -53, 25, -32, 22, -4, 25, 16, -52, 0, -17, -2, -53, -21, 0, -24, 11, 3, 3, 15, 25, -21, -19, 11, -50, 23, 10, 2, -28, -25, 41, -27, 12, 23, -4, 40, -3, 24, -52, 2, -39, -31, 8, 63, 1, 10, 13, -19, -29, -6, 48, 1, -12, -14, 1, -21, -16, 56, -7, -56, 19, 21, -25, -26, -8, -10, 10, -14, -7, 49, 38, -16, -8, 27, 2, -9, -46, 5, -24, -2, 9, 37, 3, -11, 10, 9, -17, -50, -33, -42, 3, -31, 13, -3, 2, 11, 5, -27, -18, -23, 9, -17, -11, 35, -2, -2, 12, -3, -9, 6, -18, -23, 17, -32, 26, -16, -43, 22, -34, 6, -26, 5, -39, -10, 2, 19, 2, -17, 35, -12, -19, 1, 34, -19, -15, 49, 42, 22, 16, 48, 66, 20, -24, -3, 5, 40, 25, 26, 26, -23, 2, 5, 13, 1, 14, 61, -5, 9, 17, 29, 10, 23, -23, 19, 23, 17, 6, 35, 11, -11, 29, -54, 28, 34, 11, -4, 14, 5, 8, -47, 21, 40, -6, 26, -27, 34, 0, 0, 24, -46, 0, -2, 20, -18, 15, 36, 29, 31, -4, 13, -20, 18, -16, 39, -4, -12, 7, -6, 53, -5, 27, -45, -8, 7, -60, 30, -29, 16, -15, 18, 3, 15, 57, 21, -16]
15345a6J4j4J3L6k3l1K2J5j4L8m9L3j9j6J2Kjj7j1M2j7Kk6L7Ln0N2m9O2k7m5R7
15377E5o0ON8p4O2k1ok4J2k0QJ4Lkk2LnK4%j8J1j8J2jkJ5qK6l6PJ3j0j8pM5Rj3
15414A8j0M2k4l6L7l5K7l8K3l0K1pj3L9k0j9J6lK0J9J4m6L5o1J6L2k2k0KJ6mn9
15446g0P1KrJ1K3l3J9J5j1Qk1J9j2l5K6L8m5lJ3m8O5%K2k8l1M6m9M5l6l2N4j8
15478dJJ2qKQl7L4l2L4k1QQMM2p2PJ3m0nJ4L3lm4N8j7l0J1J8J0l7l5N7j4N6m8
15513a7J0k6K3M6o3NKNjl9P0Kk3rK9km2O5p8P5k0jJ0K7p7K8j3lK4l0pN6r4L7L5
15548DK0k4j5K7m6K8j0J4Rj0K2K7r1N0K6Nk0nJ1k6M2m7K2LpM2m3j7NL0k0j3L0
15581B3p2N6l9K9oL6oo1K1j3L5Kj0J7Jj6l0N1l0J9J7m3L2l5Olk0K0J3JkPJ9l5
$$ y = [-16, -2, -16, -3, 33, 10, -21, 1, 16, 2, 40, -9, 24, 5, -11, 1, 3, 2, -15, -26, 16, -1, 1, -25, 12, 15, -35, 17, -32, 30, 3, -42, 55, -5, 1, 59, -15, 47, 26, 20, -4, 8, -12, -4, 10, 13, 11, -11, -8, -13, 11, 11, -7, 4, -14, -2, -3, -5, 10, 2, 28, -8, -1, 12, 2, -16, -23, 22, 31, 18, 8, 50, 26, -10, 27, -8, 19, -19, 4, -26, -5, -12, -25, 14, -6, -25, -9, -12, 8, 27, 41, -5, 30, -31, -15, 17, -5, -25, -23, -7, -11, -70, 1, 3, -6, 5, 28, -5, 14, 29, 18, 26, 5, 24, 12, -23, 3, 41, -4, -7, 6, -42, 23, 23, 45, 17, -14, 32, -17, 28, -8, -40, 14, -4, -3, 9, 1, 3, 11, -26, 8, -24, 10, -11, -3, 5, 9, 51, -21, -14, -1, -41, -46, -32, 1, -2, -46, 12, -5, -35, -24, -6, 4, -33, -68, -11, -25, 31, -17, -7, -33, -10, 36, -27, -22, -20, -15, -16, -55, 15, 17, -6, -15, 14, 12, -30, 35, -43, 32, 12, 11, 21, 48, -29, -1, -14, -17, 7, -23, -30, 26, -68, -31, 4, 24, 0, -15, 12, -34, -6, -16, -2, 7, -3, 19, 46, -45, 5, 31, 36, 16, 11, 22, -4, 38, -9, 13, 16, 9, 51, 8, -9, -4, 26, 6, -7, 23, -49, 7, -32, -3, -9, 27, 21, -40, -19, -32, 3, 5, -5, 12, 13, -3, -33, 18, -12, 7, 24, -19, 13, -22, -16, -19, -39, -19, -6, -5, -7, 0, 19, -16]
15615a6L1j3j1l4K3kK8k6PlJ7m0O0j7j3k1J6J6k8lJ0QJ7l0j2J9MM5m6j2J2KK5
15648A3k4Rk8J7OL9l3K0l0J5j9kJ7J0k5J0K2K7m9j2L4k7j9K7l3L3plK3k4K2J9
15680B8%jn4L4n3M7J9k3k8oM2qkn1P7j1j8j1k2P4o3L7m1K0O3j5jn2J0L9j5kj9
15713fk0L4m2J6L4pj6QK4l5Q1n7j8j3j7jL6j9j8P4p7K5j3L6m6JN0k1Ppk2L7m5
15746c7L0J1M0j7m2j4lM6J3k2Lj0j9J7M9m5Kj0k5M1Nk4jPQn5P3kk9j1J3RMJ6j5
15781Fk9J4Jl5P7ll6k2K3J5Mo1M9q7P4J4j4K5m1K6lNl7ON2n2J6jJ8pl6M4J3mk6
15816a2L6kn9M6j2%l1K8K1nK0m2KJ5oK4l2k9nN1K2k7rk9L7L2m3nK4Ok4K1n4jJ7
15851b5J7O9m5k4m0N2l2LK5j3L8ol0qJ0K6j9m2L8J3j3K3J5l9Jj9j9L6JM4r8N3
$$ y = [-16, 15, 2, -9, -43, -20, -22, 6, -20, -13, -16, 1, -39, 21, 4, -9, -30, -14, 2, -26, -29, -19, -11, 6, -24, -36, -17, -13, 32, -14, -26, -14, -12, 13, -11, -2, -30, -13, -7, 32, -1, 19, -11, 4, -15, -17, 0, 10, -15, -5, 17, 44, -5, -17, 17, -10, -29, -2, -35, -2, -9, -12, 11, -13, 9, 28, 28, 27, -27, 7, -46, 1, 20, -3, -31, -37, 5, -3, -5, -56, 21, 10, -8, -19, -41, 33, -30, 7, -34, -14, 49, 34, 33, -19, -9, 30, 15, 13, -6, -26, 8, -34, -18, 16, 9, -7, 1, 25, -10, 71, 14, -4, -17, -34, -35, 1, -18, -36, 38, -39, -14, -27, 9, -37, -36, 14, -7, 0, -7, -29, 8, -37, -7, 4, 44, 27, -15, -29, -32, 14, 27, 5, 8, -2, -21, -4, 45, 0, 2, -8, -33, 8, 13, -11, -12, -5, 3, -52, 21, 19, -10, -21, -8, 1, 5, 21, 6, -23, -9, -8, -43, 34, 31, -5, -27, -4, 11, 15, -46, 3, -84, -10, 4, -10, 15, -26, 0, -3, 2, -35, -29, 23, -29, -13, -14, 4, -3, -39, 5, 18, 14, -12, 24, 22, -37, 9, -3, -3, -34, -6, 15, 10, 30, -12, -10, 5, -1, 23, -9, -38, -43, 8, 30, 3, -6, -35, 2, 34, -9, -14, 10, 16, -8, 13, -41, -42, -25, -8, 61, 16, -8, -48, 4, -28, -25, 0, -13, 25, 19, -11, -19, -9, 17, -2, -44, -6, 7, -6, 17, 32, -7, -6, -25, -44, -8, -7, 37, -61, -8]
15883hk1j8L3Ml4L5K6K7j5k8K9l3n7O0l6%N5m5OJ1K6l2M2J8m0m3M0K7l4j6M3o5
15915d3K8k8J9L6J1k0l1K9j5L7k8J5L4n5L5k7J2PNjl4oO4m8l3%J9L0k9J9j5N1
15947C8m2L5l7L7o2PO5j2Mk9k4Pn9M5M3l8M7n5M7%j6qmK9l3J3k3M0k5mJL1kOj3
15982In6Q1k3Ql3O5op2RL0On3j8J4J9L7N1k6j3qJj0l5J8nK5l4J3M6o8pL1K5l8
16016a7O4nm9LK0K6m4mL8o7N1k1L7k3k3J4J8j9l1M6nPJ5l6L4o2kM6k1N0o4M0j2
16049DOqj0j8J1L3K2rp3P1k8J4J2m8L3kJ9j6k8K5m4K7mj4L6m0L5o0N1J4lk2K9
16082A5k7PK1Rl1Mj1lJ6j0j5L3K3K8q9RQNOqK8l0K8NJ2oj3j2J6m3j3K6l9K5K0
16117fj5J3L4m6m2Q8k1jrm1O0j1Pm3L7J6mJ1o3M9Kl6M2k1Rl0N2J0j3k2m2M5o2
$$ y = [-8, -29, -47, -14, -10, -44, -9, 17, 44, 29, 1, 30, -3, -60, 0, -36, -36, 19, -26, -20, -9, 17, -15, 27, 45, 5, -38, 2, 29, -5, -21, 22, -43, -15, -43, -24, 12, 23, 3, -28, 1, -14, 23, -5, 10, 44, -11, 24, -3, 9, 16, 21, 20, -14, -20, 44, -4, -37, -37, -18, 12, -17, 2, -13, 38, -4, 31, -6, 31, -31, -24, 41, 29, 33, 4, -20, -13, -72, -27, 16, -22, 25, -30, 17, 17, 1, -7, -11, 18, -15, -2, -25, 15, -10, -14, -13, 18, 16, 22, 9, -47, 34, 11, 19, -14, 51, 45, -27, -18, 12, 18, -35, -53, -39, -20, 17, 68, 42, 29, 21, 22, 12, -23, -5, -10, 15, -19, -6, 40, -28, -35, -4, 21, -17, 47, 42, -7, -4, 16, 42, -2, -6, 32, -35, 16, -5, 32, 9, -14, 0, 18, -1, -32, 14, 9, 16, 31, -5, 29, -33, -35, 11, -10, 40, -24, 16, 4, 10, 2, -8, -26, -15, 18, 40, 31, -42, 29, 1, 15, 27, -21, 12, 10, 29, 13, -15, 10, -34, -7, -11, -25, 11, -29, 6, -54, -3, 11, 8, -14, 15, -12, -5, 16, 25, -6, -2, -13, -16, 0, -10, -25, 8, 31, 59, -30, -21, -13, -8, -2, -10, 18, -12, 16, 21, 33, 27, 14, 2, 18, -25, -38, -12, -51, -26, -6, -21, -8, 26, -20, -62, 26, 5, 4, -5, -46, 14, 3, 10, -33, 4, 20, 16, 27, -36, 13, 15, -21, 21, 0, 9, -21, 31, 41, 28, 6, -36, 9, -53]
16150e3Q6n5O8k8j4%l4M6m6O7p0K0Q6q0PK2n9J8K4k1PL6m1KJ9J3k6Pl0K7K7Kj8
16183Ik7L0j9K4nk3k8L1k4J7L4j8j8nk5M5j1PL8j1Pj1J8m8Q0j02N1j0L7n2j6L3
16215Hl3L7nk8M9j5k1k2M7k7Ol0L0olM6l7K2n1L4M0n7kl4nP6o2O9r2L7NL6J7q2
16249e3M7lK6j9J1rl7L3M7j4k3l6k0N2j5L6k7N3k0j5jm2M4qj1J5l9M4llj6j7K7
16282Dl1M5m3KJ4J1k1L1M9q1J0L2m1OL0k7J2Pk2J8Lk9j1O9o5%K8pJ0l7O5n7k0
16315d6L3M2j7l7K7L8l8J1j4Rj1j2k6K8P2p1Ok6L1rjk0J5K7j5K8j6m0O5q0L9l8
16347d6J3K0L9n4QL5j3%mJ0m7L8j6k1J0M0pO1j01M2l3L8k4K2m7J9O2j7n0M6j6
16378Gj5J8j4j0P
$$ y = [-53, 33, -22, 46, 18, 4, 4, -30, 16, -30, 37, -33, -13, 73, -7, 0, 22, -37, -19, 5, -16, -9, 27, -14, -12, 7, 20, -6, 1, -29, -2, 25, 27, 9, -18, 12, -7, 17, 12, -11, -39, -8, -32, -15, 19, 1, -17, -22, -47, -2, -13, -6, 32, 21, 28, 17, 35, -13, 67, -35, 16, 6, 43, -9, -25, 8, -25, 12, 7, -21, 28, 13, -8, -30, 17, -10, -4, -34, -4, -10, -13, 33, -4, 18, -33, 1, 41, -16, -18, -52, -57, 19, -43, 26, -66, -29, -24, 12, 29, -53, -6, -9, 17, -2, 9, 0, -37, -4, 43, 29, 6, -30, -50, 2, -13, 23, -4, 49, 29, 14, 13, -29, 15, 7, -4, 11, -28, 16, 13, 10, -6, -23, 4, -27, 18, -25, -23, -9, 2, -19, 12, 61, -20, -10, 22, -19, -13, 17, -10, 2, 9, -13, 5, 8, -21, -32, 37, -28, -28, 0, -7, 3, -34, 31, -26, -46, -13, 29, 12, -25, 2, 40, 2, 13, -1, 8, -3, -15, -41, -13, 59, -12, -6, -32, -1, -10, -11, -31, -16, 11, -4, 24, 8, -32, 33, -47, -8, -46, -33, -13, 26, -28, -20, 15, 2, 2, -2, 8, -39, -1, -17, -38, -28, 12, 5, 66, -35, 7, -26, 12, -12, 10, -37, -18, 44, 27, -23, 23, 7, -8, 10, -4, -14, -7]
16383g
$$ Imaginary data points
##PAGE= N=2
##DATA TABLE= (X++(I..I)), XYDATA
0@%%%%%%%%%%%%%%%%%%%%%%%%%%%%%%%%%%%%%%%%%%%%%%%%%%%%%jLpJ3j8K1k5
60a4L2l3M0m9O5j19J448o56J0j34l47l59l05j50n4J98K16L99K44J69%j76k90l76
84b41k91j07N0K78L73L26K02j5j13l09k61k55j34k2J30K32K66K76J84R6l20k50
106I5l80k08j13R3L20K58K58J77L0j14k62k22k97j35j6P9L16L37K21J35q0k27
128B65l02k82k00n6J57K52K32K66J65o8l5k64k13k61j49k0J16L45K96K44O6r0
150D64k40k78k97j28mO7K25K85K24J82J6j15k38l40l19n7%K34L25K97J83R9j50
173D35k86k51k54r8o6Q9K97K67K27J65L4k32k48l18k35q8J25K17K70K58J34N4
195D96j45k07j88k35k09j0J01K06L43K79P6j7k45k30l22j44k2N4K22K77K10J71
$$ y = [0, 0, 0, 0, 0, 0, 0, 0, 0, 0, 0, 0, 0, 0, 0, 0, 0, 0, 0, 0, 0, 0, 0, 0, 0, 0, 0, 0, 0, 0, 0, 0, 0, 0, 0, 0, 0, 0, 0, 0, 0, 0, 0, 0, 0, 0, 0, 0, 0, 0, 0, 0, 0, 0, -1, 2, -5, 8, -10, 11, -14, 18, -15, 25, -24, 41, -78, 1370, 714, 724, 590, 243, -116, -421, -571, -625, -427, -211, 188, 432, 601, 601, 425, 135, -241, -532, -639, -589, -311, 62, 388, 590, 575, 462, 153, -108, -363, -497, -519, -389, -157, 109, 385, 569, 665, 345, 95, -285, -493, -606, -513, -193, 65, 323, 500, 530, 416, 154, -68, -365, -500, -516, -437, -121, 216, 437, 572, 492, 265, -37, -319, -519, -575, -418, -166, 66, 332, 497, 429, 394, 130, -83, -344, -493, -513, -397, -52, 244, 488, 554, 464, 224, -54, -351, -479, -483, -416, -191, 94, 318, 500, 516, 401, 163, -177, -496, -553, -553, -319, 6, 303, 486, 585, 435, 149, -102, -356, -454, -520, -431, -134, 133, 360, 525, 559, 327, 79, -239, -474, -562, -437, -220, 50, 308, 442, 496, 351, 144, -44, -279, -488, -498, -397, -191, 152, 431, 507, 490, 245, 15, -307, -451, -473, -419, -197, 80, 290, 461]
217D61K7r0k48k13k80j43n3J42K83L03K39J11q1k26k73k10k47QP8J99K37K60J66
240D50L4r2k48k78j97k23P8J38L11K87J73J9o2j82k52k31j69n6J23J95K34K82
262C34J25L7j62k30k87k54p2J00J68K20K80J41P1r6k31k64k08j17p4J26K46K50
$$ y = [461, 488, 398, 150, -63, -343, -486, -539, -397, -114, 189, 428, 539, 458, 232, -41, -251, -498, -490, -412, -213, 24, 284, 450, 484, 392, 144, -134, -331, -554, -476, -338, -27, 260, 433, 452, 390, 208, -44, -275, -444, -500, -377, -182, 52, 334, 459, 496, 334, 104, -183, -437, -509, -409, -241, -21, 259, 400, 471, 375, 144, -120, -328, -445, -519, -393, -147, 103]
$$ [...]
16383a3
##END NTUPLES=NMR FID
##END=
