##TITLE=31P_DE-80H_X3
 64 sc D2O
 26.2.2025
##JCAMPDX= 6.0         $$ Bruker NMR JCAMP-DX V2.0
##DATA TYPE= NMR FID
##DATA CLASS= NTUPLES
##ORIGIN= UXNMR, Bruker Analytische Messtechnik GmbH
##OWNER= root
$$ XWIN-NMR		Version 3.5
$$ Thu Feb 12 14:10:20 2026 Russian Standard Time (UT+4h)  Yarkov@DPX200
##.OBSERVE FREQUENCY= 81.013821
##.OBSERVE NUCLEUS= ^31P
##.DELAY= (6, 6)
##.ACQUISITION MODE= SIMULTANEOUS
##.ACQUISITION SCHEME= undefined
##.AVERAGES= 64
##.DIGITISER RES= 17
##SPECTROMETER/DATA SYSTEM= spect
##.PULSE SEQUENCE= zgpg30
##.SOLVENT NAME= CDCl3
##.SHIFT REFERENCE= (INTERNAL, CDCl3, 0, 243.863)
##AUDIT TRAIL= $$ (NUMBER, WHEN, WHO, WHERE, WHAT)
$$ ##TITLE= Audit trail, XWIN-NMR		Version 3.5
$$ ##JCAMPDX= 5.01
$$ ##ORIGIN= Bruker BioSpin GmbH
$$ ##OWNER= Yarkov
$$ C:/Bruker/XWIN-NMR/data/yarkov2/nmr/P31/2/audita.txt
$$ ##AUDIT TRAIL=  $$ (NUMBER, WHEN, WHO, WHERE, WHAT)
(   1,<2026-02-12 14:09:48.84 +0400>,<Yarkov>,<DPX200>,
      <created by zg, POWCHK disabled, PULCHK disabled
       configuration hash MD5:
       00 E9 B6 7A A2 85 ED C7 34 08 36 98 17 FE 4E 26
       data hash MD5: 32K
       53 A7 F0 00 AC 57 75 E8 E5 E4 B6 70 67 FD 38 88>)
$$ ##END=
$$ 
$$ hash MD5
$$ 10 D7 9D 4B AD 34 83 B5 24 E9 09 1D E7 13 55 3F
##$RELAX= 
##$RELAX= 
##$RELAX= 
##$RELAX= 
##$RELAX= 
##$RELAX= 
##$RELAX= 
##$RELAX= 
$$ Bruker specific parameters
$$ --------------------------
##$DU= <C:/Bruker/XWIN-NMR>
##$EXPNO= 2
##$NAME= <P31>
##$PROCNO= 1
##$TYPE= <nmr>
##$USER= <yarkov2>
##$AMP= (0..31)
100 100 100 100 100 100 100 100 100 100 100 100 100 100 100 100 100 100 
100 100 100 100 100 100 100 100 100 100 100 100 100 100 
##$AQSEQ= 0
##$AQ_mod= 1
##$AUNM= <au_zg>
##$AUTOPOS= <>
##$BF1= 81.014009
##$BF2= 200.13
##$BF3= 200.13
##$BF4= 200.13
##$BF5= 200.13
##$BF6= 200.13
##$BF7= 200.13
##$BF8= 200.13
##$BYTORDA= 1
##$CFDGTYP= 0
##$CFRGTYP= 5
##$CHEMSTR= <none>
##$CNST= (0..31)
1 1 145 1 1 1 1 1 1 1 1 1 1 1 1 1 1 1 1 1 1 1 1 1 1 1 1 1 1 1 1 1 
##$CPDPRG= <waltz16>
##$CPDPRG1= <>
##$CPDPRG2= <waltz16>
##$CPDPRG3= <>
##$CPDPRG4= <mlev>
##$CPDPRG5= <mlev>
##$CPDPRG6= <mlev>
##$CPDPRG7= <mlev>
##$CPDPRG8= <mlev>
##$CPDPRGB= <>
##$CPDPRGT= <>
##$D= (0..31)
0 1 0 0 0 0 0 0 0 0.06 0 0.03 2e-05 3e-06 0 0 0.0002 0 0 0 0 0 0 0 0 0 
0 0 0 0 0 0 
##$DATE= 1770890988
##$DBL= (0..7)
120 120 120 11 120 120 24 19 
##$DBP= (0..7)
150 150 150 150 150 150 150 150 
##$DBP07= 0
##$DBPNAM0= <>
##$DBPNAM1= <>
##$DBPNAM2= <>
##$DBPNAM3= <>
##$DBPNAM4= <>
##$DBPNAM5= <>
##$DBPNAM6= <>
##$DBPNAM7= <>
##$DBPOAL= (0..7)
0.5 0.5 0.5 0.5 0.5 0.5 0.5 0.5 
##$DBPOFFS= (0..7)
0 0 0 0 0 0 0 0 
##$DE= 6
##$DECBNUC= <off>
##$DECIM= 4
##$DECNUC= <off>
##$DECSTAT= 4
##$DIGMOD= 1
##$DIGTYP= 9
##$DL= (0..7)
0 0 52 120 120 21 21 25 
##$DP= (0..7)
150 150 150 150 150 150 150 150 
##$DP07= 0
##$DPNAME0= <>
##$DPNAME1= <>
##$DPNAME2= <>
##$DPNAME3= <>
##$DPNAME4= <>
##$DPNAME5= <>
##$DPNAME6= <>
##$DPNAME7= <>
##$DPOAL= (0..7)
0.5 0.5 0.5 0.5 0.5 0.5 0.5 0.5 
##$DPOFFS= (0..7)
0 0 0 0 0 0 0 0 
$$ [...]
##$SUBNAM1= <"">
##$SUBNAM2= <"">
##$SUBNAM3= <"">
##$SUBNAM4= <"">
##$SUBNAM5= <"">
##$SUBNAM6= <"">
##$SUBNAM7= <"">
##$SUBNAM8= <"">
##$SUBNAM9= <"">
##$SW= 400.765351723535
##$SWIBOX= (0..15)
0 1 3 0 0 0 0 0 0 0 0 0 0 0 0 0 
##$SW_h= 32467.5324675325
##$TD= 32768
##$TD0= 1
##$TE= 0
##$TE2= 300
##$TE3= 300
##$TEG= 300
##$TL= (0..7)
0 120 53 12 22 120 120 120 
##$TP= (0..7)
150 150 150 150 150 150 150 150 
##$TP07= 0
##$TPNAME0= <>
##$TPNAME1= <>
##$TPNAME2= <>
##$TPNAME3= <>
##$TPNAME4= <>
##$TPNAME5= <>
##$TPNAME6= <>
##$TPNAME7= <>
##$TPOAL= (0..7)
0.5 0.5 0.5 0.5 0.5 0.5 0.5 0.5 
##$TPOFFS= (0..7)
0 0 0 0 0 0 0 0 
##$TUNHIN= 0
##$TUNHOUT= 0
##$TUNXOUT= 0
##$USERA1= <user>
##$USERA2= <user>
##$USERA3= <user>
##$USERA4= <user>
##$USERA5= <user>
##$V9= 5
##$VALIST= <valist>
##$VCLIST= <CCCCCCCCCCCCCCC>
##$VD= 0
##$VDLIST= <DDDDDDDDDDDDDDD>
##$VPLIST= <PPPPPPPPPPPPPPP>
##$VTLIST= <TTTTTTTTTTTTTTT>
##$WBST= 1024
##$WBSW= 4
##$XGAIN= (0..3)
0 0 0 0 
##$XL= 0
##$YL= 0
##$YMAX_a= 228
##$YMIN_a= -213
##$ZGOPTNS= <>
##$ZL1= 120
##$ZL2= 120
##$ZL3= 120
##$ZL4= 120
##$ABSF1= 60
##$ABSF2= -190
##$ABSG= 5
##$ABSL= 3
##$ALPHA= 0
##$AQORDER= 0
##$ASSFAC= 0
##$ASSFACI= 0
##$ASSFACX= 0
##$ASSWID= 0
##$AUNMP= <proc_1d>
##$AZFE= 0.1
##$AZFW= 0.5
##$BCFW= 1
##$BC_mod= 2
##$BYTORDP= 1
##$COROFFS= 0
##$CY= 9.86611175537109
##$DATMOD= 1
##$DC= 1
##$DFILT= <>
##$DTYPP= 0
##$F1P= 182.462994727601
##$F2P= 168.069089081705
##$FCOR= 0.5
##$FTSIZE= 0
##$FT_mod= 0
##$GAMMA= 1
##$GB= 0
##$INTBC= 1
##$INTSCL= 1
##$ISEN= 30
##$LB= 1.5
##$LEV0= 0
##$LPBIN= 0
##$MAXI= 11.51145
##$MC2= 0
##$MEAN= 0
##$ME_mod= 0
##$MI= 1.244541
##$NCOEF= 0
##$NC_proc= 0
##$NLEV= 6
##$NOISF1= 0
##$NOISF2= 0
##$NSP= 1
##$NTH_PI= 0
##$NZP= 1
##$OFFSET= 243.8632
##$PC= 1.4
##$PHC0= 1673.609
##$PHC1= -1.240479
##$PH_mod= 0
##$PKNL= yes
##$PPARMOD= 0
##$PSCAL= 0
##$PSIGN= 0
##$REVERSE= no
##$SF= 81.0140731611343
##$SI= 65536
##$SIGF1= 0
##$SIGF2= 0
##$SINO= 80
##$SIOLD= 65536
##$SREGLST= <31P.CDCl3>
##$SSB= 0
##$STSI= 0
##$STSR= 0
##$SW_p= 25641.0256410257
##$SYMM= 0
##$S_DEV= 0
##$TDeff= 0
##$TDoff= 0
##$TI= <>
##$TILT= no
##$TM1= 0
##$TM2= 0
##$TOPLEV= 0
##$USERP1= <user>
##$USERP2= <user>
##$USERP3= <user>
##$USERP4= <user>
##$USERP5= <user>
##$WDW= 1
##$XDIM= 64
##$YMAX_p= 0
##$YMIN_p= 0
$$ End of Bruker specific parameters
$$ ---------------------------------
##NTUPLES= NMR FID
##VAR_NAME=  TIME,          FID/REAL,        FID/IMAG
##SYMBOL=    X,             R,               I
##VAR_TYPE=  INDEPENDENT,   DEPENDENT,       DEPENDENT
##VAR_FORM=  AFFN,          ASDF,            ASDF
##VAR_DIM=   16384,         16384,           16384
##UNITS=     SECONDS,       ARBITRARY UNITS, ARBITRARY UNITS
##FACTOR=    3.08e-05,      1,               1
##FIRST=     0,             0,               0
##LAST=      0.5045964,     0,               0
##MIN=       0,             -213,            0
##MAX=       0.5045964,     228,             0
$$ Real data points
##PAGE= N=1
##DATA TABLE= (X++(R..R)), XYDATA
0@%%%%%%%%%%%%%%%%%%%%%%%%%%%%%%%%%%%%%%%%%%%%%%%%%%%%%%jJ%J%mPj0J0
$$ 0 0 0 0 0 0 0 0 0 0 0 0 0 0 0 0 0 0 0 0 0 0 0 0 0 0 0 0 0 0 0 0 0 0 0 0 0 0 0 0 0 0 0 0 0 0 0 0 0 0 0 0 0 0 0 -1 0 0 1 1 -3 4 -6 4
63Dj1J4l1L3K04q0j13j34k7p2N6O0R7J27nP8n3o4j00j25j4OK2J03J39K2Q2j4j25
$$ 4 -7 7 -24 9 213 133 20 -114 -141 -213 -157 -97 0 127 122 200 147 83 -17 -142 -156 -150 -128 -25 114 136 218 204 79
92G9o7p3o6mJ2L6J38J09K1j7n3l6j31n0m6J2Q6M7J25k0P4k9m8j19l6o0n5L0R8
$$ 79 12 -61 -127 -131 -119 -83 55 164 185 168 115 79 -52 -102 -148 -136 -50 -3 122 102 176 147 99 -20 -56 -116 -171 -141 -43
121d3O4O2M8P7p6r0p4j16O9n0O9N6O7Q4qJ8o8o0j16K2q7R8K8P9N8nJ03q8p5j01
$$ -43 21 83 131 208 132 42 -32 -148 -79 -129 -60 -4 63 147 139 157 89 29 -87 -65 -152 -54 -26 53 111 106 209 121 46 -55
151e5n1J4p2P9M4J45K7L3l3r4k7q4Kn3O7M2P7M8P1n2m8k3j38m9k6J9J0J44Q7K6
$$ -55 -106 -92 -164 -85 -41 104 131 164 131 37 10 -74 -72 -125 -58 -16 61 109 180 128 80 57 -81 -130 -156 -137 -127 17 104 130
181A30nj1l0o1r4kr0R4P5M6N2M5J8j27j8j00k0m6P1K3O9P1K6k2J0o9p5q3m9k2
$$ 130 125 114 84 23 -71 -73 -163 -69 6 52 104 149 167 40 22 -78 -98 -144 -73 -50 19 90 116 94 104 35 -40 -123 -172 -194
211a94J52L0J00J1P9m5p6qj21j4n3K4K4J21P9j7P2q1pj07r4km4O6M7J40JK4Pn0
$$ -194 -42 -12 88 99 178 133 57 49 -72 -86 -139 -115 -91 30 109 92 164 83 76 -31 -125 -127 -171 -105 -58 82 83 107 114 64
241F4o5o0o5l0N7K0O7R0O4pl8r5o9l2p1L4Q0N4N6K7P9r1l0j11k6m6k0N3L2R5K7
$$ 64 -1 -61 -126 -156 -99 -79 -12 78 142 135 97 2 -67 -99 -170 -136 -56 -2 54 81 160 69 39 -72 -98 -144 -164 -111 -79 16 43
272D3O3J0p2m0r6j3m9M0L3mJ17K6O9p0n6k6q1j0J1M7mQ2K8O0j9n3m5r8K8o7lJ03
$$ 43 106 116 44 4 -92 -105 -154 -114 -81 -85 32 58 127 57 1 -25 -106 -116 -105 -58 -62 20 48 108 89 36 -9 -107 -79 -146 -149 -46
304d6J9J05l2L7K6q5p2p2J4m1J02J1M7M1P8l9q8j2j22J7J2J2pL7N3R4K4l3p9n5
$$ -46 -27 78 46 83 109 24 -48 -120 -106 -147 -45 -34 13 54 132 93 5 -7 -129 -112 -100 -88 -95 -58 -5 89 113 80 1 -54
334e4l8l6K8O7n0J12L2K7m4k6m7q7qj1J4O5N7Q9rk6n1l2j8k6n0JP1K2O9k0M6m
$$ -54 -92 -128 -100 -33 -83 29 61 88 44 18 -29 -116 -124 -135 -121 -56 1 90 81 55 4 -28 -46 -72 -122 -121 -50 -28 41 21 67 63
366F3l6q6m6J4LL6oO0M7M2l5J4n4m5m1o1M9M6O2O7lqm1m4l1J4n8k6N0L8O5L4K2
$$ 63 27 -59 -105 -91 -88 -52 -58 2 49 91 56 70 16 -29 -70 -131 -82 -36 26 93 90 82 41 -3 -34 -20 -78 -104 -54 -16 49 83 105
399A05m5k0K5j30kl4M9%O3O9j8j7k1K4q7j6l6j0O3K4M0K0L1K6q9n2mr6M7JO4L8
$$ 105 60 40 65 -65 -67 -101 -52 -52 11 80 62 45 24 48 -39 -55 -91 -101 -38 -14 26 46 77 103 14 -38 -42 -138 -91 -90 -26 12
431A2J6M2lm9j3l4o0K5mM0L1N2K2k9mJ7o5j04M7Jk0N2N9N0K8M7j55K6r5J1Qk1
$$ 12 28 70 67 18 5 -29 -89 -64 -68 -28 3 55 77 48 44 61 -4 -108 -61 -60 -80 -28 31 81 109 156 1 27 -68 -57 -49 -70
463g0R5k3Q5QN4j01K0m4r7k9OO5L3Q9PNj2l1j8n2qJ0l7M3L1R0J4Nr5Nl7q1M7j00
$$ -70 25 2 87 95 149 48 68 24 -73 -102 -96 -31 2 91 98 103 91 60 42 -10 -18 -8 -45 -2 29 119 133 138 43 48 11 -70 -23 -123
497a23J00M1J8J06k7j8o9k6l9K7p4M9P2L1K1j3k5Po1k9m9P3o1P6k7J12Lk5J0o4
$$ -123 -23 18 36 142 115 97 28 2 -37 -10 -84 -35 37 68 89 76 51 58 -3 -32 -81 -8 -69 7 -20 92 95 70 80 16
527A6l2o1j7J8O6M2J7M0o1PQro1Jl5M4L0K6Q0l3Ljn7%q8M6l4jJ16QK8k4l4mp1
$$ 16 -16 -77 -94 -76 -10 32 49 89 28 35 43 34 -27 -26 -61 -17 13 39 119 86 89 88 31 31 -57 -11 -45 -46 70 78 106 82 48 44 -27
562b7o2M9l7J6P0K8N5k9mrm6n0r5P9jNO6J1L0K3j9o9J2j13j1K8j0R0M4Q8n6l8
$$ -27 -89 -40 -77 -61 9 37 92 63 59 50 4 -46 -141 -62 -63 -58 8 19 49 72 53 -16 -4 -117 -128 -100 -110 -20 24 112 56 18
594A8O3j10l7olk0O1M1N3N7l1n8l7l3o0j7N7O8PK4M9K8n6q8k2j9j5m1M7P5L7P5
$$ 18 81 -29 -66 -72 -75 -95 -34 7 60 117 86 28 -9 -42 -102 -119 -62 6 13 37 86 114 58 -30 -52 -71 -86 -127 -80 -5 32 107
626A07k6m3l2pn8m2k6K8Q1M5L2K0k3K2oj07o2j0K7m5J40j9O0k4M0l5j09J4o7L0
$$ 107 81 38 6 -1 -59 -101 -127 -99 -18 27 59 79 56 78 72 -35 -97 -107 -80 -125 15 -4 56 32 72 37 -72 -58 -125 -95
656i5rP0K5K7M9k6J9l3q7j6m3j5L5J09oJ00l8j1k6m3m2m7%J2N7J3P1Ll0lp6J3
$$ -95 -104 -34 -9 18 67 41 60 27 -60 -76 -119 -134 -99 10 4 104 66 55 29 -14 -56 -103 -103 -91 -34 -21 50 53 23 20 -56 -43
688d3n0oL9L7M2m0J06j8j2k7q4j7m8K7L5L1J6O0O2o9Mp5p2m0K2K3K3N0L0M8J2
$$ -43 -93 -99 -60 -23 19 -21 85 67 55 28 -56 -73 -121 -94 -59 -28 -12 48 110 41 45 -30 -102 -142 -120 -97 -74 -24 6 54 66
719F6Oqj06m2l3J3nJ17J4P3k4k4k2r5J7n5J5j1P6J3P0oj0O3m7n6m0q4J5L8R1%
$$ 66 72 64 -42 -84 -117 -104 -109 8 22 95 71 47 25 -70 -53 -108 -93 -104 -28 -15 55 49 39 102 55 -1 -41 -125 -110 -72 19 19
751A9N1n6P5l9n2m2j21P2K7J3K3O3R0r3L6q3Nq4J2N4j4N1M1L4Pl4l3p0K1m5kk7
$$ 19 70 14 89 50 -2 -44 -165 -93 -66 -53 -30 33 123 30 66 -17 -12 -96 -84 -30 -44 7 48 82 89 55 22 -48 -27 -72 -74 -101
783a01O7Q4jM4n2jm4m2j5J5o7O7O8mN5K6o8M8j18j2Ol9P0NP4P9o5J3Lp8q9j1N4
$$ -101 -34 50 49 93 41 40 -4 -46 -61 -46 -113 -46 22 18 73 99 31 79 -39 -51 -45 -84 -14 -9 65 144 79 92 95 17 -72 -83 -29
816b9m2L5N6J3M5j3J3n7k5Km8qL0R3m2P3k8J7j9j06M1q5J2OP8K8M1J2jK8p7p2
$$ -29 -71 -36 20 33 78 65 78 21 -4 -2 -50 -58 -28 65 23 96 68 85 66 -40 1 -84 -72 -66 12 40 81 93 92 120 43 -29
848b9k5l1M7M4N9J8J1L9k4n7q5K8j02N8l4M2N6RJ43q6k2K5p0n6j3L2l3P7M1J8
$$ -29 -54 -85 -38 6 65 83 94 133 109 52 -33 -5 -107 -49 -83 -41 15 24 167 81 59 84 14 -42 -55 -23 -56 21 62 80
878H0K4r4K4o9J7r2K4MM2K4R0L0k3L5o4o0p4J7j0K5R9J4K5k3k1k6j6l1m9J7J8
$$ 80 104 10 34 -35 -18 -110 -86 -82 -40 -16 74 104 81 116 52 -8 -82 -65 -75 -50 49 63 88 65 44 18 2 -29 -78 -61 -43
909d3K8K6N2Qj2l5j5Kj33L8rP4N4K8K2l2M6j08l8np5K2N7N7j3P1k6J3%n2o4m5
$$ -43 -15 11 63 71 59 24 9 11 -122 -84 -93 -19 35 63 85 53 99 -9 -47 -52 -127 -105 -48 9 -4 67 41 54 54 2 -62 -107
941a07R6m0lR1LM8j1Po3j5n6m5J9L2P5L1lqK4p6k3J9p3J9j2P2M6KO6p4J6l2o1
$$ -107 -11 -51 -54 37 40 88 77 84 21 6 -50 -95 -76 -44 31 62 59 51 75 -1 -24 -5 -78 -59 -71 1 47 49 115 41 57 25 -36
974c6l2oOK1N0M3O2j7n8M0q0kn8RM7j6M7L4K1J4k1m6o8j9k7N7RM6LQ0j5k5n2R
$$ -36 -68 -74 -68 -47 3 46 108 91 33 73 -7 -9 -67 -58 -11 -27 20 54 75 89 68 22 -46 -65 -92 -35 -26 20 23 103 88 63 11 20
1008B0r7rN1l5J10j3Q3k6qp2j1op0nK0K4N4k8Q6p0M7n2q4O0o0L2J3R2k4QN1l3
$$ 20 -77 -86 -35 -70 40 27 110 84 76 4 -7 -13 -83 -88 -68 -44 10 -18 68 -2 45 -7 -91 -31 -91 -59 -46 46 22 30 81 48
1040D8L1r7K8j21O6nL7K1qM2j4rk0j8j0q0L8jP2M8l2oL3k4q6P0j04M7k2O0%Q3
$$ 48 79 -18 10 -111 -45 -50 -13 8 0 42 28 19 -1 -19 -29 -109 -71 -72 0 48 16 10 43 19 -67 3 -101 -54 -76 -16 -16 67
1072F7ol7K9p0jr3j4P3JK3P0K8j5l0k4o4J0r8O7M7J0kR2L6o3nq6K5k0oj1k3J23
$$ 67 61 24 53 -17 -18 -111 -125 -52 -51 -28 42 70 55 25 1 -63 -53 -151 -84 -37 -27 -29 63 99 36 31 -55 -30 -50 -56 -67 -90 33
1105C3NN6j6mq1l1k1l0Q3r3Q9l9J01L0j7l0o1qq7J0M6L2M2k7Q6l4k7J1m9n8m8
$$ 33 38 94 78 74 -7 -38 -59 -89 -6 -99 -10 -49 52 82 65 35 -26 -34 -121 -111 -65 -33 9 -18 68 34 7 18 -31 -89 -137
1136a37R1O1P2q8P6j4L4j01JJ0p1o3N4O1L6K0J9j7j4n9ml6NkM2K0O5j8j4Nk1n3
$$ -137 -46 15 87 -1 75 61 95 -6 -5 5 -66 -129 -75 -14 22 42 61 44 30 -29 -33 -69 -64 -66 -24 -4 61 43 29 34 13 -40
1168d0j8j6j9J03l8O5J5K0%m3m9n7%KJ7Q7QRJ4l3M5l7r5Pl5K0J2J09n4L5N2n6
$$ -40 -58 -74 -93 10 -28 37 52 72 72 29 -20 -77 -77 -75 -58 29 37 46 60 27 72 35 -60 -53 -88 -68 -56 53 -1 34 86 30
1200C0K7p8l7KJ5j3K4O2J4M4j6rMj25j9l0N3k0R3NK6N3k9l4m1j2o3j6N8RO5rQ4
$$ 30 57 -21 -58 -56 -41 -54 -30 32 46 90 74 65 69 -56 -75 -105 -52 -72 21 26 52 105 76 42 1 -11 -74 -90 -32 -23 42 33 117
1233A17l3m3l9n1l0qJ5N4QN1K3l2L6p5J2m4l1J7L0j8O8lN8n3K7po4k1j4J7K5N1
$$ 117 84 41 2 -49 -79 -87 -72 -18 -10 41 64 32 68 -7 5 -39 -70 -53 -23 -41 27 24 82 29 56 49 -15 -36 -50 -33 -8 43
1265D3O1J9o6rk2o4M6j20L6O9L2N1j0L1l5J7j21J0n2K5J3mJ27k6O7m0l0m4kJ6
$$ 43 104 123 57 48 26 -38 8 -112 -76 -7 25 76 66 97 62 79 -42 -32 -84 -59 -46 -50 77 51 118 78 48 4 2 18
1295A8o0K3j3P5K2K0pj4L9q7o4J7m9Q2m4M0K6J23r4Qp9K5j9q8J21m1O4j8P3lm9
$$ 18 -42 -19 -32 43 65 85 78 64 103 16 -48 -31 -80 2 -42 -2 24 147 53 61 -18 7 -12 -100 21 -20 44 26 99 96 47
1326D7k4j6p1j0J9O3j0P1k3O6n1o0qo2N8p7N0lOQ9k8N1kj4j36K9nj2M0J4L3L2
$$ 47 23 7 -64 -74 -55 8 -2 69 46 112 61 1 -7 -69 -11 -88 -38 -41 -35 54 26 77 75 61 -75 -46 -51 -63 -23 -9 24 56
1358E6J1no7K5p3l5OJ6LL5J4N8M6q7L3o2k0o7J20o5P9LJ3O2q3k8J2n2nl8M4NN9
$$ 56 67 62 -5 20 -53 -88 -82 -66 -63 -28 -14 44 90 3 36 -26 -46 -113 7 -58 21 24 37 99 16 -12 0 -52 -57 -95 -51 -46 13
1391A3N5Rn9J0k5l5k3k1K2m3J27j6M0K6k9Ln6l8l0q0J03nN6J1P5q8Ro0l2O3m1
$$ 13 68 77 18 28 3 -32 -55 -76 -54 -97 30 14 54 80 51 54 -2 -40 -70 -150 -47 -52 4 15 90 2 11 -49 -81 -18 -59
1422e9k7%O9M3m3Q7j4j01L2l3l5QKO3K7k3Q9p5Qj7n7pn0K2K5L2M0P7j3k2j4r5
$$ -59 -86 -86 -17 26 -17 70 56 -45 -13 -46 -81 -73 -71 -8 19 -4 85 10 18 1 -56 -63 -113 -91 -66 -34 6 83 70 48 34 -61
1454f1L0p5%O5L1K2k5Q1n3K8r4m5QMK7%KrJ21J4l6l0n6j2o4O2MN8M1j5O2n0l2
$$ -61 -31 -106 -106 -41 -10 12 -13 68 15 43 -51 -96 -88 -84 -57 -57 -55 -64 57 71 35 5 -51 -63 -127 -65 -61 -3 38 23 85 35 3
1487Cm5J1m5J1M8m0R4nK1om8qp1rk8pM7qJ49npl0Jm5m6k6k4Q8L3KK2P3l4J8n3
$$ 3 -42 -31 -76 -65 -17 -57 37 32 53 47 -1 -9 -80 -89 -117 -124 -77 -85 64 59 52 22 23 -22 -68 -94 -118 -30 3 5 27 100 66 84 31
1522C1j06M1m4K7K1O2k3K3P3q3mk0k0n5RM0k8L3oM7L9m3j7p3K1o1J9M0Q6K1J4
$$ 31 -75 -34 -78 -51 -30 32 9 32 105 22 18 -2 -22 -77 -68 -28 -56 -23 -29 18 57 14 -3 -76 -55 -116 -97 -57 29 50 64
1553F4Km1k3o8M8r4L3N4K1J6lM0j2L3o9nl6m3N5n9R8N6J1j4l8j2l6Ko1MM7L8M6
$$ 64 66 25 2 -66 -18 -112 -79 -25 -4 12 9 49 37 70 1 -4 -40 -83 -28 -87 11 67 78 64 26 14 -22 -20 -81 -77 -30 8 54
1586E4j7Rk6K8n7k9j0l6J2M2K9Q7pK8n4Pq0JJ9m2N4k8O8j3N6j9j9k2p0L7l4Jk
$$ 54 37 46 20 48 -9 -38 -48 -84 -72 -30 -1 86 79 107 53 60 -20 -19 0 -42 12 -16 52 39 95 76 57 35 -35 2 -32 -31 -33
1619c3J12Kj9O4n0m0m5j6mj9L6M8J7J5K8m7pn2J5p0N8K2j0N9l9O5k3j7m2nK4o8
$$ -33 79 81 62 126 76 36 -9 -25 -29 -48 -12 36 53 68 96 49 42 -10 5 -65 -7 15 5 64 25 90 67 50 8 3 27 -41
1651d1J3M3L7pJ7J8j4oj14M3j2k6J7K3L3L0J0J8n8j7j7J5q7O4NO7oJ4j2lPj32
$$ -41 -28 15 52 45 62 80 66 60 -54 -11 -23 -49 -32 -9 24 54 64 82 24 7 -10 5 -82 -18 -13 54 48 62 50 47 54 -78
1683g8N2qk3N8QPpN9J3l1j8o1J9m4J9J7M6K9J8j4j2l7l6k1ll2P2%K1K4K7l6J0
$$ -78 -26 -34 -57 1 9 16 9 68 81 50 32 -29 -10 -54 -35 -18 28 57 75 61 49 12 -24 -45 -48 -80 -8 -8 13 37 64 28 38
1716C8l1k0n5O8k1oOM9LL9k2m9J4k5m8L0j1O6j2K2Mm2J2j5Ol2jO6m4K1K1K4k5
$$ 38 7 -13 -68 0 -21 -27 -21 28 31 70 48 -1 13 -12 -60 -30 -41 25 13 35 39 -3 9 -6 0 -32 -33 33 -11 10 31 55 30
1749C0J1o8J9Qq5O4mQN6Kpo9R8p6n9M6j11J00l8J13o5N7K6l4l4m0m0K2oM6N5m1
$$ 30 41 -27 -8 0 -85 -21 -25 -17 39 41 34 -35 63 -13 -72 -26 -137 -37 -75 38 -27 30 56 22 -12 -52 -92 -70 -76 -30 25 -16
1781a6J4J1L1n6l3l2N1l0J6N3J4J5k8jj6nm4M0o8P7j4n6J40o1K0j0Pn7k6O8o2
$$ -16 -2 9 40 -16 -49 -81 -30 -60 -44 9 23 38 10 9 -7 -12 -56 -16 -84 -7 -21 -77 63 2 22 12 19 -38 -64 4 -58
1812e8K6MJ3J6M9Jp2NK3p4MJ2M4L1qk6J8jm8J0l6K4%%OM7mP2r5K4o4N0p3K1L1
$$ -58 -32 -28 -15 1 50 51 -21 -16 7 -67 -63 -51 -7 24 16 -10 8 7 -41 -31 -67 -43 -43 -43 -37 10 6 78 -17 7 -57 -7 -80 -59 -28
1847b8M5J6m5J6pJnn8NM0k9K6J4J4k4R2n4j5j7l0K0L9lo5R6l6j5L0k6Pl6N5j03
$$ -28 17 33 -12 4 -3 -2 -7 -65 -60 -20 -49 -23 -9 5 -19 73 19 4 -13 -43 -23 16 13 -52 44 8 -7 23 -3 4 -32 23 -80
1880h0L3M8l%N8l8n3J6m5QJ4k9P4l2K5M4j0pj2Op2L0l0L8l1Q0RJ3pk5k1k9Lm9
$$ -80 -47 1 -2 -2 56 18 -35 -19 -64 -56 -42 -71 3 -29 -4 40 30 23 11 17 -55 -25 -55 -17 -48 32 41 54 47 22 1 -28 -25 -74
1914g4O8j7L4pL2J0m8M6r4l4J12p4O1nJ8J6K3k3l3K3j05O8m1M3n2P6jk7N5m6k0
$$ -74 -6 -23 11 4 36 46 -2 44 -50 -84 28 -46 15 10 28 44 67 44 11 34 -71 -3 -44 -1 -53 23 22 -5 50 4 -16
1945a6J4Rm7lJ04q8M7kK1k4J3n7m8R8m8M5j5M5J4l1J5n6KN0q1mL6J0QM0l6P3j5
$$ -16 -2 7 -40 -43 61 -27 20 18 39 15 28 -29 -77 21 -27 18 3 48 62 31 46 -10 -8 42 -39 -43 -7 3 11 51 15 88 73
1978G3q9J6p8P6k3N1rj5%O5j1n4J7o6QjM0N4J2m0L0L2l0m7l3jL7p7Q6kN7nn5R
$$ 73 -16 0 -78 -2 -25 26 17 2 2 67 56 2 19 -47 -39 -40 0 54 66 26 56 88 58 11 -22 -23 14 -63 23 21 78 73 18 27
2012B7m2J7Jk9j8L0M5k8M5l3L4Oj4o0J5L2p6K4Q1nl3Ok7J9Ml3l9oN7J2L3Pj1L0
$$ 27 -15 2 3 -26 -44 -14 31 3 48 15 49 55 41 -19 -4 28 -48 -24 57 52 19 25 -2 17 21 -12 -51 -57 0 12 45 52 41 71
2046G1l3k1j6l7L0RK0J2M9p1N7l8m7j7J4J2o2O8L3l7P0o2%n0K5L9m6L1j8L8j4
$$ 71 38 17 1 -36 -6 3 23 35 84 13 70 32 -15 -32 -18 -6 -68 0 33 -4 66 4 4 -46 -21 18 -28 3 -15 23 9
2077IO8r4M4j6Lm1o6O5k8N3j1KN6L7o2J%l2OJ8n1RK8L3J4l2j4k7l9L3J9J4q%K5
$$ 9 77 -17 27 11 14 -27 -93 -28 -56 -3 -14 -12 44 81 19 20 20 -12 -6 12 -39 -30 -2 31 45 13 -1 -28 -67 -34 -15 -1 -9 -9 16
2112A6M4o9K0k1k8lm7N2K6j9J6J8J7nn4m1K5k5K5n1Q4J7M6o2M6J1n7m3ooK2L6
$$ 16 60 -9 11 -10 -38 -41 -88 -36 -10 -29 -13 5 22 17 -37 -78 -53 -78 -53 -104 -20 -3 43 -19 27 38 -19 -62 -68 -74 -52 -16
2144a6JL3L1m1OL9p2m1J7l4L3J7O2K5k4J4Ll1k3m5J4l0M7L9jN2o6Rl0j5pm3N2
$$ -16 -15 18 49 8 14 53 -19 -60 -43 -77 -44 -27 35 60 36 50 53 22 -1 -46 -32 -62 -15 24 23 75 9 18 -12 -27 -34 -77 -25
2177b5m7L8L7K9j2nL5n6Km8j9J5rM7%J1l4K4j1L0n8qK1J3J9JL7QJk4j4J3p8K1
$$ -25 -72 -34 3 32 20 15 50 -6 -4 -52 -71 -56 -65 -18 -18 -7 -41 -17 -28 2 -56 -64 -43 -30 -11 -10 27 35 36 12 -2 11 -67 -46
2211d6j4K4MM1N4pn9j8kp3P4m8K3N5l5N8%M5q6m2M0n0M5lpk4P1k1M3ko3j3Lon8
$$ -46 -60 -36 -32 9 63 56 -3 -21 -23 -96 -22 -70 -47 8 -27 31 31 76 -10 -52 -12 -62 -17 -20 -27 -51 20 -1 42 40 -23 -36 -33 -39 -97
2246i7R1pl5K3J1lJ4On3J6l3L3K9nL7m4P3l7j9m2njMM0l1O7j2mlKp0mJ0k8N9k4
$$ -97 -6 -13 -48 -25 -14 -17 -3 3 -50 -34 -67 -34 -5 -10 27 -17 56 19 0 -42 -47 -48 -44 -4 -35 32 20 16 13 15 -55 -59 -49 -77 -18 -42
2282d2j6R9m8M2k7n2J1j8J2l9J6J0N2N0l5J6m2qPk9k0k6P6l2Q7K0k9qm2lq0P6
$$ -42 -58 41 -7 35 8 -44 -33 -51 -39 -78 -62 -52 0 50 15 31 -11 -19 -12 -41 -61 -87 -11 -43 44 64 35 27 -15 -18 -98 -22
2314b2m0KN6lK2l1j6oN3l9m2KK4M7J6J7k6Jml7K0l3l0L1QJ7N8Mk7l1KL2o3J5N0
$$ -22 -62 -60 -4 -7 15 -16 -32 -38 15 -24 -66 -64 -40 7 23 40 14 15 11 -26 -6 -39 -69 -38 -30 -13 45 49 22 -9 -7 25 -38 -23 27
2349B7n7K9k3O5j6K7j6p4L5l2k1K6K1k1M7j6P3l5o8M1j2l1nN7K2L5k3K1m2l5j
$$ 27 -30 -1 -24 41 25 52 36 -38 -3 -35 -56 -30 -9 -30 17 1 74 39 -29 12 0 -31 -36 21 43 78 55 76 34 -1 -2
2380bk0o8O1l2O2K8K4l7M6l1qm0l8M4l2M7j9O2M0p2K6j00Q0l4j4J2j4Q2n2Q2l7
$$ -2 -22 -90 -29 -61 1 29 53 16 62 31 23 -17 -55 -11 -43 4 -15 47 87 15 41 -59 21 -13 -27 -15 -29 53 1 83 46
2411D6rO7q6%j9Jj4M1KK6qL9m2%o5K1n4L8J6L4lj2K3L5l4k3j5n5P5m8N8m4K7K2
$$ 46 37 104 18 18 -1 0 -14 27 29 55 47 86 44 44 -21 0 -54 -16 0 34 31 19 42 77 43 20 5 -50 25 -23 35 -9 18 40
2445D0k2qnLm3L8k5J7j2J6N3j3j3N1j11K1K4j6M0o2M0k7P7Nl8l4Krk6%K4L2qM3
$$ 40 18 10 5 8 -35 3 -22 -5 -17 -1 52 39 26 77 -34 -13 11 -5 35 -27 13 -14 63 68 30 -4 -2 -11 -37 -37 -13 19 11 54
2479E4j03R5n4l3J8j3M9q2Q5l1M2j8N5q1J1m1j1K0k4J7N8MK0o6N5k3j4m0RJKQ
$$ 54 -49 46 -8 -41 -23 -36 13 -69 16 -15 27 9 64 -17 -6 -47 -58 -38 -62 -45 13 17 37 -29 26 3 -11 -51 -42 -41 -39 -31
2511c1K5O8j7kl0n5Q3q5mKK7J1RK4l3j6J2k4rj4LL3J9J6K9J1j3m0l1qM7l0m8O8
$$ -31 -6 62 45 43 13 -42 41 -44 -48 -46 -19 -8 1 25 -8 -24 -12 -36 -45 -59 -56 -23 -4 12 41 52 39 -1 -32 -40 7 -23 -71 -3
2545cJ1lOQ%n5Kj3j8l4K8K2M9jL2K7l2j1o8k6M0o1N7L0%K6j5Po5N4l9N7p5Q0k9
$$ -3 8 5 11 19 19 -36 -34 -47 -65 -99 -71 -49 0 -1 31 58 26 15 -53 -79 -39 -100 -43 -13 -13 13 -2 5 -60 -6 -45 12 -63 17 -12
2580a2J9P7j22M5l5Lok0L7k8Nk1P7j5l2k4J8J0l2L1K6k2%Q3l7kk1n0J3l6O4n3
$$ -12 7 84 -38 7 -28 -25 -31 -51 -14 -42 -37 -58 19 4 -28 -52 -34 -24 -56 -25 1 -21 -21 62 25 23 2 -48 -35 -71 -7 -60
2612f0j0N4L8k7k8j8J2pk6J4oO2n1N3LM9n6Nl2l0K5k2j8L9M1LK5lJ5m3m2K0Mk5
$$ -60 -70 -16 22 -5 -33 -51 -39 -46 -72 -58 -64 -2 -53 0 3 52 -4 1 -31 -61 -36 -58 -76 -37 4 7 32 29 44 1 -41 -21 -17 -42
2646d2lQ2o7M2L9j9jj4rlm6M2kk3M0lKmk8J1m9MO2o6P0j1j0L9l2L5n6J7k2K9J0
$$ -42 -45 37 -30 12 51 32 31 17 8 5 -41 1 -1 -24 16 13 15 11 -17 -6 -55 -51 11 -55 15 4 -6 33 1 36 -20 -3 -25 4 14
2681A4k7J0p9J08n2M8o3N2l7o7P9m9J08j7j8K0j8l9OJ4k8j8K6K8j4k1R8p1J0k1
$$ 14 -13 -3 -82 26 -26 22 -41 11 -26 -93 -14 -63 45 28 10 30 12 -27 -21 -7 -35 -53 -27 1 -13 -34 64 -7 3 -18
2711a8M5n9N6p1J3M0%K5kJ5k5l6oNj9jL3m2M5O9n1J9n7pRj8RJ1J5JJ4j3L6q9K4
$$ -18 27 -32 24 -47 -34 6 6 31 29 44 19 -17 -23 -18 -37 -38 -5 -47 -2 67 16 35 -22 -29 -20 -38 -29 -18 -3 -2 12 -1 35 -54 -30
2746c0qjK0j3M0K2PJ0p6L2l3L1l2J6j7J9QL6M0o0N8n4m8M0j6j6j0N2J6k2O6r1
$$ -30 -38 -39 -19 -32 8 30 37 47 -29 3 -30 1 -31 -15 -32 -13 -5 31 71 11 69 15 -33 7 -9 -25 -35 17 33 11 77 -14
2778a4L9o6O3m2oM4n4O1k0j0j4P0j04O5J9j03N1J6J9J0k4K6m0L0o7K9J8m4J8M
$$ -14 25 -41 22 -20 -26 18 -36 25 5 -5 -19 51 -53 12 31 -72 -21 -5 14 24 0 26 -14 16 -51 -22 -4 -48 -30 -26
2808b6N0l3Qk1M2l7k6L2l4jM2QLN3m7K2j0j9Nk9J7j2M8K3j4L7J8m2m4K7m1J7L
$$ -26 24 -9 -1 -22 20 -17 -43 -11 -45 -46 -4 4 7 60 13 35 25 6 11 -18 -1 -13 35 58 44 81 99 57 13 40 -1 16 19
2841A9p5N6J6MQK2r0pP2l0Nn3J8J1K5L5oj3q6R6r5L3J1o4J30p9L2OQj5Mll9nK4
$$ 19 -56 0 16 20 28 50 -40 -47 25 -5 0 -53 -35 -24 1 36 30 17 -69 27 -68 -35 -24 -88 42 -37 -5 1 9 -6 -2 -5 -44 -49 -25
2876b5Ok9M4k5K4M0m3j7lk6M7j7J5k0O7j0L4m8m6K2rl3K3L9j7Q0m7j0k9j7j1k6
$$ -25 -19 -48 -4 -29 -5 35 -8 -25 -28 -54 -7 -24 -9 -29 38 28 62 14 -32 -10 -19 -52 -29 10 -7 73 26 16 -13 -30 -41 -67
2908f7jO3l7J7L1Rk0j1L0k6n2L3m3LO5j6N6n6j5K8kJ0m4Qj4L9Qlj1%n3O2k0PO
$$ -67 -68 -5 -42 -25 6 15 -5 -16 14 -12 -64 -31 -74 -71 -6 -22 34 -22 -37 -9 -11 -1 -45 -37 -51 -12 -4 -7 -18 -18 -71 -9 -29 -22 -16
2943a6m8nQ5p5Q2n7NnmL0q0K1M6j6jK8L7o0L0j0J6p7L4L2OM4n2Rpj6Po0N7m6K7
$$ -16 -64 -69 16 -59 23 -34 -29 -34 -38 -8 -88 -67 -21 -37 -38 -10 27 -33 -3 -13 3 -74 -40 -8 -2 42 -10 -1 -8 -24 -17 -77 -20 -66 -39
2978c9RK0jK5K3k8K2m1j7l4J1Ok7L1M8k0J3r%jk9m6J8K4K8QJ7o6K6L3q3P6o5L4
$$ -39 -30 -10 -11 14 37 9 31 -10 -27 -61 -50 -44 -71 -40 8 -12 1 -8 -8 -9 -38 -84 -66 -42 -14 -6 11 -55 -29 4 -79 -3 -68 -34
3012c4j6KK9j0M5o0J42j23m6l1O7M4k2O2m8L6J3n3J1l2j2K3kk6K1M0J3QK4p6k1
$$ -34 -50 -48 -19 -29 16 -44 98 -25 -71 -102 -35 9 -13 49 1 37 50 -3 8 -24 -36 -13 -15 -41 -20 20 33 41 65 -11 -32
3043c2K3p1N4J8j5N8m2O3j6rj2Qk6q5K9L1J0lPL1j1L6o6L2q3Q1k6N5k8qK5l5K4
$$ -32 -9 -80 -26 -8 -23 35 -7 56 40 31 19 27 1 -84 -55 -24 -14 -17 -10 21 10 46 -20 12 -71 10 -16 39 11 3 28 -7 17
3076A7Km3j7M1m8K2M9mk1K3kK2n3K8n7O2oqJ0L5j1k6N0q0Qm6O9J2l9N4k2OK8o7
$$ 17 19 -24 -41 0 -48 -26 23 19 -2 21 19 41 -12 16 -41 21 15 7 17 52 41 15 65 -15 -7 -53 16 28 -11 43 21 27 55 -12
3110a2K0o4P4o1P0l4MM8n5Q4n9j5J1l2K4k6Q9q0L3J2k4K0k5lj6O4n2j3K2k1N3
$$ -12 8 -56 18 -43 27 -7 -3 45 -10 74 15 0 11 -21 3 -23 66 -14 19 31 7 27 2 -1 -17 47 -5 -18 4 -17 36
3141C6k9N4m1Om2J5NPJm4K3J2K2l7K8K0k9K0m5K0nkJ9j9M0K1l4j1K1j2m3PL5o
$$ 36 7 61 20 26 -16 -1 4 11 12 -32 -9 3 25 -12 16 36 7 27 -18 2 -3 -5 14 -5 35 56 22 11 32 20 -23 -16 19 13
3175A3%j6KK4l7j8L0n6O6l5Q2k2qJ4m0M5l7j9Ll8N0JM1m4L9p4J8L6k9Pn2P3k3
$$ 13 13 -3 -1 23 -14 -32 -2 -58 8 -27 55 33 25 39 -1 44 7 -12 -9 -47 3 4 45 1 40 -34 -16 20 -9 -2 -54 19 -4
3208dP9l4j6k6K0j1m6K1JJ4J6J0Mk9M7p1M0k1m9P5k7k2K9qJ5lL1k5Lpl4k2P7n3
$$ -4 75 41 25 -1 19 8 -38 -17 -16 -2 14 24 28 -1 46 -25 15 -6 -55 20 -7 -29 0 -8 7 4 35 10 13 6 -28 -50 27 -26
3242b6j0L5k2L4K9m0kp2M1k3O2j8QlrPMJ1n6M3jJ6m3K2LnJ5Pk2j9M9p0L5j3rN0
$$ -26 -36 -1 -23 11 40 0 -2 -74 -33 -56 6 -12 -4 -7 -16 -9 -5 6 -50 -7 -8 8 -35 -13 -10 -15 0 7 -15 -34 15 -55 -20 -33 -42 8
3278Hm0J6K3jj15J5M9j4O4o4R4k8PJ7l8Om1N3o2j7M0K0prN5l0ol2k4M5n3J6m3
$$ 8 -32 -16 7 6 -109 -94 -45 -59 5 -59 35 7 14 31 -7 -1 -42 11 -51 -68 -28 -8 -15 -24 31 1 -5 -37 -61 -16 -69 -53 -96
3311i6P5J8K8o1OopK7n1M7Po9M5M2k6pk2JRl9%L5M2l7L0M2j5n3N4n8l7R6l1j5
$$ -96 -21 -3 25 -36 -30 -36 -43 -16 -67 -20 -13 -82 -37 5 -21 -28 -50 -49 -40 -79 -79 -44 -2 -39 -9 33 18 -35 19 -39 -76 20 -11 -26
3345b6m3P0N4j8l3j4qj2k2J6K0k5M6JJ3Ol3m5M5oK1l3K5J3l9J9Lk2J1n9K1j8L0
$$ -26 -69 1 55 37 4 -10 -18 -30 -52 -36 -16 -41 5 6 19 25 -8 -53 -8 -14 7 -26 -1 12 -27 -8 -5 -27 -16 -75 -54 -72 -42
3378d2J2ML4J8m9PL3m9j1R%J3k7N2Ok8J1kk7j5K5l3J6L2j5L7k1K6l7L0l2l7M2
$$ -42 -30 -26 8 26 -23 -16 17 -32 -43 -34 -34 -21 -48 4 10 -18 -7 -9 -36 -51 -26 -59 -43 -11 -26 11 -10 16 -21 9 -23 -60 -18
3411a8o0K3qL7M9m5%O7m3l4j4j6N7Ol5O2Pn3J7nk7l0N2j0KM7mRm2J9j0Nl1M8o2
$$ -18 -78 -55 -63 -26 23 -22 -22 45 2 -32 -46 -62 -5 1 -34 28 35 -18 -1 -6 -33 -63 -11 -21 -19 28 24 33 -9 10 0 5 -26 22 -40
3446d0O1m3L6rj4K6m0K3m3L7J6l6L0l9Q1n2N5%m8jMn0L7L2j8J9j7J4J2j0m7J7
$$ -40 21 -22 14 5 -9 17 -23 0 -43 -6 10 -26 4 -35 46 -6 49 49 1 0 4 -46 -9 23 5 24 7 21 33 23 -24 -7
3478gK3j8m6P7m8O7o7K2MJ6m1lJ3J1KJ3Klk0O2n0n4K1J7J1JJ8j6O0p3K9K9m8K1
$$ -7 16 -2 -48 29 -19 48 -19 3 7 23 -18 -21 -8 3 5 18 20 17 -3 59 9 -45 -24 -7 4 5 23 7 67 -6 23 52 4 25
3512B5o5J7nK1RpM3L5k9k2j2m0O3o0M9j7lJ7K6J7l9J8rl8Pn1R1n4jO3p7M2m2N1
$$ 25 -40 -23 -28 -7 2 -5 38 73 44 22 10 -30 33 -27 22 5 2 19 45 62 23 41 32 -6 1 -50 41 -13 -14 49 -28 14 -28 23
3546B3q4R6j6J0o7P2L3l4j6l9O6J6k6k8j2M2kl1M3J0q6O5J1o2M4r8P4K5RM7o4
$$ 23 -61 35 19 29 -38 34 67 33 17 -22 44 60 34 6 -6 36 34 3 46 56 -30 35 46 -16 28 -70 4 29 38 85 21
3577B1M0p0J9m0K6J8o6J28q7O6n5L7ml3Ok2POM4j6j2LJ6N1p8j1Om0L1n3Q5l8N4
$$ 21 61 -9 10 -30 -4 14 -52 76 -11 55 0 37 33 0 6 -16 -9 -3 41 25 13 16 32 83 5 -6 0 -40 -9 -62 23 -15 39
3610C9J5l8k8pM5Ql7qM4j8J0k1k5Q1m6jp4L1L6k0j0j7M8JK3k0M5l8k8j7j6ROO0
$$ 39 54 16 -12 -19 26 34 -3 -11 33 15 25 4 -21 60 14 13 -61 -30 6 -14 -24 -41 7 8 31 11 56 18 -10 -27 -43 -34 -28 32
3644C2K0m0Jm3K9j1k0j3mL3M6qm5K4j8J0kl6Qj8K8k7P8n0L7J7k2rn5M9k5j1kK2
$$ 32 52 12 13 -30 -1 -12 -32 -45 -49 -16 30 22 -23 1 -17 -7 -9 -45 -37 -55 -27 -54 24 -26 11 28 6 -3 -58 -9 -34 -45 -47 -25
3678b5N6n1K3n6N0pj5j4%l1M4N7q2P4k8%k2j%K9m8M3nK5o6N5j3l6J0L6k7l2L6
$$ -25 31 -20 3 -53 -3 -10 -25 -39 -39 -70 -26 31 -51 23 -5 -5 -27 -28 -28 1 -47 -4 -9 16 -50 5 -8 -44 -34 2 -25 -57 -21
3711b1k%LPJj0L4o3pM9n7O0J3J4m3M1o2L8l3K9m2J1K6J1J6J7L0n1rj5o1M8pL2
$$ -21 -23 -23 -20 -13 -12 -22 12 -51 -58 -9 -66 -6 7 21 -22 19 -43 -5 -38 -9 -51 -40 -14 -3 13 30 60 9 0 -15 -76 -28 -35 -3
3745ck9O2J7n2L7j10J22n2k5kMj1L4N4n3L2l9mkj1K4n7J14p8nP2k8Ml5L6p6O8
$$ -3 -32 30 47 -5 32 -78 44 -8 -33 -35 -31 -42 -8 46 -7 25 -14 -18 -20 -31 -7 -64 50 -28 -33 39 11 15 -20 16 -60 8
3777Hm3N1k0j1Q7p3K4%m1J2rMK3k3kM9n9M1rj7Qn6L2J0Rl9N4K7j8n5O0l9k1L1
$$ 8 -35 16 -4 -15 72 -1 23 23 -18 -6 -15 -11 12 -11 -13 36 -23 18 9 -8 0 -56 -24 -14 -5 -44 10 37 19 -36 24 -15 -36 -5
3811eJ9k7jNj1M0J6k9L1k4j4J5l8P4n5K4L1m4J3l5M7ml1jK1qm9R3jjj4kJ4l6l4
$$ -5 14 -13 -14 -9 -20 20 36 7 38 14 0 15 -23 51 -4 20 51 7 20 -15 32 28 -3 -4 17 9 -40 53 52 51 37 35 49 13 -21
3846b1m3L7K8J7j6J3k9Rl3N8n5J6k1N3o9J9J2R5q2LJ9o5K6k8P0k2L7rn7N6J4K
$$ -21 -64 -27 1 18 2 15 -14 -5 -38 20 -35 -19 -40 13 -56 -37 -25 70 -12 -9 10 -55 -29 -57 13 -9 28 19 -38 18 32 34
3878C4m8N8o2rP0k5l7j6Q2l2j2L3Ql1j5M0j1j4L3o8L9rj1J1ok8L5N7m3J3rL4k6
$$ 34 -14 44 -18 -27 43 18 -19 -35 47 15 3 36 44 13 -2 38 27 13 46 -22 17 8 -3 8 2 -26 9 66 23 36 27 61 35
3911C5jj4m6K8K9K5m4O7n0L1Jl0n0J6Pj9K0m2N8J8k8Ql5N8Po3j4K4j3j0N5n4N6
$$ 35 34 20 -26 2 31 56 12 79 29 60 61 31 -19 -3 4 -15 5 -37 21 39 11 19 -16 42 49 -14 -28 -4 -17 -27 28 -26 30
3944C0n6%N6k1L3p2L1K6m2N5l4J2%m6K0pM9n8M1m7J06q4J2M6j03N2Qk1l1L6N8
$$ 30 -26 -26 30 9 42 -30 1 27 -15 40 6 18 18 -28 -8 -15 34 -24 17 -30 76 -8 4 50 -53 -1 7 -14 -45 -9 49
3975D9j%l5ok6K5Jk5j7K3J4Rm5P4m2rL1m1LJ6l4O1l9%QOM6m0l3L0p2M2M1nj7K3
$$ 49 48 48 13 7 -19 6 7 -18 -35 -12 2 11 -34 40 -2 -11 20 -21 -18 -2 -36 25 -14 -14 -6 0 46 6 -27 3 -69 -27 14 9 -8 15
4011A5J3Lk3l9J2j0j3k3NJ9Q7q2P9jo9L6lK2m5oJ8j6N3kk0l2L8qm3Q3m9%o3J33
$$ 15 28 31 8 -31 -19 -29 -42 -65 -60 -41 46 -36 43 42 -27 9 6 28 -17 -23 -5 -21 32 30 10 -22 16 8 -35 48 -1 -1 -64 69
4045F9l1j5M6o6kk4QLj9N0j2o3L5%Jj3L3l7j5K5Lk7qO9k2Nl1l1M9Pk7OL3Lj2L8
$$ 69 38 23 69 3 1 -23 -15 -12 -31 19 7 -56 -21 -21 -20 -33 0 -37 -52 -27 -24 -51 -59 10 -12 -7 -38 -69 -20 -13 -40 -34 -1 2 -10 28
4081B8l0j5RJ2l8l9P4l0M4K2p1J6J0j2L7m5M0l0L3j1Pm2J4j5%m6K3L6J8n1O4m5
$$ 28 -2 -17 -8 4 -34 -73 1 -29 15 37 -34 -18 -8 -20 17 -28 12 -18 15 4 11 -31 -17 -32 -32 -78 -55 -19 -1 -52 12 -33
4113c3M5q6P5n8k3P3j6Nk5L3o7R2Qp7Q5n8Lo6K8N1nPqP%L3k2M4qn3M6m1l0N4l7
$$ -33 12 -74 1 -57 -80 -7 -23 -18 -43 -10 -77 15 23 -54 31 -27 -24 -90 -62 -11 -16 -9 -17 -10 -10 23 1 45 37 -16 30 -11 -41 13 -24
4148b4M1%l7QM7m0Kk3J2m6R1l6j6O0o9K6n5K6mpL2k4M1j8J7k6j1L0m1K9l6L6O
$$ -24 17 17 -20 -12 35 -5 -3 -26 -14 -60 31 -5 -21 39 -30 -4 -59 -33 -37 -44 -12 -36 5 -13 4 -22 -33 -3 -44 -15 -51 -15 -9
4181iJ4O1o6MJ5k5k0K7mNOj1N8k2k8l0K0J7k5pNJ2j0O0n8J5j1j6L8l1j3L5K2J0
$$ -9 5 66 0 4 19 -6 -26 1 -3 2 8 -3 55 33 5 -25 -5 12 -13 -20 -15 -3 -13 47 -11 4 -7 -23 15 -16 -29 6 28 38
4215C8p2N6m0L8j7j1k9L0L5m1L3k6k1K2RK0m8Q3o5j1N9m1Rj5M0m6N0K9q4j9L7
$$ 38 -34 22 -18 20 3 -8 -37 -7 28 -13 20 -6 -27 -5 4 24 -24 59 -6 -17 42 1 10 -5 35 -11 39 68 -16 -35 2
4246BJ2J2k7k3O3j5l3M0Qk7k6L7l9pQ7k8j5J8n3L5mJ7J7n3J0%j0M6k4L6J0qrp0
$$ 2 14 26 -1 -24 39 24 -9 31 39 12 -14 23 -16 -23 64 36 21 39 -14 21 17 34 51 -2 8 8 -2 44 20 56 66 58 49 -21
4280b1L8Ppj0N8o5K5L0q7O7l7j8J9k4K9NM1l8j5MJ5%j8N8n0K0M9pn8K2%j8j0J9
$$ -21 17 24 17 7 65 0 25 55 -32 35 -2 -20 -1 -25 4 9 50 12 -3 1 16 16 -2 56 6 26 75 68 10 32 32 14 4 23
4314B3J7j5rM0Nm8j6M2k0j9KK8n7lM9OJ3m1K8j7MQn4L4lL1L5m9j6%OL3j7m8P0
$$ 23 40 25 16 56 61 13 -3 39 19 0 2 30 -27 -30 19 25 38 -3 25 8 12 20 -34 0 -3 28 63 14 -2 -2 4 37 20 -28 42
4349D2k0m7L1k1K9k2qL4j4nk3K8Ln3L5L3j9m0M1k9oj8M0rj2J4QJ0k9l1R8Nn7q
$$ 42 22 -25 6 -15 14 -8 -16 18 4 -1 -24 4 7 -46 -11 22 3 -37 4 -25 -31 -49 -9 -18 -30 -16 -8 2 -27 -58 40 45 -12 -20
4383b0P3q9K5jM3k0j5n6J2P6o0PkQl5P5k3j7M9o9J9O2o2O7p5L5k3Lj1M3n4j4K8
$$ -20 53 -36 -11 -12 31 11 -4 -60 -48 28 -32 -25 -27 -19 -54 21 -2 -19 30 -39 -20 42 -20 47 -28 7 -16 -13 -24 19 -35 -49 -21
4416b1J2l0J3nO1m5L2m3J6k7m4P3l1J7j6LK5j4K0k1K8m8J6K9l6NJ1M8n4O2n9J
$$ -21 -9 -39 -26 -31 30 -15 17 -26 -10 -37 -81 -8 -39 -22 -38 -35 -10 -24 -4 -25 3 -45 -29 0 -36 -31 -20 28 -26 36 -23 -22
4448b2k7K3j9J7JL%Rj2J2L4j4K0p6LK9o9J03m5j1O8j9k2j6J9N7n7rkO5n5jJPp0
$$ -22 -49 -26 -45 -28 -27 -24 -24 -15 -27 -15 19 5 25 -51 -48 -19 -88 15 -30 -41 27 8 -14 -30 -11 46 -11 -20 -22 43 -12 -13 -12 -5 -75
4483g5L8M7o6K1J9J7l7M7k3qJ6poJ3Km6M1rJ1L%nk0j3K0k9M7j3j9J5J1J8l8J9
$$ -75 -37 10 -56 -35 -16 1 -36 11 -12 -20 -4 -11 -17 -4 -2 -48 -7 -16 -5 -2 -2 -7 -27 -40 -20 -49 -2 -15 -34 -19 -8 10 -28 -9
4517ij8lK1k2M1j9m5M8J2l5J8N1n1K2k9k1L0Pl0J5J5mm1QJ9J7l7j0L5Kk4M5m7
$$ -9 -27 -30 -9 -31 10 -9 -54 -6 6 -29 -11 40 -11 11 -18 -39 -9 -2 -32 -17 -2 -6 -47 -39 -20 -3 -40 -50 -15 -13 -37 8 -39
4550c9L1pj0j4K8lj3K3m5N1j4K0k3l0N1n5nJ2N3K0m2M3l6O9j01L2Ok4O3m5J4l2
$$ -39 -8 -15 -25 -39 -11 -14 -27 -4 -49 2 -12 8 -15 -45 6 -49 -54 -42 11 31 -11 32 -4 65 -36 -4 2 -22 41 -4 10 -22
4582b2R8m2ml9j2N7r8N0J8m0L2rL0K1j8ql0P0q5N8n0P9o3J5J5M5j0p4O4l9k2L4
$$ -22 76 34 30 -9 -21 36 -62 -12 6 -34 -2 -11 19 40 22 14 -16 54 -31 27 -23 56 -7 8 23 68 58 -16 48 9 -13 21
4614B1J0j2k9nJ8M3k2m2J5J4N9n0k4qO4l4J3o6L6j9L6k7J7K8Jk5J6qJ3k2lkrp
$$ 21 31 19 -10 -15 3 46 24 -18 -3 11 70 20 -4 -12 52 18 31 -35 1 -18 18 -9 8 36 37 12 28 20 33 11 8 6 -3 -10
4648a0k6K7KL5j9K8p5Q1n8J2J4J1L9j8qJ6o6N7j6J8l1J1n0J9Jk6P5j5jl0N0Mj8
$$ -10 -36 -9 -7 28 9 37 -38 43 -15 -3 11 22 61 43 35 51 -15 42 26 44 13 24 -26 -7 -6 -32 43 28 27 -3 47 51 33
4681C3j7K4Pl2L1Nn7%k2K0j2N8k6J3Oj4J5kK4r6O3K3j4qmlK2L6n1n1R8m9n4Lj3
$$ 33 16 40 47 15 46 51 -6 -6 -28 -8 -20 38 12 25 31 17 32 30 54 -42 21 44 30 22 18 15 37 73 22 -29 69 20 -34 -31 -44
4716d4O8l9M1jK1m3k5J1L9m2j3NK4K6m6O2l6j6Pj8K7K7k2k0j5RM4j2mJ9o6M7L0
$$ -44 24 -15 26 25 46 3 -22 -11 28 -14 -27 -22 2 28 -18 44 8 -8 -1 -19 8 35 13 -7 -22 -13 31 19 15 34 -32 15 45
4749D5k2j9qnoJRpK8K1n6PL4j1k4L5l8l4P6p0LO3l3J0J1K1l7Ok3L1ol9OL9m2L8
$$ 45 23 4 -4 -9 -15 -14 -5 -12 16 37 -19 -12 22 11 -13 22 -16 -50 26 -44 -41 22 -11 -1 10 31 -6 0 -23 8 2 -37 -31 8 -34 4
4785Dl6kJ1P8p2oMQm5M9pj1j8M4l3LRo0L8M4p8nM0OK4QK3k6K9p4L8p%QLJ1k2k0
$$ 4 -32 -34 -23 55 -17 -23 -19 -11 -56 -7 -14 -25 -43 1 -32 -29 -20 -80 -42 2 -76 -81 -41 -35 -11 -3 20 -6 23 -51 -13 -20 -20 -12 -9 2 -20 -40
4823d0lK5j1LLj4O1r3M2J2%kj5L7n1J0k8J2k0J4P7l6J6J0o3M9m9L1jJ5Ql0RQJ5
$$ -40 -43 -18 -29 -26 -23 -37 24 -69 -27 -15 -15 -17 -32 5 -46 -36 -64 -52 -72 -58 19 -17 -1 9 -54 -5 -54 -23 -24 -9 -1 -31 -22 -14 1
4858Aj4NJ1p4L8m1L1L0L2l3K9Rl8K5l9N6p9M8n1jrJM9n4P7Jpl5nj8L7l5J9P0n7
$$ 1 -13 -8 3 -71 -33 -74 -43 -13 19 -14 15 24 -14 11 -28 28 -51 -3 -54 -55 -64 -63 -14 -68 9 10 3 -32 -37 -55 -18 -53 -34 36 -21
4893b1Nj4OK3j5k8M1rJMJ2o7P5k4Jo6M0K4j5MJ2Mj6K2m0K1j1%P4m4o6K7J0M0j8
$$ -21 -16 -30 -24 -1 -16 -44 -3 -12 -11 -7 5 -62 13 -11 -10 -76 -36 -12 -27 -23 -11 -7 -23 -1 -41 -20 -31 -31 43 -1 -67 -40 -30 10 -8
4928hLp2O2K5n5J2N5k1mJ7m3nO7n4J8l6ML1j3OQnjj9o2P9rJ5k0K3L4j4J0m0j3
$$ -8 -5 -77 -15 10 -45 -33 22 1 -3 14 -29 -34 33 -21 -3 -39 -35 -4 -17 -11 -3 -8 -9 -28 -90 -11 -20 -5 -25 -2 32 18 28 -12 -25
4963b5J4nK6l1K1K9k5qRM0l2RpK0n8J8K4QQm7L8L5m2l8lM3k1RK0j7kN7o1k5M6
$$ -25 -11 -16 10 -21 0 29 4 -4 5 45 13 22 15 35 -23 -5 19 27 35 -12 26 61 19 -19 -22 21 0 9 29 12 10 67 6 -19 27
4998B7j4k3k6J5k1P9l4oM5n3K8Qk5J5j5Mn7M7KQL1n4JL6M4o8N5n3L7l4l3N9LJ3
$$ 27 13 -10 -36 -21 -42 37 3 -3 42 -11 17 25 0 15 0 4 -53 -6 -4 4 35 -19 -18 18 62 -6 49 -4 33 -1 -34 25 28 41
5032D1K2m6j2K4%k1J7n5M6M5o2J3lM9q0P1l3KJ6k9L8k9K3j3m1j4PM9oLnNO2p0
$$ 41 63 17 5 29 29 8 25 -30 16 61 -1 12 9 58 -22 49 16 18 34 5 43 14 37 24 -17 -31 -24 25 19 22 17 22 84 14
5066A4m2P4m3j1K9q3O3j0N7m9M0n7J8pQk5K9k1L9mK5m8L9q7L9k7L4kj5L0k0LK9
$$ 14 -28 46 3 -8 21 -62 1 -9 48 -1 39 -18 0 -7 1 -24 5 -16 23 19 44 -4 35 -52 -13 -40 -6 -8 -23 7 -13 -10 19
5099A9K0p3L1k1j1L0k8L3NK2kl8M0o8qL1K7N1j8pk4k0OoJ7l3N1n0L8n8K5K9l8
$$ 19 39 -34 -3 -24 -35 -5 -33 0 5 27 25 -13 27 -41 -49 -18 9 60 42 35 11 -9 -3 -9 8 -25 26 -24 14 -44 -19 10 -28
5132b8O3q9K1N2j4J9m7J7n5O4n1ML3L0m5PK8o7K4nN1J8o8K6k2N1p7%N2No3N1L
$$ -28 35 -54 -33 19 5 24 -23 -6 -61 3 -48 -44 -11 19 -26 -19 9 -58 -34 -39 12 30 -38 -12 -34 17 -60 -60 -8 -3 -66 -15 -12
5165a2J6m2M9k3J5J7n7K8M0p2M4p1M3O2n0K0k7M4k9QmJ3j0j0jk1%m1N2M0q9QK4
$$ -12 4 -38 11 -12 3 20 -37 -9 31 -41 3 -68 -25 37 -13 7 -20 24 -5 3 -1 12 2 -8 -9 -30 -30 -71 -19 21 -68 -60 -36
5198c6N9l3K8J3Mn8K5J1o7N8l5k2M3K6rm1Q5r1kM1oJ1m5J5Nj1Rpj1QlK2nj7OP
$$ -36 23 -10 18 31 35 -23 2 13 -54 4 -31 -53 -10 16 7 -34 51 -40 -42 -1 -7 4 -41 -26 -21 -32 -23 -30 -41 -33 -36 -14 -19 -36 -30 -23
5234b3j7K5n3L9j9P0l2%K2o4P3ol8N0j01K4L5j9k7L5%L0J9p4L1k7L8l5L5n9K0
$$ -23 -40 -15 -68 -29 -48 22 -10 -10 12 -52 21 15 -23 27 -74 -50 -15 -34 -61 -26 -26 4 23 -51 -20 -47 -9 -44 -9 -68 -48
5265d8M6lk6K4Qk3KqJ1n9K8K9M2j2ml5j8NM7l5K3NJ0m2K2j4l9N8qoKJ8n3k0J00
$$ -48 -2 -5 -31 -7 1 -22 -20 -28 -17 -76 -48 -19 23 11 7 -28 -46 -41 6 -29 -6 -1 9 -33 -11 -25 -64 -6 -14 -20 -18 0 -53 -73 27
5300B7j01O5L8p0N1n7NK5M1q2P5l0j3M2k2Jj4J0m1KL2j6K4k4N8n0P9j7j7K0n4
$$ 27 -74 -9 29 -41 10 -47 -42 -17 24 -58 17 -13 -26 16 -6 -5 -19 -9 -50 -48 -16 -32 -8 -32 26 -24 55 38 21 41 -13
5331a3Kj0J0J2Qk2k0kO6On0J0n1k7Q5l6J4J7KJ9j2%LLl1J1j4J4lM8Oj7j3J0qo8
$$ -13 -11 -21 -11 1 9 -13 -33 -35 31 37 -13 -3 -54 -81 4 -32 -18 -1 1 20 8 8 11 14 -17 -6 -20 -6 -9 39 45 28 15 25 17 -51
5367e1L7k2K2K2pNRm1O4n4O9m2J6p4P3j8k6N9l8K2p0R5m2K6m6LN0n4K9J2j7J8
$$ -51 -14 -36 -14 8 1 6 15 -26 38 -16 53 11 27 -47 26 8 -18 41 3 25 -45 50 8 34 -12 -9 41 -13 16 28 11 29
5399B9m3J6L0j3k7K2J6jj2k2K6k8J6Qm2K4j3K0k0J5j7L3N7o2mj4K5l9L8l7J03
$$ 29 -14 2 32 19 -8 14 30 29 17 -5 21 -7 9 17 -25 -1 -14 6 -14 1 -16 17 74 12 8 -6 19 -20 18 -19 84
5430H4q2K6m3K8J4lk1L0l0J8K4k6j6O5k5l7J0l9N0n3R8r5M9qk6Kj2mRjM9m0L5
$$ 84 2 28 -15 13 27 24 3 33 3 21 45 19 3 68 43 6 16 -23 27 -26 72 -23 26 18 -8 -6 -18 -22 -13 -14 35 -5 30
5463C0k2mj1l7RO9%m6QKO0m7J4n1Q5m0j3Jj0J2k4K4n8M8L6j4l4l8LNM6Ko9J09
$$ 30 8 4 -7 -44 -35 34 34 -12 -4 -2 58 11 25 -26 59 19 6 7 -3 9 -15 9 -49 -1 35 21 -13 -51 -48 -43 3 5 -64 45
5497D5m1K6l3J9J9m3k7K6K3j8qL9k9K9J4K6p0Qj6l1L4N5rp7L3Kml3N0J3n3M7m3
$$ 45 4 30 -3 16 35 -8 -35 -9 14 -4 -12 27 -2 27 41 67 -3 5 -11 -42 -8 47 38 -39 -6 -4 -8 -41 9 22 -31 16 -27
5530b7MK3Kj3K8m2K5l9M4qk2N2mpkl1L7k6J0Nm6j0K1M8o2M3m8M9j3n3L9o1N5n5
$$ -27 -23 0 2 -11 17 -25 0 -39 5 -3 -25 27 23 16 14 -17 20 -6 4 9 -37 -47 -26 22 -40 3 -45 4 -9 -62 -23 -84 -29 -84
5564h4Q8Mn8O4q2R2n3Kk0M4Rr0P9k3O8k5j8L3l1k0L0l7P3r7M8j18Q4K0NkN8r5
$$ -84 4 8 -50 14 -68 24 -29 -27 -47 -3 6 -84 -5 -28 40 15 -3 30 -1 -21 9 -28 45 -52 -4 -122 -38 -18 -13 -15 43 -52
5596e2ML3j9M1l3pJ5J3%J0k0j5K2oj3j%L0m0N0qkp7Q3Nj8Ml3R%nM8m5O1n6M8k
$$ -52 -48 -15 -34 7 -26 -33 -18 -5 -5 5 -15 -30 -8 -14 -27 -28 -28 2 -38 12 4 2 -75 8 13 -5 -1 -34 -25 -25 -30 18 -27 34 -22 26 24
5633B4k1j6j6K7j0N1o2M0r6J11l4k7N3p5M8jPm7J7j7oL8J3k1Ok7J3mN1j9k5l8
$$ 24 3 -13 -29 -2 -12 39 -23 17 -79 32 -2 -29 24 -51 -3 -4 3 -44 -27 -44 -50 -12 1 -20 -14 -41 -28 -32 19 0 -25 -63
5665f3N8J3Lj6l0L0k6qK0l2N3Mj1rK8m4K4k5lM0p5O0k4KM0k4J0j5K6j4n2M6Oj
$$ -63 -5 8 11 -5 -35 -5 -31 -39 -19 -51 2 6 -5 -14 14 -30 -6 -31 -34 6 -69 -9 -33 -31 9 -15 -5 -20 6 -8 -60 -14 -8 -9
5699ij0Rj1J0oP2n6k2Pj2K6pm7L3M5m8RJ5RJ8l5M0OK3n0j0J2n4R0o8N5k0k3K2
$$ -9 -19 -10 -21 -11 -17 55 -1 -23 -16 -28 -2 -9 -56 -23 22 -26 -17 -2 7 25 -10 30 36 59 9 -1 11 -43 47 -21 34 14 -9 13
5733A3k0J0j8M9k0j5RJ3k4j3L2k9J4j1k8L4J1J5l7M9p9J8R3o5K5j3pJJ4l4L1M7
$$ 13 -7 3 -15 34 14 -1 8 21 -3 -16 16 -13 1 -10 -38 -4 7 22 -15 34 -45 -27 66 1 26 13 6 7 21 -13 18 65
5765F5p9M8p0M3%nQl3N6l6lK3K7k8j7N7l3k1J8j4k5P8k2m0J4l6L8O8l6l6pJ0k0
$$ 65 -14 34 -36 7 7 2 10 -23 33 -3 -6 17 44 16 -1 56 23 2 20 6 -19 59 37 -3 11 -25 13 81 45 9 2 12 -8
5798hmK8K7n7oK9K1mK2l2%J2m2L6k7lJ0k4J3j3J0L1l4N3q4O0l2%K0j9K8QJ5m1
$$ -8 -12 16 43 -14 -20 9 30 26 48 16 16 28 -14 22 -5 -8 2 -22 -9 -22 -12 19 -15 38 -46 14 -18 -18 2 -17 11 19 34 -7
5832gM4j6l2L1j9nm7P4l5j8J0J7ln6P1K2o3M0oklk0N4ml8j4N8q8L6l6M5j2K1K8
$$ -7 37 21 -11 20 1 -4 -51 23 -12 -30 -20 -3 -6 -62 9 31 -32 8 2 0 -3 -23 31 27 -11 -25 33 -55 -19 -55 -10 -22 -1 27
5866B7m7K9m6M7k1L9lqLk1K8l2K1L5k0l0J6m6L4pLmk3LN0m5K3j9pK8J8k6mQ5j08
$$ 27 -20 9 -37 10 -11 28 25 17 20 -1 27 -5 16 51 31 1 17 -29 5 -2 1 -3 -26 -23 27 -18 5 -14 -21 7 25 -1 -5 80 -28
5901b8LK4K8o3K4L1m2J9j3K8m8K1j4K0j6nL4K0%M3Jj17NJ2k0K1J3J0ML1l0K2n
$$ -28 -25 -1 27 -36 -12 19 -23 -4 -17 11 -37 -16 -30 -10 -26 -31 3 23 23 66 67 -50 -45 -33 -53 -32 -19 -9 -5 26 -4 18 13
5934A3L0o6K3l4J0pQ2j15N5j2OK1l9L0rpo5R3J2rMl6J4K5l1Lo9L3J4RL4m3K4m7
$$ 13 43 -23 0 -34 -24 -31 51 -64 -9 -21 -15 6 -33 -3 -12 -19 -84 9 21 12 16 -20 -6 19 -12 -9 -78 -45 -31 -22 12 -31 -7 -54
5968e4O1m2L8p2N0j6l2J8Rk4L6M5k2lqk7j4L1K7l6K4k1K6rk4l2K9K4K9j7l4K2
$$ -54 7 -35 3 -69 -19 -35 -67 -49 -40 -64 -28 17 -5 -8 -16 -43 -57 -26 1 -35 -11 -32 -6 -15 -39 -71 -42 -18 11 -6 -40 -18
6000a8L8rNj5k9j0J9L1k1lLJ5l1M6q9K0Pj7K8KojK8l4M5j1J5k0m5L3JL4l6oJ6
$$ -18 20 11 16 1 -28 -38 -19 12 -9 -12 -9 6 -25 21 -68 -48 -41 -58 -30 -28 -34 -35 -7 -41 4 -7 8 -12 -57 -24 -23 11 -25 -31 -15
6035a5qJ7oJ1L3l0K3k6L0Nm9lKK9q4N6J8j3m8RK2L1L5j2k6j2J4m9kO2n3QL9j7
$$ -15 -23 -6 -12 -1 32 2 25 -1 29 34 -15 -18 -16 13 -71 -15 3 -10 -58 -49 -27 4 39 27 1 -11 3 -46 -48 14 -39 -31 8 -9
6069ijJ2k6N0k1Jj2j6J0j0L0N2n2K6k7Lj8K7k8L9j3m1K3l6P1l5j7O6k6qm9J1K8
$$ -9 -10 2 -24 26 5 6 -6 -22 -12 -22 8 60 8 34 7 10 -8 19 -9 30 17 -24 -1 -37 34 -1 -18 48 22 14 -35 -24 4
6102DJ7J0k5K8o7L2k2L7qn8QJ7N0rKl8%K6m0N5L9%q2R3l2k0J9k7mMj2L6l3J9n1
$$ 4 21 31 6 34 -33 -1 -23 14 6 -52 -44 -27 23 14 16 -22 -22 4 -36 19 58 58 -24 69 37 17 36 9 5 9 -3 33 0 19 -32
6137c2O3%o3J5J2J8kJ6j3L6Kj0k7nk1RN0k1m2J1K0kK0k7k3M4RK2n7kN0k0J7j0
$$ -32 31 31 -32 -17 -5 13 11 27 14 50 52 42 15 10 -11 -2 48 27 -15 -4 16 14 34 7 -16 28 37 59 2 0 50 30 47 37
6171C7j0j5j7k2rKJ7j7N1k7P2k8pLK3l2K5n8L0pL0k1n6M9l0L7oJJ4m6M8j8oJ8
$$ 37 27 12 -5 -27 -36 -34 -17 -34 17 -10 62 34 27 30 53 21 46 -12 18 11 41 20 -36 13 -17 20 14 15 29 -17 31 13 7 25
6205B5Qj3k9RMj4K3J0k2k4R9o4L9p8N9l6j2k1J2J2M1o3L6J0j4J3Ql8L3m3J4N7
$$ 25 33 20 -9 0 4 -10 13 23 1 -23 76 12 51 -27 32 -4 -16 -37 -25 -13 28 -35 1 11 -3 10 18 -20 13 -30 -16 41
6237D1l2M7o4Q4m1j4N2k2m1l1nJ8N7m3J6k8Q1p5NL5k7QJ2j8M%nM5m0j2Qj6j2K5
$$ 41 9 56 -8 76 35 21 73 51 10 -21 -26 -8 49 6 22 -6 75 0 5 40 13 21 33 15 19 19 14 59 19 7 15 -1 -13 12
6271A2jNk0K1J2o9K0K2l5j2nM0Qlj6J3LL0m9po7J32q6L5K4k1L2m9L1K8p5M4l7
$$ 12 11 16 -4 17 29 -40 -20 2 -33 -45 -50 -10 -2 -5 -21 -8 -5 25 -24 -31 -98 34 -52 -17 7 -14 18 -31 0 28 -47 -3 -40
6304d0qlj5R8q1K4L9mm7j1o8J33k7o3Q2m8J9K4m5L9m8N4n6M1k0J5O0j24J12q0
$$ -40 -48 -51 -66 32 -49 -25 14 10 -37 -48 -116 17 -10 -73 9 -39 -20 4 -41 -2 -50 4 -52 -11 -31 -16 44 -80 32 -48
6334d8NJ9j5L7M3r0K5k0nN1m7J0J4jK9k9K5k9M4Kp0O3j8K6m9j6roL6l0NK4m7K5
$$ -48 -43 -24 -39 -2 41 -49 -24 -44 -49 2 -45 -35 -21 -22 7 -22 3 -26 18 20 -50 13 -5 21 -28 -44 -53 -59 -23 -53 -48 -24 -71 -46
6368d6N4k1M2m8L9j0n5L8J0Lj6l0M2o3L1j6O5l3L5m2j8L6n4M5j2%Rn4N6k4P9p1
$$ -46 8 -13 29 -19 20 10 -45 -7 3 6 -10 -40 2 -61 -30 -46 19 -14 21 -21 -39 -3 -57 -12 -24 -24 -15 -69 -13 -37 42 -29
6400b9KmM0j4l8J0L1pj1k1K5J8k9O3j25P6oK3q2M6mM8Ln1Oj4Ok5R2l1rJ3j5L3
$$ -29 -27 -31 9 -5 -43 -33 -2 -9 -20 -41 -16 2 -27 36 -89 -13 -19 4 -78 -32 -36 12 15 -36 -30 -44 -38 -63 29 -2 -11 2 -13 20
6434B0j0o7P6m8J6L0o4J3j0j7L7Lj7lM4k1%LRL1m5J1k3oK2oJ5l1N4j5L2r6J9M9
$$ 20 10 -57 19 -29 -13 17 -47 -34 -44 -61 -24 -21 -38 -41 3 -18 -18 -15 -6 25 -20 -9 -32 -38 -16 -22 -7 -38 16 1 33 -63 -44 5
6468Em7O5m2Q3l5j9l4K0K7k8M4l6L5j5m2L1nJ2l0L1m2L6K1m8M0lomRm9K4M4o0
$$ 5 -42 23 -19 64 29 10 -24 -4 23 -5 39 3 38 23 -19 12 7 19 -11 20 -22 14 35 -13 27 24 18 14 23 -26 -2 42 -18
6501a8M0k1j2M4m1N5m2L3L1n6J8Nj9l2J8K8k2mkm6O9%K0k9Pj0MQj1PLJ3k3oK0
$$ -18 22 1 -11 33 -8 47 5 38 69 13 31 36 17 -15 3 31 9 5 3 -43 26 26 46 17 24 14 18 26 15 22 25 38 15 9 29
6536B9l3QMj3J1K3p4N7l0K7Mm8M1Ml2M8Mm4J2QnK7K9k8K0j6p3Q8l9M7o0pJ6OL7
$$ 29 -4 4 8 -5 6 29 -45 12 -18 9 13 -35 6 10 -22 26 30 -14 -2 6 1 28 57 29 49 33 -40 48 9 56 -4 -11 5 11 48
6571D8j07O8Lm3M3J4K2n4M0n1J7k6O1l9KJ6j9RQj3N2l5Mm1K9rJ9l5K9J6n4P2m5
$$ 48 -59 9 12 -31 12 26 48 -6 34 -17 0 -26 35 -4 -2 14 -5 4 12 -1 51 16 20 -21 8 -1 18 -17 12 28 -26 46 1
6604AK1k4j0N4l4K7Qrn1NP2l9n2J3J9l9N7n1M2l5oK0J7J5k9K9Kj9j9K4j9K2qn
$$ 1 22 -2 -12 42 8 35 43 34 -17 -12 60 21 -31 -18 1 -38 19 -32 10 -25 -31 -11 6 21 -8 21 23 4 -15 9 -10 12 4 -1
6638aL0n2K3pM3m1j4J2j9M8J3r6N1l1P2j3Pj5l8O3n6N6l5L8k8l7O2p2JJ4MkN7
$$ -1 29 -23 0 -7 36 -5 -19 -7 -26 22 35 -61 -10 -41 31 18 25 10 -28 35 -21 35 0 38 10 -27 35 -37 -36 -22 -18 -20 37
6671C7Pp2N5o8L1L3o2N1o0P9n9K7JmO8o6oKkj7oK5l3K5l2L4j4L5k2L7m6j4L7l8
$$ 37 44 -28 27 -41 -10 23 -39 12 -48 31 -28 -1 0 -4 64 -2 -8 -6 -8 -25 -31 -6 -39 -14 -46 -12 -26 9 -13 24 -22 -36 1 -37
6705c7j5K8lJ6l1NL1o2N3l0M7m2j8L7K1j9rjN2l7Mpj2K2o1L2lN3jl3L0o8K5j7
$$ -37 -52 -24 -27 -11 -42 -37 -6 -68 -15 -45 2 -40 -58 -21 0 -19 -28 -29 23 -14 -10 -17 -29 -7 -68 -36 -39 14 13 -20 10 -58 -33 -50
6739e0O0k3k8L3n0kM7j4Km7Q6m6L3o8O2K8j5ql3J5k1M7o3L8Lk9K5n2L0j0N0J4
$$ -50 10 -13 -41 -8 -58 -60 -13 -27 -25 -72 14 -32 1 -67 -5 23 8 0 -33 -18 -39 8 -55 -17 -14 -43 -18 -70 -40 -50 0 14
6771A4m7J5l3O4j0j2nj2jJ9L8l2oj3L0m7jkK2Lj7k3J8L0M4q4L3j5Qk8M7j0nN5
$$ 14 -33 -18 -51 13 3 -9 -14 -26 -27 -8 30 -2 -8 -21 9 -38 -39 -41 -19 -16 -33 -56 -38 -8 36 -48 -15 -30 -22 -50 -3 -13 -18 37
6805C7j8J5l2l9N3K3om0j7kj7%M2OL1o6L2j6Qk1L5l3j7M5k8j4ON9j3n3L4N4o8
$$ 37 19 34 2 -37 16 39 33 -7 -24 -26 -43 -43 -1 5 36 -30 2 -14 -6 -27 8 -25 -42 3 -25 -39 -33 26 13 -40 -6 48 -20
6838b0J9PN1q4k1M6kJ0oM6n4L1j1k1M1rL4m1L6o8MP2n7l7J3J6L2pJl2M2J7k2m
$$ -20 -1 6 57 -27 -48 -2 -4 6 0 46 -8 23 12 -9 32 23 57 16 52 -16 -12 60 3 -34 -21 -5 27 20 21 -11 31 48 26 22
6872B2k4J0K3j2l1L4m8K2OK6j1jJ7n3JKpP7o8pJ5j4L5k7k3K9K6j5K3j5K1n0J1
$$ 22 -2 8 31 19 -12 22 -26 -4 2 28 17 16 33 -20 -19 -17 -24 53 -15 -22 -7 -21 14 -13 -36 -7 19 4 27 12 33 -17 -6
6905fQM5l1mk5NM1m6P6j8m1j2jM2o1L1RJ6k8n6J30q0K6k2K3rpMkJ9m8L0J6pj4
$$ -6 2 47 16 12 -13 -8 33 -13 63 45 4 -8 -9 33 -28 3 12 28 0 -56 74 -6 20 -2 21 12 5 9 7 26 -22 8 24 17 3
6940Cj0JkK0J1l9N3k7J7n4N6r2P9pM7J5j25J09j4L4r6R0ro7K4k7K1pJ3OJ4j8K5
$$ 3 -7 -6 -8 12 23 -16 37 10 27 -27 29 -63 16 9 56 71 -54 55 41 75 -21 69 60 -7 17 -10 11 4 17 23 37 19 44
6973D4j2l5N2l7j6L8j0M3m8k4n7R6l7J5M0l4M2r2M3Ok0Q1q5L4l1J3J2J4m7M2k8
$$ 44 32 -3 49 12 -4 34 24 67 19 -5 -62 34 -3 12 52 18 60 -32 11 17 -3 78 -7 27 -4 9 21 35 -12 30 2
7004Bj6J0qO0k7J2k2k5P5p4%L1K6j07P1kJJ7l1L4l2L1jnjl6L1rmkk8J0L7M8q4
$$ 2 -14 -4 -12 48 21 33 11 -14 61 -13 -13 18 44 -63 8 6 7 24 -7 27 -5 26 25 20 19 -17 14 5 1 -1 -29 -19 18 66 -18
7039a8L5k5rK3j6N4k3lk8NK0m2J8j6N5m8K4km9M5m7O4l4k0M5Kj8L0J0m8M3n6L1
$$ -18 17 -8 -17 6 -10 44 21 18 -10 -5 15 -27 -9 -25 30 -18 6 4 -45 0 -47 17 -17 -37 8 10 -8 22 32 -16 27 -29 2
7072BQL3k4m8m2M0Oj0oL4k5N5o0M1n4rK1K8mJ0K8o1j2MK6ml7N4m8k9O5Mj9lJ5
$$ 2 10 43 19 -29 -71 -31 -25 -35 -41 -7 -32 23 -37 4 -50 -59 -38 -10 -14 -4 24 -37 -49 -45 -19 -23 -60 -6 -54 -83 -18 -14 -33 -36 -21
7107b1KJ3k8J2l5K7Lk0J0m9J28j01M8K7p5Q2o4N6m5K7%L2K1p8Pm2P6l8K2k0K1
$$ -21 -19 -6 -34 -22 -57 -30 -27 -47 -37 -86 42 -59 -11 16 -59 23 -41 15 -30 -3 -3 29 50 -28 -21 -63 13 -25 -3 -23 -2
7138bj2J3K7o0k1L6JM3n6M2l0pL3k8Pj0jm5Q0j5jOjk3k1K2k2J7KN4no0J1m0O7
$$ -2 -14 -1 26 -34 -55 -19 -18 25 -31 11 -19 -26 7 -21 -14 -24 -25 -70 10 -5 -6 0 -1 -24 -45 -23 -45 -28 -26 28 23 -37 -26 -66 1
7173Ao2M2j1K5j5j7K1k3N6k4j2lL4j6JJ9Om5MPj0L0L6m9J0KJPm8L6p9P3j5K5J1
$$ 1 -61 -19 -30 -5 -20 -37 -16 -39 17 -7 -19 -22 12 -4 -3 16 22 -23 -19 -12 -22 8 44 -5 5 7 8 15 -33 3 -76 -3 -18 7 18
7208A8n3J5J7NK6Lk4on1K4L2o4R6m5M0k1J7J2K6l7j0Rl7O0q2J4M6k9Pj0j9N4m6
$$ 18 -35 -20 -3 2 28 31 7 1 -50 -26 6 -58 38 -7 33 12 29 41 67 30 20 29 -8 52 -30 -16 30 1 8 -2 -21 33 -13
7241a3K9l7J8pO8q3K8L8k5Ol4J7Qpj6lmK4K0k8K6nlk8m4M6L6l2pM1j9r4R5n2L3
$$ -13 16 -21 -3 -10 58 -25 3 41 16 22 -12 5 13 6 -10 -13 -17 7 27 -1 25 20 17 -11 -55 -9 27 -5 -12 29 10 -84 11 -41 -8
7276hJKOOL6m4QJ1m2o2J16K6o6K2JK9k4K0n0L4Nm0M8l4J4K3j3JJ6oRJ4m4NJ3n3
$$ -8 -7 -5 1 7 43 -1 7 18 -24 -86 30 56 -10 12 13 42 18 38 -12 22 27 -13 35 1 15 38 25 26 42 36 45 59 15 20 33 -20
7312b0R8r1K9j8L1j9j2K4l1M1j6J9K4l2L4n8M0l3L9m4N5K1m9Pn7lL3J4m2N4l9
$$ -20 78 -13 16 -2 29 10 -2 22 -9 32 16 35 59 27 61 3 43 10 49 5 60 81 32 39 -18 -21 12 26 -16 38 -1
7343aj5M3m0lO2l2k5J7J9k7K9l0mM8pj2J7k3K2l8j7L9L8k5J8l1o2J0L3k7L2j5
$$ -1 -16 27 -13 -16 46 14 -11 6 25 -2 27 -3 -7 41 34 22 39 16 38 0 -17 22 60 35 53 22 -40 -30 3 -24 8 -7
7375gk0M3J5Rr0Q8l2l6M8m5M9qroK2J6k8L0k9J3k1ql0N2kKJ7l6k5k7J03m7m1N
$$ -7 -27 16 31 40 -50 38 6 -30 18 -27 22 14 5 -1 21 37 9 39 10 23 2 -6 -36 16 14 16 33 -3 -28 -55 48 1 -40 -35
7409c5N1o5J4K7MJ8J0%j6k7J2KOJ1l8J4pj9J0L8j1K3k2rJ8j6m8Q5m8JM2j2L9K2
$$ -35 16 -49 -35 -8 -4 14 24 24 8 -19 -7 -5 1 12 -26 -12 -19 -38 -28 10 -1 22 0 -9 9 -7 -55 30 -18 -17 25 13 52 74
7443G4p9j7LJ6m6K3L5m4L6J2m9M6m6OJ1k5ML5l4J4J7k3J4%J0l2NJ7j7LL2l6l1
$$ 74 -5 -22 -19 -3 -49 -26 9 -35 1 13 -36 10 -36 -30 -19 -44 -40 -5 -39 -25 -8 -31 -17 -17 -7 -39 -34 -17 -34 -31 1 -35 -66
7476f6M4J9J5j4qk8N8j3j5Jj0J0k2k6O3l7J2K5j3L8o8J27r0j3N9o1L5l3l4M6l5
$$ -66 -22 -3 12 -2 -10 -38 20 7 -8 -7 -17 -7 -29 -55 8 -29 -17 8 -5 33 -35 92 2 -11 48 -13 22 -11 -45 1 -34
7507c4M8J0o3L9Lj8J4j1j5J5k4M8LOo0QN7l9j9J9oj1N5orJ0l9L8m2Kk9M8j1KK3
$$ -34 14 24 -39 0 3 -15 -1 -12 -27 -12 -36 12 15 21 -39 -31 26 -13 -32 -13 -19 -30 25 19 10 20 -19 19 -23 -21 -50 -2 -13 -11 12
7542A2k6M6rj5m3K5K4lk7oM8p8M8N0o4J1PL1l9L0k4j1OJ8L2o9J1k8M7k0JnQL7
$$ 12 -14 32 23 8 -35 -10 14 11 -16 -22 26 -52 -4 46 -18 -7 0 31 -8 22 -2 -13 -7 11 43 -26 -15 -43 4 -16 -15 -20 -12 25
7576B5l6L3j5Lm7OMKK0qkk5O1n0j4N8MK4n0k1J9j7M5o0K6j4J4nM3J8%m5L9n7K0
$$ 25 -11 22 7 10 -37 -31 -27 -25 -5 -13 -15 -40 21 -29 -43 15 19 43 -7 -28 -9 -26 19 -41 -15 -29 -15 -20 23 41 41 -4 35 -22 -2
7611bJ4n3P0k8J5j2J2j7J0j7L4Qk6Qpm0L0rJ9ll9M4RKk3j1N8n2N7k4nl2N4p6J7
$$ -2 12 -41 29 1 16 4 16 -1 9 -8 26 34 8 16 9 -31 -1 -10 9 6 -33 11 20 22 -1 -12 46 -6 51 27 22 -10 44 -32 -15
7646a5M4q4R5k8K5m0NKrJKok2L0K3o1P3lom1J0KJ1L9r7K2N3k7MK9j3j8J2K6n8
$$ -15 29 -55 40 12 37 -3 2 4 -5 -4 -2 -8 -30 0 23 -38 35 32 26 -15 -5 -3 8 47 -50 -28 25 -2 2 31 18 0 12 38 -20
7681b0M3O3o5K4n0Mkj4O0pqk4M4o3K0Moj5NK2k1K7k0K6Kj7j9M3k0l7J1O7k4K4
$$ -20 23 86 21 45 -5 -1 -3 -17 43 36 28 4 48 -15 5 9 3 -12 -7 15 -6 21 1 27 29 12 -7 36 16 -21 -10 57 33 57
7715E7p9K5j1J3MJ0k0j8mM3j9j9J9rj2M0QRp5M3J3j5L5l1l1L4j3K1l2rM7p4P6
$$ 57 -22 3 -8 5 9 19 -1 -19 -23 20 1 -18 1 -8 -20 20 28 37 -38 5 18 3 38 7 -24 10 -3 18 -14 -23 24 -50 26
7748B6j7k0MO7j9o4P1n3j4j6NM9m9P8m1L4l2j2L7n0J5l5M6om7O6M8n6K8m5QM9
$$ 26 9 -11 -7 60 41 -23 48 -5 -19 -35 -30 19 -30 48 7 41 9 -3 34 -16 -1 -36 10 4 -43 23 71 15 43 -2 6 55
7780E5n7N6m0L1nm5J4m4J3J9m4L3k2M9J7l7k6K0KKj9kL1Nk0K7k5Nj9L1m1NjN8
$$ 55 -2 54 14 45 40 -5 9 -35 -22 -3 -47 -14 -36 13 30 -7 -33 -13 -11 -9 -28 -30 1 6 -14 13 -12 -7 -26 5 -36 -31 -32 26
7814B6o1j1M6L7m8l0L8k4K7J6n3M6l7K3J1K1J0o6J7j8L6pj3j2O3m7K8j8j0Jj1
$$ 26 -35 -46 0 37 -11 -41 -3 -27 0 16 -37 9 -28 -5 6 27 37 -29 -12 -30 6 -1 -14 -26 37 -10 18 0 -10 -9 -20
7845b0K8m5J9JM0%n0J8nJ6l5J0L2o6M0k6MM8l1mmM1j7Qqm7PMM7m4M6k3l3P3l2
$$ -20 8 -37 -18 -17 23 23 -27 -9 -14 2 -33 -23 9 -57 -17 -43 -39 9 -22 -26 -30 11 -6 2 -6 -53 -46 -42 5 -39 7 -16 -49 24 -8
7880hJ7KLMo4L1K9k8J1J4q0J17n7lL1n4N9o7K2J7Qj2J4j3m1K5L3m6k2P4m4JK9
$$ -8 9 11 14 18 -46 -15 14 -14 -3 11 -69 48 -9 -12 19 -35 24 -43 -21 -4 4 -8 6 -7 -48 -23 10 -36 -58 16 -28 -27 2
7913Bl5K6o7J12o6mPmJ3l6L0Mk4M3k3j8m3qN6J2M5k4l1KL4p6L1J8JJ0j2M8o7M7
$$ 2 -33 -7 -74 38 -28 -32 -25 -29 -16 -52 -22 -18 -42 1 -22 -40 -83 -91 -35 -23 22 -2 -33 -31 3 -73 -42 -24 -23 -13 -25 23 -44 3
7947CojJ9l0lj4O1p1L4M1m9mj5k8Q3l3oRK2l2k3NM5j8j1j9KL4qO1Rj07N2j1l7
$$ 3 -3 -4 15 -15 -18 -32 29 -42 -8 33 -16 -20 -35 -63 20 -13 -19 -10 12 -20 -43 -38 7 -11 -22 -41 -39 -5 -13 48 57 -50 2 -9 -46
7982d6L3K7l2jJ9oJ9m1N9l7K2m1P4n3N4j7K4r5J8NJ0K1l5K0l2P7j3l0J2pJl6J3
$$ -46 -13 14 -18 -19 0 -6 13 -28 31 -6 16 -25 49 -4 50 33 57 -38 -20 -15 -5 16 -19 1 -31 46 33 3 15 8 9 -27 -14
8015a4L4o2M6l0M8l1J2%J0J1nk2l6J03n0J3pLNn5PK4NK4l7J8lm1L1M1K1m5kkM8
$$ -14 20 -42 4 -26 22 -9 3 3 13 24 19 -3 -39 64 14 27 20 23 28 -27 -20 4 9 33 -4 14 11 -30 1 42 63 18 16 14 62
8050F2rn2J0m8N8O%J7Nk8%K8o0j2M9ql0L3rJ%j2J4JPl2J7L1m4j1J6J7K7k5J4K5
$$ 62 53 1 11 -37 21 27 27 44 49 21 21 49 -11 -23 26 18 -12 21 12 13 13 1 15 16 23 -9 8 39 -5 -16 0 17 44 19 33 58
8086E8j2m0M1l1O9q2L2m8j4N4l7N1qlJ2l3L3o8O7m8P7q4M3M0o9M3p7Q3l9K4j3
$$ 58 46 6 47 16 85 3 35 -13 -27 27 -10 41 33 30 42 9 42 -26 41 -7 70 -14 29 69 0 43 -34 49 10 34 21
8117B1k2J4k6JK0J0pJ3l1Nj9k4L5K5j6j0J8poQ4m4n1J7l1K5J3L1o3M7n5N8j9L0
$$ 21 -1 13 -13 -12 8 18 11 24 -7 -2 -21 -45 -10 15 -1 -11 7 0 -6 78 34 -17 0 -31 -6 7 38 -25 22 -33 25 6 36
8150C6K1Np0J6j0J3M5l9L2rm2Rj5k6PL7np8N4k7R6k8l2MJj0LK4J8rk8JM0q0Q3
$$ 36 57 62 -8 8 -2 11 56 17 49 40 -2 7 -8 -34 -27 10 5 -73 -19 -46 50 22 -10 -6 -5 -15 -12 12 30 21 -7 -6 34 -46 37
8185C7r2N1n0P8k5jkl0L8k4M3l6P%l2J3K5k6QNM2j0Lo6N1l4QL7m6J9k2j3M6m9
$$ 37 -55 -4 -54 24 -1 -2 -4 -34 4 -20 23 -13 -6 -6 -38 -25 0 -26 -18 -13 29 19 22 -44 7 -27 -19 18 -28 -9 -31 -44 2 -47
8219d7N1l5J0j9oK4PJJ6j4o4O5jl9L8jj3k0M8j4Kj7K3MpJ1MJp5N8K1l5K2m0Q3
$$ -47 4 -31 -21 -40 -46 -22 -15 -14 2 -12 -76 -11 -12 -51 -13 -14 -27 -47 1 -13 -11 -28 -5 -1 -8 3 7 8 -67 -9 12 -23 -1 -41 42
8254D2p0J5jJJ4J5l5k3L1j2pQK0m3P0l8k3N1p5P8n7kK8l6Q9m0J0rrom8L0j1L7
$$ 42 -28 -13 -14 -13 1 16 -19 -42 -11 -23 -30 -22 -2 -45 25 -13 -36 15 -60 18 -39 -41 -13 -49 40 0 10 1 -8 -14 -62 -32 -43 -6
8288fl9k4K7J5K9o3M8K2j6k0kM5k4J7J3k0J5j0j5oL7p4O6J8m9PK5m2L1j9J8kk9
$$ -6 -45 -69 -42 -27 2 -61 -13 9 -7 -27 -29 16 -8 9 22 2 17 7 -8 -14 23 -51 15 33 -16 -9 16 -26 5 -14 4 2 -27
8321b7j8L1%J7PKq2O8k0lj5K6L8m1M2j9j1LoK2o7P1l8J4l7J3L9j4pJL0qmJ3l4
$$ -27 -45 -14 -14 3 10 12 -70 -2 -22 -25 -40 -14 24 -17 25 6 -5 -2 -8 14 -53 18 -20 -6 -43 -30 9 -5 -12 -11 19 11 7 20 -14
8356a4K7l0K0pLL7l8m2N1j5L4m1mM5k9J1Ml1K1n8K0J3j7K6J5J3Mm6J4L0k2j7L8
$$ -14 13 -17 3 -4 -1 36 -2 -44 7 -8 26 -15 -19 26 -3 8 12 -19 2 -56 -36 -23 -40 -14 1 14 18 -28 -14 16 -6 -23 15
8389A5n1O7l5L6m9J4P0m5n2L0J3pm6N2j7pJ3%j3PM9l0k8JJ8j5m8M8k3O0n8O0j4
$$ 15 -36 31 -4 32 -17 -3 67 22 -30 0 13 6 -40 12 -5 -12 1 1 -12 -5 44 14 -14 -13 5 -10 -58 -10 -33 27 -31 29 15
8422A5PLj7L2k7k5k3M3ML7k9j0J5nk1L4Rrn1K8K8j4l5L0rjj7Pn0M6L0m8K9J4p
$$ 15 22 25 8 40 13 -12 -35 8 12 49 20 10 25 20 -1 33 42 33 -18 10 38 24 -11 19 10 9 -8 -1 -51 -5 25 -23 6 20 13
8457A3l0K3j1J4jJ2LmJ1j1k9O7m0k4K5jkj9Q5m7j1j5L1Jk2l0L5j1jj1L5o5N2k3
$$ 13 -17 6 -5 9 8 20 23 19 30 19 -10 57 17 -7 18 17 15 -4 81 34 23 8 39 40 18 -12 23 12 11 0 35 -30 22 -1
8491aN7m7Jk3J5Ml4RL9N5r2K6j3mQ7n8o6L1KJ5j0R2k8o1LJ3J0qnl1M0n1L6LK8
$$ -1 56 9 10 -13 2 6 -28 -19 20 75 -17 9 -4 -8 79 21 -45 -14 -12 3 -7 85 57 -4 -1 12 22 14 9 -22 18 -33 3 6 34
8526C4J2Jom4K5m9P1o3N6q1N8n3l8M3mN1Ql3L3k5Po5P5m0nM2r9N1K5k0K3n5P3
$$ 34 46 47 41 -3 22 -27 44 -19 37 -44 14 -39 -77 -34 -38 13 21 -12 21 -4 3 -62 13 -27 -32 10 -89 -38 -13 -33 -10 -65 8
8559HJ5qp3P4j7K5l6n9K8J0M0o0P4m3M3q3M7Nk4K6PkOk4J5k2M1o0K3rK7nm1K2
$$ 8 23 15 -58 16 -1 24 -12 -71 -43 -33 7 -53 21 -22 21 -62 -15 -10 -34 -8 -1 -3 3 -21 -6 -28 13 -47 -24 -33 -6 -11 -52 -30
8593c0k1M8oMjk9j6J6O7k4l6J8m3N2J9M3n1p1N6rL8l4Kn2L5Kn8L1O1q5N0Lj9N0
$$ -30 -51 -3 -9 -5 -6 -35 -51 -35 32 8 -28 -10 -53 -1 18 61 10 -61 -5 -14 24 -10 -8 -60 -25 -23 -81 -50 11 -74 -24 -21 -40 10
8627A0j7rl0L0M9l5j4Jj1POL2l8j2jL2r1L7JM3jlL2mk9k1J4Nk2J7J3k4NK1j9j5
$$ 10 -7 -16 -46 -16 33 -2 -16 -15 -26 -19 -13 19 -19 -31 -32 0 -91 -54 -53 -10 -11 -14 18 14 -15 -36 -22 -17 -39 -22 -9 -33 -28 -7 -26 -41
8663d1pQOJ5kK7l7j3j1K6L7o0K1J3j4lPJ3n4L3l0N1pL8p8P0Nm7K2l2J7l5N7Lk4
$$ -41 -48 -40 -34 -19 -21 6 -31 -44 -55 -29 8 -52 -31 -18 -32 -35 -28 -15 -69 -36 -66 -15 -22 16 -62 8 13 -34 -12 -44 -27 -62 -5 -2 -26
8698b6J8Q%k1N7m5J9oOJ0nk8lj2KM0o3M5j1%J1J4j2l3J1JK7j1MJ4m6O4m3l2JL1
$$ -26 -8 0 0 -21 36 -9 10 4 10 20 15 -13 -16 -28 -26 14 -49 -4 -15 -15 -4 10 -2 -35 -24 -23 4 -7 -3 11 -35 29 -14 -46 -45 -14
8734a4K1n3L4j2J9l1M3K1n0O3m7J5LL5l6k8K6qK1J8l3J3NLm0K6k5O9o0K2J7m4
$$ -14 7 -46 -12 -24 -5 -36 7 28 -22 41 -6 9 12 47 11 -17 9 1 22 40 7 20 25 28 -12 14 -11 58 -2 20 37 -7
8766gL4j8j2l5K6J9KM7q7N3l8l2O7nN8q0N5n9K7k3L9k6l0N5m9nN1j7Mj9M8l1J2
$$ -7 27 9 -3 -38 -12 7 9 56 -31 22 -16 -48 19 14 72 -8 47 -12 15 -8 31 5 -25 30 -19 -24 27 10 14 -5 43 12 24
8799B4K7m3Nl7O1l2K7lJRm5K3QqPK3o1M1k1k2K7j4N6q6N2k0M3m4%L6m4l4K9L7
$$ 24 51 8 13 -24 37 5 32 29 30 39 -6 17 25 17 24 47 -14 27 6 -16 11 -3 53 -33 19 -1 42 -2 -2 34 -10 -44 -15 22
8833B2l2M8k5k0K4kOk4QN0o4qk0N3n3J04n5k0M0n9J4K7j7k7M5j7k0M8J0j8pk7
$$ 22 -10 38 13 -7 17 15 21 -3 5 55 -9 -17 -37 16 -37 67 12 -8 32 -27 -13 14 -3 -30 15 -2 -22 26 36 18 11 -16
8865a6PJ0j8rON7lpk3M1p3lK8qL1k8N4p4J9L3O1r2L0M2m0j4J2m9L8l1K7pM1j9
$$ -16 -9 1 -17 -26 -20 37 34 27 4 45 -28 -31 -3 -11 20 -8 46 -28 -9 24 85 -7 23 65 25 11 23 -26 12 -19 8 1 42 23
8899B3mK5n6M3k1jJ4J4m0j1L1k8k6K7l9K6Rj0L6q1R5m1M1k7j6k1L5M2n5KL2l8
$$ 23 19 44 -12 31 10 9 23 37 -3 -14 17 -11 -37 -10 -49 -23 -14 -24 12 -69 26 -15 26 -1 -17 -38 -3 39 -16 -14 18 -20
8931b0K3l4M6j4PlLk5L7N9q8J1k1K2k4k8R2k7m8qj5K3K1K9n0OL3j3l3N6m2l1J3
$$ -20 3 -31 15 1 8 5 8 -17 20 79 -9 2 -19 3 -21 -49 43 16 -32 -40 -55 -32 -11 18 -32 -26 7 -6 -39 17 -25 -56 -43
8964d3j0P8m1QN2n8k6J1K6qk3K7l5P1o0L2L9p0O4p1J7m4JJK1L1K4q2L1L3K9Oo9
$$ -43 -53 25 -16 -8 44 -14 -40 -29 -3 -11 -34 -7 -42 29 -31 1 40 -30 34 -37 -20 -64 -63 -62 -41 -10 14 -68 -37 -4 25 31 -38
8997c8ojJ4K6k3K9J5k8k2K4O7o2m4RN0j7l2N2m0N0k8K5j2n7KN8Qj7L6p6L7j5k6
$$ -38 -44 -45 -31 -5 -28 1 16 -12 -34 -10 57 -5 -49 -40 10 -7 -39 13 -27 23 -5 20 8 -49 -47 11 19 2 38 -38 -1 -16 -42
9030d2L0k2K4k0Ql7L0k4M3oRN0p3J1J1jJ5p0M6j1M1p7N4J1O4o9nk6J2KL7l8k0
$$ -42 -12 -34 -10 -30 -22 -59 -29 -53 -10 -16 -7 43 -30 -19 -8 -9 6 -64 -18 -29 12 -65 -11 0 64 -5 -10 -36 -24 -22 15 -23 -43
9063d3K1Qj6m6K6K0m0J1J1K9K4j2j5ML0M6m5ok8L3o3M1J6j3j3mN4q1M0k6P6k6
$$ -43 -22 -14 -30 -76 -50 -30 -70 -59 -48 -19 5 -7 -22 -18 12 58 13 7 -21 12 -51 -10 6 -7 -20 -24 30 -51 -11 -37 39 13
9095A3Ok1J2J9n4L5k0M3n8J1K7j1K4m7N8Nq5K8k2J7oJ4k5O3l6j8P0n8L3n1L7q
$$ 13 19 -2 10 29 -25 10 -10 33 -25 -14 13 2 26 -21 37 42 -43 -15 -37 -20 -26 -12 -37 26 -10 -28 42 -16 17 -34 3 -5
9127eK6j4m2RJL0j0OK4j3Pl2L0KKn3K6Ok8J8P0o1J5m2P0o6N7m3J2k5L4J4q5K9
$$ -5 21 7 -35 -26 -25 5 -5 1 25 12 19 -13 17 19 21 -32 -6 0 -28 -10 60 -1 14 -28 42 -24 33 -10 2 -23 11 25 -60 -31
9161c1K1L7J3K3p0L4On4N3m9K%J6Jm1K3K8L3m4L0J5l5L9k0Km5R1o3J1j2L4k5j0
$$ -31 -10 27 40 63 -7 27 33 -21 32 -17 -15 -15 1 2 -39 -16 12 45 1 31 46 11 50 30 32 -13 78 15 26 14 48 23 13
9194A3J00r3L4k2j0K2n1L0j2L2n9O6k5Mj2l2O8lkl3Mml1M8pj0j3O4m7m3M2l0K8
$$ 13 113 20 54 32 22 44 -7 23 11 43 -16 50 25 29 17 -15 53 50 48 15 19 15 -16 32 25 15 2 66 19 -24 18 -12 16
9227A6k2L7n6K9RMk4O3l3j0m2N1J1j3J0k3L7j4M2o3Ol1N2j6Kn7N1krj5nK5J0J
$$ 16 -6 31 -25 4 13 17 -7 56 23 13 -29 22 33 20 30 7 44 30 72 9 15 -16 36 20 22 -35 16 14 5 -10 -15 10 20 21
9261B1n6M5q1P2K2j9K7k5Ll7L0OnK9n2J9MpJ7pl4L5J7p%l1%j0J4N6p5K5K8j5P
$$ 21 -35 10 -71 1 23 4 31 6 9 -28 2 8 3 32 -20 -1 3 -4 13 6 -28 7 24 17 17 -14 -14 -24 -10 46 -29 -4 24 9 16
9296A6Mj1n5N2k3NL3m6M1l2J4Rk9M4p0O1k7LK3k3Mo5R1j6l9j7O6l9jK0m7M8l0
$$ 16 20 9 -46 6 -17 -12 21 -25 16 -16 -2 7 -22 22 -48 13 -14 -11 12 -11 -7 -72 19 3 -36 -53 13 -26 -27 -7 -54 -6 -36
9329c6rL2j4J3j7L4J0k0J4n2M1LK6m9mk2O4j05J08l0QK5RL1r9K4J8Ol2M6Kj2j
$$ -36 -45 -13 -27 -14 -31 3 13 -7 7 -45 -4 -1 25 -24 -28 -50 14 -91 17 -13 -5 20 29 60 -39 -15 3 9 -23 23 25 13 12
9362A2l5OJ4j4lM9n8n4R2n8RK3j1j1J2M2o6L0L6k6Kl7K6k8J9n2M5J0J1k7j6M7
$$ 12 -23 -17 -3 -17 -20 29 -29 -83 9 -49 -40 -17 -28 -39 -27 15 -51 -21 15 -11 -9 -46 -20 -48 -29 -81 -36 -26 -15 -42 -58 -11
9394a1l8N8m3QM6l2J3%J4J3n5Oj5O9l7k7O0n6nj1N4n1P5l5k5Nk6O4Qo0K8j1JO
$$ -11 -49 9 -34 -26 20 -12 1 1 15 28 -27 -21 -36 33 -4 -31 29 -27 -32 -43 11 -40 35 0 -25 -20 -46 18 26 -34 -6 -17 -16 -10
9428a0K9k1K7n8J3nJ1ok3klK6K4rj8J9J4K3l3L6p0K4K7o0L8l1KN4J0jm8M3k3R
$$ -10 19 -2 25 -33 -20 -25 -14 -20 -43 -45 -48 -22 2 -7 -25 -6 8 31 -2 34 -36 -12 15 -45 -7 -38 -36 18 28 27 -21 22 -1 8
9462HL7j16O7o5M4M%nkL4L5l9rqK9n6L4J5J3orRj3Nn9N5J8%Om7Ok1K8l1L2j7%
$$ 8 45 -71 -4 -69 -25 -21 -21 -26 -28 6 41 2 -7 -15 14 -42 -8 7 20 14 5 14 1 6 -53 2 20 20 26 -21 -15 -36 -8 -39 -7 -24 -24
9499b4j0k3M0Llm1Q8n0J0PK3k0k4LK2l4K1K8m9M1J3m6k3O2k0J4L2r6L1O0Jj5j6
$$ -24 -34 -57 -17 -14 -17 -58 30 -20 -10 -3 20 0 -24 -21 1 -33 -12 16 -33 8 21 -25 -48 14 -6 8 40 -56 -25 35 36 21 5
9532Em4J1l0M7Pk2L7m2L9rj8j7O1j5j9L2j2LJ7k5Mj5pL6mn5N0j9L0qJ4k1j9M2
$$ 5 -39 -28 -58 -11 -4 -26 11 -31 8 -1 -19 -36 25 10 -9 23 11 14 31 6 10 -5 -12 24 20 -35 15 -4 26 18 32 11 -8 34
9566C4j3L2n6J6rRLPL1j09O8l6L4L1m8Q0o0q%N8l2j3qj9Kj2K2J2kK4m1J6J5M0
$$ 34 21 53 -3 13 4 13 16 23 54 -55 13 -23 11 42 -6 74 14 6 6 64 32 19 11 -8 -6 -18 4 16 14 38 -3 13 28 68
9600F8o6L5o1PL1k1j7J1j9Q0k2p5P4j4k0O9k7k8J0mj1L5pLn0L5ml0J3L1l5O5k9
$$ 68 2 37 -24 -17 14 -7 -24 -13 -32 48 26 -49 25 11 -9 60 33 5 15 11 0 35 28 31 -19 16 12 -18 -5 26 -9 56 27
9633B7kk3L5Rm8jj2O7l4o5M9J1j7lP0o5J6J2q4N7j9J7j7nO8n6Q3q6M2j1q4N4O
$$ 27 25 2 37 46 -2 -3 -15 52 18 -47 2 13 -4 -7 63 -2 14 26 -58 -1 -20 -3 -20 -25 43 -13 70 -16 26 15 -69 -15 -9
9666iJ9l5M1k2Qo2P4l6Qk6k5K6L0l2N6p5P8jPJ0p0N3j4N2n9j9K9K0J5l1J9l8K5
$$ -9 10 -25 16 -6 2 -60 14 -22 -14 -40 -65 -39 -9 -41 15 -60 18 17 24 34 -36 17 3 55 -4 -23 6 26 41 10 29 -9 16
9699A6m0M8l9LJ9j0J2j9K6n0N2kl1M8n5mRl0O0l0j5jK6k7K2J1k6j6K0j7M5k9L2
$$ 16 -24 24 -15 -12 7 -3 9 -10 16 -34 18 16 -15 33 -22 -26 -17 -47 13 -17 -32 -33 -7 -34 -12 -1 -27 -43 -23 -40 5 -24 8
9732HJ6q4R0n7O3p2lP7p9J1L6k7oJ8Ol0N0l7JM7o6J4%nm0P1k0j1Oj%k3L8k9J9
$$ 8 24 -60 30 -27 36 -36 -39 38 -41 -30 6 -21 -27 -9 -3 -33 17 -20 -19 28 -38 -24 -24 -29 -69 2 -18 -29 -23 -24 -24 -47 -9 -38 -19
9767a9m8M8%J6Mk7J1k2k7L1NpJ1m0Q7q0L7LLm7M9Nrj4nM4%k7k5M1K0Ok7kj3J5
$$ -19 -67 -19 -19 -3 1 -26 -15 -37 -64 -33 -28 -35 -24 -64 23 -57 -20 -17 -14 -61 -12 -7 -16 -30 -35 9 9 -18 -43 -2 18 24 -3 -5 -18 -3
9803cj2n0L4K6m2jL0p0lN8Qj0K1j1K8l6pJJ9NJ7L0o5KOL8j7k0O0p7O3lj9l1M3
$$ -3 -15 -65 -31 -5 -47 -48 -18 -88 -91 -33 -25 -35 -14 -25 3 -33 -40 -39 -20 -15 2 32 -33 -31 -25 13 -4 -24 36 -41 22 19 0 -31 12
9838A2k4J7Pm1J9m0R7r3LK3j8j0J2M4j8m5P5p0N1Ok8K4lK2l5M0j1l7K1jj5jK2
$$ 12 -12 5 12 -29 -10 -50 47 -46 -43 -20 -38 -48 -36 8 -10 -55 20 -50 1 7 -21 3 0 22 -13 27 16 -21 0 -1 -16 -17 5
9871Em4M9m5lqO2n3P5o5j3K6K9l7k3P5j8j8l7k1J1M5K7j1KnK4k8poqM7l0NJ6k9
$$ 5 -39 10 -35 -38 -46 16 -37 38 -27 -40 -14 15 -22 -45 30 12 -6 -43 -64 -53 -8 19 8 10 5 29 1 -6 -12 -20 27 -3 2 18 -11
9906a1O1q0L9k5Km3M3K2l8J16p2kj2Q1n9k0M1qm8K8J0K3l1k4L7K6n4M8L8q8M1
$$ -11 50 -30 9 -16 -14 -57 -14 8 -30 86 14 12 0 81 22 2 43 35 -13 15 25 48 17 -7 30 56 2 50 88 0 41
9937D1Mj3l4J2PM2rKk0k9rN4K4mm8j1j1K3j9K6j9m8L9J7J7m9O0J0l9PK4Kn0L9
$$ 41 45 32 -2 10 17 59 50 52 32 3 -6 48 72 68 20 9 -2 21 2 28 9 -39 0 17 34 -15 45 55 16 23 47 49 -1 38
9971C8m1j7L5LJk8J6NoL7j7l6K0L4m0L8l2l8P5q5J5L4K2mj7L3Ml8J7j1o3L7J3
$$ 38 -3 -20 15 18 19 -9 7 12 6 43 26 -10 10 44 4 42 10 -28 47 -38 -23 11 33 29 12 45 49 11 28 17 -46 -9 4
10004D%L9p6N6J7j3n5L5L6Lo3k0L9MJ6k7L7l9J9oj7P1m3m4L1pL4r7L0m2P5LMj0
$$ 4 4 43 -33 23 40 27 -28 7 43 46 -17 -37 2 6 22 -5 32 -7 12 6 -11 60 17 -27 4 -3 31 -66 -36 -78 -3 0 4 -6
10038fl3Q4j8q9R4q0R5Qn6k2n7P1j0M3j3L8k8j4L2pk1M1j10N3Onk8Nk0M4k8K0
$$ -6 -39 45 27 -62 32 -48 47 55 -1 -23 -80 -9 -19 24 11 49 21 7 39 32 11 52 -58 -5 1 -4 -32 -27 -47 -3 -31 -11
10070a1K4K7n9M1k2qm5K3P2o4L4j9j9k7N4l5K5O2p1lJ7k5K2K3M9r3M5l6Ol1JM2
$$ -11 13 40 -19 22 0 -8 -53 -30 42 -22 12 -7 -26 -53 1 -34 -9 53 -18 -21 -4 -29 -7 16 65 -28 17 -19 -13 -44 -43 -1
10102aj8l9P9m9k2J4N7m8L6k1k1N9k4ln2L4J3k9j2Q0m7jL6m4L9l3JjK1j0m5J8
$$ -1 -19 -58 21 -28 -50 -36 21 -27 9 -12 -33 26 2 -1 -53 -19 -6 -35 -47 33 -14 -15 21 -23 16 -17 -16 -17 4 -6 -51 -33
10134c3K5M7l4l4M5o5OK7rnM6k8l5M3l4J1K0ok5lK6qj0K5K6k7j4l6M1j1j8L1J9
$$ -33 -8 39 5 -29 16 -49 -43 -16 -25 -30 16 -12 -47 -4 -38 -27 -7 -13 -38 -41 -15 -23 -33 -8 18 -9 -23 -59 -18 -29 -47 -16 3
10167Cn8L0J4J7o1M9l5MPJ5L7o4L6rk0K9j2oJ4K7n1J1j1KN7j4j3Qj8o2M8%J1%
$$ 3 -55 -25 -11 6 -55 -6 -41 -37 -30 -15 22 -42 -6 -15 -35 -6 -18 -24 -10 17 -34 -23 -34 -32 25 11 -2 6 -12 -74 -26 -26 -15 -15
10201a5k3K6k2L4l5M3mk4L7k2N4o0L2l7K0Jn6N0j0L5j0m6K2kk4M5J9o0NJ5m0L
$$ -15 -38 -12 -34 0 -35 8 4 -20 17 -5 49 -11 21 -16 4 5 -51 -1 -11 24 14 -32 -10 -12 -36 9 28 -32 -27 -12 -52 -49
10233d9O8k2j5Oj4K6JjJ0jpL5m2J2l0J3j8PK7K3j9l4N5m0J1nlL2n1N0o2ML1J3
$$ -49 19 -3 -18 -12 -26 0 1 0 10 9 2 37 -5 7 -23 -10 -28 -21 6 29 10 -24 31 -9 2 -3 -6 26 -25 25 -37 -33 -2 11
10267A1J1j5qj1nPK5j9J7l9L9pLK3k5qj5M1m9K5K4OLq3M3oO4k6M5n4qk0j6jJ5
$$ 11 22 7 -1 -12 -17 -10 15 -4 13 -26 13 6 9 32 7 -1 -16 25 -24 1 25 31 34 -49 -6 -12 52 26 71 17 9 -11 -27 -28 -13
10302a3J6mj7M5k3K0k4L9l4j2L6j7k0M2Lj5k2J4RNm4J5J7j4j7j7N2k7k1M4K2l1
$$ -13 3 -1 -18 27 4 24 0 39 5 -7 29 12 -8 34 37 22 0 14 23 28 -16 -1 16 2 -15 -32 20 -7 -28 16 38 7
10334GL7l6M5m8RQn2O4lj4kll4k5N3LM8l5J3J9o6M9r5J12n0lj6L9l0QJ3J2J4k1
$$ 7 44 8 53 5 14 22 -30 34 31 17 15 12 -22 -47 6 9 57 22 35 54 -12 37 -58 54 4 1 -15 24 -6 2 15 27 41 20
10368B0Mj0k4KJ5N1o7K4J9k0J5j9M2n3m0K1M6ko2Q4j6j6k0M7j7jK7l7j7N1j2l
$$ 20 24 14 -10 -8 7 58 -9 15 34 14 29 10 52 -1 -41 -20 26 24 -38 46 30 14 -6 41 24 23 50 13 -4 47 35 32
10400C2n9N1l8j2N4kk5k3L7nJ8k3M0l2l2M2kJ4k2n1oL4J4l1J7K4M1j06N3J7lm7
$$ 32 -27 24 -14 -26 28 26 1 -22 15 10 28 5 45 13 -19 23 21 35 13 -38 -44 -10 4 -27 -10 14 55 -51 2 19 16 -31
10432c1J9J4J7l4K8%J8l3J5ll2O2j2nk2J3l2Oqk3L4L0k1l3N1j0L7l7J3kk0M8q1
$$ -31 -12 2 19 -15 13 13 31 -2 13 10 -22 40 28 23 1 14 -18 -12 -20 -43 -9 21 0 -33 18 8 45 8 21 19 -1 47 -34
10465c4M3k3J3Pk1mL3j8k8R4r5K7Pk4m8L0N5j5Kk6M8n6j0N2k1k5k2lN4k8NM9j0
$$ -34 9 -14 -1 6 -15 -19 14 -4 -32 62 -33 -6 1 -23 -71 -41 14 -1 1 -25 23 -33 -43 9 -12 -37 -59 -62 -8 -36 -31 18 8
10498HjRj5l7M5l5N0m9J5J3j1j3Kpl4K5K8Rm2J7J2j1l2M9J4%qm5M0j0rJ6k1K2
$$ 8 7 16 1 -36 9 -26 24 -25 -10 3 -8 -21 -19 -26 -60 -35 -7 2 -40 -23 -11 -22 -54 -5 9 9 1 -44 -4 -14 -23 -7 -28 -6
10532fj4K2J0qk2K8J6l5M7m4J2J2p2N0l6P8l7o2K9mK8k7N7o5Q1m6j0L5k4J9k6
$$ -6 -20 2 12 4 -18 10 26 -9 38 -6 6 18 -54 -4 -40 38 1 -61 -32 -36 -8 -35 22 -43 38 -8 -18 17 -7 12 -14
10563a4Mm3nL8J4K6m3O4j08L5j7j0K7L6K5n9L1k4KL8l5L1m7mK1J0N2o2Rk4J5r
$$ -14 -10 -53 -58 -20 -6 20 -23 41 -67 -32 -49 -59 -32 4 29 -30 1 -23 -21 17 -18 13 -34 -38 -17 -7 45 -17 -8 -32 -17 -26
10595b6K1J1l2k0P2m1nk3N2LJ9m5Ol5qM7mn7M9k6L5L3J5mo1J8Pj5L8j3k7k1L2
$$ -26 -5 6 -26 -46 26 -15 -20 -43 9 12 31 -14 -8 -43 -51 -4 -8 -65 -16 -42 -7 26 41 37 -24 -6 1 -14 24 11 -16 -37 -5
10628el5L4Njm8OK7PL7m2M3k3k6K3k7J3L0l1K4Lrl9L3o0M4K9j7rJ3K5J0m8K7R
$$ -5 -40 -6 -1 -2 -50 -44 -17 -10 27 -15 28 5 -21 2 -25 -12 18 -13 11 14 5 -34 -1 -61 -17 12 -5 -14 -1 24 34 -14 13 22
10662B2l2j7%Qk1N3K4l3l9J8NOj0J1k2PQNrK7j0K3K2mm6L4o0K4j4QM7l1M1j9l9
$$ 22 -10 -27 -27 -19 -40 13 37 4 -35 -17 -12 -6 -16 -5 -27 -20 -12 -7 -16 11 1 24 46 42 -4 30 -30 -6 -20 -12 35 4 45 26 -13
10697a3J6RK5k1j3lo4O4K3%%l9O6l6k5O2qk6k7K9m4O0J5q6N7j0J5pl7P2k4n2K4
$$ -13 3 12 37 16 3 0 -64 0 23 23 23 -16 50 14 -11 51 43 17 -10 19 -25 35 50 -36 21 11 26 19 -18 54 30 -22 2
10730BM8Qm1pjL4p2N0l4N7l2kN0p0K5K5k3J5J4n0K0K9n9R7m3j1Lm0L3M6l9j5M
$$ 2 50 58 17 10 9 43 -29 21 -13 44 12 10 60 -10 15 40 17 32 46 -4 16 45 -14 83 40 29 32 -8 25 71 32 17 21
10763B1J4K8l6j3k3K6L0p4M9LJ3ml9L4k1k9J0J7k3J1pM3%Kl6j8J4Nk7J0L9j1J2
$$ 21 35 63 27 14 -9 17 47 -27 22 25 38 34 -5 29 8 -21 -11 6 -17 -6 -13 30 30 32 -4 -22 -8 -3 -30 -20 19 8 20
10796B0k4L6n2L3L2l0j2nJ8lj7l6J5rj4N5n9J8K2K2k4LN0k5J8l6M9o3k2L5J2K3
$$ 20 -4 32 -20 13 45 15 3 -2 16 13 -4 -40 -25 -34 -48 7 -52 -34 -12 10 -14 -11 39 14 32 -4 45 -18 -40 -5 7 30
10828C0o0O4j7K9o8%O0n8N8q2J4k7K9kM2j6NPj8K2n8O9lj9kk1K7J8L1Po9K7l0
$$ 30 -30 34 17 46 -22 -22 38 -20 38 -44 -30 -57 -28 -30 12 -4 1 8 -10 12 -46 23 20 1 -1 -22 5 23 54 61 -8 19 -11
10861a1J8l5K4l1jN0mlnrPj3l0N5k1mJ%%l0N7j1k9L6k6K4j3rL6p2J3jK0j5N8n8
$$ -11 7 -28 -4 -35 -36 14 10 7 2 -7 0 -13 -43 12 -9 -13 -12 -12 -12 -42 15 4 -25 11 -15 9 -4 -13 23 -49 -36 -37 -17 -32 26 -32
10897c2KJ2NL6p8N9l1J8j7K1l1k3L8J8j1j2kj4L7j1L2o4J6M3om6M5l2J3j9pqj2
$$ -32 -30 -18 -13 23 -55 4 -27 -9 -26 -5 -36 -59 -21 -3 -14 -26 -28 -42 -5 -16 16 -48 -32 11 5 -41 4 -28 -15 -34 -41 -49 -61
10930f1P2p1L5J2j1M4k4J3n0R2j07O2K8m9mk8P2q0K9k3L9n7N3nJ7l3k6N9n2M3
$$ -61 11 -60 -25 -13 -24 20 -4 9 -41 51 -56 6 34 -15 -19 -47 25 -55 -26 -49 -10 -67 -14 -19 -2 -35 -61 -2 -54 -11
10960a1J6jl9J7nk2kK8j2M2k3N7o0JlKPj8k4JK9kJ9m6L9m4M1N7j52J40m5PMj5
$$ -11 5 4 -35 -18 -23 -45 -47 -19 -31 11 -12 45 -15 -14 -17 -15 -8 -26 -50 -49 -20 -22 -3 -49 -10 -54 -13 44 -108 32 -13 -6 -2 -17
10994a7K7k4Qk2M9n9J9J3m7L4k4M0l4J4M5n1N1l7J2k0j7K1j1O8o2J6K1Oj6J3M3
$$ -17 10 -14 -6 -28 21 -38 -19 -6 -53 -19 -43 -3 -37 -23 22 -29 22 -15 -3 -23 -40 -19 -30 38 -24 -8 13 19 3 16 59
11025E9n7K1j0k2LJ1J9m9N4m1K8K3J8Jp8N9m7K3J3k5J9j5m3M1k4j6N4m6L5R%j2
$$ 59 2 23 13 -9 -6 5 24 -25 29 -12 16 39 57 58 -20 39 -8 15 28 3 22 7 -36 5 -19 -35 19 -27 8 17 17 5
11057EOj7K3j3K1j4J6l9M7n1J7Mj6j6J6l0J6M5k9LN1J0j7l7lL8m5Pj0j1l7Q7j2
$$ 5 11 -6 17 4 25 11 27 -12 35 -16 1 5 -11 -27 -11 -41 -25 20 -9 -6 45 55 38 1 -2 36 -9 -2 -12 -23 -60 27 15
11090A5lJ0O0o4qqJ4j6K9m1J7L6j0J1k8j4N2n7L4l0M0kl5L1l6P3o7K5mK9n1K4
$$ 15 12 22 82 18 10 2 16 0 29 -12 5 41 31 42 14 0 52 -5 29 -1 39 37 2 33 -3 70 3 28 24 53 2 26
11122B6M5k2k3L1k5k2Rj8nK2j6JK4j0ll4K6K6Nj1j2PJ7n0M2k8jk4M7l8Q9m3l5
$$ 26 71 49 26 57 32 10 19 1 -4 18 2 3 27 17 14 -20 6 32 37 26 14 21 38 -12 30 2 1 -23 24 -14 75 32 -3
11155cQk2J5l9N8K4mMql6K2ll3M5m0K5k3j0MOM0l4N1j49J02L4j8j7K2Jo3R3l2
$$ -3 5 -17 -2 -41 17 41 37 41 33 -3 19 16 -17 28 -12 13 -10 -20 -16 -10 30 -4 47 -102 0 34 16 -1 21 22 -41 52 20
11188B0j4K3K2Jp3N3j2o0J4J7kpO1j4nm3J3L8m1N6o6J9j8M2kl5mM6l9pK7m4P9
$$ 20 6 29 51 52 -21 32 20 -40 -26 -9 -11 -18 43 29 24 -19 -6 32 -9 47 -19 0 -18 24 22 -13 -17 29 -10 -17 10 -34 45
11221D5L3p2j3k4L7Ql9l3Q3o1K8j7N6qn4nK8l8P8n1k4L9j9mmk3K1K3j1l2M5Mk1
$$ 45 78 6 -7 -31 6 14 -25 -58 25 -36 -8 -25 31 23 -31 -36 -8 -46 32 -19 -43 -4 -23 -27 -31 -54 -33 -10 -21 -53 -8 -4 -25
11254b5P7n0mJ2k8rNk3mK0%j4M1k4k3J1m8M1N5l1Pm6L9%J2k4LJ0j3l0K6J8m0Q7
$$ -25 52 2 -2 10 -18 -27 -22 -45 -49 -29 -29 -43 -2 -26 -49 -38 -86 -45 10 -21 -14 -60 -21 -21 -9 -33 -30 -20 -33 -63 -37 -19 -59 28
11288B8p4P0o0mM0j7jqJ9J4l7M1Ok0l4J6K6Op9M2Pn5P8k9PpJ6O5r4L2l1j0j0L3
$$ 28 -46 24 -36 -40 0 -17 -18 -26 -7 7 -30 11 17 -3 -37 -21 5 11 -68 -26 -19 -74 4 -25 -18 -25 -9 56 -38 -6 -37 -47 -57 -24
11322b4k1O0rKlnJ7j4k5K3Nm1K5j4KKj2K3K0j7j4J0l7j1K5K9L7l4l1K1KRj0Rl1
$$ -24 -45 15 6 8 5 0 17 3 -22 1 6 -35 -10 -24 -22 -20 -32 -9 11 -6 -20 -10 -47 -58 -33 -4 33 -1 -32 -11 -9 0 -10 -1 -32
11357c2N3l4k0N2l1k0pN5kKJ2l6K9nn6P1p6O0jmo5L2O0o1J9j1l6j7P5j1j5K9o3
$$ -32 21 -13 -33 19 -12 -32 -39 16 14 16 28 -8 21 16 -40 31 -45 15 14 10 -55 -23 37 -24 -5 -16 -52 -69 6 -5 -20 9 -54
11390e4Q7q5N6n3QL3k4N7rK5l0J5K3JkLj2nn9N0nk2K5m2L6m3J5L6rj1Jm9M3qj2
$$ -54 33 -52 4 -49 -41 -8 -32 25 16 41 11 26 49 50 48 51 39 34 -25 25 20 -2 23 -19 17 -26 -11 25 16 5 6 -43 0 -8 -20
11425b0J2N3j0L0j7l3lK7j8k0M2j4j1J0n0L5nl5J5j4L9l0N0m8N9l0J3L5l3K6p1
$$ -20 -8 45 35 65 48 15 12 39 21 1 43 29 18 28 -22 13 8 -27 -12 -26 13 -17 33 -15 44 14 27 62 29 55 -16
11456a6P2l7J8k7L9j9pK2j04J02n6J6K9l1L2m8J0L3L6n9l0O8l0J7n0K3L9oK0k2
$$ -16 56 19 37 10 49 30 23 45 -59 43 -13 3 32 1 33 -15 -5 28 64 5 -25 43 13 30 -20 3 42 36 56 34
11486C4lK2m4Nl3N4lLm0qN1ql9j4L8m5M8m0L8k2j0J7M3J7n7J3K8k9l1k6M4krK4
$$ 34 31 53 9 14 -19 35 32 35 -5 -13 38 30 -9 -23 15 -30 18 -22 16 -6 -16 1 44 61 4 17 45 16 -15 -41 3 1 -8 16
11520A6L2n9j1L3mL6l2j7K2k5MK5qj5Lkj0N5m0J2K7k0p9P8%n3N6n6L4%K9k9nJ8
$$ 16 48 -11 -22 11 7 43 11 -6 16 -9 -5 20 12 -3 0 -2 -12 43 3 15 42 22 -57 21 21 -32 24 -32 2 2 31 2 -3 15
11554A5k0J5J9k4l3N4J3n6J3k1N9m8L2k4jL1m3L0J5pm4K9n5P7n2L4j2pP2m0rJ2
$$ 15 -5 10 29 5 -28 26 39 -17 -4 -25 34 -14 18 -6 -7 24 -19 11 26 19 -25 4 -51 26 -26 8 -4 -11 61 21 12 24
11586B4l8K0j0K5lmk5N4o5jJ7o7P9l8J4M8k3ML3p8O5o1J6K3K3k3k2jnJ3n6M8N
$$ 24 -14 6 -4 21 18 14 -11 43 -22 -23 -6 -73 6 -32 -18 30 7 11 44 -34 31 -30 -14 9 32 9 -13 -14 -19 -6 -62 -14 -9
11619ik2L6PJ3m0J6l4L9n3M7kJ7Kl1j8N7r1L6K0Nj2pk2R4j00M7kM5m0k1K8j0N
$$ -9 -31 5 12 25 -15 1 -33 6 -47 0 -2 15 17 -14 -32 25 -66 -30 -10 -5 -17 -24 -46 48 -52 -5 -7 38 -2 -23 5 -5 0
11652@J9J9o5K4lk3N8l6M1l1r8O7o0N8jJ5j3J4Qk4OK9nOLn1K4lj5M7n2J9L3m0
$$ 0 19 38 -27 -3 -6 -29 29 -7 34 3 -95 -28 -88 -30 -31 -16 -29 -15 -7 -31 -25 4 -1 5 8 -43 -19 -22 -37 10 -42 -23 10 -30
11686c0jJK9j7J6Ro3J8M0mRL3n0pL0k8J3m4L3k5J6M1m1L0l3RPk1l4R1p8J8J6l
$$ -30 -31 -30 -1 -18 -2 7 -56 -38 2 -2 7 40 -10 -17 13 -15 -2 -46 -13 -38 -22 19 -22 8 -25 -16 -9 -30 -64 27 -51 -33 -17 -20
11720b0%QJ7J6m2j4O9o0j3M3l9N6j5k1M4l7O5k9jj5m3L4kJ2o3N6Lj3j1J5J5j2
$$ -20 -20 -12 5 21 -21 -35 34 -26 -39 4 -35 21 6 -15 29 -8 57 28 27 12 -31 3 1 13 -50 6 9 -4 -15 0 15 3
11752CK9r0O4M3l6k5j8rO1k4l6N1n9L6Q0r4K2Rj8LJ3%j2K1j2j1j8Q1m6pKPrpj4
$$ 3 32 -58 6 49 13 -12 -30 -39 22 -2 -38 13 -46 -10 70 -24 -2 7 -11 -8 5 5 -7 14 2 -9 -27 54 8 1 3 10 1 -6 -20
11787b0K2K7j4JNJ5J8o3J9J6j9Kk7N8q6L6nJ1l4rP4m4j8M7L1m2j1J%N5q2M4m8
$$ -20 2 29 15 16 21 36 54 -9 10 26 7 9 -18 40 -46 -10 -15 -4 -38 -47 27 -17 -35 12 43 1 -10 -9 -9 46 -36 8 -40
11820d0L6k8M3%k4Q0n8L4o4N9ojKn2K0j6K0lj2P1l2K3l8MJ1k3%L6Om0K4j6L4r
$$ -40 -4 -32 11 11 -13 67 9 43 -21 38 32 31 33 -19 1 -15 5 2 -10 61 29 52 14 18 29 6 6 42 48 8 32 16 50 41
11854D1j9nLk3P2l3j5J5j2%J7j1k4N2k4J2K7m4K5p0L6MM2m7J7m2L2O3o7k6K1j3
$$ 41 22 17 20 -3 69 36 21 36 24 24 41 30 6 58 34 46 73 29 54 -16 20 24 66 19 36 -6 26 89 22 -4 17 4
11886DlL4n8Rk4K3L1l7J4k3M9k5jj2K2lM0j7o9N7j8J2PrpjL6n4Q6m1Qj3J4K7m6
$$ 4 1 35 -23 -14 -38 -15 16 -21 -7 -30 19 -6 -7 -19 3 0 40 23 -46 11 -7 5 12 3 -4 -5 31 -23 63 22 30 17 31 58 12
11921A2jl2N2o6O9Ql6j0NJ2l8L7Qp2P8l0orP3l4k9K6lMk5RJ6K0lj0%L1n9Oj2J4
$$ 12 11 -21 31 -35 34 42 6 -4 1 13 -25 12 20 -52 26 -4 -10 -19 54 20 -9 17 14 18 -7 2 18 38 35 25 25 56 -3 3 -9 5
11957EMj1K4L8p2J7K4m3M4kj7o4K3J9j8QJ7l3K7oJ3m4O0l6j2L7m5j2N7k3L6M7
$$ 5 9 -2 22 60 -12 5 29 -14 30 28 11 -53 -30 -11 -29 -21 -4 -37 -10 -16 -3 -47 13 -23 -35 2 -43 -55 2 -21 15 62
11989F2p7J6j3K4k9M1q1N4k2k9P8j4K2n3K4J8l8P2r2PK6k0OL0J2n5N9l9Nk9L8
$$ 62 -15 1 -12 12 -17 24 -57 -3 -25 -54 24 10 32 -21 3 21 -17 55 -37 -30 -4 -24 -18 12 24 -31 28 -11 -6 -35 3
12020Cjk1L7j4L3m8K3qRk1k8L1J9Kk4J4qj7L0k8k8M8j3J4k8Ml1N1oj3J1q7N8K8
$$ 3 2 -19 18 4 37 -11 12 4 13 -8 -36 -5 14 16 -8 6 -2 -19 11 -17 -45 3 -10 4 -24 -20 -51 0 -6 -19 -8 -95 -37 -9
12054ij1L%K0m7L9j7Pj6j7K6k8N%J4L4m5J6kL6k8kk8J7rQ6q4N4k9K9K0n0J5n0
$$ -9 -20 -17 -17 3 -44 -5 -22 -15 -31 -48 -22 -50 -45 -45 -31 3 -42 -26 -28 8 -20 -22 -50 -33 -42 44 -40 14 -15 14 34 -16 -1 -51
12088e1P2j2rK6K1l2k2l1NrL2l3O8j14N4K0L5m2RKk4O8m2K5j4j6Nk8J2j1KL1L
$$ -51 21 9 0 26 47 15 -7 -38 -33 -42 -10 -43 25 -89 -35 -15 20 -22 -13 -11 -35 33 -9 16 2 -14 -9 -37 -25 -36 -34 -3 0
12121@l3K1L1n5K8l4M3J8k1J8k8j5J6K4J5k1OK0m5MN4p0M7m0K6Kl5M7l2J0j8L0
$$ 0 -33 -12 19 -36 -8 -42 1 19 -2 16 -12 -27 -11 13 28 7 13 33 -12 -8 46 -24 23 -17 9 11 -24 23 -9 1 -17 13
12153A3j9nL2l9M4KMqj4M3m6lj9M4ol3KK7Lk1L3mK6o7L8L0q3J9K0J9n7M6k5J2
$$ 13 -6 -11 21 -18 26 28 32 24 10 53 7 4 -15 29 23 -10 -8 19 22 1 34 30 56 -11 27 57 -26 -7 13 32 -25 21 -4 8
12187H%k3O8m8RNj1J4j8K5n7P5n6k1rL3J4Pk2Pj3mmP4r9Q7OJj3l2qn7J20o2OK7
$$ 8 8 -15 53 5 14 19 8 22 4 29 -28 47 -9 -30 -39 -6 8 15 -7 0 -13 -17 -21 53 -46 41 47 48 35 3 -5 -62 58 -4 2 29
12223B9l3N6m5j1M8k4J4j2j2MjJ8Ok6J1Rk4ll3K4K3j1kj2NK2j6K9Jk3j9J6qK6
$$ 29 -4 52 7 -4 44 20 34 22 10 14 13 31 37 11 22 31 7 4 -29 -5 18 7 5 -7 -2 20 4 33 34 11 -8 8 0 26
12257B6L5m1m4N5m6R2k4m8k3J3PJ1k0rQ3p6K6L2l1K3k9J7Oj5J5l4J6JJ9j9k2N1
$$ 26 61 20 -24 31 -15 77 53 5 -18 -5 2 13 -7 -16 67 -9 17 49 18 41 12 29 35 20 35 1 17 18 37 18 -4 47
12289D7k6N4l9%l9Q%l0K1j7QL4k3L6l4L5l3L3m2k2O0l9M6p3L6K1kj0%o1M9L3n3
$$ 47 21 75 36 36 -3 5 5 -25 -4 -21 -13 21 -2 34 0 35 2 35 -7 -29 31 -8 38 -35 1 22 20 10 10 -51 -2 31 -22
12322b2N9o3L0K0m5M0k0jLPm6R9r2L0K6o2M2m3L9N9Jm2l2j7K4K8k1j2j2j1nK8
$$ -22 37 -26 4 24 -21 19 -1 -2 1 8 -38 61 -31 -1 25 -37 5 -38 1 60 61 19 -13 -30 -6 22 1 -11 -23 -34 -39 -11
12354a1j2K8L3m9L2JRJl1l6K8L8l5OK1j7Lj6L8j9m9J4O5k9k3J8k8N8m2k2J0j1
$$ -11 -23 5 38 -11 21 22 31 32 1 -35 -7 31 -4 2 23 6 9 -7 31 12 -37 -23 42 13 -10 8 -20 38 -4 -26 -16 -27
12386b7L3j7QL0Kk0K0M4n4jl4lL8o2P1m3M0l1Nqj0L8p1jK4M7k2JKk0N8n9j0J0
$$ -27 6 -11 -3 27 29 9 29 73 19 18 -16 -19 19 -43 28 -15 25 -6 -1 -9 -19 19 -52 -53 -29 18 -4 -3 -1 -21 37 -22 -32 -22
12420b2O4k2l2M1l3jK3n4OK2l5lK6m5L2K5l0J4k3QJ8K8Jn1oO3p5nK5J3M6n3K0
$$ -22 42 20 -12 29 -4 -5 18 -36 -30 -8 -43 -46 -20 -65 -33 -8 -38 -24 -47 -39 -21 7 8 -43 -49 14 -61 -66 -41 -28 18 -35 -15
12453a5l5K6Ok5N5n3%J7JM4ql3O6pl7k2RJ6k1k0Q5l4k9m8L0N9m4M4Jl7m6O3k9
$$ -15 -50 -24 -18 -43 12 -41 -41 -24 -23 21 13 -20 46 39 2 -20 -11 5 -16 -36 49 15 -14 -62 -32 27 -17 27 28 -9 -55 8 -21
12486b1LMj7K7l2K4oL4M5o8P1r4O0L5n8k9mjLM4L5m5km1M5j5m9M4KmMjj9L7m8
$$ -21 -18 -14 -31 -4 -36 -12 -18 16 61 -7 64 -30 30 65 7 -22 -26 -27 -24 20 55 10 8 -33 12 -3 -52 -8 -6 -10 -6 -7 -26 11 -37
12521c7M7l3L7l8J8OjL8n5J9L6K1on5lk6L7K4j1Kj8Rj8L1k1j8O9m5J4Rkl0J1K4
$$ -37 10 -23 14 -24 -6 0 -1 37 -18 1 37 58 52 -3 -6 -32 5 29 18 20 2 11 -7 24 3 -15 54 9 23 32 30 0 11 35
12555C5pNk9O7p1L3k%m6K7k1qM5o1O6k3j3PK3N2n6Pl6M2J7k1nk8O7n0KqMN4m6
$$ 35 28 33 4 71 0 33 31 31 -15 12 -9 -17 28 -33 33 10 -3 4 27 79 23 30 -6 36 53 32 27 -1 66 16 18 10 14 68 22
12590B2pj3K0L2n3L7p1L6K8k0J6K0j2ol1oLL8K1j0k4j1J9K0o0L3J1Jk8M8Kk4o
$$ 22 15 2 22 54 1 38 -33 3 31 11 27 47 35 29 -2 -8 -5 33 54 44 20 9 28 48 -12 21 32 33 5 53 55 31 25
12623B5K5l1K1J5l1Lj8J9J9qk9mlK5Qj8J8k7k7N6n0N5rk5J6j3K3l4J4K7k8K6k8
$$ 25 50 19 40 55 24 27 9 28 47 39 10 6 3 28 36 18 36 9 -18 38 -12 43 34 9 25 12 35 1 15 42 14 40 12
12656A2N7l3Mpl9N4j8mj7qK6K2J0k5n0Q0q4L6j1J7j1m8O8k4J3J4k5j6QJ2K8Op6
$$ 12 69 36 40 33 -6 48 30 26 9 1 27 49 59 34 -16 64 -20 16 5 22 11 -37 31 7 20 34 9 -7 1 13 41 47 -29
12689b9N3mj0Mj7K3Ll5onL2Lj7Pj3K6m2QK1pK8QJ4l0j1J0J8m3J0k9j5NM0MK0k7
$$ -29 24 20 10 14 -3 20 23 -12 -18 -23 9 12 -5 2 -11 15 -27 -19 2 -5 23 31 45 15 4 14 32 -11 -1 -30 -45 -40 0 4 24 -3
12725cj0oK0rL4l0m3L5mM0q2O9m6J1M0l9M0m8O4p0K3j7rL3n7O5k6jj2%N1lk3M4
$$ -3 -13 -19 1 -8 26 -4 -47 -12 -16 24 -58 11 -35 -24 16 -23 17 -31 33 -37 -14 -31 -40 -7 -64 1 -25 -26 -38 -38 13 10 -13 31
12759C1l1K0%j0q6Q1J4m8N4l6K1L0l2K1jj3Nk8mL4k0K2J8p7K0L2m7MP4p2K5L8
$$ 31 0 20 20 10 -76 5 19 -29 25 -11 10 40 8 29 28 15 20 -8 -12 22 2 24 42 -35 -15 17 -30 -26 48 -24 1 39
12791C9j9l1l2M7J5o0L5K5jm2J4m6L7k5Q3o1Nl4L4J9J0Nj9pJj6K9kl0j4M0j5J9
$$ 39 20 -11 -43 4 19 -41 -6 19 18 -24 -10 -56 -19 -44 39 -22 -17 -51 -17 2 12 17 -2 -9 -8 -24 5 3 -27 -41 -1 -16 3
12824Ck5j2M2o2N4J4J2m2mJ7j8L5n0N8o1N8o0ROjM8j4Pm1K9Jk1nl0K2L1qO%k3
$$ 3 -22 -34 8 -54 0 14 26 -16 -20 -3 -21 14 -36 22 -39 19 -41 -32 -26 -27 21 7 14 -27 2 3 -18 -23 -53 -31 0 -8 -2 -2 -25
12859b5L6j7m0N3rl2O0J0m0J2m1L3J0rqrKL1n2K9J2J8K4n2j0J9nJ1j8mJ8l9O3
$$ -25 11 -6 -46 7 -2 -34 26 36 -4 8 -33 0 10 1 -7 -16 -14 17 -35 -6 6 24 48 -4 -14 5 0 11 -7 -11 7 -32 31
12892C1j4lJkl6L8k8rk6O3k8L7n6L5J1j9Qj2k3N2%k8oK8j0j2k4PJ6j5O5k9K0j11
$$ 31 17 14 15 13 -23 15 -13 -22 -48 15 -13 24 -32 3 14 -5 3 -9 -32 20 20 -8 -14 14 4 -8 -32 -25 -9 -24 41 12 32 -79
12926g9Q1Mk6M7rK7m1J3rJ6L6j19Q6l5j2K1J6Nk3L5j5MK5j9Jl6O1o1N6j3k7J2
$$ -79 2 6 -20 27 18 45 4 17 8 24 60 -59 27 -8 -20 1 17 22 -1 34 19 23 48 29 30 -6 55 -6 50 37 10 22
12958B2k7K0j0k1K0j0j5Rj0kN7k5j0Rj1%m3M8M0j7MOPk4%n1N4m3P5l7l2K0L0o
$$ 22 -5 15 5 -16 4 -6 -21 -12 -22 -24 33 8 -2 7 -4 -4 -47 1 41 24 28 34 41 17 17 -34 20 -23 52 15 -17 3 33 27
12992B7j9L9j4j1k6L8pj5L1l0M2l0j1Nj1j1%Mm6Q8j7n2L4MMj8K4o4Q1m6KL4o4
$$ 27 8 47 33 22 -4 34 27 12 43 13 55 25 14 19 8 -3 -3 1 -45 43 26 -26 8 12 16 -2 22 -42 39 -7 -5 29 -35
13025c5K0K5l2O1J7p8j3M9MlMRk4J4L7j14P9l6K0K8m5N6Ml4l3N1m4RoK7kk8J2
$$ -35 -15 10 -22 39 56 -22 -35 14 18 15 19 28 4 18 55 -59 20 -16 4 32 -13 43 47 13 -20 31 -13 -4 -10 17 15 -13 -1
13058ak6L2Nl3M9l8K9l3j8J5j0Q9l8k9K4LK8n1%M3j0Rm0K2l0J6mPOM1n5j4J0r
$$ -1 -27 5 10 -23 26 -12 17 -16 -34 -19 -29 60 22 -7 17 20 48 -3 -3 40 30 39 -1 21 -9 7 3 10 16 57 2 -12 -2 -11
13092a1K5l9L5n3M7rj7m4K7K3K5j4N5p4qRK2%K8k0J6l6J5j1mMk9RL0lm2L6RM3
$$ -11 14 -25 10 -43 4 -5 -22 -66 -39 -16 9 -5 50 -24 -32 -23 -1 -1 27 7 23 -13 2 -9 -13 -9 -38 -29 1 -2 -44 -8 1 44
13126D4n9j7M4l0l6N1j7Pm6J08Om9n0kML4l4N8m9k2M3qK5Rm9L3jRk5J5j2pK8j2
$$ 44 -15 -32 12 -18 -54 -3 -20 -13 -59 49 55 6 -44 -46 -42 -8 -42 16 -33 -55 -12 -20 5 14 -35 -2 -3 6 -19 -4 -16 -23 5 -7
13160gmk8Rk0L2l%mK1j9nj1k5Q8j4rNm5M7kk6K1k9N2n2j6P0m8j9M9rk0j4L2Qj8
$$ -7 -11 -39 -30 -50 -18 -21 -21 -25 -4 -23 -28 -39 -64 24 10 1 6 -39 8 6 -20 1 -28 24 -28 -44 26 -22 -41 8 -1 -21 -35 -3 5 -13
13196a3J3l0PJ3L6n0j3j9L9k1M3l3M4m5J8Oj5L9n1kK7L6m5J7mj5K5l1L0qk0LM7
$$ -13 0 -30 -23 -10 26 -24 -37 -56 -17 -38 5 -28 16 -29 -11 -5 -20 19 -32 -34 -7 29 -16 1 -3 -18 7 -24 6 -2 -22 -19 28
13229B8ok6k0j5K6j2J6kL5oK1oo2K3J9p1Q2l6mL3o7O1Jm5J9J2k9K8jJ5Mj7%OL1
$$ 28 22 -4 -24 -39 -13 -25 -9 -11 24 18 39 33 -29 -6 13 -58 24 -12 -16 17 -50 11 12 -33 -14 -2 -31 -3 -4 11 15 -2 -2 4 35
13264C5j7j8qJ1j4L4M0n9L4o5M4nKm3M1k9j0L5qk5L3j0Qk8j1M0l3J9j3Q5r5O9
$$ 35 18 0 -8 3 -11 23 63 4 38 -27 17 12 14 -29 12 -17 -27 8 0 -25 8 -2 6 -22 -33 7 -26 -7 -20 65 -30 39
13296C9p1N6k1k3J8j9M4k2M9l1l2K9Rj9j4kK7Qj9j2K9j7L2o3N6J7n0K7l0M7l0
$$ 39 -32 24 3 -20 -2 -21 23 1 50 19 -13 16 25 6 -8 -10 17 25 6 -6 23 6 38 -25 31 48 -2 25 -5 42 12
13327A2J6j7m1O9j3k4J3n0N1J3l0j5OK1Ml0J5NMJ8Jqn8K5k4K4L8mk3J0L0n5KK3
$$ 12 28 11 -30 39 26 2 15 -35 16 29 -1 -16 -10 11 15 -15 0 5 9 27 28 20 -38 -13 -37 -13 25 21 -2 8 38 -17 -15 8
13361HL1m6MJ1j2N9l2K1n9K1L4m5J4j8R6n6J7n7lL9k9j1K0Qk1kM8o5P8m7k9KO0
$$ 8 39 -7 -3 8 -4 55 23 44 -15 6 40 -5 9 -9 87 31 48 -9 -12 27 -2 -13 7 15 -6 -8 40 -25 53 6 -23 -21 39
13394C9o8L1JJ8l4M7K0n4K6j1k4qpL4K4l4qK1J1J6j8Jj9M1p3m5N0J3K1L8J0l8
$$ 39 -29 2 3 21 -13 34 54 0 26 15 -9 -17 -24 10 34 0 -8 13 24 40 22 23 4 45 -28 -73 -23 -10 11 49 59 21
13426B1o1N5K8r7J04j2k5KL0K1n5k1PJ8Lj7Pk0J20q2%j7lJOqn0P0j1Pl4k2M5j0
$$ 21 -40 15 43 -54 50 38 13 15 45 66 11 -10 -3 15 18 1 8 -12 108 26 26 9 6 7 13 5 -45 25 14 21 -13 -35 10 0
13460@j3N7j5m3L8j4m0L6nk6NJ1K5j4kj6L5kj9K9n1N0n9jO4j2mm5L0K5Qj8j2j1
$$ 0 -13 44 29 -14 24 10 -30 6 1 -25 -20 -9 16 2 0 -16 19 17 -2 27 -24 26 -33 -34 30 18 14 -31 -1 24 32 14 2 -9
13494iM2m0J1m1J8K7j3rK7k1Kk0L1Rl6OpK6j3M7l3JL3k6L0l4j1K2J0o3MO3p3M8
$$ -9 33 -7 4 -37 -19 8 -5 -14 13 -8 -6 -26 5 14 -22 -16 -23 3 -10 37 4 5 38 12 42 8 -3 19 29 -34 -30 33 -40 8
13528Hrk7L4nn9K5L3K1J8Op9j5M3l4K4l0jN0j8j8J8Lk3L6JJ4o0J7K6j1l8j2Q1
$$ 8 -1 -28 6 1 -58 -33 0 21 39 45 -34 -49 -6 -40 -16 -46 -47 3 -15 -33 -15 -12 -35 1 2 16 -44 -27 -1 -12 -50 -62 19
13561A9j0j5j3J0J0k7L6j7m5N5o8Q2k6j9M1o5Q6n9onO4k9k4L5m7M8l2J6k2%j2
$$ 19 9 -6 -19 -9 1 -26 10 -7 -52 3 -65 17 -9 -28 13 -52 34 -25 -31 -36 28 -1 -25 10 -37 11 -21 -5 -27 -27 -39
13592c9RK0m8N9k7J9J6n7Q8k2j7j6J2pRm5Q2j3k9l6nN8j9qN6r8O2k1k6kM3J5j6
$$ -39 -30 -10 -58 1 -26 -7 9 -48 40 18 1 -15 -3 -10 -1 -46 36 23 -6 -42 -47 11 -8 -16 40 -58 4 -17 -43 -45 -2 13 -3
13625ck6MOmJ7m8L9nNK9pJ5n2jpjJ3M4o1Q3j0J3p4J8j8L7n5L9lprl8M7L3rl2l2
$$ -3 -29 -25 -19 -23 -6 -54 -15 -20 -15 14 7 22 -30 -31 -38 -39 -26 18 -43 40 30 43 -31 -13 -31 6 -49 -10 -13 -20 -29 -67 -20 13 4 -28 -60
13662f0QM3Pj4L9k0K2k0j9L2k1N9p6N0j5J1L7k6j2k7J9J1rJ0K9p2OK8j8L9o7M2
$$ -60 -52 -9 -2 -16 23 3 25 5 -14 18 -3 56 -20 30 15 26 63 37 25 -2 17 28 19 29 58 -14 -8 20 2 41 -26 16
13694A6k4m4Q7L1p1K7o2L5L5q1P8k7l1J12j15QP0l7J4k2J8mn8P9j1k0k3M4joL2
$$ 16 -8 -52 35 66 -5 22 -40 -5 30 -51 27 0 -31 81 -34 -26 44 7 21 -1 17 13 -45 34 23 3 -20 24 23 17 49
13725D9lqm2O9o6N9pk4J3o1K1Q6ol6k1m6qQ0m8O1q4K7LK1k5j5K5qJ6J5m3nl5P8
$$ 49 46 38 -4 65 -1 58 51 27 40 -21 0 86 80 44 23 -23 -31 49 1 62 -22 5 8 29 4 -11 14 6 22 37 -6 -11 -46 32
13759C2r4Q1k8M2nn9P2l0J9Po1L2qL0ko4L9j2pL2Mn9M1M0j1j8J0k8K5l1M1nK4
$$ 32 -62 19 -9 33 28 -31 41 11 30 37 -24 8 0 30 28 -36 3 -9 -16 16 20 -39 2 42 31 13 23 -5 20 -11 30 25 49
13792D9k7j6j0rL9m7K3M1n1J2QN1r4N7m3L2L9q2Q5l5J7n4O1j2L1l3Kl2J7m2M4
$$ 49 22 6 -4 -13 26 -21 2 43 -8 4 12 63 -31 26 -17 15 54 -28 57 22 39 -15 46 34 65 32 34 2 19 -23 21
13823B1l8P8j21O4Pj3Q3l5%k4M9j6l0n8K6NrK6k8M4Km1mK2k2oO7m8j0N2n3k3R3
$$ 21 -17 61 -60 4 11 -2 81 46 46 22 71 55 25 -33 -7 -2 -11 15 -13 31 33 -8 -12 10 -12 -18 49 1 -9 43 -10 -33 60
13856F0n1K0j2k6J3M7n1K8J4m9K3KOj4Rn8N8o6O3m0%N1l3lk0K3qj3J7j9O3m9L3
$$ 60 9 29 17 -9 4 51 0 28 42 -7 16 18 24 10 19 -39 19 -47 16 -24 -24 27 -6 -9 -29 -6 -14 -27 -10 -29 34 -15 18
13889A8nPj0Nml0L1k9N8j7Kj4n9P0q9R6q9L5J0qpJ8L4o7K6k3L7j8J4l5JK8Ql2
$$ 18 13 20 10 15 11 -19 12 -17 41 24 26 12 -47 23 -66 30 -59 -24 -14 -22 -29 -11 23 -44 -18 -41 -4 -22 -8 -43 -42 -14 -6 -38
13923c8M2m9N2k5N3m3K9l0%K5q7J00o5O3l3K6l4J2J0Qj1k7M1Rm2M5m1Jqk8M2k7
$$ -38 4 -45 7 -18 35 -8 21 -9 -9 16 -71 29 -36 27 -6 20 -14 -2 8 16 5 -22 19 28 -14 31 -10 -9 -17 -45 -3 -30
13955c0K6m0kM4K0JMk0%k2K3J1n3K7l1L9l7J5K0k3j9K7oL9m4L9j0m5K2L5k2kJ0
$$ -30 -4 -44 -46 -2 18 19 23 3 3 -19 4 15 -38 -11 -42 -3 -40 -25 -5 -28 -47 -20 -26 13 -31 8 -2 -47 -25 10 -12 -14 -4
13988dp5J06l7K5Lk2O6k9n2J0j4J6j3K6pj9K1m4ML0J7qMk4J4J4L5n3j0Qp6O9J1
$$ -4 -79 27 -10 15 18 -4 62 33 -19 -9 -23 -7 -20 6 -1 -20 1 -43 -39 -9 8 0 4 -20 -6 8 43 -10 -20 -12 -88 -19 -8
14021hJ7m8J05n6l3J0J0J1k9K6K1j7J1Nj6j6N5m2pj6l4P1j5L2ok1J3K4m5K8k5
$$ -8 9 -39 66 10 -23 -13 -3 8 -21 5 26 9 20 25 9 -7 48 6 -1 -17 -51 20 5 37 31 10 23 47 2 30 5
14052Ej1rj0J2RP2n5m4qjK1M3j9L3j0o8J8J1j5PO2j1m7L4l8Qj3J1L6p6Q0l2PJ8
$$ 5 -6 -15 -25 -13 -4 68 13 -31 -39 -40 -19 24 5 38 28 -40 -22 -11 -26 -19 43 32 -15 19 -19 -11 -24 -13 23 -53 27 -5 2 20
14086B0J2Qk1L4k8m1M8m3O5l4M2m3rpkJ7j1K6o6M4JQj5l3P1Ql6L1n1P5r0K3l8
$$ 20 32 40 19 53 25 -16 32 -11 54 20 62 19 10 3 1 18 7 33 -33 11 12 20 5 -28 43 51 15 46 -5 70 -20 3 -35
14119c5M4l0L7J2l1L3k0J9nk0lk2J0J0N3l0j5Qm4P9o0K2O1p2oL5l2K4Jn6M2k5
$$ -35 9 -21 16 28 -3 30 10 29 24 4 1 -21 -11 -1 52 22 7 15 -29 50 -10 12 73 1 -5 30 -2 22 23 -33 9 -16
14151a6J5RK3j3j9j8N2j3rJ1OOj3l7RK6K2k5j5j2k5N7j5j3nL4l9M9j6n1Q9l7m
$$ -16 -1 8 31 18 -1 -19 33 20 11 22 28 34 21 -16 -7 19 41 16 1 -11 -36 21 6 -7 -12 22 -17 32 16 -35 54 17 13
14184A3k4j6M2k5M7l7%Kk5J2J2M8p7L5l5J5J7l0K5j9Mk4K5K9k9PkM7k9m0nk6J8
$$ 13 -11 -27 15 -10 37 0 0 2 -23 -11 1 49 -28 7 -28 -13 4 -26 -1 -20 -16 -40 -15 14 -15 -8 -10 37 8 -32 -37 -63 -45
14217d5M4K2k0LOk2N6p1k2kLL2J1K9l1M9j8l2L2n0j7P6o1J9k1N3L9m2n3N1lk7
$$ -45 -1 21 1 4 10 -12 44 -27 -49 -51 -48 -16 -5 24 -7 42 24 -8 24 -26 -43 33 -28 -9 -30 23 62 20 -33 18 15 -12
14249a2J3o4O0J5l2J4QJK3j0j0l7M5n4P4l5J6j7n0J9RkoK9J3l6L9M7p2j4RN4p0
$$ -12 1 -63 -3 12 -20 -6 2 3 26 16 6 -31 14 -40 34 -1 15 -2 -52 -33 -24 -26 -32 -3 10 -26 13 60 -12 -26 -17 37 -33
14282c3%K6njJ3J7n5P2o6N6n1K6j3kM4o0J5JL0k0K6o0P8k7k3k7J7p9J01l9J1j8
$$ -33 -33 -7 -12 -13 0 17 -38 34 -32 24 -27 -1 -14 -16 28 -32 -17 -16 14 -6 20 -40 38 11 -12 -39 -22 -101 0 -39 -28 -46
14314d6K6M0p2N9J1l7j0J2mm4M3mk5L4N9l2J3m4K8m8L7p4O1O9o9J5m5K8J5j4R
$$ -46 -20 20 -52 7 18 -19 -29 -17 -21 -65 -22 -26 -51 -17 42 10 23 -21 7 -41 -4 -78 -17 52 -17 -2 -47 -19 -4 -18 -9
14345iK4k7J0J8pK0j2j2P8n5l2j8LpRPrPl8N9k1%l0LO1j6K2j7Ln6P1m2j0jJ4K3
$$ -9 15 -12 -2 16 9 29 17 5 83 28 -4 -22 -19 -26 -17 -10 -19 -12 -50 9 -12 -12 -42 -39 22 6 28 11 14 -42 29 -13 -23 -24 -10 13
14381A3J3p3O4K5k8l5oM3Mj3o1Q0k2l2L0J2ql4J7l3N1m8N3K5o2K3LL5j2Pok0k7
$$ 13 26 -47 17 42 14 -21 -27 16 20 7 -54 26 4 -28 2 14 6 -28 -11 -44 7 -41 12 37 -25 -2 1 36 24 31 25 5 -22
14414b2M3o3P8j0l1L8j9o1L2ON9o9K0mOJL5lm2L8mNl1k4NL7m3QK0l0l9J18n6j3
$$ -22 21 -42 36 26 -5 33 14 -47 -15 -9 50 -19 1 -3 3 4 39 36 -6 32 28 33 2 -22 -17 20 -23 -15 5 -25 -64 54 -2 -15
14448a5k9N6j3l0M1qN5m9POk4J2j8Ml0K9M3M4o0K1m3nO0n3J1k5NN3ok2NmjK8o2
$$ -15 -44 12 -1 -31 10 2 57 8 15 21 -3 9 -9 -5 -35 -6 37 81 21 42 -1 -6 54 1 12 -13 -8 45 39 17 22 18 17 45 -17
14483a7MoL7Krm9K7K0j1N9k8k3J6k6j3K9j4J7L3j6l7L0rj9K7l4K6pj9L5%p8M6
$$ -17 -13 -19 18 20 11 -38 -11 9 -2 57 29 6 22 -4 -17 12 -2 15 48 32 -5 25 16 -3 24 -10 16 9 -10 25 25 -53 -7
14516gLnK2k5nOK2m4oR5n4rkR2o0J7kl%m7M5K6k4l0j0M7l6L4pk7lj5K1l4K4M1
$$ -7 -4 -9 13 -12 -17 -11 11 -33 -39 56 2 -7 -9 83 23 40 38 35 35 -12 33 59 35 5 -5 42 6 40 33 6 3 -12 9 -25 -1 40
14552D0k2m2K5l4kR7m9j8M0q7K4M8K7m5j4pkN4k2PRM1q7K7QJ7k9N5o7j9M7J2j6
$$ 40 18 -24 1 -33 -35 62 13 -5 35 -52 -28 20 47 2 -12 -19 -21 33 11 18 27 68 -19 8 16 33 4 59 -8 -27 20 32 16
14585A6ml4Qj6J9K4k1Nl0jQN3k6J3J8kl9j1P3l6k5L1n0K7j5K7k2j7M5k4J1k0j7
$$ 16 12 -22 -14 -30 -11 13 -8 -3 -33 -34 -26 27 1 14 32 30 -9 -20 53 17 -8 23 -27 0 -15 12 -10 -27 18 -6 5 -15 -32
14618c2L5j9lN7Qln6MK4NM1n7K5k4J8o3LL7j6K0k5O3j30R8j5j6J9j6L5l2J6k0
$$ -32 3 -16 -19 38 46 43 -13 -9 15 20 61 4 29 5 23 -40 -37 0 -16 4 -21 42 -88 10 -5 -21 -2 -18 17 -15 1 -19
14650a9J3lm1M7M1m7L5p6L9J0n3N7n8L5l5P2m4nOK3j7j8M0k3l0N9m7L5pNqL2n1
$$ -19 -6 -9 -50 -3 38 -9 26 -50 -11 -1 -54 3 -55 -20 -55 17 -27 -32 -26 -3 -20 -38 2 -21 -51 8 -39 -4 -11 -6 -14 18 -33
14683c3j0O3n7oM7m0NNmM3l0k6J6JN7Mn1k7nK0j3K3k1J0l4J2k8K5M1l9R4q3K7
$$ -33 -43 20 -37 -43 4 -36 -31 -26 -30 13 -17 -43 -27 -26 31 35 -16 -43 -48 -28 -41 -18 -39 -29 -63 -51 -79 -54 -13 -52 42 -41 -14
14716a4k7j0M0M1p9K5%Ml%j6K1j5rK4M0n1N6o9QJ4l0M2k8N3l8l1L5O0J0r4O9j6
$$ -14 -41 -51 -11 30 -49 -24 -24 -20 -23 -23 -39 -18 -33 -42 -18 22 -29 27 -42 -34 -20 -50 -8 -36 17 -21 -52 -17 43 53 -41 28 12
14749A2JOlMl9M8k7LoL1Kl9JL3K3m2j8L7m6JJ9J0K2J0k4Jn7K9jM6m8l0P0j0l9
$$ 12 13 19 16 20 -19 29 2 5 -1 30 32 -7 -6 27 50 8 -10 27 -19 -18 1 11 33 43 19 20 -37 -8 -9 37 -11 -41 29 19 -20
14784b0K1%J3NK8k5m5L6oL4o0L5K3m8jK6k1%%QMrK1l5N6k2j7Kk9P2q7O5J8m9M
$$ -20 1 1 14 19 47 22 -23 13 7 41 -19 16 39 -9 -10 16 -5 -5 -5 3 7 -2 19 -16 40 18 1 3 -26 46 -41 24 42 -7 -3
14819cj4QJ9k3nL4j1J0m3j2J0K3rL4o0M4K5m2OJ0N0m1J1k6N1k1l7P3n6K4k1L0
$$ -3 -17 -9 10 -13 -18 16 5 15 -28 -40 -30 -7 -16 18 -42 2 27 -15 -9 1 51 10 21 -5 46 25 -12 61 5 29 8 38
14851C8o9P9l4l9L3K2Nj3n4K4L2jm0N8j5J2l8J7oL4l1M8l0k4M7p8M0J0j1Nn2M0
$$ 38 -31 48 14 -25 8 30 35 22 -32 -8 24 23 -17 41 26 38 0 17 11 45 14 62 32 8 55 -23 17 27 16 21 -31 9
14883IJj9k4Rk8M4kK7pM0K5j02O6j7n2N7m7Kk5K6L9j8k8L7Lm3O8j1O%J3k5l5O3
$$ 9 10 -9 -33 -24 -52 -8 -10 17 10 50 75 -27 39 22 -30 27 -20 -18 -43 -17 22 4 -24 13 16 -27 41 30 36 36 49 24 -11 52
14917E2j9k4K6k4L0k8OPl1l3K8Q4o1J6j6k7M9m0K0m6L9Po9Q3l4J2l3K7Lom8M0
$$ 52 33 9 35 11 41 13 19 26 -5 -38 -10 74 13 29 13 -14 35 -5 15 -31 8 15 -54 29 -5 7 -26 1 4 -2 -50 -10
14949a0L3o2J1l0J2O0j0pl6L4J9Ok1M6q2N0j2m1L3OOjj3L7J7l2k8O9o1N3k6ko
$$ -10 23 -39 -28 -58 -46 14 4 -3 -39 -5 14 20 -1 45 -37 13 1 -40 -7 -1 5 4 -9 28 45 13 -15 54 -7 46 20 18 12
14982A2k5J9pK4j3M0l5K0l5LK5J8j0l1P8r5J9L9p5M1o0Q3o6%L9m0O0n1J8j8K4
$$ 12 -13 6 -1 23 10 50 15 35 0 3 28 46 36 5 83 -12 7 46 -29 12 -48 35 -31 -31 8 -32 28 -23 -5 -23 1
15013Aj5J1M8m0M4o4k5N2k5J4jJ8m7K7M1k2k9k7L1j2L4p1L5L8p4K6K3JK0k6k8
$$ 1 -14 -3 45 5 49 -15 -40 12 -13 1 0 18 -29 -2 39 17 -12 -39 -8 -20 14 -57 -22 16 -58 -32 -9 -8 12 -14 -42
15044d2k0P0m1K3Nk0rL4Ok4J4Po0M8k1J8j5l2N1rM8m9ppnL5L1m5k1%O9o1M0k7
$$ -42 -62 8 -33 -10 -5 -25 -34 0 6 -18 -4 3 -57 -9 -30 -12 -27 -59 -8 -17 31 -18 -25 -32 -37 -2 29 -16 -37 -37 32 -29 11 -16
15078a6%J1LK0r1Q8j6J4p5j9J26o3ROl7K0j7J3oJ2l7N1RJ1Qq2P3n4Pj0J2O7r4
$$ -16 -16 -5 -2 18 -73 15 -1 13 -62 -81 45 -18 -9 -3 -40 -20 -37 -24 -30 -18 -55 -4 5 16 24 -58 15 -39 -32 -42 -30 37 -57
15111e7O2j5j7ONoN0J2q4K4mk9K7j5O1k2k4NJ0l0K9M0k5Lk0J6l0N5l6J1MK1j9
$$ -57 5 -10 -27 -21 -16 -22 28 40 -44 -20 -24 -53 -26 -41 20 -2 -26 -21 -11 -41 -12 28 3 6 -14 2 -28 27 -9 2 6 27 8
15144Hn2M8K8j0L1j02L0RM2l6k4M4o4K8JRqm0L3K4j2K4No%j7J8k0RJ5m6LM2k2
$$ 8 -44 4 32 22 53 -49 -19 -10 32 -4 -28 16 -48 -20 -19 -10 -18 -58 -25 -1 -13 11 16 10 10 -7 11 -9 0 15 -31 -28 14 -8
15178hQL2%k2rk0K4m9Q0k0rj8k7J13r4J0k8M4kqL8j9km3O1ol5O7r8Q6n0k6J4O
$$ -8 0 32 32 10 1 -19 5 -44 36 16 7 -11 -38 75 -19 -9 -37 7 5 -3 35 16 14 -29 32 26 -9 58 -40 46 -4 -30 -16 -10
15212a0M9o5MJ6l8L9lN2p0J9j1L0J7qj7m8M6n4L5NQN5p0k1J0K7j1J9o9J03m4l6
$$ -10 39 -26 -22 -6 -44 -5 -8 44 -26 -7 -18 12 29 21 4 -44 2 -52 -17 -12 -4 51 -19 -40 -30 -3 -14 5 -64 39 -5 -41
15244d1P8m8QJ1j7pJ03p4k0L6%j8J4J1k3mn1PM8joK2n2MJ4O1n8Kj1jM0k4J0J8
$$ -41 37 -11 -3 8 -9 -16 87 13 -7 29 29 11 25 36 13 9 -42 -35 13 12 6 28 -24 -20 -6 55 -3 -1 -12 -13 27 3 13 31
15278C1L1j9m7L2j4J6k7J5j5k7L9l7N1p5P8k4j1j5N2j4j3L0PJ2l6J0M2q6M8j1
$$ 31 62 43 -4 28 14 30 3 18 3 -24 15 -22 29 -46 32 8 -3 -18 34 20 7 37 44 56 20 30 72 -14 34 23
15308B3j8l1O5l9J9Qn7j2L9QJ6k8k9L3j7KL2L2m4K5j9Mk4J6Kpj4L8j5J1J8Pj9
$$ 23 5 -26 39 0 19 27 -30 -42 -3 5 21 -7 -36 -3 -20 -18 14 46 2 27 8 12 -12 4 6 -1 -15 23 8 19 37 44 25
15341B5j8L2k2JlRRqp0K3L4qoqK2K1j8n6J2K9m%Rl7O6k7k4O0l6%k2L0j1O7q1J7
$$ 25 7 39 17 18 15 24 33 25 -45 -22 12 4 -2 -10 12 33 15 -41 -29 0 -4 -4 5 -32 34 7 -17 43 7 7 -15 15 4 71 -10 7
15377GOl7OoN2l8J9Km6M9j2Pj3k2j5j6J7PO7p9NL3J4l4M5j6o0O0j9Jl4N1L0m9
$$ 7 13 -24 -18 -24 28 -10 9 11 -35 14 2 9 -4 -26 -41 -57 -40 -33 34 -45 -40 -7 7 -27 18 2 -58 2 -17 -16 -50 1 31 -18
15411a8rl5O0NJ2n2M1k3pJ3m0N0j6J1L5j4l4o0N2RL1n2J4J0j8L2j7M3j8k1K5R
$$ -18 -27 -62 -2 3 15 -37 4 -19 -26 -13 -53 -3 -19 -8 27 13 -21 -81 -29 -20 11 -41 -27 -17 -35 -3 -20 23 5 -16 9 18
15443A8k1n4K3J1J8%MJ2LPo3K7qKMl5P0Oj4m6O0n5j4J1j9L5K3l9K5k3J9K2k9N6
$$ 18 -3 -57 -34 -23 -5 -5 -1 11 14 21 -42 -15 -23 -21 -17 -52 18 24 10 -36 24 -31 -45 -34 -53 -18 5 -34 -9 -32 -13 9 -20 36
15477C6m4N1o4K8Mk3JK0m7M1K5k6K7m4Q4q4l0PR9l8Qm9L2m9P%L8Nm5M1Pk8J1k1
$$ 36 -8 43 -21 7 11 -12 -11 9 -38 3 28 2 29 -15 69 -15 -45 -38 61 23 31 -18 14 -35 -28 -28 10 15 -30 11 18 -10 1 -20
15511b0j8j0J8Lj1K4M7m3k8N8o3RQOj5L5l5Kk3J8j0J6L4oQk6K7mm2M0qn3O8j5
$$ -20 -38 -48 -30 -27 -38 -14 33 -10 -38 20 -43 -34 -26 -20 -35 0 -35 -33 -56 -38 -48 -32 2 -4 4 -22 5 1 -41 -1 -9 -62 6 -9
15545ik1O2o2L1K7j8m2J7M0o0N1l1K8j6m6O3k1K8k2k5K5j5K1l9J8K1k2Rk5J6j3
$$ -9 -30 32 -30 1 28 10 -32 -15 25 -35 16 -15 13 -3 -49 14 -7 21 -1 -26 -1 -16 5 -34 -16 5 -17 -8 -33 -17 -30
15576c0R0p5K9%J5LQk9n0Q4l6rL0L0k1pK4J2n3j9J6p0N8L7Qn7K5n7K5L3K1k9N4
$$ -30 60 -15 14 14 29 32 40 11 -39 45 9 0 30 60 39 32 56 68 15 -4 12 -58 0 37 45 -12 13 -44 -19 14 35 6 60
15609F0m0oj2Lk0J1M2l6j9L9k4OJ2k0J6J0m6RK7M6n7L3Kl4M1j5l4M7k8NRrk6l
$$ 60 20 14 2 5 -15 -4 38 2 -17 22 -2 4 16 -4 12 22 -24 -15 12 58 1 34 36 2 43 28 -6 41 13 18 27 18 -8 -11
15643a1k1N0lL1l1m2O4j9L0K5k3p2K4J1k3K5l3N5o3K9J9j2K2m2Nk9%M9J7l6LJ0
$$ -11 -32 18 15 46 15 -27 37 18 48 73 50 -22 2 13 -10 15 -18 37 -26 3 22 10 32 -10 -5 -34 -34 15 32 -4 -1 9
15675In4M4L1m5RMMOk9L4l4j3J5L1n4L4K0Pj2Ol2M1n1N2m6K3J8m1M5j9OJ3n3o
$$ 9 -45 -1 30 -15 -6 -2 2 8 -21 13 -21 -34 -19 12 -42 -8 12 19 7 13 -19 22 -29 23 -23 0 18 -23 22 3 9 22 -31 -37
15709c7PN7k4j3K0l1N4q6M6K1J7j0o3M9l7L2j4%J1J5L0l3MQm0j0L1L2n1qL3m1
$$ -37 -30 27 3 -10 10 -21 33 -53 -7 14 31 21 -42 7 -30 2 -12 -12 -1 14 44 11 15 23 -17 -27 4 36 -15 -23 10 -31
15741c1M1l4N2o9N1m6J2N3q0J01n3J5J7kJ3j9j0o4Q8m2L8L4p5k4P7n6L1j1l1N3
$$ -31 10 -24 28 -41 10 -36 -24 29 -51 50 -3 12 29 27 40 21 11 -53 35 -7 31 65 -10 -34 43 -13 18 7 -24 29
15771B9J2m3k0j2L6K3Kk5j8ok4N6m5J9k1O3l6l9N3l7P4r9K2NM2k9Nj0M8jl1%k8
$$ 29 41 -2 -22 -34 2 25 27 2 -16 -22 -46 10 -35 -16 -37 26 -10 -49 4 -33 41 -58 -36 -31 11 -18 -13 -23 25 24 -7 -7 -35
15804c5K9K5m8j3M8l4LK7k5nLnP5n3Nl2K1O4j05L2Pjj8pO3l2L4m1Oj5L6K6o0L1
$$ -35 -6 19 -29 -42 6 -28 -25 2 -23 -28 -25 -30 45 -8 -3 -35 -14 50 -55 -23 -16 -17 -35 -42 21 -11 23 -18 -12 -27 9 35 -25 6
15838Fl7J1K4n6L8m7L7K6J3m7%L1mK8p0O5k7j0J8m7L9k5pK5K6k6J1j1j2k9K4J9
$$ 6 -31 -20 4 -52 -14 -61 -24 2 15 -32 -32 -1 -5 23 -47 18 -9 -19 -1 -48 -9 -34 -41 -16 10 -16 -5 -16 -28 -57 -33 -14
15870a4k6P2p6j0L6onj4M3%j4k3Qj6M1j4k1K7k3N6Mn9LM3k3j6M5m1K8J4j9K0N
$$ -14 -40 32 -44 -54 -18 -24 -29 -43 0 0 -14 -37 -29 -45 -4 -18 -39 -12 -35 21 25 -34 -31 12 -11 -27 18 -23 5 19 0 20 25
15903B5J3l0J6k2OKk0J7m9O4l8pJ7m2K6k3J6K6K4J9k3L8n0J3o5J7L5o9L5j7L3
$$ 25 38 8 24 2 8 10 -10 7 -42 22 -16 -23 -6 -48 -22 -45 -29 -3 21 40 17 55 5 18 -47 -30 5 -64 -29 -46 -13
15934a3J8j1J4j7L8o8M6j3J2LL8m3K2Mn7O1m4pML3l6OROJ0j6J2n0L5j1M1k0RJ
$$ -13 5 -6 8 -9 29 -39 7 -6 6 9 47 4 26 30 -27 34 -10 -17 -13 20 -16 -10 -1 5 15 -1 11 -39 -4 -15 26 6 15 16
15968A6l3K1j4KK2pJ3k0j5M9l5l5M4j3l3N0ln1M2L6Jn5N7l5K6m0j0K2j7lJ7L1
$$ 16 -17 4 -10 -8 14 7 20 0 -15 34 -1 -36 8 -5 -38 12 9 -42 0 36 37 -18 39 4 30 -10 -20 2 -15 -18 -1 30
16000C0n0O5k4m4L9j2J2nPl0%N4lJ3m9J3m2j5Q5j5k3M6o0j1M1k2j3O0o4L2L1o1
$$ 30 -20 45 21 -23 16 4 16 11 18 -12 -12 42 39 52 3 16 -26 -41 44 29 6 52 -8 -19 22 0 -13 47 -17 15 46 -15
16032a5L6JrMM0l1L8k8J1J8j7rk8J8k5mL5m7J7Pj5qNK3k4J1rO1l4j9k5P0q1N1
$$ -15 21 22 13 17 57 26 64 36 47 65 48 39 11 29 4 0 35 -12 5 12 -3 -11 -6 17 -7 4 -5 56 22 3 -22 48 -33 18
16066A8j6L7ql3M6n7P9r0O9l8J1q%P5o0q2K8J0kj8l5M6L1Rl9M0K9j2j9L3ok1j3
$$ 18 2 39 31 -2 44 -13 66 -24 45 7 18 10 10 85 25 -57 -29 -19 -21 -39 -74 -28 3 12 -27 13 42 30 11 44 38 17 4
16099Dm3P6o1J1NJ1jm2O6k8J4KK9%l9M7n3j2L4j6K1J2Qj8j5l0J4p2J09j5Jj6m8
$$ 4 -39 37 -24 -13 -8 3 2 -40 26 -2 12 14 43 43 4 51 -2 -14 20 4 25 37 45 27 12 -18 -4 -76 33 18 19 3 -45
16132d5N9k2J8qk0JoK4J6l0L4l4K7l0j9K2l3J3P6p6LJ6l3l1Q0k0Ql3N3k6K3ok2
$$ -45 14 -8 10 2 -18 -17 -23 1 17 -13 21 -13 14 -16 -35 -13 -46 -33 43 -33 -30 -14 -47 -78 2 -18 -10 -43 10 -16 7 1 -21
16165b1j8K5k1J3Ol7L0J7ok1L2j5K1L3n4%oqK2n2Q9k8l4J3k3qk4P0KJ0l4J3k6
$$ -21 -39 -14 -35 -22 -16 -53 -23 -6 -12 -33 -1 -16 5 38 -16 -16 -22 -30 -8 -60 29 1 -33 -20 -43 -51 -75 -5 -3 7 -27 -14 -40
16198d0M2j9k8L6n6N0k6Pj1J6M9q6N5l2L8Lj0k4L5J8l5rKj8oN0K4r7J2pL1k3J2
$$ -40 2 -17 -45 -9 -65 -15 -41 -34 -45 -29 20 -66 -11 -43 -5 -2 -12 -36 -1 17 -18 -27 -25 -43 -49 1 25 -72 -60 -67 -36 -59 -47
16231d7P5k8k4kJ0k3K7k9Lk5kL7L4L0m9Qj5nQ1q7L3n6J3O0pn4N6m6K8K1n6QL1
$$ -47 28 0 -24 -26 -16 -39 -12 -41 -38 -63 -65 -28 6 36 -13 -5 -20 -25 56 -31 2 -54 -41 19 12 -42 14 -32 -4 17 -39 -31 0
16264@KK6n5P0n6k3K5k7O7Oj7n7L2o0J06nj4m5j2oj3L2N2o4k9P1k3J8o3Q3pO6
$$ 0 2 28 -27 43 -13 -36 -11 -38 29 35 18 -39 -7 -67 39 34 20 -25 -37 -43 -56 -24 28 -36 -65 6 -17 1 -62 21 14 80
16296H0j16J9M6jOl0rm8J07o3Jk9m1Q1rJ3K1l7K6j6MM9m3nJo1O0l3L0l9N7J3m6
$$ 80 -36 -17 29 28 34 4 -5 -53 54 -9 -8 -37 -78 3 -6 7 28 -9 17 1 5 54 11 6 7 -54 6 -27 3 -36 21 34 -12
16329a2J2J9mj9Ljjn2L6j1k1JL2MK4n1K5L5l1LJ5KJ7k1Pj7K0J3n6J8L7j8J9m9
$$ -12 0 19 15 -4 -1 -2 -3 -55 -19 -30 -51 -50 -18 -14 10 -41 -16 19 -12 -9 6 8 25 4 11 -6 14 27 -29 -11 26 8 27 -22
16363b2M3L7p9Ml5J05j9k1k2j7N6j9L5p4O1J1l2Kj9L8
$$ -22 21 58 -21 -17 -52 53 34 13 -9 -26 30 11 46 -28 33 44 12 14 -5 33
16383C3
$$ Imaginary data points
##PAGE= N=2
##DATA TABLE= (X++(I..I)), XYDATA
0@%%%%%%%%%%%%%%%%%%%%%%%%%%%%%%%%%%%%%%%%%%%%%%%%%%%%%%jKjj%kQj1J4
$$ 0 0 0 0 0 0 0 0 0 0 0 0 0 0 0 0 0 0 0 0 0 0 0 0 0 0 0 0 0 0 0 0 0 0 0 0 0 0 0 0 0 0 0 0 0 0 0 0 0 0 0 0 0 0 0 -1 1 0 -1 -1 -3 5 -6 8
63Hj5J4j8L9N9Q3N8q5J0j96l6j18O2N3N7M3J00N1J6l6q4j03r1l1lQ8Q1J12K2K9
$$ 8 -7 7 -11 28 87 170 228 143 153 -43 -79 -197 -135 -82 -25 18 118 169 185 149 65 -38 -129 -160 -163 -75 6 118 140 169
93A69Jj18m7r5o4N7m2J09P5M6M0J8m1n5j11n4m0K0M3O0P6J07k1m2m1p8p9o7M3
$$ 169 170 52 5 -90 -154 -97 -139 -30 45 91 131 149 108 53 -58 -112 -152 -132 -89 -29 47 154 133 91 50 -28 -107 -174 -131
122a31OJ05rJ59K8o4L5j54K2j04p8R3qJ20j5J47J5q4J0j22q5k6N0n5J13R3J02
$$ -131 -125 -20 -29 130 158 94 129 -25 -3 -107 -185 -92 -100 20 5 152 167 83 93 -29 -114 -140 -90 -145 -32 61 163
149A63K7q2M6j49n1q7Jj6M9J17O9J5N1o0kj22j4p7kK4J40K0Q6L8p8kj48lj34P4
$$ 163 190 108 154 5 -46 -133 -132 -148 -99 18 87 102 153 93 91 -31 -45 -122 -124 -100 40 60 146 184 106 104 -44 -47 -181 -107
179a07r2J62O6L1Q9j0l1r0k1j25m0J8M0P6J08N3lkr4n6l0j04K3PQ1L5P9N2j2J2
$$ -107 -199 -37 29 60 149 139 108 18 -3 -128 -168 -150 -110 -34 74 127 124 122 28 -28 -58 -162 -139 -132 -51 -16 63 115 103 115
209A15j44n1p1k4PN4J28K3O0l2O4m7j18j3j41M3J5Q9N8L3P1o6L3p4o7p0n3N7K5
$$ 115 -29 -80 -151 -175 -168 -114 14 37 97 65 129 82 -36 -49 -190 -147 -132 -43 15 48 119 53 86 12 -55 -125 -178 -121 -96
238i6J46qJ05J1n5Rj57l7r1K8J2M1J46pJ14l6o0l1j09j0j5l9L7J11L5M6L9mp6
$$ -96 50 42 147 158 103 112 -45 -82 -173 -145 -133 -92 54 47 161 125 65 34 -75 -85 -100 -139 -102 9 44 90 129 125 49
267D9o5n0q1J3j4J10P6L8R1r4J0j39m6KJ7oK9P9L6O1J8kj30m5j8m8L1L3M3J5J12
$$ 49 -16 -66 -147 -134 -148 -38 38 76 167 73 83 -56 -102 -100 -83 -89 -60 19 55 116 134 132 2 -43 -61 -109 -78 -45 -2 13 125
298A25m4Jl2j9p4p7L7k1J00J0J15n3k4J4n1%j16j2L6J9O4O6N2K5l1m5j08L9j12
$$ 125 81 82 50 31 -43 -120 -83 -104 -4 6 121 68 44 58 7 7 -109 -121 -85 -66 -2 64 116 141 110 65 -43 -4 -116
327a16PMP6O0OJ14r7K1n9m4po6Q7qNK5J04J1n2k2o3l7l6K1K1Q2%N8j0j7ok2j05
$$ -116 -109 -105 -29 31 37 151 54 75 16 -28 -35 -101 -14 -22 -17 8 112 123 71 49 -14 -51 -87 -66 -45 37 37 95 85 68 62 40 -65
360f5N2k9j8N9J0L0P5k7j3n1m1l8n8K8L7M6O5J0K5k2k4l4o2q7J2M1O0L5J0M7l6
$$ -65 -13 -42 -60 -1 9 39 114 87 74 23 -18 -56 -114 -86 -49 -3 62 72 97 75 51 17 -45 -132 -120 -79 -19 16 26 73 37
$$ [...]
16383c3
##END NTUPLES=NMR FID
##END=
