##TITLE=31P_DE-80H_X3
 64 sc D2O
 26.2.2025
##JCAMPDX= 6.0         $$ Bruker NMR JCAMP-DX V2.0
##DATA TYPE= NMR FID
##DATA CLASS= NTUPLES
##ORIGIN= UXNMR, Bruker Analytische Messtechnik GmbH
##OWNER= root
$$ XWIN-NMR		Version 3.5
$$ Fri Jan 30 10:43:01 2026 Russian Standard Time (UT+4h)  Yarkov@DPX200
##.OBSERVE FREQUENCY= 81.013821
##.OBSERVE NUCLEUS= ^31P
##.DELAY= (6, 6)
##.ACQUISITION MODE= SIMULTANEOUS
##.ACQUISITION SCHEME= undefined
##.AVERAGES= 64
##.DIGITISER RES= 17
##SPECTROMETER/DATA SYSTEM= spect
##.PULSE SEQUENCE= zgpg30
##.SOLVENT NAME= CDCl3
##.SHIFT REFERENCE= (INTERNAL, CDCl3, 0, 243.863)
##AUDIT TRAIL= $$ (NUMBER, WHEN, WHO, WHERE, WHAT)
$$ ##TITLE= Audit trail, XWIN-NMR		Version 3.5
$$ ##JCAMPDX= 5.01
$$ ##ORIGIN= Bruker BioSpin GmbH
$$ ##OWNER= Yarkov
$$ C:/Bruker/XWIN-NMR/data/yarkov2/nmr/P31/2/audita.txt
$$ ##AUDIT TRAIL=  $$ (NUMBER, WHEN, WHO, WHERE, WHAT)
(   1,<2026-01-30 10:42:03.48 +0400>,<Yarkov>,<DPX200>,
      <created by zg, POWCHK disabled, PULCHK disabled
       configuration hash MD5:
       00 E9 B6 7A A2 85 ED C7 34 08 36 98 17 FE 4E 26
       data hash MD5: 32K
       7B 54 6D 51 93 65 16 12 1A 46 FA B3 52 94 D4 F0>)
$$ ##END=
$$ 
$$ hash MD5
$$ 12 90 79 DD 7D F6 49 91 99 EE 0F 0F 53 44 2B BC
##$RELAX= 
##$RELAX= 
##$RELAX= 
##$RELAX= 
##$RELAX= 
##$RELAX= 
##$RELAX= 
##$RELAX= 
$$ Bruker specific parameters
$$ --------------------------
##$DU= <C:/Bruker/XWIN-NMR>
##$EXPNO= 2
##$NAME= <P31>
##$PROCNO= 1
##$TYPE= <nmr>
##$USER= <yarkov2>
##$AMP= (0..31)
100 100 100 100 100 100 100 100 100 100 100 100 100 100 100 100 100 100 
100 100 100 100 100 100 100 100 100 100 100 100 100 100 
##$AQSEQ= 0
##$AQ_mod= 1
##$AUNM= <au_zg>
##$AUTOPOS= <>
##$BF1= 81.014009
##$BF2= 200.13
##$BF3= 200.13
##$BF4= 200.13
##$BF5= 200.13
##$BF6= 200.13
##$BF7= 200.13
##$BF8= 200.13
##$BYTORDA= 1
##$CFDGTYP= 0
##$CFRGTYP= 5
##$CHEMSTR= <none>
##$CNST= (0..31)
1 1 145 1 1 1 1 1 1 1 1 1 1 1 1 1 1 1 1 1 1 1 1 1 1 1 1 1 1 1 1 1 
##$CPDPRG= <waltz16>
##$CPDPRG1= <>
##$CPDPRG2= <waltz16>
##$CPDPRG3= <>
##$CPDPRG4= <mlev>
##$CPDPRG5= <mlev>
##$CPDPRG6= <mlev>
##$CPDPRG7= <mlev>
##$CPDPRG8= <mlev>
##$CPDPRGB= <>
##$CPDPRGT= <>
##$D= (0..31)
0 1 0 0 0 0 0 0 0 0.06 0 0.03 2e-05 3e-06 0 0 0.0002 0 0 0 0 0 0 0 0 0 
0 0 0 0 0 0 
##$DATE= 1769755322
##$DBL= (0..7)
120 120 120 11 120 120 24 19 
##$DBP= (0..7)
150 150 150 150 150 150 150 150 
##$DBP07= 0
##$DBPNAM0= <>
##$DBPNAM1= <>
##$DBPNAM2= <>
##$DBPNAM3= <>
##$DBPNAM4= <>
##$DBPNAM5= <>
##$DBPNAM6= <>
##$DBPNAM7= <>
##$DBPOAL= (0..7)
0.5 0.5 0.5 0.5 0.5 0.5 0.5 0.5 
##$DBPOFFS= (0..7)
0 0 0 0 0 0 0 0 
##$DE= 6
##$DECBNUC= <off>
##$DECIM= 4
##$DECNUC= <off>
##$DECSTAT= 4
##$DIGMOD= 1
##$DIGTYP= 9
##$DL= (0..7)
0 0 52 120 120 21 21 25 
##$DP= (0..7)
150 150 150 150 150 150 150 150 
##$DP07= 0
##$DPNAME0= <>
##$DPNAME1= <>
##$DPNAME2= <>
##$DPNAME3= <>
##$DPNAME4= <>
##$DPNAME5= <>
##$DPNAME6= <>
##$DPNAME7= <>
##$DPOAL= (0..7)
0.5 0.5 0.5 0.5 0.5 0.5 0.5 0.5 
##$DPOFFS= (0..7)
0 0 0 0 0 0 0 0 
$$ [...]
##$SUBNAM1= <"">
##$SUBNAM2= <"">
##$SUBNAM3= <"">
##$SUBNAM4= <"">
##$SUBNAM5= <"">
##$SUBNAM6= <"">
##$SUBNAM7= <"">
##$SUBNAM8= <"">
##$SUBNAM9= <"">
##$SW= 400.765351723535
##$SWIBOX= (0..15)
0 1 3 0 0 0 0 0 0 0 0 0 0 0 0 0 
##$SW_h= 32467.5324675325
##$TD= 32768
##$TD0= 1
##$TE= 0
##$TE2= 300
##$TE3= 300
##$TEG= 300
##$TL= (0..7)
0 120 53 12 22 120 120 120 
##$TP= (0..7)
150 150 150 150 150 150 150 150 
##$TP07= 0
##$TPNAME0= <>
##$TPNAME1= <>
##$TPNAME2= <>
##$TPNAME3= <>
##$TPNAME4= <>
##$TPNAME5= <>
##$TPNAME6= <>
##$TPNAME7= <>
##$TPOAL= (0..7)
0.5 0.5 0.5 0.5 0.5 0.5 0.5 0.5 
##$TPOFFS= (0..7)
0 0 0 0 0 0 0 0 
##$TUNHIN= 0
##$TUNHOUT= 0
##$TUNXOUT= 0
##$USERA1= <user>
##$USERA2= <user>
##$USERA3= <user>
##$USERA4= <user>
##$USERA5= <user>
##$V9= 5
##$VALIST= <valist>
##$VCLIST= <CCCCCCCCCCCCCCC>
##$VD= 0
##$VDLIST= <DDDDDDDDDDDDDDD>
##$VPLIST= <PPPPPPPPPPPPPPP>
##$VTLIST= <TTTTTTTTTTTTTTT>
##$WBST= 1024
##$WBSW= 4
##$XGAIN= (0..3)
0 0 0 0 
##$XL= 0
##$YL= 0
##$YMAX_a= 859
##$YMIN_a= -723
##$ZGOPTNS= <>
##$ZL1= 120
##$ZL2= 120
##$ZL3= 120
##$ZL4= 120
##$ABSF1= 60
##$ABSF2= -190
##$ABSG= 5
##$ABSL= 3
##$ALPHA= 0
##$AQORDER= 0
##$ASSFAC= 0
##$ASSFACI= 0
##$ASSFACX= 0
##$ASSWID= 0
##$AUNMP= <proc_1d>
##$AZFE= 0.1
##$AZFW= 0.5
##$BCFW= 1
##$BC_mod= 2
##$BYTORDP= 1
##$COROFFS= 0
##$CY= 9.86611175537109
##$DATMOD= 1
##$DC= 1
##$DFILT= <>
##$DTYPP= 0
##$F1P= 182.462994727601
##$F2P= 168.069089081705
##$FCOR= 0.5
##$FTSIZE= 0
##$FT_mod= 0
##$GAMMA= 1
##$GB= 0
##$INTBC= 1
##$INTSCL= 1
##$ISEN= 30
##$LB= 1.5
##$LEV0= 0
##$LPBIN= 0
##$MAXI= 11.51145
##$MC2= 0
##$MEAN= 0
##$ME_mod= 0
##$MI= 1.244541
##$NCOEF= 0
##$NC_proc= 0
##$NLEV= 6
##$NOISF1= 0
##$NOISF2= 0
##$NSP= 1
##$NTH_PI= 0
##$NZP= 1
##$OFFSET= 243.8632
##$PC= 1.4
##$PHC0= 1672.209
##$PHC1= -1.240479
##$PH_mod= 0
##$PKNL= yes
##$PPARMOD= 0
##$PSCAL= 0
##$PSIGN= 0
##$REVERSE= no
##$SF= 81.0140731611343
##$SI= 65536
##$SIGF1= 0
##$SIGF2= 0
##$SINO= 80
##$SIOLD= 65536
##$SREGLST= <31P.CDCl3>
##$SSB= 0
##$STSI= 0
##$STSR= 0
##$SW_p= 25641.0256410257
##$SYMM= 0
##$S_DEV= 0
##$TDeff= 0
##$TDoff= 0
##$TI= <>
##$TILT= no
##$TM1= 0
##$TM2= 0
##$TOPLEV= 0
##$USERP1= <user>
##$USERP2= <user>
##$USERP3= <user>
##$USERP4= <user>
##$USERP5= <user>
##$WDW= 1
##$XDIM= 64
##$YMAX_p= 0
##$YMIN_p= 0
$$ End of Bruker specific parameters
$$ ---------------------------------
##NTUPLES= NMR FID
##VAR_NAME=  TIME,          FID/REAL,        FID/IMAG
##SYMBOL=    X,             R,               I
##VAR_TYPE=  INDEPENDENT,   DEPENDENT,       DEPENDENT
##VAR_FORM=  AFFN,          ASDF,            ASDF
##VAR_DIM=   16384,         16384,           16384
##UNITS=     SECONDS,       ARBITRARY UNITS, ARBITRARY UNITS
##FACTOR=    3.08e-05,      1,               1
##FIRST=     0,             0,               0
##LAST=      0.5045964,     0,               0
##MIN=       0,             -723,            0
##MAX=       0.5045964,     859,             0
$$ Real data points
##PAGE= N=1
##DATA TABLE= (X++(R..R)), XYDATA
$$ plain form
0 0 0 0 0 0 0 0 0 0 0 0 0 0 0 0 0 0 0 0 0 0 0 0 0 0 0 0 0 0 0 0 0 0 0 0 0 0 0 0 0 0 0 0 0 0 0 0 0 0 0 0 0 0 0 0 2 -2 6 -5 6 -6 9
61 9 -14 19 -24 34 -62 -454 859 643 439 162 -75 -208 -95 -22 113 254 358 312 223 -46 -294 -496 -687 -707
85 -707 -600 -448 -227 -34 146 120 69 -123 -246 -357 -428 -365 -189 103 335 565 645 626 540 304 132 -35 -54
108 -54 -38 99 296 410 515 456 303 77 -129 -432 -522 -559 -544 -420 -251 -68 28 48 2 -180 -367 -547 -581 -532
132 -532 -349 -83 198 404 490 561 435 265 121 7 -78 1 205 317 467 643 613 489 314 86 -186 -358
154 -358 -403 -334 -247 -49 51 84 113 -45 -229 -403 -582 -678 -629 -472 -241 47 250 294 321 248 104 -58 -121 -136
178 -136 -12 128 347 577 696 717 601 387 175 -71 -215 -228 -210 -97 114 166 236 156 12 -225 -457 -601
200 -601 -680 -667 -578 -325 -141 55 189 170 87 -65 -243 -282 -303 -130 6 285 522 624 698 635 474 237 68
$$ packed form
0@%%%%%%%%%%%%%%%%%%%%%%%%%%%%%%%%%%%%%%%%%%%%%%%%%%%%%%KmQj1J1j2J5
61Ik3L3m3N8r6l92J313k16k04k77k37j33J13P3J35J41J04m6q9k69k48k02j91k0
85g07J07J52K21J93J80k6n1j92j23j11p1O3J76K92K32K30Q0j9q6k36j72j67j9
108e4J6J37J97J14J05n9j53k26k06l03r0l7J5J24J69J83R6K0m6j82j87j80l4M9
132e32J83K66K81K06Q6P1j26j70j44j14q5P9K04J12J50J76l0j24j75k28k72j72
154c58m5O9Q7J98J00L3K9j58j84j74j79r6M9J57K31K88K03M4K7p3j44j62o3j5
178a36J24J40K19K30J19K1j16k14k12k46j44j3J8J13K11N2P0q0j44k37k32j44
200f01p9J3Q9K53J84J96J34j9q3j52j78l9k1J73J36K79K37J02P4o3j61k37j69
$$ plain form
223 68 -106 -103 -50 82 226 348 412 301 174 -32 -335 -497 -604 -646 -539 -365 -184 -7 94 60 -88 -183 -376
246 -376 -436 -457 -309 -97 114 414 540 599 547 431 217 76 -68 -52 54 222 369 546 585 497 351 51 -210
269 -210 -415 -531 -543 -367 -351 -129 -11 49 -27 -178 -329 -519 -599 -632 -537 -296 -87 169 329 382 371 233 84
292 84 -55 -106 -70 50 223 433 588 599 583 440 230 -10 -156 -348 -347 -228 -138 30 78 114 96 -135 -343 -525
316 -525 -651 -681 -572 -454 -203 59 219 222 215 118 -51 -128 -185 -120 3 211 411 579 721 656 598 336 142 -8
340 -8 -124 -148 -87 86 185 288 229 112 -70 -257 -469 -642 -681 -616 -451 -200 -61 34 112 72 -110 -167 -290 -428
364 -428 -338 -196 25 284 478 622 566 559 372 158 28 -38 -65 63 170 374 495 412 324 96 -116 -364 -534
387 -534 -561 -572 -458 -275 -118 -12 16 -89 -217 -322 -450 -504 -428 -307 -109 102 330 462 524 408 318 158 15
$$ packed form
223F8j74LN3J32J44J22O4j11j27k06l03j62j07m2J07J74J81J77J01l4j48r5j93
246c76o0k1J48K12K11L00J26N9n2j16k14j41j44J6J06J68J47J77L9q8j46l00k61
269b10k05j16j2J76J6K22J18O0p6j51j51j90q0l3R5K41K09K56J60N3j1j38j49
292H4j39n1L6J20J73K10J55J1j6j43k10k40j46j92JJ19R0J68M8L6j8k31k08j82
316e25j26l0J09J18K51K62J60Lpr7j69p7n7O5J23K08K00J68J42o5n8k62j94j50
340hj16k4O1J73R9J03n9j17j82j87k12j73l9O5J65K51J39R5P8m0j82n7j23j38
364d28R0J42K21K59J94J44n6pj87k14j30o6k7J28J07K04J21q3q8k28k12k48j70
387e34k7j1J14J83J57J06K8j05j28j05j28n4P6J21J98K11K28J32O2j16r0j60j43
$$ plain form
410 15 -4 61 156 299 488 551 573 477 308 57 -158 -321 -352 -350 -240 -134 -26 51 45 -51 -208 -400 -542 -654 -589
435 -589 -443 -233 -30 162 278 339 241 108 -29 -110 -101 -44 106 334 498 622 648 564 384 149 -15 -199 -185
458 -185 -213 -114 28 145 174 127 -25 -256 -426 -507 -614 -626 -586 -320 -169 29 129 143 92 -73 -117 -253 -230 -120
482 -120 6 257 445 636 697 625 462 297 125 1 -30 -23 68 237 328 341 285 185 -59 -268 -464 -574 -565 -497
506 -497 -281 -188 -29 59 32 -55 -196 -315 -355 -368 -290 -116 97 337 476 531 531 408 294 141 13 -4 113 173
530 173 305 444 502 416 276 91 -136 -322 -444 -487 -395 -348 -164 -75 -20 -70 -168 -337 -429 -528 -596 -426 -309 -64
554 -64 114 254 368 388 256 120 27 -29 -29 78 211 432 498 591 597 428 241 25 -140 -247 -294 -240 -163 -50 70
579 70 113 54 -122 -267 -396 -567 -615 -524 -398 -227 -2 146 231 214 162 7 -79 -115 -97 -7 176 362 493 610
$$ packed form
410A5j9O5R5J43J89O3K2r6j69k51k15j63l1KJ10J06J08P7or6j57j92j42j12O5
435e89J46K10K03J92J16O1r8j33j37q1RN7J50K28J64J24K6q4j80k35j64j84J4
458a85k8R9J42J17K9m7j52k31j70q1j07j2M0K66J51J98J00J4n1j65m4j36K3J10
482a20J26K51J88J91O1p2j63j65j72j24l1PR1J69R1J3n6j00k44k09j96j10RO8
506d97K16R3J59Q8k7q7j41j19m0j3P8J74K13K40J39N5%j23j14j53j28j7J17O0
530A73J32J39N8q6j40j85k27j86j22m3R2M7J84Q9N5n0r8j69r2r9o8J70J17K45
554f4J78J40J14K0j32j36r3n6%J07J33K21O6R3Oj69j87k16j65j07m7N4P7J13J20
579G0M3n9j76j45j29j71m8R1J26J71K25J48Q5j7n2j55q6l6J8R0J83J86J31J17
$$ plain form
603 610 605 532 366 195 1 -102 -122 -56 7 67 164 195 123 -68 -246 -425 -556 -601 -573 -465 -283 -78 5 43 34 -81
629 -81 -151 -290 -316 -332 -143 83 278 408 511 513 433 378 230 101 24 -44 86 140 269 340 377 292 124 -72 -269
654 -269 -413 -494 -487 -395 -278 -97 -93 -36 -86 -104 -260 -406 -441 -433 -230 -104 90 300 380 441 394 277 236 72 49 37
680 37 132 321 381 494 568 430 273 63 -82 -259 -365 -349 -288 -212 -64 6 15 -93 -208 -386 -485 -540 -535 -420 -262
705 -262 -92 60 248 244 223 97 57 -58 -89 -19 94 272 387 484 525 480 362 159 -16 -133 -163 -221 -146 -66 69
730 69 95 13 -29 -192 -397 -498 -592 -574 -562 -327 -164 12 93 129 97 -21 -46 -152 -135 -81 39 179 381 511 531
755 531 585 507 315 168 42 8 -11 84 152 232 260 212 127 -44 -156 -376 -523 -481 -477 -406 -239 -80 -52 -24 -81 -193
781 -193 -238 -305 -300 -264 -108 89 303 335 434 477 393 255 127 108 37 57 146 199 341 396 348 229 65 -160 -218 -386
$$ packed form
603F10np3j66j71j94j03k0O6O3O0R7L1p2j91j78j79j31m5K8J08J82K05Q3L8rj15
629h1p0j39k6j6J89K26J95J30J03Kq0n5j48j29p7o8J30N4J29P1L7q5j68j96j97
654b69j44q1PR2J17J81MN7n0j8j56j46l5QK03J26J94K10Q0O1m7j17m1j64k3j2
680C7R5J89O0J13P4j38j57k10j45j77j06J6O1P6J48P0Rj08j15j78r9n5NJ15J58
705b62J70J52J88mk1j26m0j15l1P0J13J78J15R7M1m5j18k03j75j17l0n8P5Q0J35
730F9K6q2m2j63k05j01r4J8J2K35J63J76Q1L6l2j18k5j06J7N4J20J40K02J30K0
755E31N4p8j92j47j26l4j9R5O8Q0K8m8q5j71j12k20j47M2MP1J67J59K8K8n7j12
781a93m5o7NL6J56J97K14L2R9M3q4j38j28j9p1K0Q9N3J42N5m8j19j64k25n8j68
$$ plain form
807 -386 -457 -432 -370 -238 -119 -42 -56 -148 -268 -353 -482 -484 -352 -295 -102 69 175 332 308 260 191 99 35 76 84 176 360
834 360 442 517 508 336 284 113 -70 -194 -195 -252 -181 -46 -19 43 -54 -114 -236 -362 -501 -525 -439 -372 -234 -53 99 180
860 180 207 131 45 -11 -101 -44 62 127 309 427 524 512 482 313 169 33 -106 -44 -32 -14 58 148 123 65 -20 -195
886 -195 -286 -435 -548 -467 -451 -318 -164 -87 34 18 -16 -38 -188 -220 -210 -106 77 222 328 413 489 405 338 258 157
911 157 110 67 76 126 208 296 289 224 67 -33 -203 -296 -421 -419 -375 -272 -158 -93 -111 -144 -138 -169 -322 -312 -283 -201 -66 78
939 78 275 330 360 398 335 200 125 102 102 183 234 308 344 414 324 279 99 -42 -243 -262 -298 -262 -270 -145 -129 -114 -123 -221 -307
968 -307 -384 -448 -443 -349 -288 -140 -7 152 203 200 180 86 41 27 41 109 226 317 405 427 382 355 209 81 -33 -128 -132 -137 -77
997 -77 -26 38 0 -23 -226 -211 -399 -467 -469 -402 -350 -282 -84 -28 18 48 37 -29 -27 -40 14 79 151 308 425 437 463 417 320
$$ packed form
807c86p1K5O2J32J19P7j4r2j20q5j29kJ32N7J93J71J06J57k4m8o9r2o4M1QR2J84
834C60Q2P5rj72n2j71j83j24jn7P1J35K7O2r7o0j22j26j39k4Q6O7J38J81J52Q1
860A80K7p6q6n6r0N7J06O5J82J18R7j2l0j69j44j36j39O2J2J8P2R0k5n8q5j75
886a95r1j49j13Q1J6J33J54P7J21j6l4k2j50l2J0J04J83J45J06Q5P6q4o7q0j01
911A57m7m3RN0Q2Q8po5j57j00j70r3j25KM4J03J14O5j8l3Ol1j53J0K9Q2J35J44
939G8J97N5L0L8o3j35p5k3%Q1N1P4L6P0r0m5j80j41k01j9l6L6qJ25J6J5rr8q6
968c07p7o4NR4O1J48J33J59N1lk0r4m5j4J4O8J17R1Q8K2m5k7j46j28j14r5mnO0
997g7N1O4l8k3k03J5j88o8kO7N2O8J98N6M6L0j1o6Kj3N4O5P2J57J17J2K6m6r7
$$ plain form
1026 320 213 147 27 7 13 74 105 159 87 14 -33 -184 -305 -380 -437 -400 -362 -254 -165 -100 -84 -102 -104 -207 -207 -193 -184 -58
1054 -58 1 156 321 392 395 340 291 221 65 98 135 115 208 205 267 194 192 94 -101 -157 -271 -324 -336 -330 -212 -194 -126 -142 -144 -208
1084 -208 -251 -348 -322 -308 -223 -108 15 88 195 291 281 269 206 125 113 158 188 305 342 333 347 306 254 133 15 -118 -158
1111 -158 -240 -165 -178 -147 -128 -131 -176 -259 -288 -345 -422 -390 -376 -229 -112 -22 78 127 74 78 57 53 45 108 135 225 272 357 334 381
1141 381 300 229 161 6 -4 -53 -58 -49 -21 2 -48 -106 -167 -263 -324 -420 -454 -393 -357 -316 -164 -72 -92 -36 -52 -46 -100 -50 -1 47
1171 47 141 259 314 352 374 331 279 188 153 89 122 88 108 70 130 94 48 -31 -150 -236 -352 -331 -366 -320 -235 -229 -148 -143 -155 -155
1201 -155 -205 -232 -199 -167 -62 50 88 211 290 275 311 273 269 187 179 191 155 212 203 231 262 183 111 -29 -130 -219 -249 -320 -248
1230 -248 -250 -243 -209 -221 -246 -284 -321 -335 -347 -310 -224 -184 -36 43 126 204 189 171 189 152 117 183 179 249 291 312 336 308 239 143 84
$$ packed form
1026C20j07o6j20k0OO1L1N4p2p3m7j51j21p5n7L7L8J08Q9O5J6j8kj03%J4RJ26
1054e8N9J55J65P1Ln5m9p0j56L3L7k0R3lO2p3kr8j95n6j14n3j2OJ18J8O8j6ko4
1084b08m3r7K6J4Q5J15J23P3J07R6j0j2o3q1j2M5L0J17L7rJ4m1n2j21j18j33m0
1111a58q2P5j3L1J9lm5q3k9n7p7L2J4J47J17R0J00M9n3Mk1mqO3K7R0M7Q5k3M7
1141C81q1p1o8j55j0m9nRK8K3n0n8o1r6o1r6l4O1L6M1J52R2k0N6j6On4N0M9M8
1171D7R4J18N5L8K2m3n2r1l5o4L3l4K0l8O0l6m6p9j19q6j16K1l5M6Q5OQ1Nj2%
1201a55n0k7L3L2J05J12L8J23P9j5L6l8mq2qJ2l6N7rK8L1p9p2j40j01q9l0p1P2
1230b48kPL4j2k5l8l7j4j2L7Q6M0J48P9Q3P8j5j8J8l7l5O6mP0M2K1K4k8o9r6n9
$$ plain form
1261 84 1 -84 -52 -166 -131 -108 -118 -62 -126 -214 -287 -343 -338 -312 -306 -250 -134 -59 4 26 65 82 77 87 83 126 169 258 349 317 380
1292 380 328 327 283 196 138 71 68 52 35 85 58 -24 -52 -132 -191 -266 -329 -349 -392 -345 -237 -213 -131 -109 -109 -69 -73 -85 -110 -33 -3
1323 -3 91 119 268 295 315 334 295 236 200 161 179 113 132 173 149 146 72 24 -74 -146 -218 -293 -287 -338 -263 -198 -191 -161 -193 -184 -156 -199
1355 -199 -149 -163 -98 -90 82 167 217 281 287 307 243 215 190 193 199 212 268 244 231 236 143 96 -46 -101 -148 -195 -205 -202 -204 -186 -202 -227
1387 -227 -248 -214 -286 -277 -264 -237 -253 -83 -44 42 131 143 130 127 117 120 126 157 173 284 273 360 306 291 208 160 27 -38 -54 -89
1417 -89 -65 -113 -109 -123 -133 -182 -235 -265 -306 -368 -316 -300 -239 -152 -39 0 43 18 34 -3 54 71 112 158 191 263 342 336 363 333 257
1448 257 163 153 61 12 36 33 24 14 -28 -59 -110 -218 -261 -303 -336 -314 -324 -223 -186 -136 -122 -74 -54 -90 -111 -105 -26 4 124 157
1478 157 306 319 303 280 297 241 152 151 78 118 136 134 157 104 60 -11 -132 -202 -273 -314 -303 -278 -245 -237 -195 -127 -207 -235 -182 -223
$$ packed form
1261H4q3q5L2j14L5K3j0N6o4q8p3n6NK6ON6J16P5O3K2L9J7nJ0mM3M3Q9R1l2O3
1292C80n2jm4q7n8o7lj6j7N0k7q2k8q0n9p5o3k0m3M7J08K4Q2K2%M0mj2k5P7L0
1323cR4K8J49K7K0J9l9n9l6l9J8o6J9M1k4lp4m8r8p2p2p5On1P5O5PL0l2RK8m3
1355a99N0j4O5QJ72Q5N0O4OK0o4k8k5LOJ3N6k4j3Nr3m7j42n5m7m7j0LkJ8j6k5
1387b27k1L4p2RJ3K7j6J70L9Q6Q9J2j3lj0LOL1J6J11j1Q7n4j5q3m8j33o5j6l5
1417h9K4m8Mj4j0m9n3l0m1o2N2J6O1Q7J13L9M3k5J6l7N7J7M1M6L3P2P9oK7l0p6
1448B57r4j0r2m9K4lrj0m2l1n1j08m3m2l3K2j0J01L7N0J4M8K0l6k1OP9L0J20L3
1478A57J49J3j6k3J7n6q9jp3M0J8kK3n3m4p1j21p0p1m1J1K5L3QM2O8q0k8N3m1
$$ plain form
1508 -223 -187 -176 -102 -19 83 155 173 243 220 220 198 165 172 151 221 208 280 239 240 190 164 53 -40 -70 -180 -153 -196 -189 -157 -173
1538 -173 -171 -203 -226 -266 -272 -324 -306 -210 -175 -89 -14 52 125 136 159 169 143 66 155 105 191 281 299 340 364 272 239 122 -6 -17
1568 -17 -60 -102 -141 -152 -108 -60 -151 -211 -265 -271 -387 -375 -329 -303 -248 -168 -54 -6 -34 -7 -5 -8 -47 20 74 162 222 325 376 357
1598 357 338 257 199 112 123 67 39 26 57 96 49 -4 -82 -159 -202 -327 -333 -349 -308 -257 -204 -184 -124 -90 -77 -135 -125 -94 -103 -21
1628 -21 49 96 229 306 356 312 369 258 207 174 110 132 146 185 192 169 142 71 34 -134 -203 -283 -290 -331 -291 -237 -153 -132 -173 -168
1658 -168 -189 -248 -334 -251 -210 -121 -37 68 226 261 237 261 177 165 128 147 108 178 292 287 314 278 185 163 51 -50 -177
1685 -177 -216 -180 -152 -111 -80 -141 -96 -212 -223 -265 -316 -323 -307 -261 -123 -57 45 97 67 115 125 134 80 129 133 212 265 323 377 409
1715 409 332 250 159 73 53 -23 -70 -43 -25 -19 -55 -2 -122 -139 -266 -358 -353 -370 -300 -266 -53 -91 -45 -21 11 -46 -89 -74 -41
$$ packed form
1508b23L6J1P4Q3J02P2J8P0k3%k2l3Pk1P0j3P2m1Jn0k6j11r3l0j10K7m3PL2j6
1538a73Kl2k3m0on2J8R6L5Q6P5O6P3J1K3J0k6p7Q9n0Q6R0J8M1K4r2l3j17j28j1
1568a7m3m2l9j1M4M8r1o0n4oj16J2M6K6N5Q0J14M8k8K7Kll9O7N4Q8O0J03N1j9
1598C57j9q1n8q7J1n6k8j3L1L9m7n3p8p7m3j25oj6M1N1N3K0O0L4J3n8J0L1rQ2
1628b1P0M7J33P7N0m4N7j11n1l3o4K2J4L9Pk3k7p1l7j68o9q0pm1M0N4Q4K1m1N
1658a68k1n9q6Q3M1Q9Q4J05J58L5k4K4q4j2l7J9l9P0J14nK7l6r3k2j12j01j27
1685a77l9L6K8M1L1o1M5j16j1m2n1pJ6M6J38O6J02N2l0M8J0Rn4M9MP9N3N8N4L2
1715D09p7q2r1q6k0p6m7K7J8Ol6N3j20j7j27r2Nj7P0L4K13l8M6K4L2n7m3J5L3
$$ plain form
1744 -41 20 104 194 282 374 415 390 289 219 125 50 18 25 50 122 89 125 77 24 -108 -231 -267 -382 -401 -379 -289 -147 -145 -82
1773 -82 -82 -101 -176 -143 -155 -174 -112 -5 76 163 336 310 352 268 256 174 156 93 151 161 268 323 268 241 135 29 -80 -185
1801 -185 -296 -272 -286 -222 -218 -143 -87 -81 -183 -209 -280 -320 -293 -275 -136 -42 98 130 197 256 179 172 69 107 110 141 187 228 321
1830 321 329 307 262 161 33 -91 -177 -263 -187 -180 -86 -65 -34 -120 -216 -256 -339 -399 -410 -411 -280 -180 -107 6 100 162 80 46
1858 46 3 -19 -27 45 161 257 349 390 424 388 185 138 69 24 -62 -115 11 48 50 61 6 -46 -157 -232 -349 -400 -387 -268
1886 -268 -191 -103 -56 0 25 -37 -77 -125 -140 -94 -42 52 166 309 376 381 355 266 165 129 -19 33 -12 105 103 194 180 99
1914 99 61 -126 -172 -313 -331 -361 -293 -275 -200 -80 -79 -108 -141 -227 -268 -241 -249 -206 -80 74 214 272 327 275 232 197 117 68
1942 68 30 135 204 259 301 299 278 162 52 -64 -142 -260 -291 -254 -165 -122 -115 -15 -85 -146 -279 -332 -355 -342 -265 -189 -25
$$ packed form
1744d1O1Q4R0Q8R2M1k5j01p0r4p5l2PK5P2l3L6m8n3j32j23l6j15j9K2R0J42KO3
1773h2%j9p5L3j2j9O2J07Q1Q7J73k6M2q4j2q2j8o3N8J0J07N5n5k7j06j06j09j05
1801a85j11K4j4O4MP5N6Oj02k6p1m0K7J8J39R4J40L2O7N9p7pj03L8LL1M6M1R3
1830C21Qk2m5j01j28j24q6q6P6PR4K1L1q6r6m0q3o0j1jJ31J00P3J13R4O2q2l4
1858D6m3k2qP2J16R6R2M1L4l6k03m7o9m5q6n3J26L7KJ1n5n2j11p5j17n1J3J19
1886b68P7Q8M7N6K5o2m0m8j5M6N2R4J14J43O7Nk6q9j01l6j48N2m5J17kR1j4q1
1914I9l8j87m6j41j8l0O8J8P5J20Jk9l3q6m1K7qM3J26J54J40N8N5n2m3l5q0m9
1942F8l8J05O9N5M2kk1j16j10j16p8j18l1L7Q9M3PJ00p0o1j33n3k3J3P7P6J64
$$ plain form
1969 -25 129 168 211 222 180 113 78 15 54 103 217 264 368 419 370 297 150 -7 -70 -162 -100 -154 -89 -46 -13 5 -62 -116
1997 -116 -279 -293 -392 -424 -377 -308 -190 -104 68 82 50 -4 25 -67 -126 -64 59 160 258 335 439 422 352 203 164 12
2023 12 -42 -17 -14 64 117 143 132 77 -29 -210 -280 -409 -415 -340 -295 -202 -93 23 70 32 -87 -129 -205 -175 -178 -85 74 224
2051 224 332 384 400 384 306 147 69 -3 53 131 197 280 288 299 212 64 -3 -223 -291 -370 -306 -210 -183 -50 10 8 -111 -196
2079 -196 -252 -295 -317 -302 -187 -81 139 185 272 311 245 204 63 5 -1 42 120 193 278 376 407 293 162 -2 -138 -206
2105 -206 -253 -290 -224 -137 -75 -10 -2 -39 -191 -314 -375 -431 -412 -292 -207 -29 98 213 191 159 96 -18 6 -35 -26 111 263
2132 263 377 422 449 378 305 189 43 -119 -118 -110 -69 19 97 118 85 -11 -126 -233 -380 -459 -458 -388 -238 -168 -29 52 91
2159 91 86 -64 -129 -186 -178 -96 60 197 332 399 443 398 300 193 97 10 -45 -16 101 101 192 246 212 127 -84 -199 -321
$$ packed form
1969b5J54L9M3J1m2o7l5o3L9M9J14M7J04N1m9p3j47j57o3r2O2n4O5M3L3J8o7n4
1997a16j63j4r9l2M7O9J18Q6J72J4l2n4K9r2n9O2J23J01R8P7J04j7p0j49l9j52
2023A2n4K5LP8N3K6j1n5j06j81p0j29oP5M5R3J09J16M7l8j19m2p6L0lR3J59J50
2051B24J08N2J6j6p8j59p8p2N6P8O6Q3QJ1q7j48o7k20o8p9O4R6K7J33O0kj19q5
2079a96n6m3k2J5J15J06K20M6Q7L9o6m1j41n8oM3P8P3Q5R8L1j14j31j64j36o8
2105b06m7l7O6Q7O2O5Ql7j52j23o1n6J9J20Q5J78J27J15k2l2o3j14K4m1RJ37J52
2132B63J14M5K7p1p3j16j46j62JQM1Q8P8K1l3r6j15j07j47p9JP0J50P0J39Q1L9
2159I1nj50o5n7QQ2J56J37J35O7M4m5r8j07r6q7n5K9J17%R1N4l4q5k11j15j22
$$ plain form
2186 -321 -395 -430 -341 -280 -135 -49 -12 34 -141 -140 -258 -306 -294 -251 -85 27 210 359 379 407 312 208 49 14 -27 40
2212 40 137 230 298 375 323 205 62 -49 -169 -318 -317 -268 -242 -131 -52 37 -35 -79 -194 -347 -375 -411 -332 -238 -66 110
2238 110 242 227 258 180 110 49 -38 -33 37 149 271 387 438 410 317 172 57 -133 -180 -237 -252 -174 -23 36 85 -5
2264 -5 -104 -265 -311 -420 -519 -397 -342 -141 -37 92 123 106 56 -42 -123 -165 -117 -32 128 275 373 495 433 395 215 76
2290 76 9 -99 -106 -103 33 69 209 191 106 -55 -168 -290 -408 -466 -437 -361 -228 -82 30 52 54 24 -151 -187 -278 -225
2316 -225 -104 24 233 340 392 508 388 230 184 44 -33 -63 35 150 228 312 303 227 116 -39 -217 -369 -425 -346
2340 -346 -348 -214 -106 12 33 -86 -90 -212 -311 -361 -327 -235 -131 7 218 328 359 290 245 49 21 -59 7 44 162
2365 162 265 357 413 295 249 60 -124 -224 -319 -256 -247 -99 -1 37 37 -4 -159 -259 -351 -423 -373 -302 -205 -18 138 248
$$ packed form
2186c21p4l5Q9O1J45Q6L7M6j75Jj18m8J2M3J66J12J83J49K0K8r5j04j59l5m1O7
2212D0R7R3O8P7n2j18j43j11j20j49JM9K6J11P9Q9p2m4j15j53k8l6P9R4J72J76
2238A10J32j5L1p8p0o1q7NP0J12J22J16N1k8r3j45j15j90m7n7j5P8J51N9M9r0
2264er9j61m6j09r9J22N5K01J04J29L1j7n0r8q1m2M8Q5J60J47R8J22o2l8j80j39
2290G6o7j08pLJ36L6J40j8q5j61j13j22j18n8K9P6J33J46J12K2Kl0j75l6r1N3
2316b25J21J28K09J07N2J16j20j58m6j40p7l0R8J15P8Q4rp6j11j55j78j52n6P9
2340c46kJ34J08J18K1j19mj22r9n0L4R2J04J38K11J10L1o9m5j96k8q0O6L7J18
2365A62J03R2N6j18m6j89j84j00r5O3RJ48R8L8%m1j55j00r2p2N0P1R7J87J56J10
$$ plain form
2391 248 221 252 149 2 -36 -32 -13 53 246 317 404 513 439 383 189 53 -85 -120 -178 -115 -32 100 137 115 52 -101
2417 -101 -209 -361 -429 -436 -396 -261 -105 14 139 165 83 14 -71 -142 -206 -169 37 148 277 433 446 458 398 248 44
2442 44 -23 -86 -71 -13 110 237 274 219 96 -7 -190 -304 -418 -454 -370 -289 -142 22 46 43 -35 -69 -194 -252 -316 -283
2468 -283 -83 63 202 353 409 364 327 218 68 -14 -20 7 96 185 316 403 319 244 145 -57 -232 -334 -318 -348 -227
2493 -227 -161 -14 47 10 -44 -166 -313 -354 -384 -369 -241 -117 80 251 333 250 235 162 35 -81 -77 2 130 232 338
2518 338 429 415 326 157 23 -104 -215 -265 -214 -125 -49 55 110 46 -39 -210 -283 -410 -462 -444 -345 -178 -48 113 149
2543 149 187 90 -8 -58 -153 -155 -58 67 226 402 481 484 459 311 156 -22 -111 -114 -109 -19 36 163 176 139 72 -90 -264
2570 -264 -385 -451 -498 -356 -199 -95 99 96 116 26 -89 -197 -243 -193 -134 35 168 308 439 421 389 262 161 33
$$ packed form
2391B48k7L1j03j47l8MJ9O6J93P1Q7J09p4n6j94j36j38l5n8O3Q3J32L7k2o3j53
2417a01j08j52o8pM0J35J56J19J25K6q2o9q5p1o4L7K06J11J29J56J3J2o0j50k04
2442D4o7o3J5N8J23J27L7n5j23j03j83j14j14l6Q4Q1J47J64K4lp8l4j25n8o4L3
2468b83K00J46J39J51N6m5l7j09j50q2oK7Q9Q9J31Q7q4p5r9k02j75j02J6l0J21
2493b27O6J47O1l7n4j22j47m1l0J5J28J24J97J71Q2q3j5p3j27j16MP9J28J02J06
2518C38R1j4q9j69j34j27j11n0N1Q9P6J04N5o4q5j71p3j27n2J8R9J67J30J61L6
2543A49L8r7r8n0r5kR7J25J59J76P9Lk5j48j55j78q9lNR0N5J27J3l7o7j62j74
2570b64j21o6m7J42J57J04J94lK0r0j15j08m6N0N9J69J33J40J31j8l2j27j01j28
$$ plain form
2594 33 -35 -62 17 51 200 273 289 269 141 2 -230 -284 -466 -380 -339 -227 -79 11 50 -16 -65 -220 -324 -352 -327 -239
2620 -239 -132 52 161 341 348 345 215 106 -23 -76 -34 38 155 242 340 447 352 299 101 -52 -217 -306 -273 -254 -130
2645 -130 -11 55 31 -1 -72 -240 -361 -438 -450 -367 -195 -79 146 209 235 240 117 40 -58 -85 -74 69 142 281 449
2670 449 470 488 367 159 36 -113 -205 -216 -167 -17 48 106 150 50 -111 -239 -361 -453 -464 -441 -292 -151 17 106
2694 106 116 144 18 -78 -156 -216 -162 -50 93 242 412 455 415 316 203 62 -49 -144 -121 -24 77 217 149 242 121
2719 121 -1 -157 -302 -426 -488 -379 -302 -155 -43 34 71 -4 -4 -193 -257 -281 -252 -154 -3 199 333 436 429 334 224
2744 224 91 -11 -62 -47 85 164 257 334 375 262 89 -90 -181 -252 -387 -356 -227 -135 -20 60 13 15 -110 -301 -397
2769 -397 -387 -343 -209 -105 48 255 262 292 236 118 40 -69 -44 -14 54 182 321 423 376 341 174 73 -122 -257
$$ packed form
2594C3o8k7P9L4J49P3J6k0j28j39k32n4j82Q6M1J12J48R0L9o6m9j55j04k8K5Q8
2620b39J07J84J09J80Plj30j09j29n3M2P2J17Q7R8J07r5n3j98j53j65q9L3J9J24
2645a30J19O6k4l2p1j68j21p7j2Q3J72J16K25O3K6Nj23p7r8k7J1J43P3J39J68
2670D49K1J8j21k08j23j49r2j1M9J50O5N8M4j00j61j28j22r2j1K3J49J41J68Q9
2694A06J0K8j26r6p8o0N4J12J43J49J70M3m0r9j13j41j11r5K3R7J01J40o8R3j21
2719A21j22j56j45j24o2J09P7J47J12P7L7p5%j89o4k4K9R8J51K02J34J03pr5j10
2744B24j33j02n1J5J32P9R3P7M1j13j73j79r1p1j35L1J29R2J15Q0m7Kj25j91r6
2769c97J0M4J34J04J53K07PL0n6j18p8j09K5L0O8J28J39J02m7l5j67j01j95j35
$$ plain form
2793 -257 -273 -242 -138 -26 56 65 67 33 -119 -246 -403 -435 -425 -322 -182 -33 132 234 212 168 58 -54 -143 -124 -106
2818 -106 68 198 362 440 433 384 235 158 -29 -77 -183 -143 -18 48 172 216 177 45 -78 -207 -439 -431 -438 -372 -262
2843 -262 -117 57 101 69 66 -39 -164 -221 -243 -190 -38 118 258 351 465 394 299 150 -9 -65 -89 -59 50 191
2867 191 286 308 288 196 -8 -203 -266 -411 -420 -370 -288 -108 3 60 13 -73 -136 -258 -381 -300 -287 -93 31 152 367
2892 367 350 365 235 106 38 -30 -51 13 123 248 289 415 394 305 95 -33 -249 -340 -305 -252 -109 -43 46 80 48
2917 48 -33 -157 -273 -431 -407 -333 -214 -60 128 222 263 256 164 124 -54 -136 -77 66 167 263 319 497 433 314 154
2942 154 -2 -132 -173 -232 -149 -28 45 141 123 50 -74 -207 -346 -429 -495 -407 -291 -128 25 123 155 99 45 -48 -112
2967 -112 -198 -163 -11 55 262 334 401 436 348 242 67 -2 -136 -102 -25 42 216 237 306 143 48 -118 -306 -403 -408 -403
$$ packed form
2793b57j6L1J04J12Q2RKl4j52j27j57l2J0J03J40J49J65J02k2m4j10j12q9J9J8
2818a06J74J30J64P8pm9j49p7j87m8j06M0J25O6J24M4l9j32j23j29k32QpO6J10
2843b62J45J74M4l2lj05j25n7k2N3J52J56J40R3J14p1r5j49j59n6k4L0J09J41
2867A91R5K2k0r2k04j95o3j45rN0Q2J80J11N7m7q6o3j22j23Q1J3J94J24J21K15
2892C67j7J5j30j29o8o8k1O4J10J25M1J26k1q9k10j28k16r1L5N3J43O6Q9L4l2
2917D8q1j24j16j58K4P4J19J54J88R4M1pr2m0j78q2N9J43J01R6N6J78o4j19j60
2942A54j56j30m1n9Q3J21P3R6j8p3j24j33j39q3o6Q8J16J63J53R8L2n6n4r3o4
2967a12q6L5J52O6K07P2O7L5q8j06j75o9j34L4P7O7J74K1O9j63r5j66j88r7nN
$$ plain form
2993 -403 -289 -180 -34 30 94 30 -57 -149 -268 -273 -253 -147 17 180 337 366 374 332 244 97 8 -77 -3 55 111 244
3019 244 301 361 222 117 -2 -161 -345 -382 -290 -270 -113 -65 17 -19 10 -159 -253 -309 -415 -343 -254 -96 5 232
3043 232 296 280 241 159 7 -67 -80 -83 10 193 309 396 334 320 201 41 -123 -243 -213 -231 -170 -63 72 27 58 -12
3069 -12 -136 -229 -392 -406 -392 -319 -200 -65 98 231 240 100 52 -19 -85 -115 -119 85 212 338 409 373 440 269 162
3094 162 -3 -151 -177 -135 -6 8 140 164 117 18 -91 -218 -320 -380 -374 -316 -268 -52 -1 93 106 -8 -67 -132 -183 -216
3120 -216 -152 -52 107 255 303 387 382 269 139 26 -38 -53 -87 63 89 203 276 240 126 -5 -167 -297 -389 -332
3144 -332 -342 -217 -103 -35 30 6 -47 -130 -200 -279 -316 -207 -92 13 151 306 340 367 268 155 52 -68 -27 -21 71
3169 71 270 331 330 308 287 85 -17 -142 -202 -230 -258 -133 -84 49 27 27 -59 -138 -272 -351 -345 -320 -216 -10 87 167 213
$$ packed form
2993d03J14J09J46O4O4o4q7r2j19nK0J06J64J63J57K9Qm2q8j47q9q5P4N8N6J33
3019B44N7O0j39j05j19j59j84l7R2K0J57M8Q2l6K9j69r4n6j06P2Q9J58J01K27
3043B32O4j6l9q2j52p4j3lR3J83J16Q7o2j4j19j60j64j20L0j8O1J07J35m5L1p0
3069a2j24r3j63j4J4P3J19J35J63J33Rj40m8p1o6l0mK04J27J26P1l6O7j71j07
3094A62j65j48k6M2J29J4J32K4m7r9j09j27j02o0ON8M8K16N1R4J3j14n9o5n1l3
3120b16O4J00J59J48M8Q4nj13j30j13o4j5l4J50K6J14P3l6j14j31j62j30r2N7
3144c32j0J25J14O8O5k4n3q3p0p9l7J09J15J05J38J55L4K7r9j13j03j20M1OR2
3169G1J99O1jk2k1k02j02j25o0k8k8J25M9J33k2%q6p9j34p9OK5J04K06R7Q0M6
$$ plain form
3196 213 236 141 137 -26 -100 -38 -17 130 230 346 367 389 304 171 28 -34 -178 -149 -141 -78 -24 55 101 36 -45 -194 -262
3223 -262 -350 -355 -355 -219 -113 14 103 130 131 51 -24 -43 -120 -111 0 100 213 341 393 421 312 227 133 -2 -56 -36 -72
3250 -72 39 165 146 189 97 37 -63 -229 -310 -349 -317 -290 -161 -80 57 93 37 -14 -134 -162 -195 -192 -121 31 148 251
3276 251 364 395 331 186 89 38 0 4 46 84 169 264 251 173 114 19 -136 -262 -285 -285 -291 -129 -77 11 15 -2 -84 -209 -291
3305 -291 -311 -296 -229 -135 37 111 220 291 207 173 59 -7 -66 -19 38 166 234 344 342 301 162 66 -82 -97 -214 -227
3331 -227 -155 -88 -2 -19 28 -5 -79 -205 -309 -392 -356 -292 -142 -30 89 151 200 92 75 45 -9 -82 -11 76 120 257
3357 257 358 368 353 297 134 55 -40 -87 -82 -58 23 52 93 112 31 -67 -244 -295 -363 -402 -279 -183 -86 -4 40 46 35 -56 -101
3386 -101 -156 -205 -71 -39 73 184 275 325 318 242 154 53 -11 -48 -54 12 129 217 174 142 110 31 -129 -228 -302 -344 -317 -197
$$ packed form
3196B13K3r5mj63p4O2K1J47J00J16K1K2q5j33j43o2j44K9QO3N4P9M6o5q1j49o8
3223b62q8n%J36J06J27Q9K7Jq0p5j9p7RJ11J00J13J28N2K8j09q5r4j35n4K0l6
3250g2J11J26j9M3r2o0j00j66q1l9L2K7J29Q1J37L6n6n1j20k8l3LP1J52J17J03
3276B51J13L1o4j45r7n1l8MM2L8Q5R5j3p8n9r5j55j26k3%oJ62N2Q8Mj7q2j25q2
3305b91k0J5O7R4J72P4J09P1q4l4j14o6n9M7N7J28O8J10km1j39r6j48j5j17j3
3331b27P2O7Q6j7M7l3p4j26j04q3L6O4J50J12J19O2M9j08j7l0n4p3P1Q7M4J37
3357B57J01J0j5n6j63p9r5m7NK4Q1K9M1J9q1r8j77n1o8l9J23R6R7Q2M4Oj1r1m5
3386a01n5m9J34L2J12J11R1N0pp6q8j01o4l7oO6J17Q8m3l2l2p9j60r9p4m2K7J20
$$ plain form
3414 -197 -117 -34 -46 17 -38 -105 -144 -276 -235 -231 -119 28 124 195 295 299 195 120 88 16 -13 23 106 130 258 253 259 223 107
3443 107 -15 -134 -183 -242 -218 -145 -74 -36 11 34 -56 -122 -208 -243 -308 -248 -159 -80 61 154 195 220 116 118 5 33 24 -35
3471 -35 123 140 263 285 322 270 191 47 -61 -135 -150 -158 -103 -51 -14 50 42 -78 -159 -228 -293 -326 -327 -214 -176 -39 57 85
3499 85 80 108 8 -73 -65 -69 3 64 196 256 353 392 310 242 119 75 6 -61 -57 37 111 85 135 73 42 -43 -201 -238 -288 -277
3529 -277 -278 -154 -133 29 26 -23 -45 -16 -139 -131 -148 -96 -9 104 198 332 271 263 221 124 62 36 33 35 109 129 212 154 186 80
3559 80 -53 -140 -224 -284 -313 -221 -136 -152 -20 -36 -30 -123 -173 -205 -294 -191 -208 -91 -35 114 179 219 205 152 107 69 19 51
3587 51 94 111 178 230 275 227 181 118 13 -88 -153 -144 -127 -117 -13 -31 -13 -10 -90 -150 -296 -237 -268 -193 -166 -48 48 124 198
3616 198 95 105 109 -5 12 -1 50 174 240 279 371 299 244 172 63 -48 -100 -110 -125 25 6 50 24 -52 -44 -179 -213
$$ packed form
3414a97Q0Q3j2O3n5o7l9j32M1MJ12J47R6P1J00Mj04p5l2p2k9L6Q3K4J28nOl6j16
3443A07j22j19m9n9K4P3P1L8M7K3r0o6q6l5o5O0Q9P9J41R3M1K5j04Kj13K8rn9
3471c5J58J7J23K2L7n2p9j44j08p4j5qN5N2L7O4qj20q1o9o5l3jJ13L8J37R6K8
3499H5nK8j00q1QmP2O1J32O0R7L9q2o8j23m4o9o7MR4P4k6N0o2l1q5j58l7n0J1
3529b77jJ24K1J62lm9k2K9j23Qj7N2Q7J13R4J34o1qm2r7o2k6lKP4K0Q3n8L2j06
3559H0j33q7q4o0k9R2Q5j6J32j6Or3n0l2q9J03j7J17N6J49O5M0j4n3m5l8n0L2
3587E1M3J7O7N2M5m8m6o3j05j01o5RJ7J0J04j8J8Lq0o0j46N9l1P5K7J18R6P6P4
3616A98j03J0Mj14J7j3N1J24O6L9R2p2n5p2j09j11n2j0j5J50j9M4k6p6Qj35l4
$$ plain form
3643 -213 -284 -314 -296 -203 -133 -115 20 -6 43 35 -62 -37 -52 -70 14 63 168 251 250 266 228 221 85 43 -21 -19 14 55 104 106 77
3674 77 27 36 -85 -170 -208 -266 -267 -230 -128 -110 -34 -49 -36 -70 -140 -168 -146 -148 -107 40 58 240 247 228 203 193 80 119 80 50
3704 50 134 138 179 237 199 163 107 -4 -73 -139 -269 -201 -212 -156 -38 -55 -29 -93 -117 -172 -181 -230 -230 -194 -113 -15 51 137 180 149
3734 149 142 38 61 23 36 64 97 231 257 233 213 114 77 -55 -43 -96 -122 -129 -137 -85 -80 -11 -123 -105 -199 -233 -300 -246 -208 -170
3764 -170 -103 -10 -3 13 106 98 15 23 7 -2 61 117 221 219 283 268 177 106 78 14 -5 -18 -21 -17 27 37 47 -39 -159 -157 -174 -252 -285
3797 -285 -261 -183 -170 -18 -36 -24 17 -77 -107 -135 -67 -102 -35 49 125 186 176 280 210 177 118 -10 41 9 75 118 102 127
3825 127 72 57 -8 -57 -133 -189 -239 -212 -186 -128 -110 -81 -66 -108 -174 -147 -181 -181 -119 -109 11 63 143 166 210 152 126 157 89 113
3855 113 69 109 143 240 227 162 131 109 -18 -47 -78 -142 -131 -108 -121 -104 -43 -77 -49 -120 -198 -162 -235 -156 -171 -85 -27 41 98
$$ packed form
3643b13p1l0J8R3P0J8J35k6M9qr7K5j5j8Q4M9J05Q3jJ6l8pj36m2o4KL3M1M9Kk9
3674G7n0Rj21q5l8n8jL7J02J8P6j5J3l4p0k8K2kM1J47J8J82Pj9k5j0j13L9l9l0
3704E0Q4MM1N8l8l6n6j11o9o6j30O8j1N6J18j7K6o4k4n5rm9%L6Q1R8O6Q6M3l1
3734A49pj04K3l8J3K8L3J34K6k4k0r9l7j32J2n3k6pqN2NO9j12J8r4l4o7N4L8L8
3764a70O7R3PJ6R3qq3Qj6rO3N6J04kO4j5r1p1k8o4j9j3lMM4J0J0q6j20Kj7p8l3
3797b85K4P8J3J52j8J2M1r4l0k8O8l5O7Q4P6O1j0J04p0l3n9j28N1l2O6M3j6K5
3825A27n5j5o5m9p6n6n0K7K6N8J8K9J5m2o6K7l4%O2J0J20N2Q0K3M4n8k6L1o8K4
3855A13m4M0L4R7j3o5l1k2j27k9l1o4J1K3j3J7O1l4K8p1p8L6p3P9j5Q6N8O8N7
$$ plain form
3884 98 99 83 72 78 62 47 68 141 182 181 242 230 230 160 106 64 -28 -16 -56 -16 -73 -13 -22 -49 -55 -113 -201 -231 -254 -236 -199 -144 -77
3917 -77 -51 -10 -5 -25 22 6 -7 5 13 87 113 209 175 246 287 197 136 96 99 87 29 40 11 66 80 -8 -24 -45 -83 -142 -176 -199
3949 -199 -155 -181 -113 -152 -59 -49 -41 -39 -96 -132 -110 -34 -11 81 138 173 191 245 202 185 146 111 92 69 100 77 125 122 146 97 23
3980 23 -83 -50 -105 -136 -166 -182 -78 -164 -97 -136 -112 -149 -157 -179 -71 -79 -107 -34 48 106 133 144 167 117 87 131 86 79 111 125
4010 125 134 169 168 147 74 27 -10 -35 -81 -131 -42 -99 -109 -78 -52 -86 -110 -135 -183 -186 -210 -120 -84 -92 -16 25 62 60 63 22 17 61 85
4043 85 88 114 218 237 209 196 152 129 70 34 5 -9 -60 -19 -24 1 -6 -47 -124 -123 -185 -152 -213 -161 -187 -104 -83 -72 -22 -24 -67 -27
4075 -27 -37 -49 5 80 76 105 200 148 172 196 104 78 87 97 56 62 42 58 89 8 7 -11 -93 -171 -178 -164 -200 -177 -132 -123 -105 -76 -94
4108 -94 -69 -130 -82 -63 -81 -51 -24 50 67 158 148 127 132 131 132 90 60 102 33 112 151 121 124 29 8 -60 -70 -136 -114 -107 -122 -83 -86
$$ packed form
3884I8Jj6j1Oj6j5K1P3M1jO1j2%p0n4m2r2J2m0M0n7O0rk7on8q8l0k3J8L7N5O7
3917g7K6M1Nk0M7j6j3J2QP4K6R6l4P1M1r0o1m0Lj2n8J1k9N5J4q8j6k1l8n9l4k3
3949a99M4k6O8l9R3J0QKn7l6K2P6K3R2N7L5J8N4m3j7l9l5j9k3L1k3M8lK4m9p4
3980B3j06L3n5l1l0j6J04q6O7l9K4l7qk2J08qk8P3Q2N8K7J1K3n0l0M4m5pL2J4
4010A25RL5jk1p3m7l7k5m6n0Q9n7j0L1K6l4k4k5m8lk4R0L6qP6M1L7kLm1nM4K4
4043H5LK6J04J9k8j3m4k3n9l6k9j4n1M1nK5pm1p7Jo2L3o1N2k6Q3K1J1N0km3M0
4075b7j0j2N4P5mK9R5n2K4K4r2k6RJ0m1Ok0J6L1q1jj8q2p8pJ4l6K3M5RJ8K9j8
4108i4K5o1M8J9j8L0K7P4J7R1j0k1NjJm2l0M2o9P9L9l0Lr5k1o8j0o6K2Pj5L9l
$$ plain form
4141 -86 -103 -151 -172 -171 -155 -152 -139 -114 -105 -46 42 83 57 73 115 108 70 60 65 149 114 128 140 139 123 112 101 22 -20 -75 -105 -95 -63
4174 -63 -90 -100 -97 -134 -173 -140 -173 -163 -175 -144 -184 -136 -68 -28 0 8 9 22 55 31 41 74 116 104 161 165 186 168 141 91 86 51 12
4207 12 2 0 -5 -20 -4 -44 -49 -136 -145 -174 -186 -163 -181 -130 -130 -114 -36 -24 -49 -14 -51 -46 1 48 49 75 165 166 188 202 177 126 129 71 12
4242 12 36 34 41 67 27 35 -18 -33 -90 -71 -195 -218 -170 -185 -125 -134 -35 -100 -107 -96 -85 -61 -112 -65 -40 19 105 112 135 169 186 160 128
4275 128 95 91 75 118 144 123 153 108 127 70 -16 -61 -115 -167 -179 -97 -143 -98 -76 -101 -52 -63 -108 -162 -150 -77 -90 -39 -3 36
4305 36 80 90 102 115 132 73 80 116 92 139 138 137 154 171 121 52 24 30 -89 -83 -77 -43 -18 -13 -94 -148 -139 -135 -169 -173 -232 -135 -132 -49 -65
4340 -65 -21 6 -7 -2 -15 28 -22 82 91 81 125 153 251 163 190 152 95 66 -13 6 -62 -31 14 12 -8 -2 -38 -156 -178 -197 -233
4371 -233 -160 -194 -131 -108 -36 -6 -6 -3 -45 -19 -20 23 0 10 115 159 207 165 247 155 93 62 74 58 41 24 145 135 119 35
$$ packed form
4141h6j7m8k1JJ6LJ3K5RN9Q8M1k6J6M2pl8j0NQ4l5J4J2jj6j1j1p9m2n5l0J0L2
4174f3k7j0Ll7l9L3l3J0j2L1m0M8O8M0K8QJJ3L3k4J0L3M2j2N7MK1j8k7n0nl5l9
4207A2j0knj5J6m0nq7rk9j2K3j8N1%J6P8J2k5L5l7NM7M7JK6R0JK2J4k5n1Ln8n9
4242A2K4kPK6m0Qn3j5n7J9j24k3M8j5O0rR9o5pJ1J1K4n1M7K5N9Q6PK3L4J7k6l2
4275A28l3mj6M3K6k1L0m5J9n7q6m5n4n2j2Q2m6M5K2k5M9j1m5n4J2P3j3N1L6L9
4305C6M4J0J2J3J7n9PL6k4M7jjJ7J7n0o9k8Oj19OOL4K5Nq1n4RMl4mn9R7LQ3j6
4340f5M4K7j3Nj3M3n0J04Rj0M4K8R8q8K7l8n7k9p9J9o8L1M5kk0Ol6j18k2j9l6
4371b33P3l4O3K3P2L0%Lm2K6jM3k3J0J05M4M8m2Q2r2o2l1J2j6j7j7J21j0j6q4
$$ plain form
4401 35 10 -24 -94 -142 -146 -176 -180 -165 -94 -38 -72 -26 -61 -128 -90 -144 -86 -79 -24 29 117 139 143 117 128 80 92 25 22 101 131 133 129 171
4435 171 138 106 31 -85 -66 -187 -214 -140 -133 -79 -51 -53 -85 -76 -63 -144 -178 -168 -135 -63 -17 21 81 119 116 106 52 78 9 48 91
4466 91 143 187 198 200 203 154 130 53 4 -51 -28 -76 -56 -9 -54 12 -11 -73 -126 -172 -166 -208 -219 -172 -114 -32 4 53 79 31 8 -34
4498 -34 2 45 35 100 110 154 214 208 162 173 83 5 -10 -103 -1 24 30 55 67 1 -23 -117 -135 -208 -249 -268 -180 -130 -57 -60 -5
4529 -5 -70 -30 -78 -69 -108 -68 -30 21 87 133 168 171 177 178 159 60 56 74 63 66 134 99 128 104 39 -10 -141 -192 -221 -179 -185 -121 -65 -52
4563 -52 -20 -4 -58 -116 -168 -195 -149 -103 -63 -12 124 129 184 125 116 82 33 60 12 34 107 139 154 202 179 113 65 -32 -130 -142 -197
4594 -197 -131 -131 -74 -34 -70 -83 -163 -154 -182 -216 -241 -155 -111 -29 -11 107 86 81 45 42 7 -21 0 76 103 135 188 220 196 208 143
4625 143 33 -70 -17 -77 -64 -56 -14 28 -4 -54 -55 -109 -216 -177 -227 -254 -145 -134 -18 -10 62 61 8 -6 -43 -38 -74 85 60
$$ packed form
4401C5k5l4p0m8ml0mJ5P1N6l4M6l5o7L8n4N8PN5N3Q8K2Mk6J1m8J2o7lP9L0KmM2
4435A71l3l2p5j16J9j21k7P4PN4K8kl2RJ3q1l4J0L3P2M6L8O0L8lj0n4K6o9L9M3
4466I1N2M4J1KLm9k4p7m9n5K3m8K0M7m5O6k3o2n3m6Om2j1M7N8Q2L6M9K6m8k3m2
4498c4L6M3j0O5J0M4O0om6J1r0p8j5r3J02K5OK5J2o6k4r4j8p3m1j9Q8N0P3lN5
4529eo5M0m8Rl9M0L8N1O6M6L5LOJj9r9mJ8j1LO8l5K9k4o5m9j31n1k9M2oO4N6J3
4563e2L2J6n4n8n2k7M6M6M0N1J36NN5n9rl4m9K7m8K2P3L2J5M8k3o6m8r7r8j2n5
4594a97O6%N7M0l6j3q0Rk8l4k5Q6M4Q2J8J18k1nl6ll5k8K1P6K7L2N3L2k4J2o5
4625A43j10j03N3o0J3QM2M2l2n0jn4j07L9n0k7J09J1J16QP2jn3j4l7Nl6J59k5
$$ plain form
4654 60 157 220 230 292 187 134 59 14 -3 -30 -20 72 127 86 66 47 -60 -121 -189 -179 -259 -218 -176 -162 -50 -24 -18 28 -36
4683 -36 -100 -149 -181 -156 -91 31 76 177 217 201 192 132 101 -14 -1 27 36 62 130 179 192 109 91 -17 -77 -196 -199 -161 -155 -101
4713 -101 -93 -27 12 -99 -62 -128 -202 -204 -155 -119 -41 33 60 197 180 193 102 91 -7 17 39 71 105 208 267 204 176 108 22
4742 22 -32 -76 -112 -76 -89 -30 22 56 -14 -9 -56 -144 -245 -253 -221 -154 -107 -65 8 105 83 41 59 -16 -6 -75 -86 39 118 201
4772 201 165 206 239 182 96 -18 -55 -69 -120 -37 29 64 109 58 -14 -68 -174 -195 -255 -287 -238 -133 -78 -44 31 38 34 -80 -73
4801 -73 -69 -87 -60 -3 86 189 192 227 247 215 169 73 5 -53 14 19 110 138 171 147 117 3 -113 -114 -171 -269 -214 -145 -81 -31 20
4832 20 14 -18 -65 -122 -208 -195 -183 -76 33 67 176 215 210 125 87 56 -38 -36 16 71 143 224 221 159 132 47 -49 -77 -152 -187 -177
4863 -177 -131 -43 53 49 11 -67 -119 -168 -226 -247 -199 -134 -66 27 61 131 166 111 -1 -5 -7 -64 5 62 136 243 218 239 218 151
$$ packed form
4654F0R7O3J0O2j05n3p5m5j7k7J0R2N5m1k0j9j07o1o8J0q0M1M2J4J12K6OM6o4
4683c6o4m9l2K5O5J22M5J01M0j6ro0l1j15J3K8RK6O8M9J3q3j8j08o0j19lL8ON4
4713a01QO6L9j11L7o6p4kM9L6P8P4K7J37j7J3r1j1r8K4K2L2L4J03N9o3k8o8q6
4742B2n4m4l6L6j3N9N2L4p0Nm7q8j01qL2O7M7M2P3R7k2m2J8p5J0o9j1J25P9Q3
4772B01l6M1L3n7q6j14l7j4n1Q3O6L5M5n1p2n4j06k1o0l2M9J05N5L4P5Pmj14P
4801g3Mj8K7N7Q9J03LL5K0l2m6r6o8n8O7NR1K8L3k4l0j14j16jn7r8N5O9O4N0N1
4832B0ol2m7n7q6J3J2J07J09L4J09L9nq5l8l1r4KN2N5P2Q1lo2k7q5r6k8p5l5J0
4863a77M6Q8R6ml8p8n2m9n8k1M8O5O8R3L4P0L5n5j12mkn7O9N7P4J07k5K1k1o7
$$ plain form
4893 151 2 -38 -87 -100 -66 -64 26 67 36 39 19 -56 -190 -219 -282 -250 -163 -117 -19 28 77 54 76 -12 -82 -93 -58 -68 33
4922 33 128 221 285 257 243 186 94 15 -42 -33 -83 16 65 98 123 75 3 -77 -148 -279 -297 -225 -208 -124 -77 28 36 -20 -12 -82 -144
4953 -144 -199 -182 -160 -45 92 137 211 232 159 93 65 2 -27 -30 -16 54 127 218 143 159 65 -34 -134 -220 -148 -213 -156 -121 -70
4982 -70 -30 38 -35 -84 -70 -243 -219 -217 -197 -92 50 117 151 191 169 85 100 -73 -31 -62 -10 117 176 189 210 284 151 26
5010 26 -42 -96 -147 -129 -83 -76 -32 40 39 -12 -66 -177 -224 -282 -309 -214 -145 -39 52 119 124 129 44 -21 -47 -75 -28 -33 79 171 213
5041 213 251 276 222 104 34 -79 -86 -78 -31 -8 30 98 71 60 -11 -141 -186 -286 -269 -247 -156 -60 -16 47 20 71 -28 -43 -119
5070 -119 -108 -110 -46 18 184 199 267 264 252 104 40 -20 -27 -27 17 65 166 167 180 151 35 -76 -179 -241 -249 -247 -137 -114 -15 21
5100 21 4 17 -81 -126 -180 -196 -175 -143 -3 80 161 216 200 139 116 11 -41 -29 -28 -19 86 206 181 212 151 103 -33 -143
$$ packed form
4893A51j49m0m9j3L4KR0M1l1Lk0p5j34k9o3L2Q7M6R8M7M9k3K2q8p0j1L5j0J01
4922C3R5R3O4k8j4n7r2p9n7Rn0R9M9L3K5m8p2q0p1j31j8P2J7Q4M7J05Qn6Qp0o2
4953a44n5J7K2J15J37M5P4K1p3o6k8o3k9lJ4P0P3R1p5J6r4r9j00q6P2o5N7L5N1
4982g0M0O8p3m9J4j73K4KK0J05J42O7L4M0k2q4J5j73M2l1N2J27N9J3K1P4j33j25
5010B6o8n4n1J8M6PM4P2jn1n4j11m7n8k7R5O9J06R1O7NNq5o5k6k8M7nJ12R2M2
5041B13L8K5n4j18p0j13pQM7K3L8O8k7j1p1j30m5j00J7K2R1R6M4O3k7N1r9j5p6
5070a19J1kO4O4J66J5O8lj2j48o4o0p%M4M8J01JJ3k9j16j11j03o2qKJ10K3R9L6
5100B1j7J3r8m5n4j6K1L2J40Q3Q1N5j6o1k3j05n2J2JRJ05J20k5L1o1m8j36j10
$$ plain form
5128 -143 -175 -225 -171 -124 -112 24 39 -2 11 -73 -165 -261 -249 -199 -111 -32 15 143 211 209 137 84 -28 -50 -77 -67 59 90
5156 90 160 220 265 240 165 10 -54 -89 -118 -134 -83 5 7 94 90 50 -57 -147 -210 -283 -237 -209 -89 41 32 132 95 103 20 -42
5186 -42 -64 -117 -73 18 148 201 216 274 262 204 78 -3 -53 -83 -55 20 83 49 127 124 74 -44 -126 -189 -252 -256 -223 -152 -8
5215 -8 57 57 73 18 -70 -86 -196 -162 -104 -50 64 170 225 275 247 129 91 -1 -48 -32 -32 77 118 183 212 174 105 2 -95
5244 -95 -144 -244 -297 -161 -142 -23 56 56 58 6 -75 -202 -212 -195 -142 -82 12 151 185 258 168 97 89 -7 32 -68 18 95 154
5273 154 224 242 247 148 87 -60 -75 -152 -166 -114 -67 -21 19 49 25 -52 -103 -227 -234 -217 -203 -164 -94 44 117 130 117 41 12
5302 12 -69 -107 -66 -76 63 125 268 292 261 229 89 -2 -55 -107 -144 -63 -57 30 93 121 31 7 -141 -215 -253 -268 -243 -158 -60
5331 -60 -2 105 73 118 17 -27 -111 -141 -95 -47 52 141 183 296 231 229 148 43 -48 -93 -103 -51 83 98 118 123 99 47 -93
$$ packed form
5128a43l2n0N4M7J2J36J5m1J3q4r2r6J2N0Q8P9M7J28O8kp2n3j12k2k7J0J26L1
5156I0P0O0M5k5p5j55o4l5k9j6N1Q8KQ7mm0j07r0o3p3M6K8J20J30rJ00l7Qq3o2
5186d2k2n3M4R1J30N3J5N8j2n8j26q1n0l0K8P5O3l4P8ln0j18q2o3o3mL3P1J44
5215hO5%J6n5q8j6j10L4N8N4J14J06N5N0k8j18l8r2m7J6%J09M1O5K9l8o9j03r7
5244i5m9j00n3J36J9J19P9%Kn2q1j27j0J7N3O0R4J39L4P3r0p1qr6L9j00Q6P7N9
5273A54P0J8Nr9o1j47j5p7j4N2M7M6M0L0k4p7n1j24pJ7J4L9P0J38P3J3j3p6k9
5302A2q1l8M1j0J39O2J43K4l1l2j40r1n3n2l7Q1OQ7O3K8r0k4j48p4l8j5K5Q5R8
5331f0N8J07l2M5j01m4q4l0M6M8R9Q9M2J13o5kq1j05r1m5j0N2J34J5K0Nk4n2j40
$$ plain form
5360 -93 -195 -292 -263 -277 -174 -149 -77 72 -17 -1 -42 -96 -159 -224 -196 -151 -53 121 177 203 250 181 104 26 -71 -83 -32 19
5388 19 86 118 165 249 199 92 -15 -74 -165 -187 -179 -152 -88 -22 53 55 -56 -41 -134 -191 -186 -251 -153 -80 38 113 183 173 106 86
5418 86 22 -13 -44 -21 46 90 195 234 286 210 165 79 -40 -121 -162 -111 -104 3 26 93 70 13 -29 -145 -212 -239 -202 -184 -99
5447 -99 -9 0 121 98 107 7 -33 -97 -140 -81 -38 99 162 245 252 216 182 78 -4 -94 -62 -121 -2 11 67 102 124 24 -62
5476 -62 -132 -181 -228 -234 -188 -113 -43 19 114 127 48 -70 -137 -161 -191 -140 -39 17 168 185 278 218 143 70 21 -40 -25 -9 41
5505 41 110 143 146 204 92 46 -120 -198 -209 -220 -188 -103 -21 4 50 51 -3 -42 -174 -165 -194 -150 -117 16 107 148 195 196 163 82
5535 82 -5 -15 -100 18 38 148 199 231 237 137 100 -31 -103 -164 -169 -143 -60 31 41 32 43 -46 -99 -159 -263 -273 -198 -183 -87
5564 -87 32 107 101 96 105 -15 -53 -62 -52 -25 73 150 202 259 250 218 81 60 -60 -95 -115 -96 30 53 79 122 98 -36 -90 -183
$$ packed form
5360i3j02r7K9j4J03K5P2J49q9J6m1n4o3o5K8M5R8J74N6K6M7o9p7p8r7j2N1N1
5388A9O7L2M7Q4n0j07j07n9r1k2QK7O4O6P5Kj11J5r3n7No5R8P3J18P5P0j0o7k0
5418H6o4l5l1K3O7M4J05L9N2p6m5q6j19q1m1N1PJ07K3O7k3n7m2j16o7k7L7J8Q5
5447i9R0RJ21k3Rj00m0o4m3N9M3J37O3Q3Pl6l4j04q2r0L2n9J19J3N6L5K2j00q6
5476f2p0m9m7oM6P5P0O2R5J3p9j18o7k4l0N1J01N6J51J7R3o0p5p3m9o1J5J6N0
5505D1O9L3LN8j12m6j66p8j1j1L2Q5Q2K5M6Jn4l9j32Rk9M4L3J33R1M1M7Jl3q1
5535H2q7j0q5J18K0J10N1L2Oj00l7j31p2o1nK6Q3R1J0rJ1q9n3o0j04j0P5J5R6
5564h7J19P5onRj20l8rJ0K7R8P7N2N7rl2j37k1j20l5k0J9J26K3K6M3k4j34n4r3
$$ plain form
5594 -183 -199 -242 -263 -164 -130 14 44 91 138 14 -17 -127 -183 -104 -51 12 91 209 188 250 206 147 56 -44 -92 -131 -59
5621 -59 -9 98 168 149 58 16 -49 -138 -208 -272 -234 -162 -77 -33 8 45 74 -34 -72 -195 -167 -191 -140 8 47 192 181 218
5649 218 146 100 7 -51 -13 -17 8 69 155 199 194 187 133 -5 -128 -186 -238 -163 -126 -75 -3 33 37 23 -98 -116 -204 -210 -178 -137 -104
5680 -104 23 125 156 136 161 59 12 -19 -37 -25 71 127 153 250 264 205 166 11 -44 -147 -98 -141 -110 -15 -23 105 46
5707 46 18 -66 -139 -175 -227 -241 -194 -86 -64 -2 113 60 79 -15 -27 -89 -95 -57 -23 96 136 226 234 224 163 54 9 -91 -142
5736 -142 -101 -47 26 33 95 114 58 -32 -124 -202 -288 -252 -200 -129 -117 17 38 37 30 -24 -67 -160 -140 -93 -76 40 157 201 176 210
5766 210 147 83 4 -9 -84 -48 -9 47 107 167 168 93 15 -66 -168 -207 -246 -153 -126 -83 -27 62 56 -32 -37 -108 -190 -223 -143 -94 -32
5797 -32 97 177 135 216 135 79 -2 -63 -119 -4 40 76 191 193 196 137 49 -61 -88 -201 -161 -171 -131 -22 -10 35 -31 -24 -111
$$ packed form
5594a83j6m3k1R9L4J44L0M7M7j24l1j10n6P9N3O3P9J18k1O2m4n9r1j00m8l9P2
5621e9N0J07P0j9r1m2o5q9p0o4L8P2Q5M4M1L7K9j08l8j23K8k4N1J48L9J45j1L7
5649B18p2m6r3n8L8mK5O1Q6M4npn4j38j23n8n2P5L7N1P2L6Mj4j21j8q8oL2M1L3
5680a04J27J02L1k0K5j02m7l1j8J2R6N6K6R7J4n9l9j55n5j03M9m3L1R5qJ28n9
5707D6k8q4p3l6n2j4M7J08K2O2J15n3J9r4j2o2oL8L4J19M0R0Qj0o1j09m5j00n1
5736a42M1N4P3PO2J9n6r0r2p8q6L6N2P1J2J34K1jpn4m3r3K0M7J7J16J17M4k5L4
5766B10o3o4p9j3p5L6L9N6O0O0Jp5p8q1j02l9l9R3K7M3N6Q9oq8np1q2l3Q0M9O2
5797c2J29Q0m2Q1q1n6q1o1n6J15M4L6J15KLn9q8j10k7j13M0j0M0J09J2M5o6Pq7
$$ plain form
5826 -111 -163 -199 -198 -218 -139 -78 12 91 138 116 107 13 -4 -84 -81 -15 49 115 150 199 233 185 138 30 -22 -116 -103 -100 -13 58 51 72
5858 72 66 1 -77 -130 -231 -223 -228 -141 -110 6 23 87 86 13 -28 -103 -92 -78 -59 45 65 163 212 212 170 113 57 -13 -55 -29 -6
5889 -6 29 81 143 106 108 41 -25 -174 -201 -234 -242 -189 -130 -55 2 30 36 -14 -78 -162 -165 -155 -90 12 53 173 188 243 178 149 46
5920 46 29 -15 -31 36 43 71 170 175 162 71 8 -79 -108 -125 -148 -117 -50 -21 26 44 13 -23 -90 -129 -141 -138 -118 -34 49 96 188 138
5952 138 142 125 71 -21 4 -14 15 108 157 181 191 196 135 43 9 -70 -97 -85 -75 -21 4 24 52 23 -46 -134 -149 -218 -188 -196 -141
5983 -141 -19 -6 71 63 100 -40 9 -52 -118 -33 -10 63 150 185 216 208 147 46 20 -62 -13 -38 -68 -12 43 78 39 15 -20
6012 -20 -97 -128 -202 -260 -166 -125 -57 -22 63 63 57 -48 -53 -68 -152 -54 -50 59 128 162 239 223 192 87 36 -4 -14 -45 -48 34 138
6043 138 138 124 84 42 -109 -123 -175 -179 -191 -136 -62 24 12 16 -13 -43 -95 -182 -164 -130 -72 -2 92 63 188 106 111 79 -11 -43 -38
$$ packed form
5826a11n2l6Jk0P9O1R0P9M7k2rr4j7q0LO6O4O6L5M9L4m8m7j08n2r4J3LQ7P1pK1
5858G2oo5p8n3j01QnQ7L1J16J7O4jp3m1p5J1J4J9J04K0R8M9%m2n7n6p0m2K6K3
5889fL5N2O2l7Ko7o6j49k7l3qN3N9P5N7K8On0o4q4lJ0O5J02M1J20J5N5o5k9j03
5920D6j7m4j6O7PK8R9Nj3r1o3q7k9j7k3L1O7K9M7J8l1l6o7l9j2LK0Q4Q3M7R2n0
5952A38Mj7n4r2K5j8K9R3M9K4J0No1r2l4p9k7J2J0N4K5K0K8k9o9q8j5o9L0qN5
5983a41J22J3P7qL7j40M9o1o6Q5K3P3Q7L5L1qo1j01k6q2M9k5l0N6N5L5l9k4l5
6012b0p7l1p4n8R4M1O8L5Q5%oj05nj5q4R8MJ09O9L4P7j6l1j05n1m0j0l1lQ2J04
6043A38%j4m0m2j51j4n2mj2N5P4Q6j2Mk9l0n2q7J8L4N8P0R4k9J25q2Nl2r0l2N
$$ plain form
6074 -38 10 53 111 134 130 126 101 91 -51 -59 -181 -103 -139 -123 -45 -60 15 15 -70 -57 -136 -151 -179 -187 -144 -33 19 63 65 105 117 40
6106 40 10 -70 -24 -4 29 96 158 174 188 187 130 52 -44 -77 -77 -127 -47 19 34 24 47 -13 -24 -152 -187 -177 -215 -141 -90 -75 4
6137 4 27 20 18 -39 -60 -65 -61 -29 6 42 162 131 156 103 114 55 -20 28 -50 -46 -16 20 58 74 22 41 -24 -145 -147 -215 -188 -165 -130
6170 -130 -57 -24 16 -20 -37 -39 -134 -115 -97 -36 -57 70 120 153 168 123 113 105 10 -30 -24 16 76 54 117 88 109 38 16 -76 -79
6201 -79 -134 -127 -122 -90 -48 -8 2 -18 -3 -118 -123 -107 -109 -128 -81 -15 63 103 110 131 91 32 46 -20 -2 19 57 122 152 129 141 164
6233 164 28 30 -80 -155 -147 -58 -69 -51 37 51 10 -37 -76 -162 -176 -147 -154 -97 -74 4 71 90 31 8 51 -22 -58 -29 72 76
6263 76 52 168 148 178 115 90 28 -1 -11 -46 -31 -58 72 56 46 4 -45 -73 -125 -141 -145 -119 -123 -35 -28 -1 31 24 19 -53 -95 -79
6295 -79 -70 -15 61 118 147 160 122 203 88 34 42 37 18 -14 29 43 94 99 45 -10 -42 -62 -151 -157 -137 -87 -66 -39 -18 -13 -4 -60 -68 -97
$$ packed form
6074c8M8M3N8K3mmk5j0j42qj22P8l6J6P8j5P5%q5J3p9j5k8qM3J11N2M4KM0J2p7
6106D0l0q0M6K0L3O7O2J6J4jn7p8r6l3%n0Q0O6J5j0K3o0j1j28l5J0l8P4N1J5P9
6137DK3pkn7k1nML2L5L6J20l1K5n3J1n9p5M8p8ML0L6L8J6n2J9o5j21ko8K7K3L5
6170a30P3L3M0l6j7kr5J9J8O1k1J27N0L3J5m5j0qr5m0OM0O0k2O3k9K1p1k2r2l
6201g9n5PNL2M2M0J0k0J5j15nJ6kj9M7O6P8M0PK1m0n9J4o6J8K1L8O5L0k3J2K3
6233A64j36Kj10p5QQ9j1J8Q8J4m1m7l9q6j4K9pN7K3P8O7J9n9k3M3p3l6K9J01M
6263G6k4J16k0L0o3k5o2k9j0l5J5k7J30j6j0m2m9k8n2j6mK6mQ8PK7L2pnp2m2J6
6295g9RN5P6N7K9J3l8Q1j15n4Qnj9l2M3J4N1Nn4n5l2k0q9oK0N0K1K7K1NRn6qk9
$$ plain form
6329 -97 -143 -61 -94 -40 44 107 65 99 179 86 76 31 28 33 54 106 57 126 131 100 99 2 -22 -117 -106 -133 -145 -39 -25 -19 -64 -15
6361 -15 -100 -72 -120 -123 -115 -91 -40 -29 36 118 87 76 50 41 17 33 -6 56 141 109 144 165 144 86 19 36 -26 -73 -52 -41 -21 -1
6393 -1 -14 41 -33 -40 -126 -152 -155 -184 -72 -111 -73 -16 -7 39 -16 2 -23 -22 -74 -40 -15 -31 109 130 120 111 141 33 34 -4 -18 -26 0
6426 0 2 18 48 45 -21 -13 -72 -144 -129 -147 -164 -139 -78 -68 -49 -16 -23 -53 -66 -138 -98 -40 -32 -11 90 55 142 114 119 84 2 57 30
6459 30 17 79 65 98 65 94 42 42 -65 -112 -116 -100 -97 -88 -73 -49 -13 -54 -45 -37 -157 -146 -66 -133 -68 -46 37 68 77 58 37 92 27
6492 27 43 5 30 77 86 100 72 118 69 37 -42 -36 -56 -73 -74 -59 -68 -19 -49 -34 -30 -123 -120 -192 -128 -139 -144 -97 -3 -9 48 78 11 38
6526 38 -2 -24 3 31 17 69 109 93 136 103 66 49 -33 -31 -66 -39 -22 10 -18 -1 -23 -31 -22 -98 -103 -148 -121 -107 -85 -57 -3 -9 -22
6559 -22 -20 4 -53 -46 -9 5 7 53 83 162 135 102 76 38 -16 -21 -6 2 -27 34 33 -14 22 -32 -80 -43 -108 -103 -120 -152 -95 -108 -15 -50
$$ packed form
6329i7m6Q2l3N4Q4O3m2L4Q0r3j0m5lNK1N2m9O9Nl1jr7k4r5J1k7j2J06J4Om5M9
6361a5q5K8m8lQK4N1J1O5Q2l1j1k6rk4J6l9O2Q5l2L5K1k1n8o7J7o2m7K1J1K0K0
6393aj3N5p4pq6k6lk9J12l9L8N7RM6n5J8k5Jn2L4K5j6J40K1j0rL0j08Jl8j4qK6
6426@KJ6L0lo6Qn9p2J5j8j7K5O1J0J9L3pl0j3p2M0N8QK1J01l5Q7k8Nl5q2N5k7
6459C0j3O2j4L3l3K9n2%j07m7mJ6LRJ5K4L6m1RQj20J1Q0o7O5K2Q3L1Rj9k1N5o5
6492B7J6l8K5M7RJ4k8M6m9l2p9Ok0j7jJ5rM9l0J5Mr3Lp2O4j1nM7R4oN7L0o7K7
6526C8m0k2K7K8j4N2M0j6M3l3l7j7q2Kl5K7J7L2k8J7k2qRp6nm5K7J4K2K8N4oj3
6559b2KK4n7PL7J4KM6L0P9k7l3k6l8n4nJ5Qk9O1jm7L6n4m8L7o5Nj7l2N7j3R3l5
$$ plain form
6593 -50 -13 -46 -35 -86 -49 -60 -84 -25 6 39 138 113 76 99 91 40 30 48 46 57 15 53 77 85 2 21 15 -42 -56 -80 -102 -58
6625 -58 -91 -42 -81 -26 -97 -75 -69 -63 -95 -76 -98 -53 29 24 53 37 107 76 53 23 38 52 52 43 65 125 103 116 51 42 -13 -52 -16
6658 -16 -82 -53 -22 -21 -20 -63 -89 -62 -94 -94 -102 -109 -63 -78 -44 -24 7 44 28 10 28 -6 -1 -21 71 71 125 121 61 101 91 42 33 27 -54
6693 -54 16 52 56 21 15 -35 -20 -30 -77 -89 -89 -96 -130 -54 -38 -42 -52 9 -48 -30 -1 -46 2 -18 -4 76 64 113 118 140 74 124 68
6726 68 51 43 30 25 -10 62 68 41 14 -16 -48 -41 -83 -91 -56 -51 -69 -70 -42 -77 -15 -51 -119 -98 -70 -30 -16 42 -37 75 47 51 70 85
6760 85 56 47 20 67 41 66 69 -24 74 60 -24 9 -41 -78 -89 -80 -72 -134 -77 -25 -66 -54 -93 -66 -70 -117 -53 -51 -41 -39 5 60 50 55
6794 55 43 21 5 42 39 57 96 90 92 69 93 67 82 70 -32 3 17 -29 -21 -65 -66 -44 -22 -98 -50 -75 -76 -120 -116 -93 -30 -14 -18 5
6828 5 7 -1 -11 -30 -12 32 18 37 77 59 62 83 77 49 46 42 -3 -37 -14 -32 49 28 -38 -38 -18 -98 -53 -44 -165 -77 -66 -74 -85 5 -52
$$ packed form
6593e0L7l3J1n1L7j1k4N9L1L3R9k5l7K3qn1j0J8kJ1m2L8K4Qq3J9on7j4k4k2M4
6625e8l3M9l9N5p1K2OOl2J9k2M5Q2nK9j6P0l1k3l0J5J4%rK2O0k2J3o5rn5l9L6
6658a6o6K9L1JJm3k6K7l2%qpM6j5L4K0L1L7j6j8J8l4Nk0R2%N4mo0M0j0m9roq1
6693e4P0L6Ml5on0J5j0m7j2%pl4P6J6mj0O1n7J8K9m5M8k0J4Q0j2M9NK2o6N0n6
6726F8j7qj3nl5P2Ok7k7l0l2Pm2qL5Nj8jK8l5O2l6o8K1K8M0J4N8p9J12k8MJ9J5
6760H5k9rk7M7k6K5Lr3R8j4q4L3n0l7j1RQo2N7N2m1J2l9K7mm7O4KJ0KM4N5j0N
6794E5j2k2j6L7lJ8L9oKk3K4k6J5j2j02L5J4m6Qm4jK2K2p6M8k5jm4MK3O3J6mK3
6828EKqj0j9J8M4j4J9M0j8LK1ok8lmm5l4K3j8Q1k1o6%K0q0M5Rj21Q8J1qj1R0n7
$$ plain form
6863 -52 -50 -22 -63 -9 -45 -4 -18 19 23 59 82 56 68 125 65 29 10 36 20 26 30 42 16 15 21 6 -42 -127 -89 -100 -76 -108 -86
6896 -86 -32 -49 -62 -56 -59 -9 -62 -84 -71 -35 -36 38 57 56 55 39 80 23 20 36 44 10 24 42 105 36 31 38 -41 -16 -38 -61 -54 -34 -50
6931 -50 -49 -40 -66 -78 -102 -90 -97 -72 -92 -94 -11 -50 -7 34 9 24 50 43 53 -17 31 75 57 41 107 81 13 78 37 31 9 -12 -24
6964 -24 -55 -17 -44 -47 -80 -56 -69 -75 -85 -136 -122 -138 -40 -90 29 -53 -22 12 -31 -52 -5 -5 33 17 76 75 98 129 99 97 103 42 42
6997 42 24 3 -15 18 11 0 -6 -10 -51 -48 -95 -105 -96 -143 -113 -78 -49 -9 -35 -17 -46 -38 -47 -87 -36 6 -10 59 53 109 128 48 51 46 48 58
7033 58 70 62 34 53 71 35 -81 47 -22 -67 -64 -104 -124 -18 -37 -84 -52 -54 -48 -66 -17 -33 -85 -68 -45 -37 28 -3 96 37 93
7064 93 54 26 83 20 41 27 41 86 87 77 78 27 -13 13 -27 -29 -73 -34 -79 -28 -45 -27 -18 -47 -59 -117 -142 -117 -79 -72 0 21 -16
7097 -16 56 44 50 40 52 37 34 20 16 71 83 132 130 122 34 51 -15 24 -37 -59 -26 -27 -13 -10 -28 -14 -54 -79 -46 -106 -45 -104 -28 -44
$$ packed form
6863e2KK8m1N4l6M1j4L7ML6K3k6J2N7o0l6j9K6j6OMJ2k6jOj5m8q5L8j1K4l2K2
6896h6N4j7j3OlN0n3k2J3L6jP4J9jjj6M1n7lJ6Ql4J4J8O3o9nPp9K5k2k3PK0j6
6931e0JRk6j2k4J2pK5k0kQ3l9M3M1k5J5K6pJ0p0M8M4j8j6O6k6o8O5m1ok2k1j2
6964b4l1L8k7ll3K4j3oj0n1J4j6R8n0J19q2L1L4m3k1M7%L8j6N9jK3L1l0kOo1%
6997D2j8k1j8L3pj1omm1Lm7j0Rm7L0L5K9M0k6J8k9Qrm0N1M2j6O9oN6J9q0LnKJ0
7033E8J2qk8J9J8l6j16J28o9m5Lm0k0J06j9m7L2kOj8M9j6n2J7K3QO5l1R9n9N6
7064I3l9k8N7o3K1j4J4M5Jj0Jn1m0K6m0km4L9m5N1j7J8Rk9j2n8k5K5L8PP2K1l7
7097a6P2j2Oj0J2j5lj4mN5J2M9kqq8J7o6L9o1k2L3jJ4Lj8J4m0k5L3o0O1n9P6j6
$$ plain form
7131 -44 -3 -24 -11 -10 15 -50 11 22 25 64 52 120 121 116 99 73 59 34 -31 65 44 48 18 39 62 33 38 -26 -38 -70 -132 -76 -101
7164 -101 -73 -25 0 -10 -112 -49 -17 -65 -60 -42 -41 -25 24 41 83 127 83 78 86 14 -3 44 48 13 50 47 75 82 13 -28 -60 -76 -85
7197 -85 -127 -81 -47 -38 -38 -2 -19 -79 -50 -98 -78 -98 -50 -47 -52 13 74 91 52 118 38 -16 33 45 38 19 118 93 84 111 88 16 -38
7230 -38 -55 -26 -74 -17 -20 -85 15 13 -42 -17 -58 -91 -171 -109 -56 -81 -18 -18 66 -9 39 27 -7 13 1 64 53 38 103 118 116 117
7262 117 94 9 45 8 -32 -36 -36 -10 56 12 -6 -38 -36 -116 -108 -99 -120 -94 -122 -34 -14 -24 -38 4 16 -98 -65 -29 -32 -1 -50 21
7294 21 102 90 65 75 94 25 25 -29 7 -15 4 14 23 8 36 -27 -53 -54 -109 -137 -95 -91 -99 -59 -65 -1 -20 -78 -71 -60 -112 -103 -72 -55
7328 -55 4 101 80 74 66 76 68 37 13 -25 0 95 78 32 123 43 68 -5 -78 -93 -127 -92 -106 -79 -36 -33 -30 -55 -53 -100 -54 -145 -143 -96
7362 -96 -55 -22 62 56 -4 41 34 -14 -1 -42 2 14 76 41 78 125 108 46 29 -25 -68 -49 -49 -24 -42 -17 23 26 -14 -57 -47 -90
$$ packed form
7131d4M1k1J3JK5o5O1J1LL9j2O8Jnj7k6j4k5o5R6k1Ml0K1K3k9No4j2l2o2N6k5
7164a01K8M8K5j0j02O3L2m8NJ8JJ6M9J7M2M4m4nQp2j7M7Ml5L7lK8Po9m1l2j6r
7197h5m2M6L4R%L6j7o0K9m8K0k0M8LnO5O1J7l9O6q0n4M9J2pj9R9k5rK7k3p2n4
7230c8j7K9m8N7lo5J00kn5K5m1l3q0O2N3k5O3%Q4p5M8j2l4K0j2O3j1j5O5J5kJ
7262A17k3q5L6l7m0m%K6O6m4j8l2Kq0QRk1K6k8Q8K0j0j4M2J2j14L3L6lL1m9P1
7294B1Q1j2k5J0J9o9%n4L6k2J9J0Rj5K8o3k6jn5k8M2MqM0oO4j9n8PJ1n2RL1J7
7328e5N9R7k1oqJ0ql1k4l8K5R5j7m6R1q0K5p3p3j5l4L5j4K7M3LLk5Km7M6r1KM7
7362i6M1L3Q4oo0M5pm8J3m1M4J2O2l5L7M7j7o2j7n4m3J9%K5j8K5M0Lm0m3J0m3
$$ plain form
7394 -90 -92 -147 -140 -65 -77 -31 6 -1 -5 56 -23 -14 -46 -14 16 79 54 115 88 101 73 55 25 -3 -4 -11 29 -3 45 28 36 59 -40 -29
7428 -29 -135 -117 -95 -100 -88 -68 -11 -43 58 -49 -6 -58 -52 -69 -69 -9 51 98 133 61 114 90 60 -34 -43 -8 -6 74 84 126 29
7459 29 88 70 15 -6 -105 -104 -68 -80 -74 -79 4 -10 -57 8 -80 -68 -51 -122 -122 -85 -40 36 39 73 115 76 57 -6 -22 30 1 60 72
7492 72 85 113 99 110 103 28 -8 -45 -44 -70 -55 -44 -18 4 11 8 -70 -76 -58 -103 -98 -69 -12 11 60 66 78 59 15 20 -36 7 -12 54
7526 54 54 105 130 114 97 55 37 25 -41 -98 -45 -10 19 22 12 14 -7 -109 -59 -114 -160 -149 -105 -51 -64 -10 16 6 20 -13 -87
7557 -87 -93 -43 -32 0 31 149 107 101 103 55 38 32 7 -28 16 3 45 33 80 31 30 9 -71 -106 -158 -119 -109 -28 -30 8 8 -11 38
7590 38 -48 -32 -77 -95 -70 -30 55 107 82 104 83 71 18 5 -46 -14 -18 10 41 54 115 82 27 11 -90 -59 -125 -115 -78 -45
7620 -45 -38 11 35 -43 -11 -70 -95 -125 -117 -100 -78 -38 25 96 67 53 64 10 -9 -82 -20 -28 26 67 67 100 115 83 38 -12 -73 -80 -70
$$ packed form
7394i0kn5PP5j2M6L7pmO1p9Rl2L2L0O3k5O1k7J3k8j8l0k8jpM0l2M8j7QK3r9J1
7428b9j06J8K2nJ2K0N7l2J01j07M3n2Oj7%O0O0M7L5p2N3k4l0r4rL5KQ0J0M2r7
7459B9N9j8n5k1r9JL6j2OnQ3j4m7O5q8J2J7p1%L7M5P6LL4M2l9j9o3j6N2k9N9J2
7492G2J3K8j4J1pp5l6l7Jk6J5J1K6K2Plp8oJ8m5NK9N7K3M9OJ2j9m4Nn6M3j9O6
7526E4%N1K5j6j7m2j8j2o6n7N3L5K9Lj0Kk1j02N0n5m6J1M4N4j3N4K6j0J4l3p4
7557h7oN0J1L2L1J18m2oKm8j7ok5l5M4j3M2j2M7m9jk1q0l5n2L9J0Q1kL8%j9M9
7590C8q6J6m5j8K5M0Q5N2k5K2k1j2n3j3n1L2mK8L1J3O1l3n5j6j01L1o6J0L7L3
7620d5PM9K4p8L2n9k5l0QJ7K2M0O3P1k9j4J1n4j9p3O2qN4M1%L3J5l2m5n0o1pJ0
$$ plain form
7653 -70 -42 -46 -30 24 -1 46 -44 -70 -126 -177 -136 -117 -76 -29 4 32 72 -2 27 -6 -40 -25 -36 -29 41 97 51 154 129 69 51
7684 51 -26 -46 -31 -26 -55 -35 22 12 16 -14 -8 1 -119 -104 -119 -118 -112 -92 0 -3 3 -3 -66 -39 -77 -37 -76 -34 26 -61 90 90 110 87
7718 87 72 5 -34 -38 1 -34 -5 86 39 93 57 13 -34 -161 -140 -133 -128 -46 -58 -26 22 33 0 -32 -68 -123 -91 -66 -80 -20 33
7749 33 32 107 100 108 69 34 -5 -1 -26 5 48 25 97 102 102 10 20 0 -93 -89 -83 -68 -10 61 -11 -33 7 -37 -42 -79 -92 -147 -102 -49 -57
7784 -57 2 15 58 34 58 9 -22 2 3 -11 44 114 143 153 117 43 51 -6 -41 -73 -97 -63 3 67 43 20 16 -31 -59 -111 -130 -131
7816 -131 -99 -62 -30 38 75 53 61 13 -59 -52 -18 -21 -8 77 93 55 114 132 100 9 22 -30 -75 -28 -25 14 21 92 58 9 3 -68 -107
7849 -107 -151 -158 -137 -36 -33 -48 12 44 44 -22 -60 -97 -86 -7 -18 38 71 51 150 104 88 6 25 -27 -47 7 38 91 60 108 109
7880 109 80 48 -30 -73 -127 -105 -90 -63 -60 0 10 17 4 -42 -54 -74 -128 -159 -69 21 17 56 97 84 81 16 -18 -58 -14 20 18 37
$$ packed form
7653g0K8mJ6N4k5M7r0k6n6n1M1J9M1M7L3K8M0p4K9l3l4J5j1PP0N6m6J03k5o0j8
7684E1p7k0J5Nk9K0N7j0Ml0ORj20J5j5JOK0R2lOoo3K7l8M0l9M2O0q7J51%K0k3
7718H7j5o7l9mL9l5K9R1m7N4l6m4m7j27K1PNQ2j2L2M8J1l3l2l6n5L2K5j4O0N3
7749C3jP5pQl9l5l9Mk5L1M3k3P2N%r2J0k0r3MOJ5N8P1p2k2M0m4nl7j3n5M5N3q
7784e7N9J3M3k4K4m9l1K4Jj4N5P0K9J0l6p4Qn7l5l2k4L4O6O4k4k3mm7k8n2j9j
7816a31L2L7L2O8L7k2Qm8p2PL4lJ3Q5J6l8N9J8l2r1J3n2m5M7LL9PP1l4m9op1l9
7849a07m4pK1J01Lj5O0L2%o6l8l7J1P9j1N6L3k0R9m6j6q2J9n2k0N4L1N3l1M8J
7880A09k9l2p8m3n4K2J5K7LO0J0Pj3m6j2k0n4l1R0R0mL9M1j3lo5l4m0M4L4kJ9
$$ plain form
7912 37 92 131 126 108 62 -9 -49 -48 -45 -64 -15 -11 31 55 28 -31 -36 -131 -84 -84 -91 -93 -57 -30 35 61 77 31 24 -62 -54 -90 -11 -7 70 123
7948 123 107 158 70 72 -52 -23 -74 -17 -51 -25 7 12 67 9 -52 -31 -108 -111 -168 -89 -134 -89 -17 6 -26 9 27 -46 -62 -83 -61
7979 -61 -30 -9 54 105 126 105 64 50 26 -12 -36 -65 -31 8 81 55 91 51 76 17 -61 -121 -139 -75 -109 -9 21 50 25 6
8009 6 -31 -64 -58 -88 -107 -62 -35 -23 58 105 103 82 72 6 -8 -28 -31 -10 50 -4 95 134 106 94 29 -24 -87 -138 -80 -36 -18 8
8041 8 17 41 -24 -58 -67 -122 -97 -182 -77 -58 -31 54 82 83 72 9 -12 -33 -32 -57 -30 26 66 74 72 87 59 24 -12 -85 -99 -82 -16
8074 -16 -33 24 -23 36 -42 -59 -78 -134 -140 -173 -136 -54 -48 -39 39 66 5 40 -63 -52 -64 -36 -19 60 86 111 128 105 89 92 12 -52
8106 -52 -59 -46 -4 62 34 69 28 29 -62 -48 -38 -126 -139 -155 -67 -23 38 -41 18 37 -74 -44 -104 -130 -79 -35 30 45 131 114 59
8137 59 81 27 10 -14 -85 -32 63 44 109 65 71 37 -21 2 -49 -129 -83 -132 -76 -61 -18 -4 -3 27 -16 -15 -140 -174 -86 -71 25
$$ packed form
7912C7N5L9nj8m6p1m0JLj9M9MM2K4k7n9nr5M7%pkL6K7O5K6J6m6pq6Ql6P9MP7N3
7948A23j6N1q8Kj24K9n1N7l4K6L2NN5n8o1K1p7ln7P9m5M5P2K3l2L5J8p3j6k1K2
7979f1L1K1O3N1K1k1m1j4k4l8k4k9L4L9P3k6L6m0K5n9p8o0j8O4l4J00L0K9k5j9
8009Fl7l3Ol0j9M5K7J2Q1M7kk1j0o6j4k0lK1O0n4R9L9k8j2o5n3o3n1N8M4J8K6
8041HRK4o5l4rn5K5q5J05J9K7Q5K8Jj1o3k1k1Jk5K7N6M0QkJ5k8l5l6p3j4J7O6
8074a6j7N7m7N9p8j7j9n6ol3L7Q2ORP8K7o1L5j03J1j2K8J7P9K6K5J7k3j6Lq0o4
8106e2pJ3M2O6k8L5m1Jr1J4J0q8j3j6Q8M4O1p9N9J9j11L0o0k6N1M4O5J5Q6j7n5
8137E9K2n4j7k4p1N3R5j9O5m4Ol4n8K3n1q0M6m9N6J5M3J4JL0m3Jj25l4Q8J5R6
$$ plain form
8168 25 -25 54 54 80 51 8 54 -30 -56 -49 26 37 90 96 119 123 40 -26 -17 -128 -117 -104 -2 19 28 -2 -14 3 33 -60 -113 -142
8200 -142 -99 -66 -14 1 38 44 24 59 6 -35 -21 1 -9 36 95 142 107 97 119 77 2 -17 -34 -64 -85 -25 37 32 52 44 9
8231 9 -55 -90 -149 -150 -81 -97 -55 -5 56 46 22 6 -27 -61 -59 -39 -18 1 16 93 175 83 154 99 -20 29 -27 -35 28 57 40 49
8263 49 116 126 43 0 -45 -113 -112 -119 -77 -79 -25 16 18 17 3 -73 -63 -111 -79 -58 -20 34 53 110 104 53 63 6 -17 -28 -65 3 8 66
8297 66 117 99 84 -1 18 -41 -50 -70 -90 -84 -32 -19 -11 23 13 -44 -68 -139 -91 -153 -70 -36 -16 57 48 75 82 5 25 -15 -16 -42 24
8330 24 11 66 127 127 119 123 36 -32 -44 -96 -94 -72 -14 8 61 55 6 20 -54 -112 -118 -136 -79 -92 -39 33 -9 104 26 7 -73 -48 -54
8363 -54 -40 14 13 38 113 111 100 132 56 -9 -47 -47 -21 5 -14 20 51 36 -10 -13 -64 -93 -136 -138 -94 -73 -37 -40 28 9 -63 16 -70
8396 -70 -63 -82 -66 -44 -4 31 68 97 91 94 65 35 -65 -29 -25 33 -2 75 90 39 80 -10 -24 -26 -109 -92 -82 -15 -43 1 45 -41
$$ packed form
8168B5n0P9%K6k9m3M6q4k6PP5J1N3OK3Mq3o6Rj11J1J3J02K1Rl0j2J7L0r3n3k9
8200a42M3L3N2J5L7Ok0L5n3m1J4K2j0M5N9M7l5j0K2m2p5j9j7l0k1O0O2nK0ql5
8231Io4l5n9jO9j6M2N0O1j0k4j6l3l4KK0K1J9J5P7Q2r2P1n5j19M9n6qO3K9j7R
8263D9O7J0q3m3m5o8JpM2kN4M1Kjj4p6J0m8L2K1L8N4J9N7on1J0n7k3j1l7O8NN8
8297F6N1j8j5q5J9n9rk0k0ON2J3QL4j0n7k4p1M8o2Q3L4K0P3rK7Pp7K0m0jk6O6
8330B4j3N5O1%qMq7o8j2n2KK2N8K2N3om9J4p4n8oj8N7j3N3P2m2J13p8j9q0K5o
8363e4J4N4jK5P5kj1L2p6o5l8%K6K6j9L4L1j5m6ln1k9m3kM4K1L6lO8j9p2P9q6
8396g0Pj9J6K2M0L5L7K9oLk9l0j00L6MN8l5P7J5n1M1r0j4kq3J7J0O7k8M4M4q6
$$ plain form
8428 -41 15 -55 -88 -89 -101 -81 -89 -42 32 53 84 88 38 -31 -36 -41 7 -28 -2 36 54 74 72 84 18 37 -59 -103 -111 -75 -52 -11 43 22
8462 22 11 18 -69 -96 -89 -157 -98 -106 -49 21 23 48 58 27 -27 -37 -36 -55 5 35 96 55 100 95 96 18 28 6 -74 -51 -70 -65 24 32 45
8497 45 -16 -29 -87 -95 -99 -132 -92 -55 -83 -2 6 41 31 -38 -14 -8 -70 -59 -46 -16 17 42 46 113 93 75 -44 -32 -14 -17 0 5 -3 60
8531 60 67 35 60 20 -45 -121 -162 -109 -113 -33 14 -4 40 35 -25 -58 -65 -56 -42 -18 -67 -21 54 90 52 95 42 16 -43 -31 -48 35 -5
8564 -5 30 92 73 94 83 17 -9 -59 -96 -86 -105 -57 -28 -17 0 -16 -15 -29 -119 -46 -126 -104 -76 16 29 75 149 53 38 -5 3 -41
8596 -41 -38 15 -5 88 75 94 118 54 45 -60 -50 -68 -39 -72 -33 -19 -10 42 26 -3 -38 -116 -126 -88 -82 -34 12 20 73 18 34 31 -33
8629 -33 -37 -28 -50 -36 18 25 79 119 125 41 80 32 -11 -5 -6 9 4 42 84 54 42 8 -32 -96 -69 -104 -102 -53 -9 12 32 22 9 -15
8663 -15 -73 -53 -34 -60 -54 -28 7 62 86 112 78 68 -20 -26 26 -9 -3 17 56 93 43 7 -18 29 -58 -81 -72 -49 -26 -36 36 -16
$$ packed form
8428d1N6p0l3jj2K0qM7P4K1L1Mn0o9nnM8l5K6L8J8K0kJ2o6J9r6m4qL6K3M1N4k1
8462B2j1Pq7k7Po8N9qN7P0KK5J0l1n4j0Jj9O0L0O1m1M5nJp8J0k2q0K3j9NQ9QJ3
8497D5o1j3n8qml3M0L7k8Q1QL5j0o9K4Oo2J1J3L0L3K5MO7k0j8j19J2J8lJ7NqO3
8531F0Pl2K5m0o5p6m1N3mQ0M7j8M4no0l3pRJ4K4m9M6P5L6l8M3n3k6n9J2j7Q3m0
8564eL5O2j9K1j1o6k6n0l7J0j9M8K9J1J7j6Jj4r0P3q0K2K8R2J3M6P4r6j5m3Qm4
8596d1LN3k0R3j3J9K4o4rj05J0j8K9l3L9J4RN2j6k9l5p8j0L8OM8M6QN3n5J6lo4
8629c3mRk2J4N4PN4M0Oq4L9m8m3OjJ5nL8M2l0j2l4m0o4K7l5KM9M4K1K0j0j3k4
8663a5n8K0J9k6OK6L5N5K4K6l4j0q8oN2l5OK0L9L7n0l6k5M7q7k3RK3K3j0P2n2
$$ plain form
8695 -16 7 -22 6 -53 -31 -76 -83 -27 -36 9 35 51 83 51 58 -3 13 -16 -55 3 18 118 62 70 86 21 2 -46 -61 -99 -50 -36
8727 -36 -67 11 30 -47 -23 -47 -60 -124 -111 -73 -87 -57 -55 -5 52 4 28 37 16 -15 -6 5 -1 28 48 111 35 72 74 6 -11 -48 -60
8760 -60 -40 -15 13 14 53 0 -11 0 -36 -87 -101 -83 -99 -81 -36 -7 15 4 22 -56 -35 -84 -92 -11 -49 24 76 76 94 82 30 51
8792 51 -42 7 -37 -10 16 -3 66 64 56 30 -30 -26 -162 -80 -53 -85 -42 -42 -31 -40 25 -35 -30 -51 -49 -40 -35 -23 -47 16 31 43 79 49
8826 49 47 0 -15 -53 -16 -43 25 38 33 100 33 -5 -31 -80 -62 -104 -90 -61 23 -37 14 5 -11 -37 -136 -43 -93 -72 -55 5 40 41
8858 41 5 17 44 -26 -19 -22 -51 16 37 75 27 51 74 31 51 -17 -37 -107 -63 -36 -85 -44 -28 34 26 -37 -47 -108 -33 -58 -64 -97
8890 -97 -52 1 26 82 -18 12 7 -18 -61 -12 -23 -35 65 59 51 88 53 68 -15 37 -29 -12 24 33 36 -14 49 0 0 -52 -76 -79 -78
8923 -78 -137 -80 -85 3 -38 24 -28 -70 -43 -55 -25 -62 -20 0 48 41 54 32 67 30 50 -9 -53 5 17 -22 60 53 39 20 -12 -22
$$ packed form
8695a6K3k9K8n9K2m5pN6rM5K6J6L2l2Po1J6k9l9N8J5J00n6QJ6o5j9m8j5l8M9J4
8727c6l1P8J9p7K4k4j3o4J3L8j4L0KN0N7m8K4Rk1l1RJ1oK9K0O3p6L7Ko8j7l7j2
8760f0K0K5K8JL9n3j1J1l6n1j4J8j6J8M5K9K2j1J8p8K1m9qQ1l8P3N2%J8j2n2K1
8792E1r3M9m4K7K6j9O9kqk6o0Mj36Q2K7l2M3%J1rO5o0Nk1KRNJ2k4O3J5J2L6l0
8826D9km7j5l8L7k7O8J3nO7o7l8k6m9J8m2J4K9Q4o0N1rj6k6r9R3n0K1J7O0L5J
8858D1l6J2K7p0Plk9O7K1L8m8K4K3m3K0o8k0p0M4K7m9M1J6O2qo3j0o1P5k5ol3
8890i7M5N3K5N6j00L0nk5m3M9j1j2J00oqL7l5J5q3N2o6J7L6RLn0O3m9%n2k4lJ
8923g8n9N7nQ8m1O2n2m2K7j2L0l7M2K0M8pJ3k2L5l7K0n9m4N8J2l9Q2pj4j9l2j0
$$ plain form
8955 -22 -77 -39 -53 -75 -22 -18 -2 8 -30 -5 -40 -14 -8 -106 -126 -9 -9 -7 29 37 55 34 71 14 37 -23 7 -31 12 79 34 125
8987 125 46 24 -2 -15 -45 -53 -38 -67 5 -17 2 -5 -40 -15 -38 -47 -65 -79 -57 -98 -16 20 27 53 42 -8 -24 -16 -11 37 33 41 7 94
9021 94 89 108 38 10 18 -42 1 3 -4 7 -17 46 12 26 -31 -15 -30 -88 -58 -41 -6 8 0 -9 32 18 -6 -1 0 27 -48 0 39 54
9055 54 110 49 83 25 36 -23 -29 60 -51 53 19 75 38 12 31 5 -2 -38 -32 -45 -55 -55 -39 -4 -2 -42 -18 -24 -37 1 -29 -46
9087 -46 -43 -32 50 76 71 36 40 21 12 -14 -19 -43 21 66 57 85 11 19 45 -57 42 -40 4 -15 -27 -7 -59 -7 -39 -2 -31 0 -55
9120 -55 -39 -51 -66 -43 24 26 51 -19 120 -8 23 -8 29 -8 -34 40 37 36 80 49 8 -16 -21 -13 -53 -27 -23 -22 -14 40 -13 -20 -44 -88
9154 -88 -49 -25 -45 -72 -5 29 4 14 -4 12 -42 21 -33 -12 43 -10 10 -3 48 57 48 54 4 -12 15 26 63 7 -20 33 -19 -2
9186 -2 -4 -16 -33 -54 -84 -94 -93 -46 -26 -43 -10 -27 33 -39 -1 -11 -22 -16 0 -39 29 59 69 50 69 35 -21 4 -23 7 1 86 16
$$ packed form
8955b2n5L8j4k2N3MJ6J0l8K5l5K6Or8k0J17%KL6QJ8k1L7n7K3o0L0l8M3O7m5R1
8987A25p9k2k6j3l0qJ5k9P2k2J9pl5K5k3rj8j4K2m1Q2L6PK6j1n0j6QNM8mQl4Q7
9021I4nJ9p0k8Qo0M3KpJ1k4O3l4J4n7J6j5n8L0J7L5J4qrM1j4k4NJK7p5M8L9J5
9055E4N6o1L4n8J1n9oQ9j11J04l4N6l7k6J9k6pl6Oj3j0%J6L5Km0K4oj3L8l0j7
9087d6LJ1Q2K6nl5Mj9rk6nk4O4M5rK8p4QK6j02R9q2M4j9j2K0n2N2l2L7k9L1n5
9120e5J6j2j5K3O7KK5p0J39j28L1l1L7l7k6P4ljM4l1m1k4nQm0K6MJQN4n3pk4m4
9154h8L9K4k0k7O7L4k5J0j8J6n4O3n4K1N5n3K0j3N1RrOn0j6K7J1L7n6k7N3n2J7
9186bkj2j7k1l0j0JM7K0j7L3j7O0p2L8j0j1OJ6l9O8L0J0j9J9l4n6K5k7L0oQ5p0
$$ plain form
9219 16 35 31 -15 -6 -92 -21 -63 -51 -58 -70 -6 -71 12 -50 -51 -7 -87 -30 -91 5 -31 12 12 22 26 -21 0 -4 3 14 18 20 25 31 38 6 20
9256 20 3 8 -16 12 -49 -36 -15 -21 -44 -30 -42 -31 -54 -27 -26 -47 -83 -29 -30 -32 7 -4 1 -1 -38 -13 -28 1 -29 -3 48 41 27 21 45
9291 45 14 6 14 -21 16 15 -20 -9 16 6 8 -3 12 10 -51 -20 -113 -52 19 -29 -13 28 -26 -5 -62 -14 -15 6 -9 -10 57 35 44 55
9325 55 57 62 43 50 21 26 32 55 40 18 -8 12 -6 -5 -24 -90 -71 -84 -64 -48 -82 -4 -28 1 -34 23 40 -17 -4 -33 33 42 10 30
9359 30 29 69 37 59 73 -9 20 12 46 20 -4 69 84 10 40 2 9 7 -3 -45 -9 -23 -29 -14 -23 5 -30 7 -28 -45 -27 -27 -37 -23
9393 -23 16 10 21 102 40 49 -13 49 73 45 49 11 70 8 59 35 17 13 -18 -19 -26 35 20 -11 -43 -64 -35 -28 -7 -50 5 -9 -49 61
9427 61 -2 36 27 55 19 29 49 -10 -25 7 28 58 83 55 88 56 18 18 -7 16 -33 48 21 1 6 28 7 -34 -7 -1 -45 -1
9459 -1 -32 -25 7 -54 -12 44 -7 11 11 -50 -40 3 22 -17 8 -17 55 99 63 95 -15 1 18 11 44 11 52 40 7 1 -26 -27 12
$$ packed form
9219A6J9mm6Rq6P1m2J2pj2O4o5Q3o2jM4q0N7o1R6l6M3%J0Mm7K1mPJ1MKNOPl2J4
9256B0j7Nk4K8o1J3K1ok3J4j2J1k3K7Jk1l6N4jkL9j1Nkl7K5j5K9l0K6N1pj4oK4
9291D5l1qQl5L7jl5J1K5j0Kj1J5ko1L1r3O1P1m8J6M1n4K1n7M8jK1j5jO7k2RJ1
9325E5KNj9Pk9NOK3j5k2k6K0j8Jj9o6J9j3K0J6l4P8k4K9l5N7J7n7J3k9O6Rl2K0
9359C0jM0l2K2J4q2K9qL4k6k4P3J5p4L0l8Pkj0m2L6j4oJ5rK8l5L7l5j7J8%j0J4
9393b3L9oJ1Q1o2Ro2O2K4k8Ml8N9o2N1k4j8ml1jpO1j5l1l2k1K9PK1m3N5j4m0J10
9427F1o3L8rK8l6J0K0n9j5L2K1L0K5k8L3l2l8%k5K3m9Q1k7k0NK2k1m1K7Om4M4
9459al1PL2o1M2N6n1J8%o1J0M3J9l9K5k5P2M4l6L2j10J6J7pL3l3M1j2l3ok7jL9
$$ plain form
9492 12 -8 1 -26 -64 -36 -28 -48 -53 -44 -9 -18 21 -44 -12 -26 9 0 24 -8 28 7 19 -16 22 -40 -41 15 23 51 16 28 11 19 29 -22
9527 -22 -8 -2 -19 -18 -45 -34 -14 -10 -57 -74 -25 58 -36 -43 -35 -54 -77 -2 -9 24 -11 8 22 55 13 -16 0 -11 29 24 23 4 -12 25
9561 25 -5 71 8 -50 11 -13 -65 -2 -9 -1 13 -18 -12 -24 -16 -37 -11 -65 -19 -54 5 -52 -4 31 25 42 18 -22 -17 -14 -31 51 38 20
9595 20 40 23 7 -7 4 -18 -17 -19 -63 -7 -37 -65 -11 -54 -23 -12 -68 -74 -44 -80 -81 -13 -31 -23 -31 -9 -6 -9 -26 -14 -13 -2 14 2 5
9630 5 17 12 -2 49 3 -21 5 7 -29 0 -19 -7 -16 -43 -17 -56 7 2 -5 -55 -67 -58 -35 -20 9 -25 -42 -1 16 -26 -31 21 33 22
9664 22 -8 8 87 38 36 16 2 21 17 34 -4 53 60 79 42 -16 22 -39 3 -11 -12 -59 -49 -27 -20 -24 -63 -11 -90 -50 16 -43 -16
9697 -16 -30 2 9 59 42 -26 37 25 35 28 12 17 5 69 -40 21 -27 19 17 -30 8 -16 -36 -11 -34 0 -15 -23 -30 5 18 8 -82
9730 -82 -40 -40 -11 -23 0 19 24 36 11 24 -7 32 -9 23 27 4 38 28 42 11 32 25 -24 -3 -18 27 -19 -15 -39 19 -5 -5 -4 -44
$$ packed form
9492A2k0Rk7l8K8Qk0nRL5rL9o5L2j4L5rK4l2L6k1J2l5L8o2jN6QK8l5J2j7QJ0n1
9527b2J4Oj7Jk7J1K0Mm7j7M9Q3r4pQj9k3P5pL3l5J9J4L3m2k9J6j1M0njj9j6L7
9561B5l0P6o3n8O1k4n2O3pQJ4l1Oj2Qk1K6n4M6l5N9n7M8L5oJ7k4m0NLj7Q2j3j8
9595B0K0j7j6j4J1k2Jkm4N6l0k8N4m3L1J1n6oL0l6jO8j8QqK2Llj7J2JJ1J6j2L
9630EJ2nj4N1m6k4K6Kl6K9j9J2rk7K6l9O3npn0j2RK3J5K9l4j7M1J7m2nN2J2j1
9664B2l0J6P9m9kk0j4J9mJ7l8N7PJ9l7n8L8o1M2j4jm7J0K2Pml9N2p9M0O6n9K7
9697a6j4L2PN0j7o8O3j2J0pj6Nj2O4j09O1m8M6km7L8k4k0K5k3L4j5qpL5J3j0r0
9730h2M2%K9j2K3J9NJ2k5J3l1L9m1L2Mk3L4j0J4l1K1pm9K1j5M5m6Mk4N8k4%Jm0
$$ plain form
9764 -44 -39 -46 -71 -24 -19 -3 -3 28 9 11 4 5 -5 6 2 -5 23 52 -49 47 48 13 33 -14 -4 -14 30 11 16 -20 5 -21 13 -43 -30
9799 -30 -31 -37 -78 -69 2 -10 -2 -29 -40 0 12 -30 -20 -19 -21 -34 22 13 1 67 40 48 38 -1 15 -37 45 17 38 10 -8 2 5 15 28
9834 28 -11 -37 13 -51 6 -38 -9 -33 -12 29 16 -10 -32 -46 -55 5 -32 4 -6 37 10 -18 79 -10 30 36 59 71 23 32 14 39
9866 39 66 11 2 -56 -11 7 -28 -21 -3 -59 9 7 -49 -18 -53 -45 -46 -65 -32 -6 17 -14 -10 -24 -3 -7 43 -18 22 15 73 41 65 42
9900 42 59 76 10 -16 -8 -67 -9 12 -13 -19 -52 17 -57 -23 -33 -41 -43 -31 -62 -29 -5 -35 -13 41 8 16 -21 -59 -4 18 -9 28 25
9933 25 -3 44 44 76 -23 34 -12 16 -33 5 3 -11 29 3 -15 56 19 3 -47 -5 -46 -30 -47 -54 4 -54 6 -13 -49 -68 -65 -75
9965 -75 -40 -26 -34 -7 1 38 31 -3 2 16 8 14 -82 -39 -17 48 50 75 55 -17 -38 -34 6 -32 -37 -25 -60 -40 -36 -37 -13 -7 -48 -40 -21 -26 -1
10002 -1 -51 4 -31 -24 18 -8 -8 21 -21 26 -40 -2 60 2 28 34 20 58 -4 -26 -18 -13 -26 -6 -56 35 13 -44 -22 -60 -14 -65 -25
$$ packed form
9764d4Npk5M7NJ6%L1j9KpJj0J1mpK8K9j01R6Jl5K0m7J0j0M4j9Nl6K5k6L4n6J3
9799c0jom1RP1j2Qk7j1M0J2m2J0Jkj3N6rj2O6k7Qj0l9J6n2Q2k8K1k8j8J0LJ0J3
9834B8l9k6N0o4N7m4K9k4K1M1j3k6k2j4rO0l7L6j0M3k7k8R7q9M0OK3J2m8Rj8K5
9866C9K7n5rn8M5J8l5PJ8n6O8kn6L1l5Qjj9L3K6K3l1Mj4K1mN0o1M0pN8l2K4k3
9900D2J7J7o6k6Qn9N8K1k5ol3O9p4L4j0qkJ2l1L3K4l0K2N4l3Ql7l8N5K2k7L7l
9933B5k8M7%L2r9N7m6K8m9L8kj4M0k6j8P1l7j6n0M2m1J6j7pN8n8O0j9l6j9Lj0
9965g5L5J4qK7QL7pl4NJ4qOr6M3K2O5KK5k0p2k1MM0l8nJ2l5K0MjK4Om1QJ9nK5
10002an0N5l5PM2k6%K9m2M7o6L8O2n8K6Oj4L8o2k2QNj3K0n0R1k2n7K2l8M6n1M0
$$ plain form
10035 -25 -19 -67 -18 -25 -19 -21 -13 -5 1 2 4 11 -25 -24 40 12 40 8 37 6 29 -40 -25 -13 -34 -1 41 0 41 -1 -25 -25 -66 -26 -54 -38
10071 -38 -51 14 -25 -6 16 1 -45 -43 -71 -47 -18 -20 -23 12 47 53 45 50 29 40 33 -15 -19 20 60 78 33 9 42 36 23 -40 -18 -31
10105 -31 -12 -39 -10 -22 -11 36 -20 25 -30 -19 -46 -39 13 21 -27 27 11 43 32 34 -5 18 3 -42 -20 12 77 11 69 24 28 14
10137 14 5 14 -35 3 -20 -25 2 42 -9 -35 -18 -11 -30 -18 -54 -68 -63 -6 23 32 31 -12 10 -50 3 -59 18 -13 -17 7 22 59 36 7
10171 7 45 -8 -1 -2 -6 -24 65 22 -6 1 -5 -22 -2 -37 -53 -26 -31 -5 -42 -3 54 36 24 -9 2 -17 -7 7 18 18 29 61 16 19
10205 19 46 3 9 16 -8 11 35 48 23 44 47 87 -12 -39 -71 -1 -40 -55 9 -34 -48 -5 29 -41 -5 9 -64 -32 -35 21 -21 33
10237 33 29 33 14 12 93 26 -26 4 -12 38 -21 35 51 11 25 19 19 -18 -45 -70 16 -8 -15 -38 -1 10 -17 -23 -19 -73 -45 -62 -33 26
10271 26 43 23 19 69 78 30 -22 -32 -28 -3 16 40 -2 60 42 32 29 47 17 -52 9 -35 -32 9 2 -4 -28 52 -63 -38 -68 -83 -60
$$ packed form
10035b5Om8M9pOkQQOJKPl6JO4k8K8l2K9l1K3o9J5J2k1L3M2m1M1m2k4%m1M0k8J6
10071c8j3O5l9J9K2j5m6Kk8K4K9klL5L5OqNk1J1pm8mL9M0J8m5k4L3oj3o3K2j3
10105c1J9k7K9j2J1M7n6M5n5J1k7PN2Qm8N4j6L2j1Kl9K3j5m5K2L2O5o6N8m5Mj4
10137A4rRm9L8k3nK7M0n1k6J7Pj9J2l6j4NN7K9Rjm3K2o0N3o2P7l1mK4J5L7k3k9
10171GL8n3Pjmj8Q9m3k8Poj7K0l5j6K7nK6l7L9N7j8j2l3J1j9J0J4J1%J1L2m5L
10205A9K7m3OPk4J9K4J3k5K1LM0r9k7l2P0l9j5O4m3j4M3L4p0L6J4p3L2lN6m2N4
10237C3mMj9kQ1o7n2L0j6N0n9N6J6m0J4o%l7k7k5Q6k4pk3L7J1k7oMn4K8j7K9N9
10271B6J7k0mN0Rm8n2j0MK5J9K4m2O2j8j0lJ8l0o9O1m4LM1pok4Q0j15K5l0j5K3
$$ plain form
10304 -60 -34 -16 -43 4 47 7 -3 -13 8 -56 -20 11 47 32 70 34 3 88 42 42 -49 -3 -25 -4 40 -5 28 -35 4 9 -50
10335 -50 22 -39 -50 -113 -67 15 -51 -30 -31 -12 -32 -38 -4 -60 -20 -52 -33 -17 46 35 16 32 -15 15 -5 -7 5 -10 -21 11 58
10366 58 -29 -12 16 -48 -54 -16 -61 -25 -42 -32 7 -10 8 1 -87 -52 -65 -48 -40 -46 -35 1 -10 -26 35 -8 55 -40 11 -43 23 -15
10398 -15 -25 26 -19 7 26 15 -11 -10 -5 -37 -33 -53 25 -16 6 23 -59 -39 -42 -30 -83 -48 -45 -46 -37 -20 21 41 37 -13 -38 -24 11 26
10432 26 -34 26 3 12 33 48 37 -8 -24 -20 -40 3 -36 -29 34 -8 4 -7 -42 -41 -6 -97 -27 -46 -25 -7 2 8 -16 8 -8 -2 3 0
10466 0 -53 -7 -41 -9 47 -17 -20 36 42 24 -40 -4 -8 -26 -45 33 39 49 26 -16 -7 -106 -37 -55 -20 -24 -25 -1 -22 21 -61 22 -52 -51
10500 -51 -32 -23 44 -50 36 23 -21 52 50 -15 -25 5 -25 24 -3 39 17 46 50 -18 -25 -6 -1 -53 -42 -6 -38 2 21 21 -21 2 -16
10533 -16 -25 -1 -68 -9 -10 -22 -1 43 70 60 74 -26 31 -67 -12 -4 35 34 28 59 30 22 56 45 3 10 -19 18 2 -6 -1 -21 -7 19
$$ packed form
10304f0K6J8k7M7M3m0j0j0K1o4L6L1L6j5L8l6l1Q5m6%r1M6k2K1M4m5L3o3L9Nn9
10335e0P2o1j1o3M6Q2o6K1jJ9k0oL4n6M0l2J9J6O3j1j9J6m7L0k0kJ2j5j1L2M7
10366E8q7J7K8o4oL8m5L6j7J0L9j7J8pq8L5j3J7QoJ1L6j1j6O1m3O3r5N1n4O6l8
10398a5j0N1m5K6J9j1k6JNl2Mk0P8m1K2J7q2K0lJ2n3L5LjRJ7M1K0mn0k5J4L5J5
10432B6o0O0k3RK1J5j1m5j6Mk0M3l9PO3m2J2j1l5JL5r1P0j9K1J8ROk4K4j6ONl
10466@n3M6l4L2N6o4lN6Oj8o4L6mj8j9P8OJ0k3m2Rr9O9j8L5mjK4k1M3q2Q3p4J
10500e1J9RO7r4Q6j3m4P3ko5j0L0l0M9k7M2k2K9Mo8pJ9Nn2J1L6l2M0J9%m2K3j8
10533a6rK4o7N9jj2K1M4K7j0J4j00N7r8N5QL9joL1k9qL4j1m2Pk9L7j6qNk0J4K6
$$ plain form
10567 19 -6 1 -38 5 -103 -41 -27 3 -20 -8 64 22 -16 -15 -37 -9 -22 20 -6 39 35 28 51 -22 -4 -29 -22 -28 -20 45 19 7 76
10600 76 39 6 -20 -42 2 -2 21 -20 35 -37 -6 13 1 -22 2 -56 -20 -40 0 3 67 -12 55 77 56 61 35 -8 -4 -7 30 23 30
10633 30 0 18 17 21 5 -35 -7 -6 11 -53 -16 -2 13 -18 23 8 -48 -38 -52 -38 -24 -50 23 9 39 48 -8 -10 1 13 -39 -24
10665 -24 -8 4 5 20 74 51 52 -15 -80 -34 -61 -61 -72 3 37 -18 55 -38 -19 -31 -33 -32 -53 -33 -60 -3 -27 33 -7 26 -13 -16 1
10698 1 -67 22 -7 37 14 -2 44 16 25 -7 -21 -31 -2 -58 -10 -6 3 26 -13 -13 -7 -23 -43 -32 -67 -41 -39 -34 -6 -13 -16 5 -20 -37 -43
10733 -43 -25 40 -6 -55 3 34 40 56 2 37 -3 33 -68 30 8 33 -2 34 -3 -15 22 -47 -64 -31 -40 -40 -32 3 -17 -31 -38 -26
10765 -26 -9 -40 -45 -58 0 -11 -15 16 -13 34 29 36 25 -26 37 -56 -18 15 42 3 -47 16 34 45 11 -16 -78 -28 -42 -60 11 -23
10797 -23 18 -15 -43 3 -87 -22 -32 -10 -41 34 -17 9 61 21 53 -50 -40 -18 -35 -27 -27 31 20 27 -12 26 -23 -23 1 1 -44 -43
$$ packed form
10567A9k5Pl9M3j08O2J4L0k3J2P2m2l8Jk2K8j3M2k6M5mpK3p3J8k5PoQO5k6j2O9
10600G6l7l3k6k2M4mK3m1N5p2L1J9j2k3K4n8L6k0M0LO4p9O7K2k1Nk6m3MlL7pP
10633C0l0J8jMj6m0K8JJ7o4L7J4J5l1M1j5n6J0j4J4J4k6P3j4L0Rn6kJ1J2n2J5
10665b4J6J2JJ5N4k3Jo7o5M6k7%j1P5L4n5P3r3J9j2kJk1K0k7N7k4O0m0L3l9lJ7
10698Ao8Q9k9M4k3j6M6k8Rl2j4j0K9n6M8MRK3l9%Oj6k0J1l5K6KNK8plK1k5j7o
10733d3J8O5m6m9N8L1OJ6n4L5m0L6j01R8k2K5l5L6l7j2L7o9j7L3r%QL5k0j4pJ2
10765b6J7l1nj3N8j1mL1k9M7nPj1n1O3r3L8L3K7l9n0O3J8J1l4k7o2N0j4j8P1l4
10797b3M1l3k8M6r0O5j0K2l1P5n1K6N2m0L2j03J0K2j7Q%N8j1Pl9L8m9%K4%m5J
$$ plain form
10829 -43 12 -23 3 26 34 -2 -13 -2 -75 -39 -19 -10 -11 -4 -39 -12 43 -9 -34 -40 -45 -9 -57 19 -7 3 -3 -19 58 21 7 -5 -12 36
10863 36 2 16 -15 8 17 10 29 14 -8 -19 -40 -40 -17 -14 1 37 6 19 48 3 -18 25 6 -1 34 -7 -2 35 22 21 -13 -10 9 -29
10897 -29 -2 22 28 -18 -30 47 29 3 31 -15 12 -23 -56 -66 -65 10 -3 -12 28 -5 -4 22 -55 -22 -22 -9 7 -36 59 6 -5 20
10929 20 -20 16 -2 43 27 3 14 71 71 25 36 -26 8 -35 -1 -13 7 14 -40 49 -3 31 -3 -60 -19 -45 -35 -29 -39 23 14 28
10961 28 9 82 -18 -2 -16 -37 -8 20 38 8 39 68 6 52 51 -13 3 -31 12 22 -31 43 0 0 -10 22 -10 -14 -26 -49 -18
10992 -18 -33 16 21 -35 11 13 -59 -17 -7 -2 14 -12 -31 3 -3 23 -5 18 22 -16 -56 14 -2 -25 28 61 -24 82 1 13 -55 -53
11024 -53 -30 -54 -32 -6 21 -10 24 39 -21 0 -25 0 -53 -33 28 15 38 3 60 13 56 75 54 33 2 36 25 -44 34 32
11054 32 59 -9 45 -36 -24 -30 -9 -29 -43 19 -33 26 -12 -21 -9 -18 -26 -38 -50 -28 -38 54 63 63 17 65 -14 -20 -37 -9 -13 30 -18 24
$$ packed form
10829d3N5l5K6K3Ql6j1J1p3L6K0RjPl5K7N5n2k5onL6m8P6k6J0oj6P7l7j4j2pM8
10863C6l4J4l1K3RpJ9j5k2j1k1%K3LJ5L6l1J3K9m5k1M3j9pL5m1NL7j3jl4LJ9l8
10897b9K7K4Om6j2P7j8k6K8m6K7l5l3j0JP5j3rM0l3JK6p7L3%J3J6m3R5n3j1K5
10929B0m0L6j8M5j6k4J1N7%m6J1o2L4m3L4j2K0Pn4Q9n2L4l4n7M1k6J0Oj0O2rJ4
10961B8j9P3j00J6j4k1K9K8J8l0L1K9o2M6jo4J6l4M3J0n3P4m3%j0L2l2mj2k3L1
10992a8j5M9Nn6M6Kp2M2J0NJ6k6j9L4oK6k8K3Ml8m0P0j6k3N3L3q5J06q1J2o8K
11024e3K3k4K2K6K7l1L4J5o0K1k5K5n3K0O1j3K3l5N7m7M3J9k1k1l1L4j1o9P8k
11054C2K7o8N4q1J2oK1k0j4O2n2N9l8rJ2rqj2j2K2j0R2R%m6M8p9oj7K8mM3m8M2
$$ plain form
11088 24 53 91 62 -11 -39 -40 -37 -33 -37 -34 -6 5 28 25 -41 -24 -69 -46 3 -45 -3 12 10 10 20 -19 53 -33 -46 -101 19 -70 53
11121 53 4 53 32 34 62 0 13 -29 23 -35 31 -33 -15 -4 8 20 -16 4 -30 -46 -34 -52 -20 -28 -3 12 -25 32 16 18 -45
11152 -45 -40 -28 -33 -28 12 1 1 8 16 -6 29 -43 3 26 -2 -19 -6 -6 -8 -27 -3 -14 -10 -5 -17 -15 -82 26 -50 4 10 -16 -48 -76 -22
11187 -22 -44 0 0 -69 11 -24 32 6 -19 11 -36 -6 -37 -36 34 23 29 1 21 -23 12 -39 49 -53 -28 -63 -56 17 -42 -20 -21 -7
11219 -7 -12 -39 -26 -75 4 -42 -9 19 11 16 -2 1 -32 32 34 -21 16 11 9 27 37 71 4 32 -20 26 -18 -25 -35 -29 11 -8 -23 2 4
11254 4 -25 -25 -30 -47 -78 -50 -49 16 -10 1 33 4 13 -2 -54 -12 -14 -33 37 39 53 48 50 41 -2 -4 20 0 -3 12 20 47 11 25 -12 -5 -37
11291 -37 24 -4 -23 -6 -30 -11 -33 -8 -8 14 -15 -2 -28 -20 24 -47 -5 29 31 23 -29 3 44 5 -12 -23 8 1 48 46 49 20 22 2
11325 2 -16 13 13 1 -14 -28 25 0 35 7 -1 -23 -25 4 -14 -11 -29 -6 32 9 -17 -4 4 25 13 24 8 14 33 30 16 -3 10 38
$$ packed form
11088B4K9L8k9p3k8jLMmLK8J1K3lo6J7m5K3M9m8M2J5k%J0l9P2q6j3n5J20q9J23
11121E3m9M9k1KK8o2J3m2N2n8O6o4J8J1J2J2l6K0l4j6J2j8L2qK5J5l7N7j6Ko3
11152d5NJ2nNM0j1%PQk2L5p2M6K3k8j7J3%kj9K4j1MNj2Ko7J08p6N4Ok6l2k8N4
11187b2k2M4%o9Q0l5N6k6k5L0m7L0l1JP0j1Ok8K0m4L5n1Q8j02K5l5PP3n9K2jJ4
11219gnk7J3m9P9m6L3K8qNj8Ll3O4Kn5L7nkJ8J0L4o7K8n2M6m4pj0OM0j9j5K5K
11254Dk9%nj7l1K8JO5k6J1L2k9Rj5n2M2kj9P0KJ4nKrm3kK4k0lJ5QK7l6J4l7Pl2
11291c7O1k8j9J7k4J9k2K5%K2k9J3k6QM4p1M2L4Kqn2L2M1l9j7j1L1pM7kLk9Kk0
11325Bj8K9%j2j5j4N3k5L5k8qk2kK9j8Lj8K3L8k3k6J3QK1j2J1j6OJ9lj4j9J3K8
$$ plain form
11359 38 5 -10 20 -39 65 -18 38 -12 62 15 36 21 38 13 -68 -1 -16 -36 -12 -14 18 30 18 -29 20 32 -1 -6 -24 20
11389 20 -5 -7 42 14 47 -1 39 -42 23 0 3 10 -46 22 -16 27 -33 -18 -40 -16 -45 -38 -38 37 18 16 12 17 2 37 -48 -37 -23 17
11423 17 0 19 40 -4 35 13 -1 -9 0 2 -5 34 40 -28 -26 -35 -9 32 38 3 -50 -4 -7 -84 -9 -27 9 -2 20 -47 -47 -23 -65 -25 -49
11458 -49 4 55 41 39 47 29 33 -18 -13 -37 44 4 57 4 13 40 18 -10 -17 -15 -26 12 4 -50 43 -20 7 -18 -12 -28 -30 -1 -1 -102 -50
11493 -50 -18 22 -24 35 -11 10 -32 4 -16 11 -6 -50 -1 -46 6 20 12 10 -11 -13 -42 25 -16 -1 7 -1 -74 -53 0 -74 14 -21
11525 -21 -55 2 -8 -40 -71 -13 -53 43 -4 -30 -20 -72 -3 -14 16 24 -35 -31 -26 40 31 44 -17 -3 -11 -35 -18 -19 -24 0 -13 -19 22 -22
11559 -22 8 -42 -46 -41 -2 3 -36 -23 -4 -4 -14 -25 -14 -9 -19 -8 -54 -26 -42 -3 32 2 -51 -14 -9 16 22 -49 22 2 -8 -10 -38 14
11593 14 -43 -5 -1 3 0 -20 -18 13 -16 21 8 -22 -28 -48 -21 -26 -33 9 2 -15 26 23 32 -10 -19 31 -15 -21 17 -7 -32 8 -30 21 29 -1
$$ packed form
11359C8l3j5L0n9J04q3N6n0P4m7K1j5J7k5q1O7j5k0K4kL2J2j2m7M9J2l3nj8M4
11389B0k5kM9k8L3m8M0q1O5k3LPn6O8l8M3o0J5k2K4k9P%P5j9kmNj5L5q5J1J4M0
11423A7j7J9K1m4L9k2j4qRKpL9Oo8KrK6M1Ol5n3M6lp7P5j8L6j1K2o7%K4m2M0k4
11458d9N3N1j4kQj8Mn1Nk4Q1m0N3n3RK7k2k8pKj1L8qn4R3o3K7k5Oj6kK9%j01N2
11493e0L2M0m6N9m6K1m2L6k0K7j7m4M9m5N2J4qkk1kk9O7m1J5Qqp3K1N3p4Q8l5
11525b1l4N7j0l2l1N8m0R6m7k6J0n2O9j1L0Qn9MNO6rJ3o1J4qk4J7jnK4j3oM1m4
11559b2L0n0mNL9Nl9J3J9%j0j1J1Nj0J1m6K8j6L9L5l0n3L7NK5Op1P1k0j0kk8N2
11593A4n7L8MMlk0KL1k9L7j3l0ok0K7npM2pj7M1lRm2rN0m6oL8k4k5M0l8N1Ql0
$$ plain form
11629 -1 -41 -35 9 -33 -14 8 20 -8 19 -62 -33 -8 -31 -12 31 38 -14 19 -8 -47 -18 9 29 21 27 -13 -3 15 -30 10 -8 -18
11661 -18 9 -1 -38 16 48 -49 39 -39 30 31 -3 31 -21 12 22 -12 11 -17 -30 -53 -20 -15 15 -29 -27 7 -26 5 -9 49 -3
11692 -3 20 50 -21 34 -5 33 -39 -6 56 -4 28 45 21 12 20 15 -13 -2 12 -25 -14 -31 -16 10 31 -30 41 18 -53 23 2 36
11724 36 0 -6 14 27 13 19 28 23 20 -14 56 17 -13 39 12 5 35 -7 28 -12 14 24 19 -4 26 11 36 37 11 1 25 -6 -19 -39
11758 -39 -12 10 -8 14 12 5 13 41 43 -13 60 39 24 5 -22 26 -8 35 1 1 17 8 -16 35 1 23 8 -4 -12 -4 1 10 -5 -38 0
11793 0 -2 17 -38 -9 23 19 14 10 -7 -8 3 -45 33 39 -6 19 41 -2 55 49 -4 40 1 -2 27 14 32 34 -47 20 -4 14 -24 -27 13
11828 13 -49 -61 -18 -10 1 -52 -32 -11 -3 3 -29 21 -20 -46 15 -6 -12 50 16 12 -24 -2 -6 32 18 34 -34 19 -38 -30 37 -23 31
11861 31 -32 2 29 -11 -24 -40 -4 -44 -14 -22 -24 -79 -23 -25 -31 -36 -63 33 -38 4 9 21 -22 13 -14 -39 30 17 -9 42 30 20 8
$$ packed form
11629am0OM4m2J9K2J2k8K7q1K9K5k3J9M3Pn2L3k7l9K9K7K0qOm0J0J8m5M0j8j0
11661a8K7j0l7N4L2r7Q8p8O9Jl4L4n2L3J0l4K3k8j3k3L3NL0m4KL4l3L1j4N8n2
11692cK3L0p1N5l9L8p2L3O2o0L2J7k4rQnk8J1J4l7J1j7J5K6K1o1P1k3p1P6k1L4
11724C6l6oK0J3j4ORnll4P0l9l0N2k7pL0m2L5m0K6J0nk3L0j5K5Jk6j0K4l1j3k0
11758c9K7K2j8K2kpQK8Kn6P3k1j5j9k7M8l4M3l4%J6rk4N1l4K2j5j2qQNRj5l3L8
11793@kJ9n5K9L2mnmj7jJ1m8P8Om5K5K2m3N7on3M4l9lK9j3J8Kq1O7k4J8l8lM0
11828A3o2j2M3QJ1n3K0K1QOl2N0m1k6O1k1oO2l4ml6K2mL8j4J6o8N3n7QO7o0N4
11861C1o3L4K7m0j3j6L6m0L0qkn5N6konk7R6p1M2NJ2m3L5k7k5O9j3k6N1j2j0j2
$$ plain form
11894 8 -5 20 -29 -6 22 2 11 0 -24 -25 -14 3 -23 -14 -59 -22 24 -7 -9 -6 33 -19 -3 8 36 11 -39 4 14 53 14 -27 4
11927 4 24 18 -38 -24 -1 -12 21 -33 21 9 -8 20 -10 48 -58 -20 -69 19 -17 -28 16 -69 -10 -22 9 -16 20 12 -61 -20 -24
11958 -24 7 45 -36 8 -35 -2 6 -54 -19 9 8 -12 -11 -1 40 -5 -36 -14 0 -39 6 -12 -30 -48 -24 -9 -16 42 -10 -27 1 -12
11990 -12 -46 -13 -5 12 -7 -38 42 43 -13 32 -5 -38 32 9 14 -12 2 7 33 54 23 -1 23 -1 -13 6 0 -5 -38 2 30 -64 10
12023 10 -30 15 23 -15 -1 -8 7 41 32 7 -11 3 -12 -7 -35 4 60 -9 11 7 24 33 -7 -20 -33 17 -11 7 1 11 51 18 20 -28
12057 -28 12 3 6 -2 -3 2 8 46 23 20 23 24 -17 -23 55 5 -22 56 8 6 63 -31 -5 1 33 42 93 -39 12 35 -3 15 30 35 16 11 -49
12094 -49 2 -27 -58 -6 -16 -10 14 -32 26 -6 26 8 -22 17 3 19 -3 14 32 15 49 -8 52 3 54 -9 61 2 -5 10 -3
12125 -3 24 14 -12 17 7 -17 10 -25 -41 7 48 -21 40 -18 52 31 -11 -1 -9 48 -9 -15 -22 30 -25 16 25 -1 -3 -21 13 28 14
$$ packed form
11894Hj3K5m9K3K8k0Rj1k4jJ1J7k6Rm5L7M6l1kLL9n2J6J1K8k5n0M3J0L9l9m1L1
11927DK0on6J4K3j1L3n4N4j2j7K8l0N8j06L8m9Q8l6j1M4q5N9j2L1k5L6qp3M1m
11958b4L1L8q1M4m3L3Qo0L5K8jk0JJ0M1m5l1K2J4l9M5j8j8j8K4J5pN8n2j7K8j3
11990a2l4L3QJ7j9l1Q0Jn6M5l7l3P0k3Nk6J4NK6K1l1k4K4k4j2J9onl3M0K8r4P4
12023A0m0M5Ql8J4pJ5L4rk5j8J4j5Nk8L9N6o9K0mJ7Rm0j3j3N0k8J8oJ0M0l3Km8
12057b8M0rLqjNOL8k3lLJm1oP8n0k7P8m8kN7r4K6OL2RN1j32N1K3l8J8J5Nj9no0
12094d9N1k9l1N2j0OK4m6N8l2L2j8l0L9j4J6k2J7J8j7L4n7O0m9N1o3P0n9pJ5j3
12125cK7j0k6K9j0k4K7l5j6M8M1o9O1n8P0k1m2J0qN7n7opN2n5M1Rk6kj8L4J5j4
$$ plain form
12158 14 -4 43 -13 6 26 18 -29 -12 -17 -32 10 -22 42 -38 6 6 9 14 -10 0 -21 -3 -8 -11 -5 -22 -3 25 -37 -38 17 17 -48 23 10
12193 10 3 36 9 14 -47 37 -30 -83 15 -42 31 8 33 3 2 5 -78 47 -2 -43 19 -56 8 -24 22 15 0 -14 32 -12 -21 -4
12225 -4 -42 14 -1 17 0 -2 35 -29 -9 -54 2 -22 35 -13 19 2 -24 27 -47 -41 -53 -77 4 0 -38 14 11 4 -6 -39 -1 -6 19
12258 19 -32 -26 -16 -1 -38 -17 -12 -17 28 -5 9 -36 -17 -6 6 3 -1 8 15 -20 -7 -6 -28 -28 -41 24 -21 -17 -42 -26 5 -5 -16 -26 2
12293 2 -13 -63 10 -1 -45 -35 -37 -16 -43 -7 -22 20 -18 56 -8 8 -3 0 41 -36 29 18 -7 3 37 8 -71 17 8 -4 -9 -4 3
12326 3 39 -8 -26 1 -21 -13 25 -29 1 -21 -15 -3 -83 -30 21 32 -1 11 -21 13 -13 -36 -2 6 -49 -29 -4 39 -7 -30 27 -12
12358 -12 -14 -6 25 0 -33 -21 -21 -9 -7 4 3 -53 -19 -18 -13 -8 5 -10 -72 15 -37 17 -5 -9 19 -47 -35 21 -24 6 18 15 -48 27 -43
12393 -43 46 -19 -8 -42 -9 19 -5 30 -23 32 19 8 -21 -19 20 -1 13 -24 1 36 10 42 26 37 0 -35 -33 4 59 -24 22
$$ packed form
12158A4j8M7n6J9K0qm7J7nj5M2l2O4q0M4%LNk4J0k1J8nlOj7J9K8o2jN5%o5P1j3
12193A0pL3k7No1Q4o7n3R8n7P3k3K5l0jLq3J25m9m1O2p5O4l2M6pj5j4M6m4rJ7
12225dl8N6j5J8j7kL7o4K0m5N6k4N7m8L2j7k6N1p4Oj2k4Q1ml8N2lpj0l3L8nK5
12258A9n1OJ0J5l7K1NnM5l3J4m5J9J1J2lmRPl5J3Jk2%j3O5m5Mk5J6L1j0j1j0K8
12293Bj5n0P3j1m4J0kK1k7L6j5M2l8P4o4J6j1LM1p7O5j1k5J0L4k9p9Q8rj2nNP
12326CL6m7j8K7k2QL8n4L0k2OJ2q0N3N1J1l3J2l2L4k6k3L4Qn5K0K5M3m6k3N7l9
12358a2kQL1k5l3J2%J2KJ1jn6L4JNNJ3j5o2Q7n2N4k2mK8o6J2N6m5L0J2lo3P5p0
12393d3Q9o5J1l4L3K8k4L5n3N5j3j1k9KL9k1J4l7K5L5k6L2j6J1l7l5KL7N5q3M6
$$ plain form
12424 22 13 11 13 0 46 21 0 27 29 -11 28 7 69 0 -13 22 -3 8 -17 11 -43 -3 -29 -33 -4 46 17 -3 -38 9 1 -7 15
12457 15 17 -54 22 -23 29 -21 -30 -15 32 15 -13 -14 18 -36 27 29 5 24 29 26 -18 7 -14 43 -36 -34 11 44 4 -15 -35 -51 -9
12490 -9 -44 -8 -33 7 12 -14 54 9 35 11 -49 29 -36 44 -2 8 62 -22 -5 -9 45 -24 4 10 33 -22 -24 39 8 -12 -24 5
12522 5 -25 -5 2 28 56 25 21 34 33 29 71 0 28 21 -22 2 -7 -17 -7 13 23 70 -17 14 -7 -15 -48 14 18 10 14 -34 -8 -26 -1
12557 -1 20 -5 -8 -20 -1 18 35 2 45 -19 -18 -25 -19 34 39 32 21 -18 39 74 -28 -15 29 -3 1 -26 -61 8 19 9 -20 13 20 1
12591 1 12 1 -18 -5 5 -3 20 34 31 -53 9 -25 15 39 2 -43 -48 -2 -13 18 -2 35 -14 -13 17 -7 -9 -2 12 5 25 -23 -21 47
12625 47 14 24 12 -17 -4 -23 15 -14 -11 9 -34 -63 45 -11 -26 23 22 -40 23 -32 -10 17 -15 -27 -10 15 -2 50 -68 -5
12655 -5 -13 -18 0 23 34 -38 9 -30 9 29 -25 0 -18 -27 6 5 -37 14 -9 -25 -29 -11 -15 -38 10 7 1 3 4 8 19 5 -39 -11 -2 -61
$$ packed form
12424B2rkKj3M6k5k1K7Km0L9k1O2o9j3L5k5J1k5K8n4M0k6mK9N0k9k0l5M7qqK2
12457A5Kp1P6m5N2n0rJ5M7j7k8jL2n4O3Kk4J9Nlm4K5k1N7p9KM5L3m0j9k0j6M2
12490il5L6k5M0Nk6O8m5K6k4o0P8o5Q0m6J0N4q4J7mN4o9K8OK3n5kO3l1k0j2K9
12522El0K0PK6K8l1mJ3jmM2p1K8pm3K4rj0J0K0J0M7q7L1k1ql3O2MqMm8K6j8K5
12557aK1k5lj2J9J9J7l3M3o4JpON3Npj1l9N7L5j02J3M4l2Mk7l5O9J1j0k9L3Pj9
12591AJ1j1j9J3J0qK3J4lq4O2l4M0K4l7m5nM6j1L1k0L7m9JL0k4kPJ4pK0m8KO8
12625D7l3J0j2k9J3j9L8k9LK0m3k9J08n6j5M9jo2O3n5K2K7l2j2J7K5j7N2j18O3
12655eqnJ8K3J1p2M7l9L9K0n4K5j8rL3jm2N1k3j6mJ8mk3M8loKJMJ1j4m4K8Rn9
$$ plain form
12691 -61 6 -22 -8 43 33 -21 -36 23 -11 17 -33 -30 43 -9 -48 -24 8 -24 27 -23 -28 -37 0 25 18 2 -18 -13 21 -7 -54 16
12723 16 -21 -31 -21 -7 -11 -12 -37 -9 14 27 4 13 -28 -14 4 -17 -8 29 -7 -8 -19 -1 -16 -18 26 -23 -35 0 -17 24 -21 -9 -2
12756 -2 -45 49 -4 -26 -8 19 26 -52 54 -25 -7 33 25 59 5 48 9 39 27 20 -4 12 15 -1 4 24 -6 22 -40 31 1 5 -19
12789 -19 -54 -30 -10 -8 -8 14 -35 8 -21 11 27 22 6 -15 7 15 5 -19 2 -4 -21 -15 23 -3 -16 46 -19 28 29 -21 4 -30 16
12822 16 -1 29 -30 10 -16 -36 5 -35 0 -9 -44 20 17 -9 3 50 -16 29 -8 -5 4 -19 75 -14 18 0 8 9 15 32 -52 12 -3
12855 -3 -22 0 0 -4 9 7 9 -18 -1 -46 16 -13 35 -37 34 -10 -16 -36 4 11 -14 -4 24 -13 3 21 -7 -9 -23 7 -18 19 18 7
12889 7 6 13 -3 -27 31 -35 -3 -8 -19 3 -24 -24 -2 16 37 -42 -23 -18 -37 20 -8 -13 11 28 18 -22 -4 -9 52 10 3 45 -12 26
12923 26 1 43 -40 2 -13 38 2 -48 16 -28 -10 23 -1 26 -44 10 -31 34 -39 -51 1 -10 8 6 -10 20 6 2 17 25 -16
$$ packed form
12691f1O7k8J4N1j0n4j5N9l4K8n0LP3n2l9K4L2l2N1n0nrL7K5pj6k0NL4k8m7P0
12723A6l7j0J0J4mjk5K8K3J3k3Rm1J4J8k1RL7l6jj1J8j5kM4m9j2L5j7M1m5J2P
12756bm3R4n3k2J8K7Pp8J06p9J8M0qL4n4M3l9L0j2pk4J6Lj6NK0l0K8o2P1l0Mk4
12789a9l5K4K0K%K2m9M3k9L2J6nj6k1K2Qj0k4K1oj7OL8k6j3O2o5M7Jn0K5l4M6
12822A6j7L0n9M0k6k0M1m0L5rl5O4lk6J2M7o6M5l7LRk3R4q9L2j8QJOJ7q4O4j5
12855cj9K2%mJ3kKk7J7m5O2k9M8p2P1m4ok0M0Pk5J0K8l7J6J8k8kj4L0k5L7jj1
12889GjPj6k4N8o6L2nj1K2k7%K2J8K1p9J9Nj9N7k8nK4J7j0m0J8nO1m2pM2n7L8
12923B6k5M2q3M2j5N1l6n0O4m4J8L3k4K7p0N4m1O5p3j2N2j1J8kj6L0j4mJ5Qm1
$$ plain form
12954 -16 49 -20 -8 10 -2 33 -43 16 -26 -3 60 13 7 -22 -37 -27 -16 0 -15 -16 -25 -60 -15 -11 -35 -50 -9 -45 -36 -16 1 -30
12986 -30 -37 16 -25 0 -61 -32 38 -26 -20 15 -15 39 -43 6 -39 -42 42 -21 -26 -1 -31 -4 5 -10 -61 -10 -2 15 -19 -15 -32 -31 -8 14
13020 14 32 7 -20 -37 11 34 -60 10 -1 -11 21 -10 9 -30 -5 -2 13 -15 4 -2 -49 -10 -41 3 -39 13 37 -46 -4 -8 -37
13051 -37 40 -26 23 2 12 -19 -21 -36 -30 4 -1 -37 -30 -53 4 -14 -34 -13 -8 9 10 -75 -12 24 -11 -21 -46 -7 24 7 -26 6 0
13084 0 -40 -28 -32 -22 -40 23 13 29 -62 9 -38 2 -18 27 15 -27 -40 -15 22 -30 18 -25 6 -12 -8 35 22 -16 31 -10 38
13115 38 -28 -28 27 -20 -3 -36 -13 -4 -13 -6 -7 9 -3 -6 -10 -12 1 -16 3 -18 12 -65 -15 -11 -19 -16 -57 -30 -4 21 -34 0 3 16 -21 -11
13151 -11 -21 -35 -11 -14 18 -20 11 -45 10 -20 -23 26 59 6 -32 -4 -94 -37 10 7 10 -8 57 10 -26 13 -12 8 -32 -28 -38 20
13183 20 3 0 5 18 36 -32 35 -18 -14 -28 -54 62 0 -5 -26 -26 31 -14 9 -12 0 3 10 0 -9 12 -3 -16 21 34 58 -15 6
$$ packed form
12954a6O5o9J2J8j2L5p6N9m2K3O3m7ok9j5J0J1J6j5jrl5M5Mk4j5M1l6RK0J7l1
12986c0pN3m1K5o1K9P0o4OL5l0N4q2M9m5lQ4o3nK5l0K7Rj5n1N1QJ7l4Mj7JK3K2
13020A4J8k5k7j7M8K3r4P0j1j0L2l1J9l9K5LJ5k8J9om7L9l1M4m2N2K4q3M2mk9
13051c7P7o6M9k1J0l1kj5OL4nl6Pk3N7j8k0K1NJ7Jq5O3L6l5j0k5L9L1j7l3L2o
13084@m0J2mJ0j8O3j0J6r1P1m7M0k0M5j2m2j3K5L7n2M8m3L1j8MM3j3l8M7m1M8
13115C8o6%N5m7J7l3K3RrPjJ6j2lmkJ3j7J9k1L0p7N0MqLm1K7K6K5n5L4LJ3l7J0
13151a1j0j4K4lL2l8L1n6N5l0lM9L3n3l8K8r0N7M7lLj8O5m7l6L9k5K0m0Mj0N8
13183B0j7lNJ3J8o8O7n3Mj4k6J16o2nk1%N7m5K3k1J2LPj0rK1j5j3L7J3K4p3K1
$$ plain form
13216 6 37 -14 36 36 16 29 -21 -23 27 -12 18 42 15 13 2 13 13 -12 35 -18 23 2 -12 18 -43 44 31 5 -5 12 -22 16
13248 16 0 7 10 20 18 -20 40 1 33 25 29 3 15 5 -6 4 -11 25 -1 -7 38 -24 32 -32 25 9 -5 21 1 -3 -42 15 -19
13281 -19 15 34 15 -17 -13 20 1 17 -7 13 -26 21 5 12 40 -16 62 24 3 36 -6 27 48 36 16 -12 46 0 8 34 26 10
13313 10 11 15 -5 43 -1 -15 -11 -11 0 29 33 -3 48 3 2 -27 -11 -20 -11 -18 26 -9 2 13 18 -41 24 10 25 4 -15 -5 -8 -9 14 19
13349 19 -19 4 -20 -26 8 22 23 -20 19 11 36 26 -4 13 4 -22 9 -4 -31 -3 13 -21 -4 12 7 -36 -41 18 -12 -24 24 12 -30
13382 -30 15 38 7 13 1 -17 -44 4 6 -18 -9 1 -14 -62 11 -44 17 4 8 -10 -28 9 15 20 43 -2 -5 32 -28 -45 39 -16 -47
13415 -47 31 14 5 -13 -16 -22 -23 -6 -33 1 -29 22 -39 -31 -37 -44 -14 -10 2 5 -6 -39 -20 -7 -13 19 -2 31 -3 -20 -30 19 -21 -31 28
13450 28 12 3 8 5 -1 22 -66 5 -11 -16 5 -21 -18 7 9 -54 -47 1 -76 -11 -27 -27 14 21 8 -26 23 -16 -25 -8 9 18 -13 30 -4 -7
$$ packed form
13216FL1n1N0%k0J3n0kN0l9L0K4k7kj1J1%k5M7n3M1k1j4L0o1Q7j3k6j0J7l4L8
13248A6j6PLJ0kl8O0l9L2qMk6J2j0j1J0j5L6k6oM5o2N6o4N7j6j4K6k0ml9N7l4
13281a9L4J9j9l2ML3j9J6k4K0l9M7j6PK8n6P8l8k1L3m2L3K1j2k0k8N8m6QK6qj6
13313A0JMk0M8m4j4M%J1K9Ml6N1m5jk9J6rRpM4l5J1J1Nn9O5j4J5k1j9J0ljK3N
13349A9l8K3k4oL4J4Jm3L9qK5j0l0J7rk6L1j3k7K8J6l4J7J6nm3nN9l0j2M8j2m2
13382c0M5K3l1Oj2j8k7M8Kk4RJ0j5m8P3n5O1j3Mj8j8L7ONK3m5lL7o0j7Q4n5l1
13415d7P8j7rj8lojJ7k7L4l0N1o1QopL0MJ2Lj1l3J9J3oL2k1L3l4j7j0M9m0j0N9
13450B8j6rNloK3q8P1j6nK1k6LK5Ko3PM8p7O5j6%M1Pj3l4M9l9rJ7J7Rl1M3l4l
$$ plain form
13486 -7 -13 -8 -10 10 60 11 -28 -52 19 1 -11 5 -6 13 -7 15 22 -2 -43 -20 18 -27 13 -20 -7 -8 -8 -22 -25 44 -9 7 -48 3
13520 3 -2 27 -13 -16 -14 37 -7 -20 -36 -15 -14 -22 17 -18 4 -6 -5 -13 -11 31 9 -16 25 -50 -22 -24 -35 31 -3 26 -22 47 -32 -26 24
13555 24 -15 1 -3 24 -10 -14 6 27 46 -18 -22 11 16 10 5 -15 -41 18 -38 -13 -10 -37 -44 13 34 14 7 34 1 24 2 14 -2 -15
13589 -15 23 -30 -14 21 30 -20 -25 14 -10 -25 -39 -18 2 -14 -27 26 17 -11 -4 31 42 8 26 -24 -8 -29 22 14 -12 16 -8 29
13621 29 26 10 -51 -11 31 5 27 -28 -33 16 6 12 -19 25 6 -4 -7 3 6 7 59 25 53 -3 31 -26 4 12 3 26 -10 23 -7 3
13655 3 37 -5 35 -19 4 -17 -19 66 -56 23 10 41 -29 -23 27 -52 27 -37 -10 -39 2 31 -17 11 -2 46 -20 7 -17 8 4
13686 4 -18 70 20 45 -26 39 47 -20 20 15 24 18 11 19 18 53 -29 71 1 -22 16 71 36 33 -16 20 -33 3 32 0 8 -54 19 20 -28
13721 -28 12 28 28 19 30 -12 -25 62 -1 54 -12 46 8 10 -18 -1 25 -20 10 -2 2 26 -4 11 18 26 20 20 -13 -57 -39 -10 -12 -14 -18
$$ packed form
13486goNkK0N0m9l9k4P1j8j2J6j1J9k0K2Pk4m1K3L8m5M0l3J3j%j4lO9n3J6n5N1
13520CnK9m0lKN1m4j3j6K1JqL9l5K2j0JqKM2k2k5M1p5K8kj1O6l4K9m8O9p9ON0
13555B4l9J6mK7l4mK0K1J9o4mL3Nonk0k6N9n6K5Lk7pN7K1k0pK7l3K3k2J2j6j3
13589a5L8n3J6L5Rn0nL9k4j5j4K1K0j6j3N3rk8PL5J1l4J8n0J6k1N1qk6K8k4L7
13621B9lj6o1M0M2k6K2n5nM9j0Ol1M4j9j0lJ0LJN2l4K8n6L4n7L0QrK3l6L3l0J0
13655CL4m2M0n4K3k1kQ5j22P9j3L1p0ON0p9P9o4K7k9M1K9m8K8j3M8o6K7k4K5m
13686Dk2Q8n0K5p1O5Qo7M0nRopQjL5q2J00p0k3L8N5l5lm9L6n3L6K9l2Qo2P3Jm8
13721b8M0J6%rJ1m2j3Q7o3N5o6N8l8Kk8J7K6m5L0j2MK4l0J5PQo%l3m4J8K9kkm
$$ plain form
13756 -18 -13 -29 62 -3 -11 -21 25 -38 -14 36 -27 14 -22 -5 -3 -5 37 -18 -29 -24 6 37 -46 -32 -8 37 -17 -32 -38 2 -9 -39 -31
13789 -31 -58 -23 -16 -6 -15 23 -21 11 -31 -27 -8 -14 30 -32 10 46 28 -32 40 -40 -41 -27 -22 -31 44 -22 -1 0 -16 -58 -54 4 -8 -5 8
13824 8 -21 4 59 0 42 0 1 -1 -63 -37 -74 11 -1 -16 -29 -11 -21 0 -7 -1 -41 21 -31 -17 25 -5 -15 -15 9 20 -12 -30 3
13857 3 -46 39 -9 -20 -18 -17 -1 -11 -16 -33 -1 -9 -61 26 -7 -27 -55 5 7 36 -30 2 -71 6 10 -28 34 -4 47 14 -10 -2 5 -36
13891 -36 -4 -8 -43 -43 -10 -12 16 -42 32 -32 0 -3 -39 27 27 46 7 8 19 -19 -18 18 -5 -47 -3 -21 -24 23 -46 45 9 45 7 -20
13925 -20 0 -16 22 -53 40 7 -43 28 -25 2 31 -47 3 -22 6 -1 12 -25 4 -2 -3 10 -68 -12 -21 -31 -70 -32 -25 30 -9 -26
13957 -26 16 -54 20 42 27 10 -32 -4 6 1 3 23 -26 22 -42 -53 -3 -49 26 -5 22 -17 32 21 -15 -20 -31 1 -43 -18 -23 23
13989 23 1 -8 -17 -4 -6 26 -1 5 -32 -14 40 16 -33 65 26 -26 -28 -13 58 8 -54 -44 4 -30 43 -45 -17 24 -36 -13 33 -2
$$ packed form
13756a8Nj6R1o5qj0M6o3K4N0o3M1l6J7KkM2n5j1NL0L1q3J4K4M5n4j5oM0j1l0Q
13789c1k7L5PJ0rL8m4L2m2MJ9oM4o2M2L6j8o0P2q0jJ4NrP5o6K1Jj6m2MN8j2LJ3
13824Hk9K5N5n9M2m2Jko2K6l7Q5j2j5j3J8j0K1pOm0O2n2J4M2l0j0%K4J1l2j8L3
13857Cm9Q5m8j1KJJ6j0nj7L2qn2Q7l3k0k8O0KK9o6L2p3P7Ml8O2l8N1l3k4QPm1
13891c6L2ml5%L3kK8n8P4o4L2ll6O6%J9l9JJ1l8JL6k3m2M4j8lM7o9R1l6L6l8k7
13925b0K0j6L8p5R3l3n0P1n3K7K9p8N0k5K8pJ3l7K9ojJ3p8N6rj0l9L8PN5l9j7
13957b6M2p0P4K2j5j7m2K8J0nKK0m9M8o4j1N0m6P5l1K7l9M9j1l6nj1L2m4K5nM6
13989B3k2rrJ3kL2k7Ol7J8N4k4m9R8l9n2kJ5P1n0o2J0M8l4P3q8K8M1o0K3M6l5
$$ plain form
14021 -2 3 -9 -10 -22 -27 -3 56 28 -30 1 -21 -11 9 -43 33 38 42 -30 -5 -15 47 8 -68 -37 -24 10 -4 -25 8 -21 -19 17 13 17
14055 17 -27 -10 45 29 30 54 22 35 -5 41 -10 -46 -25 -13 -7 8 6 14 8 12 -29 16 -1 8 -65 -1 15 14 57 -4 17 -20 26 -40
14089 -40 -26 -1 -18 31 -8 49 72 39 -63 24 44 -14 3 -44 9 19 6 -1 -51 -4 11 7 -7 -8 -3 -1 -10 -51 -13 -3 45 23
14121 23 22 38 -23 -27 22 -1 11 7 46 -20 -14 9 6 1 -24 1 -14 -10 -26 16 1 7 31 44 -5 -15 16 11 -18 -3 -32 -27 35 -25 25
14156 25 -28 -17 19 -35 -14 -1 -35 17 -22 45 -35 -42 2 -11 21 -24 -22 -34 2 -27 3 -9 -25 30 27 48 -42 -27 -3 1 -15 -34
14188 -34 28 -15 19 -6 -47 -21 -29 -23 -11 24 16 -26 -29 31 13 -6 0 -14 -19 -26 -48 4 -11 -4 -20 -4 -22 -14 -19 0 -1 11 -5 -45 37
14223 37 -18 10 10 -28 -3 -5 -23 -6 24 29 -48 -33 -6 -26 33 -29 -5 -9 -39 -14 -19 30 -22 -7 21 -8 -2 -22 -44 -36 5 -46 6
14256 6 -6 -5 -11 26 -12 -21 -57 -59 -19 -7 -19 -20 33 25 28 -14 -24 29 -9 -24 -25 -26 -35 38 -31 -34 -24 -41 -33 3 -21 -46 -21 -63 -46 -35
$$ packed form
14021bNj2jj2nK4N9k8n8L1k2J0K0n2P6NMp2K5j0O2l9p6L1J3L4j4k1L3k9KL6mM
14055A7m4J7N5j6JK4l2J3m0M6n1l6K1J2OJ5kQoMm1M5j7Rp3O4J6jM3o1K1l7M6o6
14089d0J4K5j7M9l9N7K3l3j02Q7K0n8J7m7N3J0j3pn0M7J5mj4jNKrm1L8J0M8k2
14121B3jJ6o1mM9k3J2mL9o6OK3lnk5K5j5Mj6M2j5OK4J3m9j0L1nk9J5k9NO2o0N0
14156B5n3J1L6n4K1J3l4N2l9O7q0pM4j3L2m5Kj2L6k9L0j2j6N5lK1r0J5K4Mj6j9
14188c4O2m3L4k5m1K6qOJ2L5qm2lO0j8j9Oj4npk2N2j5Pj6J6j8QnJ9jJ2j6m0Q2
14223C7n5K8%l8K5kj8J7L0Np7J5K7k0N9o2K4ml0K5nM9n2J5K8k9Ok0k2QM1n1N2
14256Fj2JoL7l8rl6kM0J2j2jN3qLm2j0N3l8j5jjrP3o9lJ0j7QL6k4k5K5m2J7J1
$$ plain form
14292 -35 -14 -13 -37 20 20 -9 11 -52 -31 -19 -12 12 -6 33 -32 7 0 -12 37 0 -7 -20 13 48 15 -30 -22 42 -29 -15 -25 -22 -23 21
14326 21 47 -45 13 -5 55 -16 -14 -9 -25 3 -20 4 -4 39 -28 42 -2 16 -14 -9 17 -52 -12 -45 22 21 37 9 4 -1 -12 -1 -43
14359 -43 19 -13 -30 17 17 19 17 6 11 -51 -6 -15 44 -34 -5 3 7 24 -2 -8 7 10 -43 -26 -4 -12 20 -15 -7 31 49 9 -38 -19 -14 16
14395 16 24 10 -7 -7 102 8 0 1 5 68 23 13 -12 22 -1 48 26 -15 12 2 -3 39 -1 33 31 -30 36 -17 15 3 9 14 -21 43
14429 43 16 2 -3 34 -14 -42 27 25 -31 5 28 21 -42 0 17 -1 22 8 12 6 32 -18 15 -4 24 1 21 29 11 39 -53 0 -14
14462 -14 19 17 -43 -5 8 33 38 13 -32 17 0 -9 -47 11 -28 18 4 20 0 29 19 -13 0 36 20 -13 -6 -8 21 -9 9 5 14
14495 14 -5 -39 -20 11 -6 17 -9 7 -7 45 38 15 8 42 -25 -1 -7 37 -34 32 -11 -13 0 -29 -11 19 -38 -23 31 3 -25 -34
14527 -34 1 -17 8 -4 -2 -3 -27 21 -28 -16 -4 33 -15 3 6 -2 -23 -24 -45 -39 -11 -3 -39 7 -38 -15 -22 -19 -50 -18 -22 -18 -44 -18 13
$$ packed form
14292c5K1Jk4N7%k9K0o3K1J2PK4j8L9o5L9pj2M9l7pj3L3L5l3m5QO4p1J4j0LjM4
14326B1K6r2N8j8O0p1KNj6K8k3K4qM3o7P0m4J8l0NK6o9M0l3O7jJ6k8nnj1J1m2
14359d3O2l2j7M7%Kkj1No2M5rN9p8K9QMJ7k6oJ5Ln3J7K2qL2l5QL8J8m0m7J9NL0
14395A6Qj4j7%J09r4qJMO3m5j0k5L4k3M9k2m1K7j0nM2m0L4ko1O6n3L2j2ONl5O4
14429D3k7j4nL7m8k8O9kn6L6K3po3M2J7j8K3j4MoK6n0L3j9K8k3K0Qj8K8r2N3j4
14462a4L3ko0L8J3K5Nk5m5M9j7rl8N8l9M6j4J6k0K9j0l2J3L6j6l3PkK9l0J8mR
14495A4j9l4J9L1j7K3k6J6j4N2pk3pL4o7K4oM4p1O6m3kJ3k9J8L0n7J5N4k8k8r
14527c4L5j8K5j2Kjk4M8m9J2J2L7m8J8Lqk1jk1OK8Ql6M6m5K3pLl1L2mMk6K6L1
$$ plain form
14562 13 -44 -14 11 -32 -36 -17 6 -28 -18 19 -6 3 -22 9 -34 11 9 -75 -5 -70 36 -9 -16 -45 -18 13 9 34 -1 -12 4 -53
14594 -53 44 -23 -6 -6 -11 10 -39 -22 -3 -60 -27 -15 -20 -43 16 10 17 -31 -31 10 -32 -20 -37 -8 30 -21 -5 8 -8 5 -21 17 -42
14627 -42 -15 -14 -7 -20 -34 -11 -5 -25 33 -18 -31 -59 20 -42 22 -12 25 15 29 11 -38 16 7 0 -36 3 -14 -26 -8 8 -12 2
14659 2 -79 32 -5 20 -14 -3 10 -9 35 29 19 2 15 8 -26 -31 -36 -27 -18 -2 21 30 -24 -15 24 -71 -18 -24 -16 -36 9 32 -8 16 -8
14694 -8 1 -32 10 -27 -49 17 -9 -42 -11 -10 -15 -9 -6 14 -51 30 -17 -19 37 -18 6 30 -43 -51 -31 -16 29 -41 -49 22 27 13 50 -23 -28
14729 -28 13 5 19 -62 5 7 35 -5 6 45 -25 -2 -3 20 -11 10 -39 -67 46 19 11 -19 -2 -4 -14 -43 -64 -17 -36 72 11
14760 11 15 1 11 11 23 -4 43 -37 31 -1 -30 19 37 39 57 48 2 10 -28 -25 30 -19 17 46 48 27 39 1 -19 -16 -31 -25 31 8
14794 8 12 0 -9 30 -35 26 1 -23 32 -23 2 -36 -18 32 0 29 -21 -21 -42 32 -6 34 2 -40 -8 -16 -15 0 36 9 -7 20 1
$$ packed form
14562A3n7L0K5m3mJ9K3l4J0L7k5Rk5L1m3M5kq4P0o5J06m5pk9K7L1mK5l5j1J6n7
14594e3R7o7J7%nK1m9J7J9n7L3J2nk3N9oPm8%M1m2J2j7K9L8n1J6J3j6J3k6L8n9
14627d2K7JPj3j4K3Ok0N8n1j3k8P9o2O4l4L7j0J4j8m9N4rpl6L9j7j2J8J6k0J4
14659Bq1J11l7K5l4J1J3j9M4oj0j7J3pl4nnRRJ6K3Rn4RL9r5N3oQk0M5K3m0K4k4
14694hRl3M2l7k2O6k6l3L1JnOLK0o5Q1m7kN6n5K4K4p3qK0J5M5p0qP1Nj4L7p3n
14729b8M1qJ4q1O7KK8m0J1L9p0K3jK3l1K1m9k8J13k7ql0J7kj0k9k1M7j9J08o1
14760A1Mj4J0%J2k7M7q0O8l2k9M9J8KJ8rm6Ql8LN5m9L6K9Kk1J2l8k0Lj5ON6k3
14794HMj2rL9o5O1k5k4N5n5K5l8J8N0l2K9n0%k1P4l8M0l2m2L2qJJ5L6k7j6K7j9
$$ plain form
14827 1 6 -30 -21 -52 -5 21 17 33 -49 3 -18 -15 28 17 6 -6 91 -11 -3 46 -23 22 -31 -12 10 -19 -20 -10 29 37 -16 24 58
14860 58 -13 -30 14 -23 20 42 31 8 61 30 23 10 31 13 -20 40 13 66 -27 9 33 37 0 18 -17 -23 17 -24 38 1 -42
14891 -42 25 28 62 -33 5 8 1 40 -9 42 52 44 8 -9 49 -2 32 -70 -6 25 29 20 14 2 -13 31 0 -1 28 -12 7 4 25 38
14925 38 -16 -14 16 22 -18 -41 -27 4 -7 1 1 -9 -19 18 26 1 -5 32 -25 -4 2 3 -11 33 23 8 14 32 19 -6 -11 -5 -6 11 10 16 12
14962 12 -22 -16 -15 -25 13 -15 -2 -14 -8 -14 -10 11 -59 3 -4 -29 8 -57 -7 -9 57 -22 32 -10 -9 -27 -15 7 -26 -35 -3 -6 -15 21 27 47
14998 47 -55 -26 -7 -5 -51 20 -10 -5 -8 -29 -27 10 -37 -18 -24 31 5 -7 -37 40 -25 15 -31 19 3 -3 -13 8 2 28 51 12 8
15031 8 -16 25 13 -22 -2 -35 -3 5 -54 20 -21 -4 10 -26 34 -8 6 -40 -9 -46 6 -9 -9 -8 12 8 -38 -15 -31 -13 -2 15
15063 15 -18 -7 6 5 -13 -17 12 -46 24 -24 -1 19 -7 -61 -5 -33 -27 -8 -35 -30 -13 -27 10 43 18 -24 -10 52 -24 -19 -12 -47 2
$$ packed form
14827ANl6Rl1M7K6mJ6q2N2k1LM3j1j1j2R7j02QM9o9M5n3J9K2k9jJ0L9Qn3M0L4
14860E8p1j7M4l7M3K2j1k3N3l1pj3K1j8l3O0k7N3r3L6K4Ml7J8l5oM0m1O2l7m3
14891d2O7LL4r5L8LpL9m9N1J0ql6j7N8n1L4j02O4L1Mroj2j5M4l1jK9m0J9lK1J3
14925C8n4KL0Om0k3J4L1j1Q%j0j0L7Qk5oL7n7K1OJj4M4j0j5OJ8j3k5nOjJ7jOm
14962A2l4OJj0L8k8J3j2OoMK1p0O2pk5L7o5N0kO6p9N4m2Jj8J2K2l3rL2lrL6OK0
14998D7j02K9J9Km6P1l0Nlk1KL7m7J9oN5k6j2l0P7o5M0m6N0j6oj0K1oK6K3l9m
15031Hk4M1j2l5K0l3L2Qn9P4m1J7J4l6O0m2J4m6L1l7N2j5%JK0mm6K3j6J8J1J7
15063A5l3J1J3jj8mK9n8P0m8K3K0k6n4N6k8OJ9k7NJ7j4L7L3k5m2J4O2p6NPl5M9
$$ plain form
15096 2 -53 -23 6 -19 2 2 -51 25 1 -30 -7 -10 -36 8 -69 44 -4 9 12 -38 -36 -27 -9 -42 46 2 32 -24 11 -10 3 6 -18
15129 -18 -48 3 18 2 7 30 7 26 38 18 -13 14 -27 -13 -14 -10 -8 8 -7 17 15 7 -36 17 12 29 -6 33 -4 25 10 6 38 -13
15163 -13 -19 9 29 -12 -17 34 -23 24 3 -24 5 -32 -1 18 -9 -7 -21 12 37 -9 2 -27 -8 19 -10 -17 1 -44 -16 -14 47 12
15195 12 36 -21 -36 -4 0 -22 -25 1 -1 -2 10 6 52 18 -4 6 0 -7 -40 -18 -5 44 38 -9 -22 1 -4 -15 36 16 -11 20 15 2 10
15230 10 0 51 31 -25 -33 -3 29 -14 11 24 42 29 16 18 -54 -6 52 7 35 0 47 -15 5 -9 42 -30 8 -27 10 -3 3
15261 3 -14 -15 -30 12 21 -11 -34 -31 11 -24 19 -19 5 26 -21 7 -14 28 -13 -35 -19 3 -7 25 -2 -4 11 -4 -3 -5 -9 -13 -52 29
15295 29 -2 28 22 27 -7 13 -20 -18 -13 6 -29 -10 -53 -11 15 5 7 -20 17 -32 9 10 -2 -28 -5 -30 14 3 -1 6 -12 -16 -26 -21 -26
15330 -26 3 -2 -34 -8 -13 -9 0 11 -31 -45 -25 -54 4 -20 24 -30 -2 -3 20 12 27 12 7 -28 -11 -43 3 -5 -10 2 36 -4 11 -21
$$ packed form
15096Bn5L0K9k5K1%n3P6k4l1K3lk6M4p7J13m8J3Ln0KRJ8l3Q8m4L0n6L5k1J3Lk4
15129a8l0N1J5j6NK3k3J9J2k0l1K7m1J4jMKJ6j5K4kqm3N3nJ7l5L9l7K9j5mL2n1
15163a3oK8K0m1nN1n7M7k1k7K9l7L1J9k7Kj4L3K5m6J1k9J9K7k9pJ8m5K8KO1l5
15195A2K4n7j5L2Mk2lK6kjJ2mM6l4k2J0opl3K2J3M9om7j3K3nj1N1k0k7L1nj3Q
15230A0j0N1k0n6qL0L2m3K5J3J8j3j3Kp2M8N8m5K8l5M7o2K0j4N1p2L8l5L7j3O
15261Cj7jj5M2Rl2k3LM2l5M3l8K4K1m7K8k1M2m1k2J6K2j0L2k7kJ5j5Jkmml9Q1
15295B9l1L0oNl4K0l3KNJ9l5J9m3M2K6j0Kk7L7m9M1Jj2k6K3k5M4j1mPj8mj0Nn
15330b6K9nl2K6nMRJ1m2j4K0k9N8k4M4n4K8jK3qJ5j5nl5J7l2M6qnJ2L4m0J5l2
$$ plain form
15364 -21 -8 -20 -39 35 -15 -15 -30 -64 11 5 -31 -16 -25 -25 14 30 6 -15 8 -16 21 -61 -54 19 13 5 -23 50 -1 57 -32 -31 -20 -29
$$ packed form
15364b1J3j2j9P4n0%j5l4P5ol6J5r%L9J6k4k1K3k4L7q2PP3oqk8P3n1N8q9JJ1r
$$ [...]
16383f4
##END NTUPLES=NMR FID
##END=
