##TITLE=31P_DE-80H_X3
 64 sc D2O
 26.2.2025
##JCAMPDX= 6.0         $$ Bruker NMR JCAMP-DX V2.0
##DATA TYPE= NMR FID
##DATA CLASS= NTUPLES
##ORIGIN= UXNMR, Bruker Analytische Messtechnik GmbH
##OWNER= root
$$ XWIN-NMR		Version 3.5
$$ Wed Jan 28 13:50:25 2026 Russian Standard Time (UT+4h)  Yarkov@DPX200
##.OBSERVE FREQUENCY= 81.013821
##.OBSERVE NUCLEUS= ^31P
##.DELAY= (6, 6)
##.ACQUISITION MODE= SIMULTANEOUS
##.ACQUISITION SCHEME= undefined
##.AVERAGES= 64
##.DIGITISER RES= 17
##SPECTROMETER/DATA SYSTEM= spect
##.PULSE SEQUENCE= zgpg30
##.SOLVENT NAME= D2O
##.SHIFT REFERENCE= (INTERNAL, D2O, 0, 243.863)
##AUDIT TRAIL= $$ (NUMBER, WHEN, WHO, WHERE, WHAT)
$$ ##TITLE= Audit trail, XWIN-NMR		Version 3.5
$$ ##JCAMPDX= 5.01
$$ ##ORIGIN= Bruker BioSpin GmbH
$$ ##OWNER= Yarkov
$$ C:/Bruker/XWIN-NMR/data/yarkov2/nmr/P31/2/audita.txt
$$ ##AUDIT TRAIL=  $$ (NUMBER, WHEN, WHO, WHERE, WHAT)
(   1,<2026-01-28 13:49:09.21 +0400>,<Yarkov>,<DPX200>,
      <created by zg, POWCHK disabled, PULCHK disabled
       configuration hash MD5:
       00 E9 B6 7A A2 85 ED C7 34 08 36 98 17 FE 4E 26
       data hash MD5: 32K
       2C 40 3A 7F AE 2A B7 76 87 AC F5 89 ED D7 44 F4>)
$$ ##END=
$$ 
$$ hash MD5
$$ 98 94 F6 76 87 07 88 AE D5 B7 9C 5C BD 78 20 32
##$RELAX= 
##$RELAX= 
##$RELAX= 
##$RELAX= 
##$RELAX= 
##$RELAX= 
##$RELAX= 
##$RELAX= 
$$ Bruker specific parameters
$$ --------------------------
##$DU= <C:/Bruker/XWIN-NMR>
##$EXPNO= 2
##$NAME= <P31>
##$PROCNO= 1
##$TYPE= <nmr>
##$USER= <yarkov2>
##$AMP= (0..31)
100 100 100 100 100 100 100 100 100 100 100 100 100 100 100 100 100 100 
100 100 100 100 100 100 100 100 100 100 100 100 100 100 
##$AQSEQ= 0
##$AQ_mod= 1
##$AUNM= <au_zg>
##$AUTOPOS= <>
##$BF1= 81.014009
##$BF2= 200.13
##$BF3= 200.13
##$BF4= 200.13
##$BF5= 200.13
##$BF6= 200.13
##$BF7= 200.13
##$BF8= 200.13
##$BYTORDA= 1
##$CFDGTYP= 0
##$CFRGTYP= 5
##$CHEMSTR= <none>
##$CNST= (0..31)
1 1 145 1 1 1 1 1 1 1 1 1 1 1 1 1 1 1 1 1 1 1 1 1 1 1 1 1 1 1 1 1 
##$CPDPRG= <waltz16>
##$CPDPRG1= <>
##$CPDPRG2= <waltz16>
##$CPDPRG3= <>
##$CPDPRG4= <mlev>
##$CPDPRG5= <mlev>
##$CPDPRG6= <mlev>
##$CPDPRG7= <mlev>
##$CPDPRG8= <mlev>
##$CPDPRGB= <>
##$CPDPRGT= <>
##$D= (0..31)
0 1 0 0 0 0 0 0 0 0.06 0 0.03 2e-05 3e-06 0 0 0.0002 0 0 0 0 0 0 0 0 0 
0 0 0 0 0 0 
##$DATE= 1769593748
##$DBL= (0..7)
120 120 120 11 120 120 24 19 
##$DBP= (0..7)
150 150 150 150 150 150 150 150 
##$DBP07= 0
##$DBPNAM0= <>
##$DBPNAM1= <>
##$DBPNAM2= <>
##$DBPNAM3= <>
##$DBPNAM4= <>
##$DBPNAM5= <>
##$DBPNAM6= <>
##$DBPNAM7= <>
##$DBPOAL= (0..7)
0.5 0.5 0.5 0.5 0.5 0.5 0.5 0.5 
##$DBPOFFS= (0..7)
0 0 0 0 0 0 0 0 
##$DE= 6
##$DECBNUC= <off>
##$DECIM= 4
##$DECNUC= <off>
##$DECSTAT= 4
##$DIGMOD= 1
##$DIGTYP= 9
##$DL= (0..7)
0 0 52 120 120 21 21 25 
##$DP= (0..7)
150 150 150 150 150 150 150 150 
##$DP07= 0
##$DPNAME0= <>
##$DPNAME1= <>
##$DPNAME2= <>
##$DPNAME3= <>
##$DPNAME4= <>
##$DPNAME5= <>
##$DPNAME6= <>
##$DPNAME7= <>
##$DPOAL= (0..7)
0.5 0.5 0.5 0.5 0.5 0.5 0.5 0.5 
##$DPOFFS= (0..7)
0 0 0 0 0 0 0 0 
$$ [...]
##$SUBNAM1= <"">
##$SUBNAM2= <"">
##$SUBNAM3= <"">
##$SUBNAM4= <"">
##$SUBNAM5= <"">
##$SUBNAM6= <"">
##$SUBNAM7= <"">
##$SUBNAM8= <"">
##$SUBNAM9= <"">
##$SW= 400.765351723535
##$SWIBOX= (0..15)
0 1 3 0 0 0 0 0 0 0 0 0 0 0 0 0 
##$SW_h= 32467.5324675325
##$TD= 32768
##$TD0= 1
##$TE= 0
##$TE2= 300
##$TE3= 300
##$TEG= 300
##$TL= (0..7)
0 120 53 12 22 120 120 120 
##$TP= (0..7)
150 150 150 150 150 150 150 150 
##$TP07= 0
##$TPNAME0= <>
##$TPNAME1= <>
##$TPNAME2= <>
##$TPNAME3= <>
##$TPNAME4= <>
##$TPNAME5= <>
##$TPNAME6= <>
##$TPNAME7= <>
##$TPOAL= (0..7)
0.5 0.5 0.5 0.5 0.5 0.5 0.5 0.5 
##$TPOFFS= (0..7)
0 0 0 0 0 0 0 0 
##$TUNHIN= 0
##$TUNHOUT= 0
##$TUNXOUT= 0
##$USERA1= <user>
##$USERA2= <user>
##$USERA3= <user>
##$USERA4= <user>
##$USERA5= <user>
##$V9= 5
##$VALIST= <valist>
##$VCLIST= <CCCCCCCCCCCCCCC>
##$VD= 0
##$VDLIST= <DDDDDDDDDDDDDDD>
##$VPLIST= <PPPPPPPPPPPPPPP>
##$VTLIST= <TTTTTTTTTTTTTTT>
##$WBST= 1024
##$WBSW= 4
##$XGAIN= (0..3)
0 0 0 0 
##$XL= 0
##$YL= 0
##$YMAX_a= 993
##$YMIN_a= -817
##$ZGOPTNS= <>
##$ZL1= 120
##$ZL2= 120
##$ZL3= 120
##$ZL4= 120
##$ABSF1= 60
##$ABSF2= -190
##$ABSG= 5
##$ABSL= 3
##$ALPHA= 0
##$AQORDER= 0
##$ASSFAC= 0
##$ASSFACI= 0
##$ASSFACX= 0
##$ASSWID= 0
##$AUNMP= <proc_1d>
##$AZFE= 0.1
##$AZFW= 0.5
##$BCFW= 1
##$BC_mod= 2
##$BYTORDP= 1
##$COROFFS= 0
##$CY= 9.86611175537109
##$DATMOD= 1
##$DC= 1
##$DFILT= <>
##$DTYPP= 0
##$F1P= 182.462994727601
##$F2P= 168.069089081705
##$FCOR= 0.5
##$FTSIZE= 0
##$FT_mod= 0
##$GAMMA= 1
##$GB= 0
##$INTBC= 1
##$INTSCL= 1
##$ISEN= 30
##$LB= 1.5
##$LEV0= 0
##$LPBIN= 0
##$MAXI= 11.51145
##$MC2= 0
##$MEAN= 0
##$ME_mod= 0
##$MI= 1.244541
##$NCOEF= 0
##$NC_proc= 0
##$NLEV= 6
##$NOISF1= 0
##$NOISF2= 0
##$NSP= 1
##$NTH_PI= 0
##$NZP= 1
##$OFFSET= 243.8632
##$PC= 1.4
##$PHC0= 1663.573
##$PHC1= 24.15952
##$PH_mod= 0
##$PKNL= yes
##$PPARMOD= 0
##$PSCAL= 0
##$PSIGN= 0
##$REVERSE= no
##$SF= 81.0140731611343
##$SI= 65536
##$SIGF1= 0
##$SIGF2= 0
##$SINO= 80
##$SIOLD= 65536
##$SREGLST= <31P.CDCl3>
##$SSB= 0
##$STSI= 0
##$STSR= 0
##$SW_p= 25641.0256410257
##$SYMM= 0
##$S_DEV= 0
##$TDeff= 0
##$TDoff= 0
##$TI= <>
##$TILT= no
##$TM1= 0
##$TM2= 0
##$TOPLEV= 0
##$USERP1= <user>
##$USERP2= <user>
##$USERP3= <user>
##$USERP4= <user>
##$USERP5= <user>
##$WDW= 1
##$XDIM= 64
##$YMAX_p= 0
##$YMIN_p= 0
$$ End of Bruker specific parameters
$$ ---------------------------------
##NTUPLES= NMR FID
##VAR_NAME=  TIME,          FID/REAL,        FID/IMAG
##SYMBOL=    X,             R,               I
##VAR_TYPE=  INDEPENDENT,   DEPENDENT,       DEPENDENT
##VAR_FORM=  AFFN,          ASDF,            ASDF
##VAR_DIM=   16384,         16384,           16384
##UNITS=     SECONDS,       ARBITRARY UNITS, ARBITRARY UNITS
##FACTOR=    3.08e-05,      1,               1
##FIRST=     0,             0,               0
##LAST=      0.5045964,     0,               0
##MIN=       0,             -817,            0
##MAX=       0.5045964,     993,             0
$$ Real data points
##PAGE= N=1
##DATA TABLE= (X++(R..R)), XYDATA
$$ [...]
4023 40 -113 -349 -310 -277 -102 119 266 385 233 159 -70 -196 -302 -278 -200 9 159 298 329 255 96 -108 -312
4046 -312 -300 -274 -88 110 229 329 270 185 6 -224 -312 -316 -210 -31 156 326 359 278 101 -98 -314 -368 -268
4069 -268 -104 100 242 366 334 233 41 -148 -313 -307 -230 -50 134 283 355 301 117 -106 -265 -372 -251 -160
4091 -160 27 171 310 282 238 22 -125 -312 -365 -295 -76 119 335 345 303 131 -81 -210 -292 -285 -226 -15 193
4114 193 278 266 268 72 -181 -299 -392 -271 -128 61 270 316 316 194 9 -155 -322 -258 -242 -59 158 312 330 212
4138 212 133 -154 -276 -350 -307 -164 16 237 324 288 180 5 -185 -332 -296 -292 -83 88 268 368 256 127 -81
4161 -81 -269 -356 -292 -163 2 227 286 334 232 77 -149 -259 -314 -276 -115 128 283 351 286 129 -42 -269 -333
4184 -333 -352 -212 12 174 301 324 241 73 -105 -258 -331 -281 -141 93 237 350 281 183 -5 -218 -299 -360 -230
4207 -230 -41 168 299 312 266 89 -93 -299 -376 -262 -168 106 168 308 322 196 -22 -242 -297 -296 -203 -44 142
4230 142 242 316 248 88 -73 -228 -338 -321 -198 42 187 305 294 249 41 -176 -302 -343 -197 -70 138 231
4252 231 314 300 199 -65 -206 -334 -278 -182 -38 163 283 349 217 41 -123 -320 -309 -237 -123 63 215 314 267
4275 267 131 -21 -185 -319 -310 -250 -58 176 331 336 240 120 -130 -247 -301 -244 -138 26 194 311 282 239 -25
4298 -25 -200 -332 -335 -231 -66 198 308 311 256 145 -100 -217 -280 -338 -164 28 149 333 310 183 68 -179 -312
4321 -312 -323 -273 -92 117 245 322 236 139 -26 -230 -315 -321 -200 -30 201 274 377 216 58 -123 -287 -262 -250 -111
4345 -111 128 247 344 343 238 -51 -165 -285 -284 -216 -38 134 318 339 227 102 -150 -290 -348 -263 -128 90 206
4368 206 353 275 204 19 -108 -256 -352 -218 -72 141 286 312 251 77 -123 -225 -315 -250 -159 4 201 310 299
4391 299 191 23 -150 -320 -352 -291 -101 74 289 337 272 121 -50 -225 -315 -310 -179 30 136 273 324 182 43
4414 43 -96 -255 -311 -239 -121 70 212 330 362 137 -21 -198 -301 -204 -181 -8 144 309 260 259 114 -65 -246
4437 -246 -372 -322 -119 75 236 281 298 149 21 -187 -298 -319 -233 -39 100 264 351 263 118 -102 -201 -282 -274 -131
4461 -131 20 213 309 302 186 39 -130 -271 -314 -222 -80 104 224 342 308 101 -60 -217 -308 -314 -207 -19 151
4484 151 293 279 229 52 -63 -191 -294 -241 -140 80 221 328 288 160 -28 -212 -324 -306 -237 -26 129 231
4506 231 255 186 58 -108 -227 -315 -309 -166 69 220 314 301 207 -7 -193 -293 -251 -203 -71 132 293 295 215 67
4530 67 -46 -241 -271 -287 -181 -10 178 263 248 217 34 -227 -247 -301 -179 -89 72 237 295 256 160 -73 -211 -303
4554 -303 -303 -201 -25 172 225 278 218 77 -161 -232 -310 -219 -71 60 222 228 244 113 -73 -174 -329 -293 -239 -49
4578 -49 171 278 318 190 44 -125 -215 -305 -248 -166 36 213 250 266 171 18 -143 -299 -300 -200 -44 116 252 293
4602 293 219 120 -107 -209 -239 -241 -137 3 140 258 286 156 0 -148 -249 -321 -247 -38 73 194 278 259 135
4625 135 -62 -194 -282 -279 -189 4 174 318 286 200 91 -143 -252 -306 -228 -80 52 253 242 229 148 0 -167 -259
4649 -259 -271 -210 -103 157 251 286 245 92 -51 -280 -249 -249 -127 62 201 276 279 132 13 -122 -209 -304 -154 -68 134
4674 134 270 268 234 140 -94 -240 -294 -249 -133 51 154 253 249 150 75 -192 -244 -280 -205 -133 145 195 312 307 116 -15
4700 -15 -211 -291 -276 -126 -17 153 270 298 184 61 -113 -212 -280 -211 -75 85 207 332 258 137 -43 -189 -278
4723 -278 -250 -126 -13 113 248 325 256 98 -107 -231 -275 -275 -105 56 219 303 280 162 24 -148 -270 -259 -166
4746 -166 -10 140 247 330 215 124 -39 -167 -249 -259 -125 85 184 257 280 139 10 -141 -303 -308 -184 -54 80
4769 80 218 315 260 173 -67 -141 -255 -297 -119 -11 183 326 285 201 64 -136 -264 -267 -234 -97 57 169 277 214
4793 214 186 -23 -218 -267 -232 -168 -72 160 232 299 176 39 -144 -248 -247 -222 -138 83 204 256 251 155 36 -189 -258
4818 -258 -285 -226 -17 65 269 246 213 56 -62 -193 -259 -256 -143 50 136 287 288 178 40 -153 -281 -262 -183 -53
4842 -53 71 223 257 194 80 -83 -163 -300 -219 -180 -3 138 272 284 194 11 -120 -280 -265 -174 -59 56 183
4865 183 221 303 74 13 -162 -279 -252 -166 -35 109 242 284 213 64 -102 -218 -302 -227 -124 39 191 226 210 145
4889 145 6 -192 -252 -305 -165 -70 146 248 268 221 72 -71 -216 -278 -247 -110 22 171 207 252 185 0 -156
4912 -156 -257 -296 -225 -89 109 180 283 218 117 -24 -207 -231 -231 -113 23 162 265 253 219 20 -125 -235 -296
4935 -296 -242 -116 82 240 248 226 143 -83 -195 -262 -292 -173 -57 100 204 238 203 86 -71 -177 -300 -215 -116 70
4959 70 176 273 266 100 -38 -181 -251 -293 -173 -76 60 205 280 169 78 -49 -193 -277 -282 -174 25 150 271 248
4983 248 151 9 -164 -259 -240 -238 -102 28 215 279 262 102 -63 -263 -341 -248 -139 28 164 190 285 143 -10 -112
5007 -112 -263 -281 -226 -63 91 258 272 303 155 -33 -173 -269 -237 -188 4 168 209 257 182 56 -78 -167 -278 -227
5031 -227 -139 37 208 274 248 102 -43 -177 -219 -287 -180 -8 144 184 319 216 76 -99 -159 -257 -246 -142 -5
5054 -5 190 236 258 126 -22 -155 -270 -248 -215 -55 84 229 202 218 156 -44 -153 -276 -299 -116 3 166 252 233
5078 233 155 -27 -126 -245 -207 -217 -94 52 206 256 234 132 -30 -197 -339 -249 -185 -47 154 289 261 160 60
5101 60 -68 -179 -224 -206 -121 96 182 269 236 152 6 -180 -257 -288 -183 -31 132 263 268 239 88 -86 -171 -240 -227
5126 -227 -129 58 138 261 277 178 72 -115 -209 -274 -192 -69 110 230 254 216 113 -43 -181 -220 -205 -163 -3 80
5150 80 280 225 138 70 -83 -205 -269 -180 -71 94 201 225 244 106 -33 -132 -240 -219 -197 -10 115 224 244 227
5174 227 96 -122 -201 -245 -211 -85 27 195 237 191 112 28 -95 -257 -246 -189 8 110 224 291 229 109 -109 -214
5198 -214 -208 -235 -131 -12 156 228 234 135 47 -99 -226 -215 -182 -50 108 199 236 187 126 -83 -182 -255 -180 -119 5 134
5224 134 206 260 158 61 -71 -226 -212 -220 -51 86 159 265 182 113 -15 -130 -218 -232 -146 -41 86 236 233 200 76
5249 76 -88 -193 -234 -237 -99 96 220 184 180 86 1 -161 -225 -213 -173 -52 80 210 229 149 94 -73 -184 -251 -198 -162
5275 -162 35 170 145 211 162 -9 -99 -231 -210 -170 -51 17 177 269 177 108 -18 -169 -277 -240 -170 -1 130 218
5299 218 237 200 82 -101 -193 -243 -185 -98 88 169 226 189 116 2 -214 -235 -240 -120 13 94 213 227 142 39 -98
5324 -98 -200 -286 -183 -83 20 166 272 231 109 17 -148 -280 -219 -161 -28 87 147 213 191 46 -83 -191 -231
5347 -231 -211 -119 8 201 216 225 102 -14 -138 -232 -284 -160 -80 56 195 254 170 99 -55 -166 -216 -219 -152 31 183
5372 183 232 238 162 44 -46 -265 -231 -187 -70 99 150 218 176 102 6 -137 -188 -279 -120 -21 113 234 216 151 57 -78
5398 -78 -221 -214 -213 -104 55 137 260 209 146 -11 -97 -192 -253 -172 -55 131 209 249 185 22 -75 -259 -201 -230 -72 15
5424 15 163 250 264 196 56 -130 -229 -250 -170 -40 92 210 205 260 80 -84 -156 -258 -232 -132 12 126 180 216 161
5449 161 31 -111 -192 -237 -202 -102 86 152 230 238 102 -55 -127 -226 -197 -139 13 121 211 220 172 55 -74 -196 -270
5474 -270 -168 -59 38 212 272 231 130 -9 -72 -182 -197 -157 1 97 209 306 193 111 -60 -169 -214 -247 -86 23
5498 23 159 209 229 109 -23 -91 -198 -197 -184 -37 95 181 275 182 127 -65 -144 -267 -222 -131 -19 134 229 282 165
5523 165 70 -95 -183 -210 -199 -73 90 191 224 240 109 -29 -189 -198 -252 -145 13 134 195 293 182 71 -35 -191
5547 -191 -215 -173 -115 50 160 248 228 139 25 -127 -188 -220 -148 8 112 214 191 189 99 -30 -175 -269 -203 -107 -17 164
5573 164 246 237 123 14 -132 -156 -217 -140 -65 86 171 226 228 102 -45 -143 -236 -212 -114 12 118 257 192 150 52 -81
5599 -81 -187 -190 -149 -71 60 157 241 191 123 -14 -171 -207 -191 -150 -11 132 233 208 127 -3 -69 -168 -211 -162 -77 8 159
5626 159 182 212 142 -20 -156 -230 -177 -131 -20 108 228 203 151 34 -66 -253 -275 -216 -179 22 108 207 198 111 53 -119
5652 -119 -199 -240 -175 -59 146 181 234 151 96 -64 -170 -220 -223 -114 12 126 198 191 165 6 -113 -204 -211 -171 -43 80
5678 80 157 239 140 102 -49 -115 -183 -227 -150 -17 126 201 232 137 50 -76 -179 -220 -173 -131 40 86 242 200 101 -64
5704 -64 -140 -223 -226 -173 -62 79 169 247 201 75 -92 -175 -180 -169 -161 45 162 191 206 133 9 -68 -183 -217 -153 -43 104
5731 104 163 241 213 81 -31 -161 -186 -190 -104 34 98 195 233 165 76 -41 -152 -230 -209 -22 60 235 208 208 72 -14
5757 -14 -137 -213 -243 -170 -68 85 190 196 168 72 -86 -195 -249 -176 -100 14 183 184 219 147 57 -152 -211 -231 -168 -24
5783 -24 54 191 177 141 98 -69 -138 -240 -160 -131 27 174 193 220 118 61 -105 -175 -173 -117 -48 86 159 244 187 92 -48
5810 -48 -122 -237 -211 -130 -11 154 180 154 132 36 -104 -209 -193 -168 -93 61 135 222 200 99 -18 -166 -136 -176 -135 -27
5836 -27 50 197 174 219 21 -103 -137 -217 -224 -87 80 131 216 196 129 -16 -136 -186 -153 -112 15 157 203 199 161 58
5862 58 26 -173 -159 -116 -56 30 115 248 209 161 7 -122 -193 -225 -87 -87 69 153 236 177 90 -33 -161 -174 -180 -138 64
5889 64 155 232 196 164 18 -101 -140 -184 -153 -55 64 163 182 230 66 41 -107 -210 -217 -120 -14 149 164 194 154 102 -112
5916 -112 -193 -196 -162 -58 50 182 211 173 116 -4 -105 -187 -210 -141 -8 107 145 244 151 50 -98 -104 -173 -198 -33 -13
5942 -13 135 204 190 126 -8 -95 -215 -190 -167 -19 45 183 220 147 107 -88 -127 -190 -148 -128 -9 129 185 209 103 21
5968 21 -90 -159 -219 -152 -41 61 129 171 188 76 -7 -90 -146 -177 -138 -21 89 192 209 157 68 -61 -202 -169 -148 -89
5994 -89 5 146 232 155 45 13 -87 -151 -173 -120 -13 105 145 214 147 86 -40 -154 -199 -166 -87 48 157 184 186 100
6020 100 -4 -126 -148 -209 -184 -32 64 173 200 99 52 -70 -130 -194 -156 -112 10 87 147 157 117 58 -93 -183 -221 -127
6046 -127 -45 64 162 216 140 92 -14 -196 -221 -189 -92 3 63 137 171 135 2 -74 -140 -205 -178 -108 51 150 174 178 151 -31
6074 -31 -138 -152 -165 -143 -34 106 165 214 185 37 -34 -155 -176 -199 -66 24 82 203 190 132 26 -70 -162 -170 -137 -20
6100 -20 28 160 150 142 103 -58 -141 -205 -178 -45 10 67 158 205 108 23 -75 -167 -142 -92 -53 55 185 199 209 108 -27
6127 -27 -155 -237 -182 -101 11 139 176 159 114 22 -80 -179 -192 -158 -109 103 97 230 193 111 -28 -132 -192 -185 -111 -72 70
6154 70 185 163 119 80 -17 -103 -157 -179 -56 74 109 206 184 80 52 -128 -210 -127 -107 -24 93 157 169 132 59 -42 -104
6181 -104 -181 -149 -102 26 56 182 224 123 16 -54 -194 -160 -101 -108 39 132 175 171 111 -28 -89 -209 -156 -122 -12 106
6207 106 187 214 127 39 -76 -132 -178 -94 -51 48 133 165 194 114 -2 -54 -141 -184 -111 -16 124 174 229 163 113 -77 -92 -168
6235 -168 -147 -90 18 144 198 199 109 25 -46 -160 -175 -128 -23 85 173 209 133 60 -23 -112 -148 -176 -105 -44 91 183 150
6262 150 147 -9 -77 -121 -171 -124 -68 99 162 213 168 73 13 -77 -127 -169 -82 -23 53 122 186 177 99 -41 -180 -227 -127 -64
6290 -64 76 123 169 204 40 -26 -82 -173 -161 -114 -18 96 178 166 96 49 -27 -122 -180 -180 -41 46 115 186 143 157 19 -61
6318 -61 -133 -173 -138 -63 55 102 201 177 121 -7 -180 -187 -155 -91 34 114 124 158 116 9 -46 -178 -188 -208 -80 21 155
6345 155 222 182 89 -37 -146 -169 -178 -87 15 60 189 149 126 15 8 -136 -179 -190 -77 52 92 171 129 85 -41 -92
6371 -92 -207 -182 -99 -10 36 174 163 148 84 -50 -150 -220 -141 -31 23 189 157 173 99 -44 -94 -168 -126 -99 -36 34 90
6398 90 188 154 101 -25 -103 -174 -182 -86 -3 58 137 144 90 2 -82 -190 -120 -155 -56 2 76 201 170 76 -13 -42 -192 -162 -124
6427 -124 -34 73 117 163 122 41 -79 -161 -141 -143 -78 10 113 154 153 103 -25 -86 -199 -189 -114 -10 56 127 182 142 10
6454 10 -1 -142 -211 -142 -115 20 72 164 175 81 44 -64 -154 -179 -125 32 59 204 197 155 105 -81 -131 -132 -158 -129 27 95
6482 95 158 139 148 -1 -73 -118 -214 -171 -72 58 165 149 189 45 -68 -107 -148 -204 -135 9 52 161 164 139 59 -57 -90
6509 -90 -178 -156 -32 16 95 121 202 81 -4 -66 -152 -172 -75 -44 53 153 179 116 23 -36 -113 -170 -143 -75 -54 103 159 127
6537 127 107 -12 -66 -159 -192 -151 -8 37 103 148 173 82 -59 -142 -210 -133 -77 -9 113 177 149 109 -18 -67 -129 -163 -130
6564 -130 17 56 103 160 156 35 -44 -122 -182 -139 -82 -55 84 148 150 121 19 -21 -149 -158 -172 -77 40 100 198 153 115 -32
6592 -32 -57 -156 -178 -159 -40 96 124 142 137 36 -65 -100 -152 -179 -76 52 107 147 134 140 6 -89 -118 -162 -115 -42 46 122
6620 122 142 157 103 -26 -144 -143 -137 -106 -13 142 163 152 103 -7 -67 -121 -244 -93 -58 37 163 167 140 47 -19 -102 -161 -180
6648 -180 -116 -19 105 123 177 114 41 -66 -150 -141 -165 -68 4 100 169 233 84 -21 -93 -183 -137 -92 -1 110 106 190 139 -21
6676 -21 -60 -81 -128 -146 -52 56 128 159 179 113 -32 -97 -147 -116 -84 12 32 133 140 115 42 -32 -148 -170 -134 -79 13 47 119
6705 119 177 95 8 -98 -119 -166 -148 -47 49 85 139 162 44 -11 -116 -121 -128 -91 -70 71 154 181 156 -12 -68 -109 -142 -110
6733 -110 -80 89 134 191 160 63 5 -135 -159 -157 -87 -29 66 181 136 126 29 -36 -103 -163 -143 -75 23 94 129 116 106 12 -88
6762 -88 -134 -155 -111 -78 68 139 171 141 31 -4 -151 -168 -137 -64 -25 96 148 148 110 11 -84 -169 -193 -92 -37 62 123 146
6790 146 101 50 5 -67 -128 -138 -68 -11 63 122 153 98 57 -59 -114 -177 -110 -45 52 92 148 115 94 38 -114 -137 -158 -135 -32
6819 -32 76 104 143 132 61 -15 -156 -128 -117 -47 -11 135 116 155 73 33 -35 -205 -111 -128 -34 84 116 127 124 66 -51 -93
6847 -93 -143 -111 -50 -33 165 97 145 55 -30 -11 -145 -141 -184 -96 39 69 166 126 95 0 -61 -182 -135 -72 -28 46 98 109 113
6876 113 49 -63 -139 -181 -125 -47 16 109 114 134 70 -12 -34 -156 -148 -104 -3 87 114 132 141 23 -29 -131 -156 -147 -97 27 103
6905 103 158 141 19 -26 -61 -121 -99 -136 -14 62 125 197 176 64 -27 -117 -197 -139 -52 39 47 148 174 92 13 -38 -98 -146
6933 -146 -115 -56 15 111 144 125 54 1 -78 -132 -175 -104 -18 28 188 141 97 31 -72 -91 -129 -107 -88 66 113 128 146 48
6961 48 56 -141 -168 -157 -83 -2 45 152 147 113 59 -12 -113 -153 -152 -50 -6 93 142 193 76 -28 -89 -164 -175 -109 -47 78
6989 78 79 142 102 67 -25 -67 -93 -134 -68 18 52 164 146 111 14 -79 -176 -177 -119 -26 81 116 140 113 90 -63 -67 -110 -113 -102 10
7020 10 56 144 173 144 -13 -20 -137 -108 -99 -70 87 68 149 119 130 18 -71 -139 -143 -41 -12 88 133 129 133 30 -31 -154 -117
7049 -117 -149 -72 54 83 127 190 117 77 -32 -138 -182 -94 -40 73 121 126 149 114 -12 -70 -153 -97 -68 2 64 117 149 90
7077 90 20 -61 -98 -146 -114 -4 73 150 142 122 57 18 -76 -116 -103 -60 9 77 114 146 104 59 -56 -98 -147 -104 -27 46 162
7106 162 164 152 72 -5 -82 -119 -107 -73 -31 54 105 160 97 72 -14 -109 -163 -121 -78 31 103 92 160 57 0 -89 -139 -125 -111
7135 -111 5 34 77 152 134 85 -8 -107 -113 -164 -38 -62 124 129 184 106 36 -95 -94 -190 -111 -18 -23 127 141 155 42 -10 -112
7164 -112 -174 -105 -52 -12 32 116 102 61 45 -42 -86 -125 -176 -74 12 67 93 119 106 -14 -82 -132 -127 -56 4 38 93 107 136
7193 136 67 -22 -94 -196 -108 -94 39 70 158 135 48 -21 -79 -111 -139 -99 -99 58 120 140 118 16 6 -118 -144 -131 -94 13
7221 13 49 149 136 50 -17 -35 -84 -116 -105 -57 60 59 82 99 37 0 -80 -153 -185 -110 -16 94 96 130 132 17 -30 -116 -129 -91
7251 -91 -84 8 100 120 86 77 -5 -68 -155 -149 -95 -20 68 76 139 86 21 -54 -124 -91 -144 -61 14 101 165 128 114 -24 -74 -129 -182 -139
7283 -139 -53 43 122 134 83 37 -30 -128 -93 -126 -74 -26 68 148 189 93 52 -64 -170 -116 -151 -43 85 125 140 91 64 -27
7311 -27 -81 -136 -149 -44 -29 63 138 147 104 -19 5 -121 -127 -103 -34 90 90 116 93 58 -41 -47 -113 -84 -57 -16 96 126 105 87
7341 87 5 8 -124 -164 -68 -70 -2 50 94 141 57 19 -91 -90 -129 -142 6 11 90 145 168 54 -13 -54 -139 -130 -86 -25 83 123
7371 123 144 73 11 -51 -112 -182 -101 -66 10 124 151 134 90 -32 -103 -131 -108 -75 31 66 97 152 80 22 -93 -62 -116 -162
7399 -162 -2 3 163 130 166 95 47 -74 -69 -86 -89 4 39 108 150 130 20 -24 -99 -128 -109 -54 27 89 73 145 50 -11 -86
7428 -86 -116 -61 -100 -21 21 138 169 130 73 -29 -80 -153 -95 -54 22 90 158 146 65 17 -24 -35 -96 -70 -17 6 126 112 89
7457 89 33 -11 -105 -95 -115 -83 35 68 104 126 95 3 -38 -106 -120 -45 -62 -8 110 136 90 103 30 -79 -110 -130 -33 -34 68
7486 68 80 154 117 6 3 -65 -134 -105 -91 5 62 104 78 66 17 -88 -42 -102 -65 -32 50 156 122 112 81 -12 -33 -100 -118
7515 -118 -74 35 84 141 111 92 59 -82 -154 -137 -66 -72 13 98 100 74 26 -11 -97 -135 -71 -115 -12 86 122 97 74 49 -27
7544 -27 -129 -116 -99 -5 20 107 89 127 93 31 -83 -141 -93 -72 -43 85 93 203 101 21 -59 -120 -103 -145 -75 40 98 53
7572 53 116 81 -18 -59 -95 -102 -87 3 59 99 140 135 44 5 -79 -131 -141 -60 3 59 100 158 89 14 -48 -112 -96 -111 -73 3 89
7603 89 134 120 15 -57 -56 -141 -58 -127 -14 34 126 133 100 63 -109 -134 -135 -119 -20 50 75 94 65 49 0 -76 -76 -102 -69 -27 36
7634 36 138 105 101 16 -59 -98 -158 -142 -77 9 84 50 91 33 25 -69 -100 -103 -87 -36 27 176 111 133 15 -48 -112 -146 -105 -64
7664 -64 25 54 134 87 78 -27 -39 -84 -173 -124 -60 25 96 79 124 33 -57 -105 -97 -108 -93 -2 73 95 91 51 44 -20 -90 -147 -123 -57
7696 -57 16 113 105 107 43 66 -51 -99 -106 -75 54 49 94 110 91 2 -27 -79 -126 -118 -82 8 51 149 90 93 5 -53 -137 -99 -94 -23 24
7729 24 74 103 64 17 17 -67 -122 -96 -52 -33 116 111 138 104 -19 -69 -125 -84 -61 10 48 64 118 146 94 -26 -43 -95 -121 -73
7759 -73 -10 48 70 113 86 -35 -12 -82 -69 -85 -17 65 66 123 106 57 -12 -35 -145 -132 -39 -24 75 88 143 96 11 -41 -116 -132
7789 -132 -123 -74 6 91 99 161 113 21 -22 -144 -134 -34 -4 7 70 126 70 25 -42 -66 -140 -75 -60 16 76 115 92 70 22 -62
7819 -62 -97 -112 -44 40 45 85 112 121 81 -28 -91 -124 -125 -130 21 46 82 108 66 34 -52 -103 -131 -72 -36 38 96 99 80 31 0 -23
7851 -23 -127 -60 -109 10 28 68 108 109 61 -102 -89 -90 -56 16 23 45 105 113 91 -10 -41 -75 -102 -108 33 67 110 64 70 32 -28
7882 -28 -87 -99 -23 -88 3 66 67 65 101 20 -7 -101 -150 -101 -52 45 69 82 80 70 15 -36 -123 -104 -77 0 24 75 95 83 53 14
7914 14 -115 -86 -71 -93 33 104 164 99 73 -36 -83 -56 -68 -63 -4 55 32 62 99 71 -7 -87 -31 -75 -59 40 77 150 94
7943 94 48 -2 -50 -90 -107 -99 -45 -1 61 128 90 51 -24 -108 -112 -114 -83 29 42 83 49 63 21 -67 -69 -86 -58 -47 -15 73 109 69
7975 69 4 -38 -107 -99 -98 -47 -7 33 86 40 54 36 -58 -84 -70 -98 -21 47 55 59 120 105 -55 -61 -105 -92 -73 -5 23 112 91 54
8007 54 31 -45 -102 -110 -90 -80 -6 95 76 106 52 -58 -59 -126 -81 -106 -2 46 93 93 63 33 -31 -37 -104 -102 -17 -12 67 87 100 77
8039 77 -26 -88 -136 -69 -82 -30 -7 87 142 66 -11 -48 -70 -107 -68 -24 -14 71 95 121 78 -7 -36 -57 -77 -63 -47 20 84 87
8069 87 95 82 -8 -69 -138 -123 -70 -39 3 71 80 66 5 -52 -60 -125 -48 -60 27 40 61 109 117 -11 -29 -106 -113 -67 2 18 39 83
8101 83 95 -13 -54 1 -66 -79 -53 7 91 97 101 64 33 -75 -118 -111 -24 7 5 121 48 111 49 1 -115 -70 -50 -41 46 13 88
8132 88 55 81 -8 -18 -122 -68 -24 -42 13 115 80 108 91 -14 1 -93 -103 -131 37 60 58 92 117 27 -63 -99 -97 -93 -27 -2
8162 -2 48 90 62 65 19 -28 -68 -56 -71 52 1 86 100 122 82 -45 -56 -90 -122 -31 11 80 83 100 90 19 -2 -121 -85 -56
8192 -56 -27 47 111 139 55 51 3 -78 -40 -97 -13 -9 94 113 94 73 31 22 -67 -50 -61 -16 42 99 115 122 98 11 -48 -49 -76 18
8224 18 -42 75 57 132 145 7 17 -83 -105 -86 -13 -1 106 105 84 61 -19 -52 -97 -118 -61 42 27 39 145 111 31 -9
8252 -9 -86 -122 -64 -47 21 100 96 113 54 68 -36 -100 -15 -104 -71 14 124 107 58 60 -14 -60 -123 -77 -73 5 34 77 84 46 67 -42
8284 -42 -89 -77 -91 -53 20 39 58 119 29 2 -34 -119 -57 -56 8 53 97 77 36 37 -55 -37 -87 -57 -46 51 60 84 99 44 44 -30
8316 -30 -105 -74 -22 -25 60 96 60 37 26 6 -54 -152 -70 -41 44 34 93 75 60 1 -68 -94 -128 -77 -10 47 67 57 70 25 -35
8347 -35 -98 -55 -94 -56 -37 57 119 90 54 -34 -33 -80 -140 -70 -3 -7 76 82 83 49 -5 -78 -59 -145 -33 -30 29 49 96 109 -12 -50
8379 -50 -87 -90 -54 -106 -1 55 116 75 5 33 -52 -62 -121 -69 1 49 77 121 65 -4 -26 -88 -63 -132 -69 0 17 63 51 74
8409 74 0 -74 -90 -163 -24 -27 28 44 126 106 -7 -1 -69 -114 -62 -92 9 59 105 185 93 33 -25 -100 -76 -82 17 22 97 108 80
8440 80 -11 23 -58 -110 -48 -95 -25 9 54 79 68 52 -54 -65 -89 -112 -57 -7 60 63 98 34 -29 -50 -74 -105 -24 -19 44 93 154
8471 154 48 49 -42 -96 -65 -49 -21 2 66 26 80 101 34 -7 -87 -49 -38 -20 1 99 86 109 77 -24 -66 -107 -87 -74 -47
8500 -47 33 53 68 50 4 -75 -65 -118 -124 -72 -5 42 88 143 73 -40 -83 -56 -82 -71 10 27 92 66 54 46 -4 -58 -83 -76 -71 -5
8532 -5 67 102 97 45 -31 -75 -106 -28 -47 -10 11 50 62 97 27 -1 -81 -90 -12 -75 25 71 90 117 -11 6 -76 -65 -92 -58 -25
8563 -25 16 73 62 82 53 -12 -58 -101 -48 -78 -37 69 122 62 77 1 10 -74 -83 -55 -24 79 39 101 88 26 25 -97 -30 -77
8593 -77 -104 18 33 73 84 69 4 -54 -91 -43 -52 -4 21 60 77 108 26 14 -38 -114 -82 -56 21 31 59 40 121 35 15 -82
8623 -82 -50 -90 -30 22 5 94 81 74 -3 -14 -51 -69 -55 33 55 59 121 41 24 -35 -34 -75 -70 -16 -28 23 89 102 101 -8 -8 -96 -93
8656 -93 -59 -52 79 81 77 62 64 -4 -71 -44 -81 -48 -6 67 91 68 70 -4 -23 -61 -84 -41 -34 5 70 47 39 54 29 -25 -83 -102 -75
8689 -75 0 23 81 117 93 32 -14 -51 -75 -60 -30 1 29 33 53 62 37 -47 -96 -75 -43 17 8 55 53 21 57 -37 -30 -85 -75 -23 -38
8722 -38 -5 73 63 44 37 -39 -68 -92 -71 -1 35 98 132 108 96 -21 -71 -101 -76 -17 -6 68 52 103 67 44 -20 -99 -65 -53
8752 -53 -27 -18 69 101 64 49 10 -9 -103 -54 -97 -33 22 68 100 109 35 -20 -67 -84 -81 -51 -19 69 100 91 45 -10 -44 -71 -72 -39 -30
8785 -30 27 56 71 73 52 -27 -56 -36 -71 -37 -5 63 23 52 83 -5 -17 -79 -120 -70 -31 11 10 91 74 40 -9 -50 -49 -101 -64 -8
8817 -8 24 23 62 21 16 16 -70 -64 -67 -30 46 41 81 96 55 -8 -82 -52 -96 -21 -2 20 85 38 93 36 5 -28 -41 -52 -65 8 21 39
8851 39 65 99 2 -18 -16 -59 -60 -11 50 65 94 84 49 -2 -35 -66 -71 -54 -16 63 80 92 53 49 -51 -65 -76 -5 2 45 7 91
8883 91 104 30 36 -42 -73 -54 -23 23 68 91 100 95 16 -23 -60 -53 -101 22 10 49 101 63 89 9 -9 -69 -51 -20 -23 24 10 65
8915 65 70 67 40 -107 -39 -67 -42 -8 72 41 99 69 79 0 -69 -83 -132 2 33 73 125 87 22 5 -35 -65 -51 -17 2 29
8945 29 28 90 18 5 -12 -66 -59 -27 -22 16 56 46 -20 83 0 -8 -47 -85 -46 -24 49 58 73 57 71 -13 -72 -50 -40 0 10 47
8977 47 86 86 18 -7 -2 -25 -84 -83 23 29 56 59 23 33 12 -48 -72 -45 -34 22 13 52 89 -9 -7 -55 -30 -79 -56 -17 3 86 52
9010 52 104 30 10 -51 -49 -33 -40 12 20 98 77 0 35 -33 -36 -58 -82 -67 0 38 58 69 11 -34 -67 -39 -67 12 6 19 15 66 34
9043 34 -13 -29 -60 -62 -29 -18 -18 97 23 31 34 -5 -58 -77 -82 -34 -5 31 28 60 71 48 -25 -47 -96 -41 -22 0 75 71 49 41 -2 -34
9077 -34 -57 -58 -14 -62 -33 45 56 71 47 4 -73 -46 -85 -26 24 35 56 44 62 -15 -26 -70 -86 -53 -52 6 38 38 67 9 1 -79
9109 -79 -62 -79 -19 25 6 51 100 8 -40 -27 -58 -47 -72 -32 -15 -7 30 54 18 37 -73 -112 -87 -47 -48 1 31 78 72 -9 -27
9140 -27 -28 -67 -49 -4 -31 9 49 62 68 -1 18 -71 -50 -55 -51 64 62 55 37 37 20 -17 -26 -42 -85 -14 66 83 27 30 63 -33 -76 -88
9174 -88 -54 4 17 3 -5 54 60 13 -20 -65 -62 -58 -30 6 57 53 46 50 -51 -55 -99 -43 -29 -34 28 15 70 51 42 -6 -33 -34 -58 -44 17
9209 17 58 87 74 48 -30 -54 -96 -62 -61 -35 26 30 71 39 26 -38 -65 -66 -74 -40 -31 54 85 26 21 13 -85 -61 -114 -64 -31 29 41 125
9243 125 97 20 -51 -88 -75 -77 -21 28 25 98 46 4 1 -42 -45 -10 -35 18 8 108 33 20 36 -29 -37 -68 -52 -12 8 25 70 68
9275 68 39 25 -24 -45 -62 -31 -33 94 55 59 30 -13 -18 -74 -87 20 -18 30 55 66 84 44 59 -19 -2 -24 -47 -47 39 55 103
9306 103 106 26 26 -49 -80 -39 16 19 9 56 62 103 30 13 -55 -87 -20 -19 34 20 54 78 30 21 -7 -52 -64 -28 14 60 49 59 93
9339 93 34 -1 -49 -55 -88 7 32 9 93 58 121 -13 -63 -54 -54 3 -6 2 25 44 47 39 -14 -48 -89 -82 9 14 89 46 100 21 -69 0
9373 0 -37 -36 -1 -32 7 55 77 66 38 -50 -31 -16 -69 -1 3 52 68 47 38 25 -13 -40 -8 -92 -18 57 31 29 -28 73 3 -11
9405 -11 -49 -98 -47 -39 49 55 75 65 -40 -68 -26 -29 -33 -5 -5 39 23 37 40 -5 4 -47 -41 -55 -8 47 54 59 83 13 -25 -41 -93 -23 -20
9440 -20 -36 58 45 38 35 -29 -9 -90 -38 -59 49 -13 42 29 77 30 -6 -9 -56 -10 -32 -6 9 44 70 51 56 -14 -40 -104 -35 10
9472 10 2 50 40 54 56 38 11 -6 -24 -23 8 13 75 70 42 19 -12 -35 -65 -45 -16 7 35 34 54 44 65 24 -112 -79 -9 20 1
9505 1 29 124 28 -16 -10 -22 -55 -35 -20 11 53 21 87 44 27 32 -29 -36 -16 -16 42 107 103 44 23 -34 -16 -53 -67 -8 9 58 57 32
9539 32 61 5 -11 -28 -38 -73 -44 23 41 64 46 36 65 -25 -8 -32 -24 -4 -6 28 27 108 12 -4 -47 -79 -43 -13 39 43 54 12
9571 12 41 15 -31 -88 -62 -63 -44 56 30 72 76 21 -8 -74 -21 -66 -32 -44 28 51 90 37 1 -13 -38 -59 -83 -23 20 9 84
9602 84 66 23 -31 -54 -66 -58 -27 -16 66 108 57 22 55 8 -63 -75 -49 -30 5 43 46 55 46 -14 5 -47 -55 4 30 21 36 67 51
9635 51 44 -52 -17 -85 -19 -21 10 72 70 47 34 37 -71 -69 -26 -34 18 25 66 25 21 20 7 -37 -81 -28 7 -4 50 34 32 44 -13 -7 -22
9670 -22 -34 -78 -19 18 67 39 50 32 1 18 -39 3 -22 20 53 19 27 55 -6 30 -26 -24 -65 -57 37 69 91 79 93 23 -8 -75
9702 -75 -25 -44 21 -2 60 111 30 -11 18 -29 -52 -34 17 28 71 45 52 3 -7 -43 -8 -60 -12 20 43 79 88 59 51 1 -26 -45
9734 -45 -37 -26 15 18 69 63 18 80 -51 -36 -85 -41 5 9 84 49 61 40 22 -18 -40 -7 -42 -26 -26 40 16 -7 38 -44 -11 -33
9766 -33 -44 -26 7 56 29 78 27 13 -40 -17 -61 -28 8 -12 -12 50 56 4 10 -26 -20 -32 7 29 10 69 74 -3 -15 -7 -61 -64 -12 -35
9800 -35 22 48 61 73 52 -36 -88 0 -58 -41 -5 76 -3 14 70 3 -47 -15 -56 -54 -21 -13 25 53 49 32 -26 -53 -33 -37 3 -69
9832 -69 56 77 5 26 -16 52 -38 -14 -63 -10 37 23 127 29 58 4 -38 -46 -4 2 -9 60 11 69 53 24 -7 -7 -66 -95 -25
9863 -25 40 96 65 32 71 15 -43 -48 -109 -20 11 9 -20 67 28 -10 16 -75 -39 -30 -61 -29 13 14 28 -15 -19 -61 -75 -56 -71 -43 -13
9896 -13 18 17 31 30 -6 -41 -78 -43 -77 -59 -5 33 46 11 -25 -16 -51 -55 -4 -23 -10 24 15 63 25 44 -10 -57 -27 -51 20 13 27
9929 27 57 7 -2 -4 -13 -36 -25 5 -14 83 22 46 14 37 -45 -68 -29 -48 0 22 59 59 49 23 -25 -62 -31 -33 -41 -50 -3 66 23 22
9963 22 -21 -41 -104 -38 -11 20 7 35 57 39 55 -28 -10 -51 -28 -26 31 51 73 62 49 27 -39 -30 -19 -60 3 -2 35 104 74 62
9995 62 28 -28 1 -92 -23 -33 13 68 55 71 32 -1 -33 -62 -47 -32 2 -49 35 20 24 36 47 -31 -49 -2 -79 32 21 30 49
10026 49 27 44 -39 -14 49 -21 24 -6 56 18 1 -7 -7 -43 -15 -11 -13 -3 25 55 68 22 -34 -8 -17 -50 -9 -48 32 0 53 43
10058 43 42 -10 -11 -31 -40 -73 12 29 21 99 -4 -5 -18 12 14 -26 -31 -6 3 69 83 66 8 -49 -23 -91 -6 40 58 49 48 55 0 -22 -28
10093 -28 -108 -27 -29 15 13 66 -7 -20 12 -16 -4 -42 17 -17 4 45 63 13 15 -17 20 5 -79 -19 42 22 42 -1 58 -4 -54
10124 -54 -66 -36 -8 32 29 28 91 41 24 27 -46 -30 -18 -44 7 7 16 25 84 12 -38 -38 22 8 -20 19 37 62 35 41 -23 -36 -35 -32 6
10159 6 12 26 24 60 18 58 -24 -54 -19 -5 23 0 23 30 59 -4 -5 -33 -42 -39 -61 26 43 16 -1 -2 23 -33 -29 -52 -21 -48 47 53 16
10194 16 53 32 19 -30 -58 -40 -22 7 -22 38 31 21 -1 -53 -47 -25 -5 -20 22 -15 8 59 38 16 -25 -18 -36 -24 21 29 60 40
10226 40 64 8 19 -18 -44 -4 -5 -35 70 48 58 52 13 -13 -59 -31 -57 -18 21 -9 28 38 -40 41 -47 -7 -54 -21 -17 -31 -11
10257 -11 54 40 19 -18 -57 -43 -49 -54 14 -6 65 0 26 21 -27 -7 -65 -18 -32 15 30 64 61 -16 -49 -42 -8 -97 -33 19 39 44 29
10290 29 53 38 -13 -50 -47 -4 -62 83 39 16 47 -14 10 -36 -39 -50 -20 0 39 9 8 67 9 -27 -2 -71 -63 1 1 0 4 19 -11
10323 -11 19 -78 -31 21 -32 25 30 22 13 18 18 -9 -9 -36 -39 -4 -13 61 26 33 3 7 -32 -25 -18 -7 36 65 6 14 2 41 26 -30 -24 -25 -36
10360 -36 28 41 0 76 23 -31 -29 -46 -28 -42 -17 38 24 26 -27 36 -35 -15 39 -6 -17 29 72 -12 34 24 -38 -36 -27 -37 -49 28
10392 28 -15 23 9 -5 45 15 -28 -36 -35 -68 10 51 23 17 10 26 -18 -11 -15 -9 -37 13 14 46 48 55 -14 -20 -40 20 -18 17 -32 40 44 23
10428 23 -9 -26 15 -23 -12 -2 -30 1 27 45 -1 22 -53 -53 -32 -56 -19 36 20 40 46 13 -2 -19 -35 -9 -13 11 25 40 32 72
10460 72 -10 -49 11 -69 -25 -15 29 48 64 12 0 -22 -20 -44 -33 13 -44 13 18 22 4 25 -40 -2 -70 3 12 9 34 35 26 44 36 -26
10494 -26 43 -32 -61 42 61 49 21 45 -21 -44 19 -29 -2 -23 71 47 11 13 -12 50 12 -16 -13 -9 -20 25 64 48 83 12 -30
10525 -30 -68 -33 -44 27 11 -1 13 50 60 20 40 -51 -17 -26 -22 -13 21 100 62 19 -36 -33 7 -32 10 -12 20 -24 70 38 22 -1
10557 -1 -20 -39 -61 4 3 -33 29 64 54 43 -4 -15 9 -42 -19 35 -13 71 43 25 -14 -28 -24 -68 -14 37 44 31 39 38 9 3 -41
10590 -41 -2 -39 -53 -32 -20 50 56 64 18 -56 2 -31 -41 13 7 64 78 28 31 -2 -30 -52 -36 -22 7 46 23 86 -10 23 -43 -53
10622 -53 0 -36 -4 -2 15 1 13 -6 -43 -13 -41 -37 -5 -18 16 23 74 -13 -20 -15 -36 37 -38 22 -1 24 3 56 49 -49 2 -61 -16
10655 -16 -25 -10 8 22 23 16 -24 -39 -56 -28 -54 6 0 24 40 5 36 -19 0 21 -42 -4 -28 20 51 7 -30 -8 -40 -23 -1 -16
10687 -16 -10 -21 23 25 4 51 -23 5 -56 -85 7 -76 54 29 21 -33 14 -6 -26 -17 -50 -16 18 -21 10 44 3 -21 -40 -30 -3
10718 -3 11 11 -12 1 52 41 -51 4 -30 -27 18 8 -4 -2 73 10 16 -1 -58 -17 -32 30 -64 24 -3 55 5 -11 42 -63 -18 -4
10750 -4 -36 -27 -43 -33 29 36 60 55 -21 -48 -21 -40 -21 5 62 57 56 7 -45 8 3 -39 -18 29 12 10 63 -21 38 -5 -42 -39 -33 -9 21
10785 21 13 2 37 15 -6 40 -21 -59 -3 2 4 56 7 36 -19 -6 -45 -22 -3 -15 56 77 6 8 45 25 -15 5 7 -45 14 25
10817 25 71 38 -3 6 -5 -13 -60 6 -13 24 17 11 59 -8 27 -64 6 -74 -9 -69 19 74 10 62 -24 1 -72 -22 -25 3 8 22 23
10850 23 12 -14 1 3 -31 22 25 10 40 34 51 24 -60 4 -19 -41 25 9 9 -18 33 36 27 36 32 -21 -50 -57 9 45 6 8 38 35 -28
10885 -28 -62 -65 -32 24 21 41 51 34 30 31 -2 -33 -6 -11 59 19 7 7 46 81 8 40 -17 -11 -13 14 -34 29 17 29 14 6 -43 -74
10919 -74 -25 29 45 54 40 -7 -6 -11 8 -47 -5 -23 40 15 47 -3 4 -17 -27 -55 -2 -66 -20 11 26 18 45 18 30 -42 35 -18
10951 -18 13 26 4 44 53 12 15 -72 -56 -52 -5 17 -18 29 6 25 -6 -3 -14 -17 10 8 31 34 11 48 4 44 2 -22 7 5 -10 -33
10985 -33 -5 20 13 -14 -17 -8 24 8 -6 -48 18 58 9 27 -8 -18 -8 23 -8 -41 0 35 27 -17 23 -4 -32 3 -49 -20 -48 6
11017 6 10 48 42 48 9 -16 -32 -24 20 -67 4 23 0 22 4 -7 2 -51 3 -49 25 14 75 44 32 29 2 -39 5 -4 -38 12 6 21
11051 21 35 -14 -16 -24 -6 -67 -1 -41 13 6 34 -14 -19 -1 -4 -14 -53 -31 22 10 3 14 -11 9 -64 -49 -30 -20 10 59 -9 42 -11
11084 -11 -25 -24 -43 1 -22 -41 -43 5 -26 -40 16 -18 -16 -50 -57 17 -30 17 -25 28 11 21 -1 8 -52 -25 -42 -35 -1 20 6 -13 -3
11117 -3 -27 -12 -6 -7 -59 5 1 30 -12 27 -14 4 -57 -88 -81 27 -19 7 -19 -9 18 33 -54 -8 20 16 12 11 48 2 -37 15 4
11150 4 -26 41 -48 -25 -2 37 -12 30 -1 -25 5 -30 -35 22 38 0 32 2 -7 35 -12 -6 -3 6 -40 -16 86 49 73 -20 -71 -3
11182 -3 -4 -24 -34 1 9 -47 6 -8 24 -40 24 -8 -34 9 9 2 -11 76 24 20 33 9 -2 -17 15 6 30 44 48 42 -43 -33 -36 -6 26
11217 26 24 24 28 16 -11 19 8 12 9 21 13 4 11 15 -43 25 -23 12 -15 -15 -13 -28 1 49 13 -11 0 15 -20 -19 -62 -33 23 -2 -13 22
11253 22 -20 -9 -34 -23 -13 -14 36 -1 34 -32 -15 -5 7 -6 -13 28 -15 -12 -18 74 55 42 5 -36 -13 -22 -25 33 -1 48 30 61 0
11286 0 -23 22 1 -34 9 44 29 45 43 42 -9 -29 -11 -24 0 33 15 -25 -7 -20 -10 47 -29 -7 -75 -32 10 -10 53 -5 -27
11317 -27 -21 -4 3 0 5 -33 25 -21 27 8 53 26 -13 -12 -37 -13 -10 66 30 32 37 -13 -13 35 9 -26 8 7 -1 18 50 20 -5 13 -28
11352 -28 -3 -13 8 25 36 60 -18 11 -28 -37 -18 16 1 -34 -27 -5 19 24 -23 -33 -13 25 -21 18 26 21 36 -24 -43 37 -15 19
11384 19 -25 -24 -34 12 -2 4 -13 13 -34 -75 -56 -49 -6 23 31 53 19 -24 -47 -5 -55 -46 0 -11 8 19 -3 -3 -2 -21 12 -53 -23
11417 -23 -26 -48 -16 -20 -13 -1 38 -45 16 -44 -34 -6 -42 7 -18 42 36 -15 -25 -44 -9 -25 -27 49 50 13 8 -4 -10 28 -42 9 -7 3
11451 3 19 26 19 -19 -32 2 -33 14 14 28 2 -3 13 -13 15 18 -14 -16 29 -26 -44 79 32 22 -14 -10 50 9 4 -9 32 25 47 49 -9
11486 -9 -16 -45 22 16 -20 41 24 -3 44 9 17 43 38 -25 13 -17 76 -44 23 39 50 50 5 19 -77 10 -22 4 33 23 26 77 27
11519 27 -6 -1 -8 24 67 -7 6 53 17 -13 -24 -25 0 -35 -1 12 18 71 56 -34 -41 -65 15 -9 -12 -21 22 -19 -11 -14 -3 7 -36 -26
11553 -26 -10 46 -11 16 26 -6 28 -12 13 -12 0 -8 19 40 23 46 3 35 44 21 32 -44 -11 -9 30 24 6 3 24 0 -6 31 -22
11586 -22 -40 14 15 54 47 -8 -17 -27 -27 1 -14 -44 1 78 9 5 18 28 26 -8 -55 9 -15 32 -12 -2 26 -6 11 -6 15 -21 -15
11619 -15 -13 38 -1 31 65 -4 -6 -22 4 18 -3 24 37 47 -18 65 -66 -3 -11 -14 16 10 47 -7 -21 14 16 -20 -54 -32 -30 46 48
11652 48 -8 49 4 20 12 -24 21 -1 9 7 25 12 27 3 8 -3 -14 -9 12 20 34 9 77 23 10 13 5 33 -40 4 4 31 -26 19
11686 19 30 3 -25 -17 -15 -6 34 13 25 -45 -14 17 -2 -14 -2 12 32 -16 6 -20 36 32 11 -21 -37 -6 -1 -12 30 16 40 26
11718 26 51 31 -58 13 -54 10 -12 -24 12 -15 17 -19 -14 -31 20 -68 -2 -17 21 37 3 -9 -12 -21 -24 4 12 -25 37 13 -4 36
11750 36 -23 -4 -49 -50 -35 -12 30 -9 23 -8 -60 8 -6 -17 8 17 -25 -53 -13 -17 39 -9 -12 -15 -6 -9 -15 -14 -44 40 18 -14 -13 12 -37
11785 -37 21 -35 6 -15 30 15 -46 4 -27 -60 3 -8 0 -1 9 42 18 -37 4 21 -23 -30 -50 28 13 38 40 31 16 -25 -17 -30 -23
11818 -23 -9 -10 -27 -3 42 -21 24 -11 0 -68 -52 29 -71 2 13 -32 22 1 9 -53 -23 -13 -21 1 12 -18 45 -21 -42 32 -12
11849 -12 -52 -56 -46 18 -27 14 -12 -66 42 23 36 -13 4 -1 -11 16 38 33 -20 -25 1 19 -25 3 9 10 -5 -12 1 -17 47 -23 -1
11882 -1 -14 20 15 40 42 3 42 -13 -37 -61 -19 -7 -11 37 -14 15 -14 -25 -32 -48 13 -22 8 -31 30 5 -5 8 -15 22 -34 -20
11914 -20 13 -41 42 -47 -18 11 -9 -32 0 -18 -28 1 16 0 37 -17 57 -21 26 -67 -18 14 18 39 -3 34 5 -12 -63 -7
11944 -7 1 -43 14 50 17 7 44 -4 -18 8 -8 -27 -29 0 21 27 -20 14 -27 39 -14 27 -1 -26 44 52 80 4 -9 -2 -15 -16 -9 22
11978 22 18 -16 -15 8 24 -23 19 -1 25 31 16 16 23 62 -2 3 33 1 30 -14 -11 17 -6 28 17 57 50 5 -1 -27 20 46 4 16
12012 16 35 23 18 -19 -20 23 -37 9 5 25 -2 12 -2 17 40 -22 9 55 14 26 9 4 11 69 32 70 8 -54 -15 -9 -5 7 27
12045 27 -11 -21 -3 -20 26 16 -3 0 7 8 -12 -10 0 11 -21 -2 -2 -28 -39 30 -39 -4 8 -16 -28 1 24 -23 -8 17 -24 33
12077 33 14 47 19 15 48 -23 19 11 43 0 8 -35 15 20 -21 -10 -7 -2 28 -9 13 -23 -18 40 -7 -23 11 30 -37 17 18 28 34 -6
12111 -6 -24 -3 -1 -22 -27 7 25 -22 -32 16 -18 -9 24 -88 -49 -7 33 -1 36 -32 -44 -36 -10 -27 -39 -56 1 13 -2 23 34 2
12143 2 24 -22 -36 -16 -25 -15 4 29 -44 27 12 -19 30 14 -14 25 24 20 55 -5 32 -61 -13 -25 -37 41 35 22 -14 -21 9 36 21
12176 21 19 20 -35 41 8 44 0 18 31 -38 -25 4 -2 11 4 23 -1 2 -24 47 62 1 -15 -65 -24 -51 15 -6 -25 15 4 -22
12208 -22 -33 10 33 -1 -6 19 1 -7 -14 -11 -13 -2 11 23 31 31 36 30 75 -25 25 -45 14 12 -34 50 14 -8 18 0 23 -22 3 -26
12242 -26 28 -6 -11 -20 -47 8 59 -41 -26 11 -8 -30 33 -5 11 26 -50 29 -37 -20 -27 31 -44 -38 9 44 5 43 -1 -27 7
12273 7 9 -15 3 14 20 46 -4 18 -2 51 -30 29 -5 -10 34 55 4 -7 13 -10 13 -19 -12 34 21 -20 22 17 0 20 -2 24 -24
12306 -24 24 -35 20 43 55 6 -10 -56 -22 3 -5 25 -8 -16 -14 17 50 22 -60 -34 6 -3 32 -21 -2 59 -29 -9 12 -1 11 16
12338 16 -23 40 -13 2 50 31 30 -19 -18 2 -48 36 -17 39 -7 -42 -7 -10 -9 -41 58 6 20 8 42 20 0 -12 -23 6 -40 7
12370 7 -7 53 40 21 13 -12 27 -6 -25 15 -17 16 26 54 36 -25 16 -28 -8 20 -16 6 23 42 -6 -5 24 2 41 -34 5
12401 5 0 62 -2 8 -11 -23 -9 7 -24 46 17 -45 28 8 21 3 5 -42 -14 -18 10 -31 -25 26 37 38 -4 30 11 13 26 -60 -1
12434 -1 27 -12 -18 21 15 6 16 -4 1 -33 -30 24 -34 22 -7 -17 16 39 -2 -71 -20 -29 51 10 16 -20 -44 -2 4 6 18 31 -2 -34 51
12469 51 27 56 -14 -25 12 -25 -18 -2 2 -23 19 22 11 4 -34 21 -23 16 43 17 22 1 -37 2 -26 -13 21 -6 -33 -31 10 9 -9
12502 -9 -10 -27 -36 -27 5 -15 40 -1 -19 26 2 -36 -2 5 -67 -7 38 21 48 21 42 -34 18 -14 24 5 -12 -3 27 24 22 4 12 2
12536 2 33 -15 -59 -2 -5 42 -27 77 -18 3 -17 -19 23 -1 19 -18 6 29 -15 0 -15 20 -9 -16 -21 -12 48 -2 -6 3 38 -56 -9
12569 -9 -15 5 18 17 -19 -20 2 -31 20 24 -37 -9 50 -18 41 5 22 30 45 -12 -18 -25 -3 -29 -16 -32 19 -12 25 22 -55 -34 15 -14
12603 -14 -54 -6 31 18 41 -3 17 -9 -8 -13 -20 51 9 69 13 -38 34 -1 -7 -15 -6 6 27 10 64 -10 23 16 -37 27 -22 5 -6
12636 -6 13 33 -10 12 19 -35 68 -13 -18 38 -6 -1 50 57 -45 -18 -5 18 -22 55 -28 -8 94 33 44 -2 23 -39 -21 21 12
12667 12 19 -31 39 9 17 6 -5 -5 -11 -1 -4 21 -9 -11 -13 12 -35 -1 -15 -21 -4 12 4 31 2 22 -20 49 10 29 4 -9 43 30
12701 30 21 -23 44 -39 -28 24 -30 -6 22 37 -8 -1 28 -20 20 -30 27 16 71 54 17 23 -37 98 30 31 -26 -7 14 -51 -7
12732 -7 0 15 48 28 25 12 -7 -27 14 18 39 26 12 36 -12 8 8 14 -45 39 12 -22 52 -6 22 46 -14 4 7 -18 15 26 7
12765 7 40 25 -5 35 6 25 7 27 -8 3 41 43 29 51 2 0 -9 12 37 -10 3 30 13 -13 10 8 -4 -43 32 -34 48 42 -4
12798 -4 45 -11 4 -5 -1 -9 28 61 2 43 7 11 -22 6 -11 4 -7 -9 4 1 60 -18 5 24 -34 60 11 62 24 -13 -21 -8 -8 5
12832 5 43 -1 -2 -19 27 11 36 -19 5 65 -3 -20 -5 12 28 -45 40 4 -17 21 23 49 -7 -12 -24 -64 44 17 22 28 13 -9
12864 -9 24 58 0 34 9 -17 8 -20 5 -21 -18 34 -30 33 39 32 42 47 19 51 -22 19 6 15 -4 15 -27 7 6 12 2 -46 -18 -28
12898 -28 -5 -20 25 23 12 34 7 -25 -2 -6 -6 -53 44 15 18 -48 -5 23 2 -10 -2 -32 -76 -12 -21 55 -24 -68 -2 18 -19 24 -18
12931 -18 -34 -30 25 -14 -5 12 28 4 10 28 -19 25 18 0 7 8 -12 -50 13 -2 12 28 3 -27 14 54 -36 -4 -16 -26 -55 -46 -34
12964 -34 -17 -26 -26 13 -23 48 -39 -29 -13 -4 -15 8 40 -10 4 -69 -23 -23 0 20 -13 -66 4 38 -27 -5 17 -2 -9 2 -58 -22
12996 -22 18 23 -43 62 17 -1 -6 -47 -4 -26 37 -4 -6 -11 -13 -15 0 16 30 8 16 -58 37 23 20 -17 -39 -26 -15 -8 -17 13 18 -24 20
13031 20 -26 -9 -39 22 -37 -40 -40 -4 42 -17 -5 8 9 -34 -33 -16 -28 -18 -21 39 -29 -19 -2 9 -18 -6 38 -8 39 -4 -20 -3
13063 -3 -24 -21 3 -28 -5 13 0 -8 23 14 -20 -5 3 21 -48 -36 -26 -11 27 -13 26 -26 -6 16 14 18 -7 7 -6 -20 31 0 20
13096 20 3 10 -10 27 -6 -24 -15 21 35 -28 19 -5 -19 -34 -28 8 -17 11 21 46 46 -2 9 -19 -6 -28 -7 -2 55 47 18 -8 7
13129 7 14 -20 -10 25 -1 37 -11 3 17 -14 -1 -2 48 -20 22 11 -6 14 -8 -9 3 -4 -28 30 0 48 -6 14 4 6 -10 -19 7
13162 7 3 -14 30 -21 3 -27 -12 -21 27 5 38 21 -19 15 14 66 83 -10 5 -52 38 28 60 39 -14 15 -24 30 -2 29 36 -13
13194 -13 3 -46 46 -33 1 24 -6 32 -23 -24 -28 4 8 -24 6 -5 24 25 -1 8 21 -24 -7 6 2 15 59 -6 5 -21 33 18 -4
13227 -4 -15 31 41 -37 16 36 8 5 42 -6 22 9 3 1 3 -7 52 0 -27 -14 -3 4 -30 -9 -42 24 36 -19 -34 -48 -42 2 20
13260 20 -4 -24 28 -36 3 24 -53 -14 -23 -19 -13 5 10 -4 62 -12 14 -62 16 16 -11 5 -14 -44 1 26 -16 0 12 -27 -14 -53
13292 -53 23 5 24 -11 -20 13 -51 15 3 45 -11 -17 1 1 2 -16 -3 30 15 -6 -13 17 30 13 1 44 -17 11 -51 2 29 -14
13324 -14 -15 19 20 -11 26 -40 26 3 -8 -14 -30 63 17 -3 11 -26 -12 -5 -9 -16 105 -22 -12 26 7 30 -28 10 33 10 20 22
13356 22 89 18 35 11 -39 -9 -43 1 16 -4 -10 36 10 -17 -19 3 60 -12 -30 26 -23 23 -21 9 43 -6 -23 -5 25 -12 -22
13387 -22 -6 9 -4 15 27 -1 -29 42 -1 -3 -1 50 23 18 -1 1 4 -42 1 13 17 51 63 -7 42 23 45 8 29 -20 1 51 31
13420 31 21 -8 1 -40 1 21 -58 -10 -16 -21 28 -32 29 28 2 -19 15 -38 -49 -7 32 30 11 17 -6 86 -3 -19 -39 -6 26 -18 38
13453 38 33 46 -5 16 -2 -50 25 1 13 48 -3 19 2 -2 13 5 -38 36 12 47 51 12 17 19 2 1 5 -14 3 15 3 -11 10 -27
13487 -27 -39 27 51 -31 -37 2 -2 -5 45 47 -36 -36 23 -22 -25 -41 -9 4 8 18 37 -28 1 24 4 8 -34 37 28 81 -20 1 33 -5
13521 -5 20 -3 9 -3 -16 1 28 18 -27 41 -16 -20 -5 7 34 8 23 11 20 22 -15 17 -1 -35 -12 53 -25 58 -15 10 0 -35
13553 -35 2 5 14 14 42 27 18 -13 16 3 -5 -10 26 -13 -7 13 28 14 15 0 -33 9 -1 -12 0 10 -17 -22 9 -19 -39 -18 -11 -27 27
13588 27 -9 12 -33 24 -13 -6 -9 -12 -49 -12 28 10 36 26 6 5 24 11 -54 -60 36 -4 -11 8 47 3 -11 -4 0 -13 52 -19 5 21
13622 21 -7 -20 59 19 54 1 -12 -55 17 42 -6 65 14 0 12 -47 -21 8 -13 -9 -10 29 16 1 -10 13 -56 11 33 1 -7
13653 -7 -25 56 20 -28 -25 2 37 -40 12 -34 42 41 -11 36 -27 -20 3 -14 -29 5 53 7 21 52 17 -51 27 -13 -20 7 2 14 32
13686 32 23 -19 -24 1 -57 -24 -3 39 55 8 51 -38 -33 28 44 -13 14 -31 -34 -38 25 0 26 31 5 -24 -81 -16 8 78 32 -2 21
13719 21 -31 23 -18 6 -34 9 61 -57 50 -37 -2 10 -40 -2 -28 -2 -28 31 25 -15 29 -18 -39 -8 6 10 36 1 -44 51
13749 51 -23 10 0 5 -31 -74 15 -43 13 13 -17 4 -9 -37 7 14 -15 -23 -33 -11 -17 -5 9 6 16 17 -2 -5 -55 11 24 23 6 -9
13783 -9 -12 -26 -18 13 -19 -1 20 1 51 11 36 -49 17 7 -11 -2 -49 52 1 15 -13 4 4 -27 73 0 9 49 -26 23 -6 16
13815 16 -80 61 -42 -32 7 -33 10 -22 -29 -6 5 41 -15 22 21 38 19 0 55 -3 24 -7 -26 -32 6 6 6 39 -37 -1 -15
13846 -15 -17 34 -49 -2 -42 -13 18 53 30 14 28 -28 -7 -14 13 44 8 44 -14 32 55 25 40 43 35 6 46 21 5 -15 57 19
13878 19 -12 18 5 -1 -15 47 43 68 -1 26 14 -27 6 0 -8 22 -3 -33 16 21 6 60 -63 23 29 0 5 -31 -2 4 9 -2 71 -11
13912 -11 -15 18 -9 -8 32 31 41 3 25 -46 -14 27 -9 -30 2 50 73 13 20 33 6 26 -5 -28 -51 35 12 13 -26 -40 28 8
13944 8 22 23 -1 13 13 -6 -46 -6 5 13 -20 24 -26 -17 -30 17 -19 8 47 17 31 13 -20 -32 -16 11 34 22 12 -15 -38 -32 19
13977 19 20 21 -15 -14 10 15 49 -8 -35 -48 -13 24 -24 33 34 4 34 9 10 -23 -27 8 0 38 -17 56 33 2 65 -27 3 -11 -9 -8 22
14012 22 -8 4 -25 -2 1 -32 -8 14 6 29 31 -5 -3 28 -2 -21 -7 -27 16 -15 13 13 2 -11 37 -5 -56 -14 -17 12 -16 -5 -25
14045 -25 28 22 24 29 12 -34 -55 -19 -12 20 -23 18 18 21 1 -63 32 -41 -17 -31 -18 5 37 29 -21 29 -11 17 -28 1 20 22 24 19 -11
14080 -11 3 -63 17 -4 -14 -4 29 40 -9 52 0 -44 -52 -12 -11 -13 24 -52 32 -3 7 19 -32 3 9 -36 -10 -4 1 18 -10 -26 11
14113 11 0 -28 18 7 -4 -13 -13 -27 -31 -23 -15 -13 15 -34 24 43 -4 9 26 -33 -5 10 12 -9 -2 47 -23 10 -41 17 65 -6 -41 -45
14147 -45 -18 -39 -19 31 37 21 4 -44 -18 -26 -7 -46 -15 49 -46 -5 10 4 -54 -47 -10 -35 4 17 13 38 -26 -15 -9 -2 11 8 3 13
14181 13 40 29 13 -12 12 19 -17 23 -10 -38 42 23 -10 -8 7 -17 16 -51 4 21 20 13 25 67 -20 8 21 -26 -38 22 -13 1
14213 1 10 20 -7 79 8 -8 -13 0 5 14 17 41 45 -4 17 -2 35 -24 -31 -3 -11 58 14 -5 4 13 2 -6 -58 -1 8 36 59 24 58 16
14249 16 -12 -9 24 -38 25 11 64 62 -28 26 38 24 16 -50 -1 -15 -2 16 14 -1 -13 2 18 -17 6 22 -17 -44 17 -6 39 38
14281 38 1 -2 -16 51 -10 78 77 48 -13 -17 34 -14 9 -41 4 -20 44 25 -26 -6 35 -7 -27 -13 24 -37 56 1 1 -25 26 4
14313 4 -30 -29 1 18 1 27 -8 -10 5 31 -58 13 -7 -50 20 -6 16 44 26 -22 -4 -35 -65 -32 -15 50 -6 -2 -5 -19 0 -18
14345 -18 -49 -14 -16 37 8 11 15 0 7 48 -38 -3 -27 -28 0 -29 -2 -3 13 -39 -2 -17 -9 -11 -28 26 18 -5 -6 -7 11 40 -1 -40 23
14380 23 15 -50 5 19 53 -37 16 -35 -33 -38 -40 -12 -16 20 48 -4 1 -52 -34 20 -60 7 -39 45 -5 -3 28 20 -56 -18 8 -16 -5 -7
14414 -7 42 -5 9 16 -7 -8 -12 34 -34 -8 -31 15 26 -28 9 -46 -20 -3 -11 13 56 26 -14 7 -26 -21 -48 -37 36 -35 10 -38 29
14447 29 -21 46 11 -11 8 -40 19 1 2 29 9 12 24 12 -35 14 -21 -16 -24 -7 31 11 -16 16 -28 -15 2 6 -39 -6 -16 5
14479 5 36 -18 -3 10 -21 10 36 11 9 -9 26 27 22 23 -5 41 19 -53 52 14 -59 35 -13 -43 -2 -11 -5 -34 20 -17 -14 10 -14
14512 -14 12 -40 11 19 -1 68 -17 51 24 53 -5 36 19 -6 -58 8 44 -17 14 29 20 19 -13 0 -32 -35 32 -17 14 -10 17 14
14544 14 -49 -43 -64 23 -2 17 -18 -13 56 37 20 -30 3 11 -32 -13 -43 55 22 29 7 14 8 -12 -5 -33 3 32 37 18 31 23 -2 -44
14578 -44 -11 -11 1 0 46 1 -13 12 6 -3 -18 -26 -16 -20 -13 9 54 -9 46 16 -4 5 7 -14 -24 12 12 -17 31 14 5 -16 16 10 -44 20
14614 20 30 -18 -30 -34 32 -29 20 -8 -1 10 -9 -12 34 63 11 23 26 -10 -13 -37 41 23 19 2 33 -4 17 -7 1 -10 17 14 41 37
14648 37 62 16 59 0 -14 23 -8 -17 3 32 -5 41 31 13 32 11 48 -37 -1 40 20 19 -3 28 -7 -21 -1 -27 -2 9 39
14679 39 14 26 62 41 43 -25 10 23 0 54 35 34 23 10 30 -1 -12 2 37 -5 38 52 8 21 -3 -54 49 -16 -19 -6 10
14710 10 41 74 13 -11 -7 21 -22 -20 -53 38 -31 40 21 54 -3 -3 -22 -62 22 34 39 -13 28 22 9 21 15 -17 -30 19 -4 -34 8
14743 8 15 50 -22 29 -24 -18 -44 -16 1 15 17 26 -1 18 -8 -18 37 4 9 18 21 29 22 11 -28 -6 -6 -4 -15 -30 15 38 -3 37 -13 -36
14779 -36 -33 0 -15 11 24 46 13 -17 17 -33 17 -20 -6 7 -21 3 -2 60 -16 28 58 5 -20 -55 56 13 -18 5 25 58
14809 58 2 3 -15 -16 0 23 29 -6 20 47 79 -28 -57 26 -38 11 -10 22 2 24 3 9 -2 -3 26 2 9 30 35 16 -14 3 28
14842 28 -65 8 31 -15 -1 66 -28 8 -8 9 0 18 -22 5 0 7 2 47 10 30 -4 -16 -47 17 -45 21 6 52 26 -12 -28 -35
14874 -35 44 -25 -1 -20 23 35 -20 7 5 39 -24 -62 -37 27 29 -21 55 12 48 -8 18 9 -61 39 -30 36 1 38 45 11 -5
14905 -5 -24 44 3 3 9 31 17 5 -25 -19 -56 21 -22 -22 -15 -45 40 11 19 -43 15 6 23 -5 -19 52 -1 -27 -10 58 16 -61 30 5
14939 5 -7 -53 -47 17 25 20 -6 32 3 -7 -24 -23 7 18 39 30 59 0 -64 23 5 8 -6 13 6 -10 23 20 -29 12 -6 -24 29 -5
14973 -5 14 10 39 -8 45 15 -13 1 0 -35 -8 11 55 34 1 1 -14 -24 31 -47 42 24 10 15 5 40 38 -8 5 -23 11 47 11
15006 11 -5 56 25 30 3 -12 45 -22 18 -34 18 61 19 -5 27 9 -9 -2 -45 -20 3 6 35 12 37 39 26 -15 23 -7 23 -4
15038 -4 29 -31 -17 -49 -35 -17 -28 -21 50 48 29 23 11 55 5 2 -12 2 27 -15 -30 49 9 9 41 11 -14 -54 -23 -22 7 64 25
15071 25 36 9 53 16 48 10 -32 -16 -4 4 14 58 55 6 25 -37 19 -6 5 34 35 31 -17 30 4 5 28 -19 -33 -23 -11 60
15103 60 -6 -19 10 -40 -19 -1 35 -55 9 41 52 43 -14 38 -12 12 -15 36 13 11 16 30 44 19 41 11 -44 -28 16 -13 -39
15134 -39 -3 46 -16 -9 -44 0 7 -47 13 -10 8 24 14 -36 -15 16 -43 0 -15 39 23 8 38 -44 41 -58 20 -31 12 -38 7
15165 7 6 -55 -13 -25 36 -31 -6 35 -21 -17 -5 31 15 -24 16 5 11 14 -45 -31 7 16 29 -6 -50 -29 5 -9 8 -39 28 -15 5
15198 5 17 -23 -16 -23 -12 -64 -49 -21 -3 -36 -16 33 -4 -46 -26 -6 -12 -47 -21 12 24 28 7 -5 3 -22 -30 -70 -4 -19 -35 -24 -21 0
15232 0 -9 -4 -25 -42 -3 -51 35 0 -19 45 -6 19 -41 15 -6 14 5 -1 54 1 66 7 -43 -34 -24 -13 8 -26 -8 40 -22 26 -84
15265 -84 -5 -6 -48 53 -47 -7 63 36 -50 0 -16 -8 -28 -42 -10 43 40 5 32 -12 -40 -25 2 3 1 -54 0 -11 18 33 -19
15296 -19 -19 -27 -21 24 -26 6 16 15 -13 -43 -8 -12 -2 9 -18 -3 8 -4 13 25 0 17 -7 -1 -28 7 26 17 -3 36 -29 -8 26
15329 26 -40 22 -9 41 14 -45 20 44 18 -12 -1 12 48 -15 11 12 14 5 -3 -22 4 -4 -46 -36 32 35 50 -1 18 12 -14 -31 2
15362 2 -14 -2 -33 4 22 4 10 9 -25 2 -38 -41 10 -10 69 52 34 82 -16 -43 -43 13 2 22 6 1 63 26 -12 -26 -24 -43 14
15395 14 -50 6 1 4 75 44 36 -13 -2 -56 6 -15 21 33 79 -12 14 -2 -1 29 -37 -29 26 43 32 25 24 13 -6 -31 -23 -4 12 12
15429 12 0 41 11 11 -13 -48 43 -56 -51 23 -15 74 25 37 44 10 -21 -55 -24 -21 47 -54 -18 -12 5 -9 -53 5 -25 -11 10 43
15461 43 -14 44 10 0 2 -37 -7 16 -13 34 -7 6 17 -9 18 14 12 -17 -24 -13 27 40 36 37 -10 11 28 -20 50 -3 -9 28 33 48
15495 48 -1 36 -48 -30 -24 -53 19 -21 4 9 -26 -28 -17 -4 -38 -2 -2 -44 -8 -57 3 -15 -49 -24 -22 -23 -77 -11 -29 9 9 -9 3
15528 3 -16 -2 -33 53 5 -5 18 8 37 7 31 -29 -42 -45 17 7 -14 12 20 16 -7 -21 -19 -39 -22 32 -44 10 11 65 29 -4 -18
15561 -18 3 -14 -27 3 -16 -10 -68 2 -29 -39 21 -44 -79 2 -17 4 -25 11 26 17 -24 -62 -46 -15 3 3 -42 51 -52 -5 9
15592 9 -26 -11 -35 -9 -75 -24 5 26 -15 17 14 9 -38 -40 -7 17 -36 -11 -14 23 -1 -20 -2 -35 -18 -72 -13 51 21 -37 14 47
15624 47 -57 -6 -42 -52 2 1 20 -15 47 -24 21 -38 17 10 -56 26 53 19 2 -22 -6 -66 -1 41 -29 -32 -22 62 15 -10 5
15655 5 -18 -23 -59 -16 -14 10 9 37 4 28 17 -48 -19 -31 -17 26 -18 31 8 21 -18 -15 -6 -8 -12 -16 10 23 7 1 59 -16 -16 -10 4 -30
15691 -30 20 -18 -5 23 50 21 -16 -49 3 7 11 -11 -5 -40 11 28 -3 -9 -19 0 -22 30 -23 33 16 20 47 -7 -15 28 -4 19 28
15724 28 39 16 -15 -26 -2 23 -22 5 -45 20 -7 58 -25 60 61 -21 -2 -29 18 -44 21 22 26 44 6 33 -61 -55 0 -26 19 30
15756 30 14 25 57 19 -41 5 -26 -34 0 6 3 -4 14 49 -32 40 9 -43 -54 -11 -2 -13 8 16 -15 4 -13 -23 -59 -43 -15 -10 18
15789 18 46 48 44 0 -1 -8 -14 20 -16 -1 4 54 -26 1 -38 -54 24 7 -15 -26 -7 -36 14 35 19 10 11 -27 -52 12 27 62 34 45
15823 45 16 -3 -6 -40 -8 -34 26 11 37 53 40 13 6 -19 42 -19 0 -30 44 22 68 27 11 -31 18 28 -24 -21 54 -10 -6 14
15855 14 45 18 34 10 -25 6 1 40 37 -8 -11 1 11 18 8 15 32 19 23 22 28 0 19 -31 13 -21 27 -7 6 45 -20 -10 8 -1
15889 -1 -43 1 -18 4 9 33 74 -20 9 -4 -50 -15 -16 68 3 -24 4 17 49 -3 -13 -8 -21 14 34 -12 -4 20 79 -38 32 -43
15921 -43 -6 -14 11 -40 31 45 -12 35 -30 -1 5 3 -17 -43 -28 36 -12 48 33 15 -30 -70 16 15 -9 22 48 1 -46 -31 -14 23
15953 23 -26 -33 -37 22 -5 26 30 16 61 -13 -34 7 -7 14 1 20 12 -10 14 1 -12 3 7 15 19 -5 36 40 4 15 -2 -18 24 -5
15987 -5 -14 -62 -4 20 -9 27 -17 -6 -22 -10 -60 4 32 16 44 -20 5 14 -3 33 -33 20 26 21 -5 33 20 2 55 20 2 -6 39
16020 39 30 -16 69 -34 40 -14 -16 -38 24 -30 -6 41 45 44 48 -29 -17 19 0 17 -5 -6 -7 17 30 37 -41 -28 -4 -6 -98 11 -10
16053 -10 2 -11 -8 8 -3 6 -40 -23 -17 6 -43 14 18 -10 6 18 -28 2 25 -13 -3 -1 -21 9 -4 -17 -24 -20 47 -22 8 2 28 23
16087 23 -1 -16 -50 -50 -17 40 9 2 21 20 26 11 -14 16 -41 3 -63 27 -24 39 4 3 -1 -30 -9 22 -69 13 28 50 1 -6 58
16120 58 10 -2 -56 44 -5 39 48 -2 16 7 40 -1 -30 -7 5 10 18 59 -35 -23 3 -9 44 21 6 41 -17 23 -2 12 13 2
16152 2 31 -20 -7 -56 36 23 20 61 -8 39 -66 -44 -25 37 0 -7 16 10 61 26 47 -22 -49 1 -32 30 -28 9 44 30 21 -11
16184 -11 -9 -26 -36 16 -19 25 20 33 24 -12 10 -27 -16 -60 -38 -14 18 9 32 20 -4 58 -27 -5 4 3 -21 3 10 28 4 29 4
16217 4 -21 15 -5 15 -9 53 33 11 23 -24 11 16 22 35 10 54 10 21 55 2 -53 11 11 20 22 34 0 -30 27 9 -10 -6 -33
16250 -33 13 -21 -25 21 18 37 -42 -2 -26 7 4 -36 6 -10 18 53 41 -22 4 -2 -77 -2 -49 -14 -5 4 41 5 0 -27 -37 -60 -17
16283 -17 7 -6 12 43 36 13 -28 -2 -70 -38 -6 -6 -7 13 24 -9 -30 -40 0 -19 -9 -34 -14 -37 2 2 10 -12 -4 -8 -21 -10 -2 -24
16317 -24 15 -32 -13 -6 -27 -6 -25 -51 -11 -13 6 6 -25 -6 -24 25 -60 -11 -43 -47 11 11 59 57 -43 6 -47 -44 -20 13 -46 -60 -2
16350 -2 37 -5 -26 -3 -18 -32 21 -38 16 -9 4 0 -29 -12 -49 12 -47 -48 -31 -19 19 8 35 12 -33 -26 -32 -34 -63 -6 15 10 1
16383A
$$ Imaginary data points
##PAGE= N=2
##DATA TABLE= (X++(I..I)), XYDATA
0 0 0 0 0 0 0 0 0 0 0 0 0 0 0 0 0 0 0 0 0 0 0 0 0 0 0 0 0 0 0 0 0 0 0 0 0 0 0 0 0 0 0 0 0 0 0 0 0 0 0 0 0 0 -1 1 -1 -1 3 -5 5 -4 3 -1 9
63 9 -10 14 -33 993 451 724 838 610 248 -318 -585 -745 -545 -229 96 564 762 743 425 -7 -414 -765
85 -765 -743 -584 -112 298 604 688 527 177 -231 -587 -782 -630 -327 113 467 717 750 544 102 -366 -620 -697
107 -697 -532 -106 336 656 764 573 271 -149 -538 -763 -764 -442 -64 354 656 661 460 83 -351 -627 -738 -539
129 -539 -170 288 587 836 687 353 -35 -405 -651 -658 -434 -46 350 653 687 558 79 -309 -688 -789 -651
150 -651 -314 137 467 727 622 412 -19 -384 -681 -733 -448 -77 328 645 814 593 234 -205 -622 -795 -673
171 -673 -381 142 443 648 683 396 37 -416 -657 -789 -536 -169 303 647 728 629 268 -135 -520 -740 -614
192 -614 -321 66 405 646 730 482 89 -291 -625 -722 -551 -263 155 546 703 629 299 -118 -496 -714 -646 -411
214 -411 -21 379 619 708 579 200 -229 -588 -655 -599 -290 144 565 709 670 405 -61 -395 -701 -723 -473 -114
236 -114 324 605 738 561 192 -195 -547 -663 -651 -266 90 544 706 713 476 72 -386 -650 -705 -513 -150 254
258 254 554 720 598 260 -191 -555 -708 -702 -414 42 434 671 725 474 90 -278 -600 -619 -528 -195 250 573
280 573 750 715 363 -48 -493 -669 -678 -450 -10 373 631 659 473 97 -272 -588 -729 -567 -273 133 477 727
302 727 709 395 -21 -409 -620 -676 -430 -5 350 667 714 595 210 -162 -539 -684 -609 -373 80 433 662 676
324 676 385 32 -395 -676 -720 -488 -126 267 617 734 655 277 -76 -460 -657 -564 -307 72 455 688 701 471
346 471 131 -384 -606 -668 -545 -232 169 475 650 549 292 -76 -421 -646 -650 -412 1 396 675 780 541
367 541 197 -248 -535 -625 -540 -258 163 530 707 650 400 -22 -433 -722 -699 -501 -144 301 690 696 564 189
389 189 -204 -507 -683 -569 -232 137 449 676 685 424 57 -247 -620 -673 -496 -136 305 550 697 544 224
410 224 -180 -519 -701 -629 -353 -32 402 587 673 463 88 -275 -570 -679 -523 -141 291 554 763 641 336
431 336 -78 -501 -693 -686 -439 -86 318 512 635 503 67 -265 -620 -772 -594 -288 116 518 674 618 341
452 341 -32 -389 -622 -610 -432 -37 302 577 683 531 214 -193 -568 -740 -577 -293 45 492 631 596 400
473 400 -26 -367 -634 -720 -495 -181 202 584 678 683 325 -128 -476 -669 -604 -329 70 437 667 651 444 89
495 89 -290 -611 -674 -545 -227 127 566 651 549 284 -93 -464 -673 -604 -363 18 361 600 687 517 166 -221
517 -221 -500 -678 -582 -239 117 520 664 602 311 -84 -447 -714 -695 -481 -81 301 602 689 528 216 -217 -513
539 -513 -635 -597 -286 110 538 711 692 474 64 -379 -555 -643 -520 -119 236 536 657 534 245 -154 -505
560 -505 -687 -677 -431 61 451 701 660 488 53 -273 -598 -646 -463 -137 223 527 711 621 336 -125 -485 -726
582 -726 -742 -459 -6 336 594 640 485 87 -248 -597 -641 -524 -223 191 464 719 694 391 42 -421 -607 -654
604 -654 -421 -4 341 585 652 498 147 -208 -554 -658 -563 -309 85 374 670 644 398 32 -377 -595 -719
625 -719 -477 -70 286 610 731 532 244 -119 -453 -641 -582 -377 72 422 650 645 454 58 -317 -633 -705 -526
647 -526 -192 237 529 697 564 297 -63 -423 -620 -635 -369 2 429 616 721 524 147 -232 -617 -704 -560
668 -560 -216 131 465 584 563 308 -38 -432 -670 -690 -492 -72 336 536 698 540 177 -176 -488 -639 -490
689 -490 -286 132 471 693 653 409 20 -330 -662 -664 -511 -154 276 528 692 484 248 -198 -498 -648 -612 -321
711 -321 26 477 633 681 485 76 -247 -523 -629 -512 -178 231 550 750 569 277 -133 -417 -632 -584 -371
732 -371 -26 401 573 637 441 126 -221 -542 -701 -526 -169 191 457 735 671 363 -36 -380 -608 -642 -416
753 -416 -114 277 581 629 552 143 -271 -573 -687 -575 -269 105 473 666 607 353 46 -360 -563 -641 -474 -73
775 -73 264 576 629 594 296 -112 -518 -661 -616 -337 62 409 643 591 385 46 -370 -563 -668 -541 -203 212
797 212 547 649 633 282 -117 -399 -619 -582 -304 31 434 630 659 439 114 -257 -548 -651 -539 -275 139
818 139 486 651 599 347 -92 -436 -639 -623 -409 -66 360 554 616 528 147 -179 -536 -665 -514 -256 147 464
840 464 626 661 346 -73 -366 -634 -664 -477 -91 274 585 647 483 204 -180 -463 -632 -595 -325 80 421 669
862 669 649 457 44 -328 -587 -610 -455 -180 256 527 654 532 279 -108 -490 -678 -693 -393 -58 391 630
883 630 630 489 123 -253 -568 -613 -510 -207 179 475 647 595 309 -21 -350 -615 -636 -414 -78 270 583 644
905 644 426 119 -237 -560 -664 -574 -319 92 404 631 617 369 27 -363 -587 -658 -420 -118 269 582 624 506
927 506 189 -140 -471 -649 -597 -340 41 374 577 590 388 54 -318 -584 -700 -507 -154 172 501 666 545
948 545 262 -79 -416 -602 -586 -364 -7 387 601 704 453 134 -271 -583 -689 -562 -182 143 487 611 539
969 539 291 -39 -415 -622 -566 -395 -85 329 585 611 522 183 -164 -486 -595 -515 -263 96 442 647 559 313
991 313 5 -379 -599 -635 -491 -155 202 502 599 510 186 -165 -445 -575 -585 -283 69 441 639 681 434 95
1013 95 -260 -527 -623 -534 -173 195 498 663 526 241 -146 -457 -629 -591 -363 -25 349 553 565 440 128 -216
1035 -216 -477 -623 -509 -224 201 489 685 585 307 -28 -330 -552 -636 -363 -45 259 523 572 483 147 -207
1056 -207 -524 -655 -552 -316 92 401 665 553 384 -31 -291 -511 -505 -301 -95 311 515 679 526 232 -157
1077 -157 -462 -642 -534 -291 3 358 600 547 387 55 -323 -538 -576 -498 -139 220 495 664 587 298 -95
1098 -95 -360 -563 -549 -303 16 354 593 649 433 98 -319 -476 -590 -475 -264 144 454 531 505 320 -46 -368
1120 -368 -622 -597 -365 -24 353 589 633 442 215 -209 -474 -533 -497 -242 78 434 585 568 388 25 -350 -587
1142 -587 -623 -489 -126 295 460 660 466 172 -153 -434 -549 -533 -305 30 419 638 648 389 135 -337 -552
1163 -552 -615 -469 -181 201 483 599 474 227 -105 -425 -583 -579 -336 -15 300 569 620 434 105 -271 -490
1184 -490 -565 -439 -170 159 515 624 572 321 -15 -390 -606 -575 -427 -46 257 506 536 455 135 -281 -494 -585
1206 -585 -527 -294 118 406 596 600 337 107 -331 -520 -546 -410 -87 242 588 623 528 142 -218 -505 -662 -586
1228 -586 -337 8 301 552 583 328 92 -323 -531 -610 -473 -181 190 557 627 582 249 -57 -377 -613 -575 -333
1250 -333 40 341 578 570 380 69 -284 -546 -640 -521 -238 107 449 555 503 235 -32 -393 -554 -543 -358 -9
1272 -9 286 584 655 470 182 -169 -506 -572 -559 -211 77 412 617 517 319 -45 -394 -577 -580 -430 -186 225
1294 225 432 590 503 210 -143 -435 -585 -549 -240 91 382 597 528 400 56 -303 -536 -589 -472 -218 154
1315 154 462 590 458 174 -127 -507 -664 -628 -359 -33 300 585 569 413 88 -173 -459 -558 -455 -190 192
1336 192 441 616 568 317 -46 -394 -545 -546 -360 -77 311 493 522 473 122 -212 -493 -576 -480 -233 163 424
1358 424 642 608 336 -21 -327 -484 -515 -371 -56 270 503 580 476 188 -160 -479 -608 -555 -321 17 394
1379 394 581 573 317 28 -269 -529 -559 -411 -149 222 427 621 497 285 -107 -392 -555 -516 -362 28 319
1400 319 566 574 377 87 -289 -456 -600 -443 -212 171 410 524 502 306 -15 -363 -573 -522 -348 8 393
1421 393 517 572 425 150 -193 -410 -545 -480 -202 87 406 546 536 323 -35 -384 -567 -582 -442 -77 255
1442 255 497 572 511 197 -105 -414 -576 -487 -251 95 376 630 551 366 75 -277 -514 -558 -470 -145 198 425
1464 425 554 451 171 -149 -358 -532 -553 -355 -9 369 574 598 410 71 -239 -519 -577 -397 -188 174 472
1485 472 588 501 279 -66 -361 -550 -544 -458 -70 278 492 537 403 110 -198 -440 -598 -465 -268 152 437 548
1507 548 582 311 23 -309 -508 -581 -408 -107 273 465 550 466 163 -73 -448 -587 -526 -301 61 283 539 514
1529 514 358 47 -256 -510 -574 -434 -156 214 489 593 483 256 -116 -425 -565 -553 -334 7 341 510 526
1550 526 376 56 -241 -492 -625 -473 -217 155 389 544 518 284 -88 -391 -511 -498 -330 -10 278 471 594
1571 594 421 182 -137 -502 -565 -490 -269 92 408 522 499 288 -56 -274 -521 -538 -395 -112 212 462 543 476
1593 476 192 -120 -398 -531 -490 -207 96 401 508 505 354 20 -220 -513 -517 -433 -200 177 412 548 496 193
1615 193 -108 -440 -541 -539 -345 46 336 511 496 384 112 -189 -435 -506 -414 -201 170 406 572 497 285 -80
1637 -80 -353 -554 -553 -388 -35 234 478 488 370 147 -196 -425 -534 -461 -249 85 412 573 582 323 31 -304
1659 -304 -469 -537 -334 -50 208 504 549 406 119 -128 -400 -567 -507 -299 43 341 577 522 254 67 -272
1680 -272 -522 -531 -411 -79 214 467 507 492 276 -128 -343 -564 -514 -332 23 321 507 531 329 49 -280 -506
1702 -506 -526 -429 -152 143 363 543 527 270 -108 -389 -450 -477 -332 24 255 495 559 414 136 -186 -399 -499
1724 -499 -431 -276 75 358 477 452 281 -13 -330 -548 -561 -340 -74 268 499 588 426 164 -140 -389 -509
1745 -509 -454 -198 59 343 528 475 334 38 -284 -501 -562 -407 -173 178 382 584 408 206 -97 -382 -470
1766 -470 -507 -273 9 312 552 558 401 82 -197 -474 -537 -405 -153 169 426 528 403 261 -52 -343 -523
1787 -523 -502 -355 -50 265 473 556 413 105 -158 -396 -520 -434 -158 164 408 533 423 301 24 -266 -477
1808 -477 -471 -331 -55 202 459 521 441 173 -144 -431 -549 -491 -205 63 365 505 557 388 34 -233 -448 -486
1830 -486 -360 -85 168 470 557 506 208 -134 -392 -562 -478 -226 -10 331 433 438 358 65 -259 -442 -539 -463 -164
1853 -164 175 463 548 504 281 -79 -359 -526 -432 -317 -11 279 459 535 382 122 -179 -404 -568 -467 -201
1874 -201 73 377 489 440 266 -1 -269 -554 -459 -323 -21 224 472 580 437 197 -72 -359 -496 -476 -241
1895 -241 21 366 467 479 298 -12 -238 -477 -499 -412 -124 110 419 482 383 193 -148 -400 -516 -472 -260 26
1917 26 320 535 537 352 85 -238 -410 -518 -406 -174 160 348 504 461 249 -42 -383 -535 -460 -328 -21 230
1939 230 440 465 378 103 -165 -392 -496 -418 -179 80 426 529 500 275 15 -339 -494 -526 -344 -43 194 413
1961 413 562 412 90 -215 -388 -495 -446 -262 44 357 553 508 301 51 -272 -454 -512 -347 -64 217 447
1982 447 483 450 180 -99 -356 -525 -519 -313 4 253 506 500 318 31 -254 -454 -504 -366 -103 155 408 532
2004 532 485 262 -53 -305 -441 -488 -326 -4 279 421 486 334 116 -248 -450 -525 -471 -225 69 344 482 465
2026 465 271 -12 -275 -516 -462 -386 -76 213 465 558 386 155 -176 -375 -517 -453 -260 -28 323 501 466 364
2048 364 -20 -288 -477 -552 -410 -136 226 366 500 398 178 -170 -418 -447 -490 -297 -9 259 495 490 370 98
2070 98 -220 -450 -501 -423 -183 121 355 475 465 211 -37 -348 -492 -433 -300 -97 249 480 485 329 135 -141
2092 -141 -385 -474 -399 -158 147 343 493 413 219 -15 -270 -450 -472 -324 -148 175 406 493 401 127 -180 -399
2114 -399 -534 -462 -225 61 317 436 460 308 49 -264 -417 -454 -340 -125 167 394 501 444 216 -123 -405
2135 -405 -543 -507 -287 -14 245 463 474 326 75 -203 -381 -470 -435 -208 145 423 465 465 284 -38 -276 -482
2157 -482 -494 -321 26 277 477 456 336 135 -188 -426 -493 -492 -214 68 341 441 457 261 -25 -322 -476 -479 -299
2180 -299 -42 228 457 531 382 221 -115 -377 -484 -474 -249 70 299 462 443 241 45 -321 -500 -464 -317
2201 -317 -139 146 369 466 371 196 -60 -335 -460 -475 -272 14 330 497 528 354 77 -212 -435 -513 -375 -185
2223 -185 152 318 479 424 233 -39 -311 -507 -490 -326 -53 296 473 495 359 122 -98 -430 -460 -395 -185 143
2245 143 331 502 475 273 -11 -314 -476 -503 -336 -82 177 419 476 347 79 -131 -395 -470 -389 -248 17 337
2267 337 441 488 309 84 -270 -465 -515 -366 -115 208 388 465 430 179 -124 -347 -475 -463 -261 -33 282 422
2289 422 470 320 92 -200 -408 -467 -378 -119 175 381 578 475 235 -59 -267 -472 -459 -266 -69 272 444
2310 444 502 310 95 -225 -438 -512 -418 -172 79 364 442 420 217 -25 -235 -450 -405 -302 -73 208 391 531
2332 531 388 166 -134 -381 -465 -421 -225 -23 300 454 393 312 -4 -232 -468 -492 -369 -131 156 382 534 377
2354 377 219 -120 -352 -465 -383 -258 18 303 459 477 290 95 -206 -409 -455 -397 -193 94 320 416 387 186
2376 186 -84 -316 -465 -420 -261 -29 190 401 434 333 144 -113 -333 -485 -420 -202 69 328 469 448 221
2397 221 -43 -307 -409 -489 -327 -58 180 452 423 376 161 -107 -391 -487 -426 -203 103 300 483 457 297 9
2419 9 -252 -430 -499 -349 -156 138 354 467 400 157 -111 -335 -532 -407 -296 10 268 405 420 312 42 -229
2441 -229 -369 -455 -382 -144 130 387 493 399 242 -62 -309 -453 -447 -273 -59 214 425 432 330 72 -159 -324
2463 -324 -466 -385 -172 84 329 455 445 289 -15 -224 -411 -421 -303 -49 248 412 462 349 150 -135 -329
2484 -329 -474 -430 -224 21 229 450 374 310 -27 -237 -432 -456 -341 -47 196 381 508 331 199 -73 -314
2505 -314 -404 -455 -179 -15 268 460 422 272 64 -199 -435 -467 -361 -154 147 342 411 348 207 -23 -282 -484
2527 -484 -454 -287 -29 251 423 484 359 68 -189 -380 -466 -338 -128 105 318 415 380 276 15 -296 -444 -506
2549 -506 -378 -75 197 384 421 335 130 -156 -343 -392 -369 -165 50 329 479 407 295 53 -248 -410 -431 -374
2571 -374 -82 138 397 382 352 182 -94 -286 -486 -424 -218 -16 238 456 453 335 118 -219 -433 -378 -336 -103
2593 -103 168 367 468 397 172 -90 -288 -423 -403 -276 -66 234 465 458 348 112 -187 -391 -495 -345 -130
2614 -130 89 348 461 436 229 58 -244 -393 -418 -280 -52 183 408 437 318 150 -145 -382 -469 -383 -187 32
2636 32 301 380 392 266 -24 -225 -386 -477 -323 -37 138 379 474 384 203 -40 -312 -430 -414 -206 35 262
2658 262 406 421 316 30 -210 -348 -493 -387 -174 134 304 444 350 233 -75 -286 -413 -434 -220 -69 268
2679 268 400 421 338 84 -152 -358 -456 -357 -186 110 267 436 413 229 -31 -291 -435 -495 -319 -69 168 339
2701 339 393 333 120 -81 -301 -408 -374 -124 81 279 467 464 250 66 -192 -389 -442 -342 -88 158 350 362
2723 362 382 147 -132 -345 -450 -393 -274 8 254 384 462 296 -2 -194 -353 -413 -344 -151 122 336 474 433
2745 433 254 -72 -271 -418 -439 -300 -45 216 406 405 307 81 -183 -360 -413 -368 -193 65 321 448 427 262
2767 262 17 -236 -425 -389 -297 -50 232 389 433 266 111 -149 -345 -423 -452 -189 66 268 384 372 243 9
2789 9 -216 -469 -393 -325 -67 159 307 421 394 201 -119 -263 -429 -427 -185 16 264 430 502 316 19 -191 -382
2812 -382 -476 -343 -181 100 320 438 348 161 -52 -266 -429 -387 -275 -19 248 428 410 334 145 -174 -366 -461
2834 -461 -349 -170 90 301 389 384 253 -15 -257 -390 -433 -320 -125 145 404 423 353 112 -133 -326 -466 -350
2856 -350 -199 89 296 386 402 239 91 -265 -433 -436 -326 -94 98 379 413 362 72 -105 -352 -392 -385 -266 57
2879 57 255 411 437 309 64 -174 -299 -438 -366 -101 164 349 424 397 141 -65 -237 -410 -364 -263 -37 213
2901 213 404 426 348 176 -147 -352 -435 -365 -137 121 332 427 454 224 9 -225 -411 -389 -283 -102 176 377
2923 377 429 333 115 -105 -386 -424 -404 -197 76 285 408 382 242 16 -187 -427 -427 -302 -81 166 371 452 360
2946 360 201 -26 -306 -401 -400 -231 1 256 402 414 313 39 -159 -401 -436 -335 -153 126 323 436 397 211
2968 211 -77 -255 -357 -391 -227 -24 268 373 412 321 102 -158 -341 -403 -356 -158 87 328 384 394 200 -15
2990 -15 -237 -417 -439 -201 -37 183 364 460 378 160 -85 -294 -407 -353 -151 72 257 406 390 252 30 -240
3012 -240 -379 -435 -319 -87 111 376 435 389 161 -96 -266 -402 -351 -241 44 248 435 409 268 84 -150 -347
3034 -347 -372 -338 -84 127 333 366 352 185 -52 -266 -451 -389 -283 4 215 413 437 337 137 -180 -287 -419
3056 -419 -340 -148 114 328 398 382 216 -28 -233 -384 -416 -301 -41 186 377 457 285 139 -119 -293 -424 -311
3078 -311 -133 -4 289 377 404 249 36 -196 -410 -402 -306 -64 220 358 403 339 119 -107 -297 -370 -416 -181 -8
3101 -8 220 405 400 284 54 -224 -356 -450 -363 -41 127 346 436 370 152 -70 -259 -330 -402 -220 2 211 370
3124 370 387 383 55 -199 -362 -394 -337 -138 140 315 434 358 242 -29 -239 -352 -413 -232 -58 175 386 423 407
3147 407 138 -164 -355 -427 -311 -207 24 277 386 339 223 34 -219 -328 -414 -300 -110 151 382 409 336 118
3169 118 -79 -317 -383 -376 -209 50 226 370 398 290 90 -180 -374 -368 -271 -92 109 301 378 361 154 -57 -280
3192 -280 -396 -363 -275 -21 200 343 366 312 114 -183 -331 -411 -340 -120 69 317 407 362 199 -37 -179 -397 -380
3215 -380 -243 -45 210 305 348 276 142 -98 -320 -398 -366 -160 95 272 419 401 252 -10 -190 -357 -341 -244 -59
3238 -59 204 377 412 314 205 -80 -250 -400 -378 -224 36 230 396 400 231 27 -163 -366 -425 -304 -83 72
3260 72 296 423 342 139 -67 -230 -410 -318 -201 -3 175 379 359 294 40 -177 -339 -409 -361 -130 76 344
3282 344 351 411 222 -9 -240 -376 -372 -230 8 250 350 403 363 145 -102 -292 -365 -360 -192 51 219 355 409 259
3306 259 16 -263 -329 -448 -294 -58 139 318 400 310 148 -52 -269 -342 -337 -191 53 246 384 417 276 78
3328 78 -221 -352 -396 -299 -114 129 310 319 301 127 -84 -261 -383 -384 -249 10 202 338 420 290 63 -133 -309
3351 -309 -386 -259 -89 129 298 415 331 210 13 -286 -359 -352 -242 -63 187 376 384 275 114 -134 -313 -382 -301
3374 -301 -156 24 269 356 361 240 10 -152 -349 -367 -247 -78 194 355 375 328 163 -93 -320 -353 -361 -213 -33
3397 -33 252 330 366 243 32 -169 -330 -336 -272 -121 144 320 405 363 162 -37 -256 -312 -400 -205 -31 177 331
3420 331 352 326 74 -135 -369 -355 -289 -167 72 289 394 353 221 -33 -227 -336 -380 -241 -56 152 369 352
3442 352 341 120 -122 -391 -367 -345 -167 66 256 363 405 208 -3 -204 -347 -390 -273 -47 118 347 409 380
3464 380 134 -86 -266 -373 -337 -183 34 218 387 362 235 59 -182 -311 -403 -316 -119 73 287 370 303 188
3486 188 -95 -297 -451 -367 -225 -13 228 353 382 278 82 -132 -295 -349 -336 -145 109 272 441 366 198 -13
3508 -13 -204 -351 -320 -237 -83 122 280 371 247 156 -107 -238 -377 -335 -178 63 203 376 352 196 -53 -220
3530 -220 -331 -348 -278 -91 107 313 373 270 152 -87 -296 -398 -365 -245 8 218 418 328 287 31 -151 -308
3552 -308 -362 -272 -138 144 329 416 316 204 -41 -258 -384 -405 -264 8 190 355 385 235 66 -166 -332 -400
3574 -400 -315 -146 70 263 379 347 171 40 -222 -371 -399 -217 -29 183 438 391 274 119 -139 -332 -428 -322
3596 -322 -210 51 254 400 295 180 -6 -201 -310 -396 -280 -83 187 312 377 333 102 -83 -274 -396 -339
3617 -339 -181 16 218 374 398 291 23 -207 -351 -385 -314 -122 93 285 333 259 163 -73 -239 -330 -353 -242 -59
3640 -59 222 361 410 306 95 -176 -326 -355 -299 -84 92 293 379 316 196 17 -188 -333 -347 -259 -48 162 318
3663 318 374 263 100 -92 -308 -356 -328 -73 80 269 358 369 213 29 -152 -373 -339 -266 -44 152 308 412
3685 412 275 119 -94 -297 -357 -333 -126 16 223 316 331 251 36 -155 -369 -325 -293 -88 151 305 409 304
3707 304 151 -58 -248 -353 -333 -210 -13 219 366 352 253 65 -103 -336 -340 -304 -111 74 308 336 316 155 -34
3730 -34 -228 -346 -313 -204 37 164 375 349 333 96 -110 -259 -413 -330 -93 48 274 324 347 134 11 -199
3752 -199 -321 -345 -238 -40 156 385 390 316 180 -65 -246 -333 -331 -167 74 239 386 418 239 42 -127 -313 -332
3775 -332 -294 -119 80 279 335 348 146 -60 -254 -365 -266 -238 17 182 375 405 221 126 -125 -272 -316 -258 -119
3798 -119 54 275 350 316 206 5 -248 -352 -340 -195 13 204 300 307 253 76 -42 -232 -369 -282 -119 73 292
3821 292 340 368 231 22 -192 -320 -300 -246 -74 143 256 367 280 118 -116 -264 -430 -331 -176 -40 248 362
3843 362 319 216 1 -153 -269 -333 -238 -99 132 267 334 291 157 -64 -261 -329 -350 -205 15 173 349 321 262
3866 262 68 -144 -300 -354 -273 -151 101 201 356 261 226 -31 -247 -315 -382 -250 -47 211 339 349 260 31 -92
3889 -92 -293 -372 -287 -175 16 214 349 294 194 -26 -244 -283 -342 -244 -45 157 292 341 277 113 -94 -208 -299
3912 -299 -308 -169 38 221 347 356 214 26 -195 -326 -371 -302 -49 114 292 293 276 128 -101 -242 -380 -300 -178
3935 -178 -7 188 330 353 230 141 -152 -305 -349 -311 -97 85 246 325 312 121 -19 -253 -337 -338 -234 -55 171
3958 171 310 321 277 116 -140 -278 -316 -281 -112 77 229 323 316 224 18 -125 -320 -320 -259 -4 158 262 355 272
3982 272 83 -120 -309 -369 -337 -175 35 181 282 314 253 39 -151 -261 -314 -248 -67 100 318 373 328 150 -41
4005 -41 -268 -324 -339 -179 3 176 302 305 231 72 -121 -272 -391 -303 -140 65 286 333 346 169 -27 -235 -282
4028 -282 -296 -193 16 186 295 286 272 135 -129 -280 -367 -286 -161 21 197 314 317 177 -58 -206 -304 -363 -190
4051 -190 -60 136 251 294 301 162 -86 -214 -352 -286 -155 79 235 335 316 210 38 -204 -278 -323 -214 -74
4073 -74 107 247 316 315 142 -80 -188 -364 -318 -206 18 219 333 307 262 89 -179 -313 -327 -245 -78 74 245
4096 245 360 232 175 -40 -244 -353 -294 -209 -10 178 313 376 235 56 -101 -230 -302 -267 -69 60 228 336
4118 336 337 210 -10 -173 -334 -302 -219 -25 167 250 337 256 106 -84 -214 -319 -259 -134 7 201 324 368 274
4141 274 68 -145 -298 -333 -244 -50 156 292 353 294 169 -38 -209 -311 -358 -207 16 187 287 310 241 18
4163 18 -166 -288 -374 -227 -116 135 248 344 296 185 -15 -195 -304 -300 -205 -37 199 287 331 295 58 -140 -296
4186 -296 -349 -230 -140 47 236 305 322 185 -2 -177 -287 -372 -286 6 116 290 329 288 137 -76 -261 -311 -306 -145
4210 -145 50 174 317 345 224 49 -215 -269 -344 -223 -90 110 295 352 285 155 -92 -228 -336 -273 -159 15
4232 15 161 262 336 201 87 -163 -279 -372 -291 -109 111 233 330 249 160 -65 -245 -296 -327 -209 -49 93 269
4255 269 379 284 78 -115 -231 -321 -275 -155 87 237 324 299 176 -42 -160 -310 -292 -229 -67 103 250 386
4277 386 285 97 -80 -326 -319 -298 -129 94 221 303 316 196 26 -136 -288 -301 -256 -83 113 248 344 308 140
4300 140 -43 -251 -307 -326 -135 1 148 308 286 215 22 -133 -303 -343 -243 -126 101 226 347 295 162 -41
4322 -41 -216 -299 -349 -191 -20 180 233 299 217 77 -113 -258 -287 -258 -130 128 254 355 289 149 7 -192 -354
4345 -354 -307 -188 -17 146 241 327 291 116 -95 -197 -316 -269 -177 19 202 307 330 216 4 -184 -245 -340 -275
4368 -275 -90 139 311 307 275 139 -67 -189 -285 -268 -174 58 240 288 344 210 36 -127 -299 -314 -241 -105 49
4391 49 231 230 312 120 -36 -193 -317 -298 -220 -42 190 264 336 197 94 -110 -239 -291 -270 -105 62 269 311 297
4415 297 151 17 -173 -359 -284 -225 -6 170 275 336 253 111 -87 -204 -283 -272 -140 31 192 291 300 222 13
4438 13 -150 -279 -271 -193 -54 148 286 305 222 113 -72 -246 -302 -328 -217 -16 187 308 306 240 100 -117 -249 -294
4462 -294 -217 -109 90 249 341 263 135 -6 -190 -303 -296 -200 -23 180 280 293 228 47 -76 -275 -364 -232 -120
4485 -120 152 251 293 279 162 -24 -181 -282 -306 -203 -27 141 245 328 263 54 -53 -268 -295 -195 -154 25 192
4508 192 289 280 140 10 -162 -262 -318 -198 -85 123 249 282 256 120 -30 -215 -301 -267 -184 -17 158 263 272 191
4532 191 63 -117 -294 -271 -197 -102 95 253 332 271 134 -31 -176 -298 -284 -162 -20 146 249 300 273 72 -77
4555 -77 -217 -280 -261 -104 74 210 323 255 154 -68 -152 -278 -274 -233 -74 103 192 304 238 113 -108 -258 -313 -294
4579 -294 -143 48 245 286 308 244 25 -141 -202 -239 -180 -55 99 174 322 298 108 -111 -227 -283 -294 -152 0
4602 0 195 225 265 175 13 -108 -224 -254 -249 -89 109 262 314 319 131 -71 -239 -279 -310 -170 -32 137 248 283 163
4627 163 50 -140 -223 -288 -273 -100 45 212 261 310 150 18 -202 -255 -261 -202 -8 162 207 252 222 53 -63 -193
4651 -193 -287 -254 -174 42 180 275 295 131 7 -156 -275 -306 -193 -13 121 249 275 235 99 -34 -182 -295 -256
4674 -256 -137 -3 186 268 356 186 28 -151 -222 -288 -312 -94 64 165 237 257 123 -55 -187 -328 -259 -199 -39
4697 -39 162 278 331 210 55 -120 -237 -276 -231 -127 46 196 266 218 149 -15 -182 -273 -307 -223 -68 186 263 306
4721 306 227 67 -64 -239 -243 -233 -192 67 152 269 289 178 41 -145 -251 -218 -186 -83 129 246 280 201 102 -60
4745 -60 -200 -289 -282 -111 -5 141 284 283 215 50 -112 -232 -310 -235 -109 109 239 288 270 147 -37 -186 -248 -261
4769 -261 -103 -47 115 266 262 206 17 -126 -237 -285 -193 -131 92 188 310 259 129 33 -168 -226 -316 -180 4 161
4793 161 266 291 244 76 -119 -261 -323 -263 -158 31 189 248 243 130 -25 -150 -206 -285 -199 -75 100 249 287 260
4817 260 149 -25 -209 -241 -237 -113 30 122 303 266 159 -18 -75 -280 -261 -244 -101 82 198 281 214 131 -40 -198
4841 -198 -313 -228 -180 -28 142 262 300 229 94 -29 -205 -255 -240 -111 15 207 274 212 119 -72 -99 -256 -281 -197
4865 -197 -28 126 210 269 203 86 -72 -206 -280 -284 -155 51 201 242 283 192 20 -101 -282 -215 -228 -64 82 176
4889 176 239 233 146 -81 -172 -291 -299 -137 -10 152 284 253 196 57 -132 -212 -246 -193 -47 51 217 271 271 149 -26
4914 -26 -195 -288 -264 -183 -3 105 249 254 185 5 -138 -209 -272 -231 -116 65 168 293 297 160 -20 -175 -249 -297 -131
4939 -131 -2 105 316 261 202 33 -67 -215 -261 -225 -171 18 169 245 289 118 -8 -158 -230 -234 -166 -27 132 253
4963 253 285 255 112 -66 -175 -258 -217 -172 51 204 272 277 164 76 -121 -247 -308 -194 -88 91 235 228 232 126 18
4988 18 -191 -231 -244 -145 17 99 277 249 191 66 -91 -205 -306 -214 -83 62 146 235 237 147 -15 -142 -261 -218 -205
5013 -205 -36 103 281 286 171 89 -62 -204 -227 -213 -76 67 148 247 237 131 -6 -106 -268 -227 -201 -83 157
5036 157 193 274 152 110 -85 -224 -259 -258 -126 -4 175 247 269 179 52 -101 -261 -297 -203 -55 53 198 242 221
5060 221 91 -73 -218 -203 -290 -155 -38 111 248 239 182 47 -140 -230 -279 -216 -143 50 256 236 258 120 -35 -130
5084 -130 -225 -235 -164 -29 119 215 258 190 74 -78 -206 -313 -241 -122 43 175 234 248 80 4 -144 -259 -229 -176
5108 -176 -60 74 231 288 228 70 -103 -161 -269 -242 -114 12 152 265 262 135 21 -140 -243 -260 -233 -89 25
5131 25 215 231 269 121 -39 -174 -254 -243 -153 44 184 235 255 171 67 -125 -268 -233 -253 -58 50 171 197 247
5155 247 141 13 -153 -286 -234 -170 28 128 180 249 193 66 -58 -172 -270 -224 -70 43 185 235 244 120 -3
5178 -3 -169 -298 -249 -182 -71 123 215 240 201 103 -38 -209 -250 -242 -120 34 155 272 273 237 -13 -85 -177 -240 -134 -93
5204 -93 66 193 240 176 105 -23 -215 -316 -267 -191 -17 175 254 251 192 37 -112 -158 -225 -218 -87 87 131 234 237 140
5230 140 51 -162 -187 -237 -163 -36 150 247 235 158 45 -73 -183 -267 -168 -117 13 142 218 187 103 6 -118 -228 -246
5255 -246 -183 -7 149 180 266 220 86 -54 -149 -252 -201 -130 7 147 212 240 197 37 -116 -245 -236 -235 -41 69 192
5280 192 252 205 121 -9 -69 -234 -200 -138 -8 157 213 257 230 113 -72 -203 -240 -210 -49 56 181 225 246 68
5304 68 -30 -132 -224 -263 -129 -57 131 214 300 162 98 -100 -222 -229 -219 -123 95 138 210 225 154 15 -122 -228 -250 -162
5330 -162 -87 80 183 283 193 114 -132 -183 -222 -187 -98 -12 121 243 205 189 34 -107 -185 -239 -194 -59 72 177
5354 177 238 173 68 -54 -162 -208 -246 -132 27 97 256 215 128 33 -72 -208 -257 -220 -182 53 196 240 185 84
5378 84 21 -165 -199 -230 -144 -24 82 214 193 191 65 -13 -164 -282 -195 -109 40 167 203 234 126 43 -161 -151 -223
5403 -223 -161 -48 80 236 204 173 79 -39 -210 -272 -207 -147 15 100 229 199 124 51 -194 -181 -209 -220 -26 61 181
5428 181 201 236 97 -33 -147 -241 -234 -155 59 147 211 177 159 7 -83 -173 -276 -191 -93 65 163 231 231 158 -31 -169
5454 -169 -195 -250 -128 -51 127 190 229 127 17 -48 -171 -201 -219 -161 37 93 232 194 116 -13 -144 -206 -193 -148 -58
5479 -58 83 149 217 184 47 -29 -151 -203 -244 -177 -40 98 224 191 204 50 -119 -225 -281 -183 -103 139 106 206 138
5504 138 47 -43 -177 -267 -296 -159 -29 117 187 216 174 6 -134 -176 -231 -165 -62 64 185 209 165 126 -5 -160
5528 -160 -230 -243 -131 -33 120 191 227 160 23 -59 -163 -223 -203 -115 47 177 223 208 98 32 -125 -236 -233 -152 -39
5553 -39 77 192 243 193 64 -55 -136 -269 -213 -142 -6 95 219 230 154 53 -98 -206 -235 -171 -51 74 204
5576 204 213 170 64 -61 -117 -212 -181 -128 12 125 185 223 204 100 -112 -203 -255 -173 -40 79 177 193 194 109 -39 -125
5602 -125 -205 -184 -186 -40 106 232 218 182 73 -55 -148 -237 -239 -63 -8 111 212 201 134 -2 -82 -190 -177 -160 -52
5627 -52 141 171 207 207 71 -81 -176 -211 -227 -87 61 125 207 207 126 -7 -107 -139 -229 -184 -72 90 165 257 166 64
5653 64 -35 -206 -231 -253 -87 -19 112 187 213 159 46 -11 -147 -212 -196 -77 59 119 254 181 93 8 -142 -240 -197 -112
5679 -112 -21 74 175 203 182 71 -41 -159 -200 -209 -112 48 172 258 175 108 -17 -106 -172 -199 -103 -37 77 192 247 187
5705 187 17 -36 -175 -221 -171 -109 -8 177 209 229 92 31 -155 -192 -175 -159 -58 62 172 264 197 127 -14 -157
5729 -157 -251 -252 -156 -26 128 177 237 97 -2 -80 -213 -181 -210 -45 37 97 255 185 121 -12 -144 -227 -231 -185 -4 112
5755 112 177 222 157 59 -52 -231 -195 -243 -111 16 113 213 193 147 -34 -118 -210 -193 -133 -36 103 146 212 148 94 -71
5781 -71 -129 -218 -205 -85 13 142 203 215 121 37 -91 -241 -237 -137 -88 94 133 222 159 56 -20 -139 -240 -205 -145 -3
5807 -3 93 181 218 140 23 -111 -187 -211 -132 -49 43 181 178 150 82 35 -146 -184 -245 -198 -35 47 205 191 170 51 -81
5834 -81 -168 -270 -201 -87 -5 96 177 183 96 1 -124 -224 -229 -164 -74 68 201 224 168 31 -89 -167 -231 -159 -82 5 104
5861 104 183 196 114 35 -123 -196 -187 -174 -38 78 218 263 168 104 -72 -142 -171 -151 -120 36 114 177 189 124 19 -155
5887 -155 -189 -218 -197 -46 44 159 211 153 96 -56 -142 -247 -199 -139 -26 53 176 166 177 54 -38 -217 -207 -175 -57
5912 -57 34 101 227 165 130 -23 -134 -217 -218 -106 -42 103 150 242 158 86 -59 -139 -213 -201 -127 17 162 162 163 176 -1
5939 -1 -61 -164 -216 -146 -92 64 126 219 163 78 -62 -138 -190 -224 -64 22 116 213 186 143 37 -92 -130 -228 -167 -57 89
5966 89 187 241 145 61 -47 -119 -206 -228 -124 -16 122 163 218 150 20 -36 -166 -201 -148 -87 12 140 206 182 103 -45
5992 -45 -149 -178 -159 -137 2 73 162 172 164 52 -55 -140 -201 -208 -126 37 117 183 234 144 33 -70 -166 -159 -139 -58 34 175
6020 175 192 177 104 -77 -116 -212 -208 -148 -40 120 214 165 88 60 -123 -135 -146 -180 -25 27 169 172 184 103 17 -144 -171
6047 -171 -190 -182 2 116 159 194 165 6 -56 -153 -205 -208 -77 -37 122 167 204 77 62 -84 -183 -211 -157 -42 98 161
6073 161 235 118 47 18 -105 -155 -194 -109 35 78 218 175 130 -16 -75 -143 -248 -183 -58 90 142 168 167 70 10 -151
6099 -151 -190 -176 -116 -49 89 235 176 138 -16 -69 -159 -186 -110 -58 83 95 173 161 58 16 -135 -166 -233 -127 -48 102
6125 102 173 203 156 72 -51 -145 -199 -160 -44 11 107 185 162 138 28 -148 -152 -212 -105 -67 57 145 212 106 47 -91
6151 -91 -164 -196 -144 -55 49 116 161 148 119 2 -100 -136 -177 -179 -47 94 138 191 164 102 -44 -165 -193 -137 -105 7 114
6178 114 113 182 95 76 -46 -175 -203 -160 -27 3 160 198 166 71 -38 -115 -193 -185 -53 5 58 100 195 127 61 -39 -202
6205 -202 -212 -217 -123 51 120 157 155 103 1 -78 -144 -160 -130 -41 45 113 220 175 72 -36 -140 -121 -165 -109 -12 168 197
6232 197 192 113 -10 -128 -193 -171 -146 -58 -21 140 232 163 47 -32 -142 -160 -194 -110 3 105 174 194 125 6 -96 -142
6258 -142 -173 -155 -55 5 104 152 218 124 -18 -154 -198 -156 -90 -2 100 176 156 137 20 -79 -162 -199 -156 -89 22 160
6284 160 166 158 89 9 -130 -181 -215 -127 20 78 186 155 153 30 -49 -115 -164 -154 -118 56 104 199 240 107 13 -32 -161 -165
6312 -165 -131 -34 43 151 162 173 43 -44 -91 -166 -224 -160 -60 68 172 177 130 36 -57 -106 -165 -97 -67 30 127 150 168 81
6340 81 -20 -115 -172 -150 -125 9 83 176 193 161 79 -75 -140 -141 -113 -79 21 115 178 184 107 33 -101 -160 -177 -101 -62 64
6368 64 132 139 176 48 -39 -145 -181 -211 -67 -2 83 136 139 123 -13 -54 -160 -193 -127 -76 70 127 222 105 69 -3 -126
6395 -126 -126 -156 -82 -3 60 183 150 139 37 -52 -149 -218 -94 -82 116 122 175 162 90 -23 -130 -143 -159 -99 -43 79 143
6422 143 148 156 2 -35 -138 -226 -129 -34 53 177 207 166 142 19 -132 -192 -208 -123 -71 80 176 179 189 88 -45 -163 -194
6449 -194 -139 -90 5 125 174 202 133 44 -59 -143 -132 -135 -54 67 175 186 165 78 -27 -82 -174 -194 -90 27 132 140 168
6476 168 73 43 -10 -105 -186 -173 -42 41 167 229 194 155 -17 -93 -197 -142 -73 -61 113 132 181 120 64 -70 -140 -186 -108
6503 -108 -30 -23 137 149 180 105 8 -77 -203 -200 -134 42 47 149 174 131 24 -37 -136 -146 -156 -124 2 116 208 198 125 21
6531 21 -109 -152 -150 -130 -41 66 122 198 171 105 -15 -118 -151 -147 -66 6 81 182 170 132 60 -98 -151 -154 -109 -108 23 107 160
6560 160 176 93 -27 -127 -169 -161 -94 1 65 178 104 125 30 -48 -113 -159 -115 -133 67 103 140 170 114 9 -107 -146 -141 -110
6588 -110 13 48 122 160 100 5 -60 -141 -126 -81 -140 75 102 165 170 121 79 -114 -123 -208 -90 -67 71 122 169 155 57 -9
6616 -9 -53 -121 -156 -106 -11 86 151 130 129 16 -107 -163 -130 -143 -15 67 120 138 79 74 7 -72 -198 -167 -79 -72 70 128 216 186
6646 186 53 -38 -159 -156 -149 -33 13 108 134 156 75 58 -97 -186 -170 -138 -57 130 99 145 96 42 -47 -191 -132 -137 -65 99
6674 99 138 138 170 82 10 -57 -115 -135 -148 -117 66 119 191 116 69 -35 -132 -104 -125 -105 -8 86 150 158 100 5 -61 -101 -158 -104
6704 -104 -119 67 129 188 121 54 0 -106 -125 -134 -105 -30 64 130 156 155 57 -55 -128 -162 -146 -63 24 129 168 109 45 -5 -137
6733 -137 -144 -121 -107 -50 35 163 86 168 22 -29 -94 -184 -144 -101 12 107 167 157 104 55 -70 -108 -122 -95 -46 72 173
6760 173 171 157 84 -10 -108 -168 -140 -89 -1 102 122 136 78 -4 -52 -115 -166 -124 -103 64 197 166 146 113 -56 -108 -139 -113
6788 -113 -67 -21 101 125 158 134 32 -36 -101 -89 -127 -101 27 189 162 162 92 -6 -67 -182 -134 -99 -40 72 140 159 179
6815 179 49 -16 -71 -135 -154 -131 10 66 132 129 103 18 -52 -93 -153 -62 -64 63 176 138 136 88 9 -108 -102 -169 -84 -1 72
6844 72 137 83 146 -18 -50 -127 -145 -89 -26 -7 99 149 88 82 3 -104 -129 -109 -109 -35 71 179 162 124 12 -10 -153 -157
6872 -157 -118 -55 73 112 203 165 88 -8 -53 -144 -148 -76 -35 82 155 150 149 90 -61 -64 -82 -83 -79 22 71 179 124 88 -23 -111
6902 -111 -158 -113 -85 -3 70 87 135 128 76 -25 -75 -134 -111 -103 -6 89 128 134 159 44 -69 -109 -171 -79 -70 20 158 151 161 90
6932 90 -30 -35 -137 -137 -32 -66 65 121 185 56 57 -83 -110 -99 -68 -64 11 71 128 156 99 19 -28 -153 -143 -82 -55 41 102
6961 102 137 127 22 -24 -160 -155 -156 -70 26 72 185 145 93 35 -79 -127 -188 -134 -29 53 69 166 166 19 -10 -98 -126 -160
6989 -160 -47 4 17 113 128 117 2 -38 -120 -183 -168 -34 27 96 145 99 46 -6 -156 -88 -130 -114 -11 20 157 179 159
7016 159 21 -26 -138 -170 -75 -41 51 96 150 146 59 -11 -117 -119 -145 -103 -36 19 160 126 103 68 -41 -83 -173 -100 -86 23
7044 23 97 166 152 75 4 -59 -123 -159 -102 -33 36 149 123 118 117 8 -61 -129 -124 -83 -37 58 159 108 105 50 -49 -129 -146 -143 -78
7075 -78 0 76 111 134 78 -53 -70 -151 -157 -99 -17 79 117 165 100 51 -39 -108 -96 -150 -60 25 75 165 135 65 23 -82 -160 -142
7105 -142 -59 -29 72 88 115 75 38 -40 -129 -122 -178 -61 -23 112 121 139 114 8 -25 -126 -175 -49 -32 9 117 152 117
7132 117 91 -18 -97 -110 -163 -63 -20 79 127 215 100 23 1 -113 -185 -123 -37 55 88 142 125 32 -17 -66 -101 -133 -66 -18
7160 -18 45 144 158 102 29 -43 -129 -95 -123 -65 69 96 133 154 71 9 -56 -148 -120 -135 -43 5 133 173 108 55 -52 -104 -120
7189 -120 -103 -106 4 123 110 134 75 44 -52 -153 -121 -155 -18 -44 140 148 105 62 -63 -31 -171 -127 -119 -26 28 112 184 69
7217 69 71 -61 -147 -145 -103 -73 -29 126 143 111 82 -79 -127 -102 -119 -121 32 40 127 119 107 66 -49 -132 -156 -115 -56 4 115 153
7247 153 131 74 -10 -36 -130 -147 -78 1 9 124 138 99 37 -97 -133 -152 -71 -84 -41 47 120 111 68 -33 -59 -100 -173 -113 -58
7276 -58 71 58 162 113 59 -17 -100 -135 -165 -21 -47 41 126 85 93 -30 -10 -103 -136 -139 -83 31 110 121 108 37 -5 -92 -152
7305 -152 -156 -41 -37 67 76 112 92 7 -17 -123 -129 -128 -54 6 142 146 150 99 -31 -99 -117 -178 -60 -34 26 78 145 130 58 -39
7335 -39 -117 -135 -139 -140 48 77 89 110 100 24 -46 -89 -168 -49 -26 7 82 112 114 64 -23 -95 -166 -174 -79 44 66 134 126 65 -3
7366 -3 -28 -119 -116 -142 -56 13 100 148 77 90 -7 -68 -147 -103 -99 -19 67 135 150 117 17 -16 -76 -96 -73 -20 -14 80 131 114 66 -21
7398 -21 -45 -200 -72 -85 -38 17 100 109 86 28 -87 -90 -103 -103 -74 -27 96 134 83 72 -31 -57 -91 -105 -99 -11 50 118 138 141
7428 141 40 -47 -92 -138 -81 -72 -59 49 112 140 68 -20 -101 -82 -103 -127 -12 44 88 118 133 41 4 -141 -57 -171 -88 47
7456 47 62 117 136 162 0 -39 -92 -162 -75 -80 35 73 97 99 80 36 -61 -71 -138 -131 -22 53 124 130 143 37 -81 -110 -117 -121 -29
7487 -29 23 69 115 152 115 -30 -85 -101 -108 -113 -44 60 128 91 134 38 27 -110 -127 -103 -100 -11 73 98 115 77 85 -64 -115 -124 -124
7518 -124 -31 7 32 135 80 71 2 -83 -74 -98 -67 -15 57 116 110 91 23 -27 -98 -91 -111 -3 3 75 128 156 90 -54 -34 -173
7548 -173 -86 -53 -13 52 72 131 103 28 -41 -77 -114 -92 -9 0 95 104 118 72 -1 -50 -119 -83 -112 -25 86 21 167 78 70 9
7578 9 -99 -98 -103 -16 2 88 102 100 122 -13 -24 -123 -101 -92 -46 70 85 104 134 37 -7 -83 -126 -117 -74 -6 55 60 108 81 68 -19
7610 -19 -102 -88 -86 -16 27 31 126 129 59 48 -46 -111 -134 -47 3 64 92 90 116 5 -43 -21 -106 -94 -47 34 10 63 155 67 15 -43
7642 -43 -147 -138 -66 -7 18 124 99 93 73 -8 -52 -84 -107 -90 -4 72 114 130 43 30 -50 -87 -133 -112 -28 35 75 97 130 75
7672 75 6 -64 -127 -85 -120 -21 43 123 138 74 50 -57 -128 -110 -116 -51 10 80 136 103 67 26 -87 -82 -112 -101 -14 37 111 130
7702 130 91 47 -42 -99 -96 -111 -72 -17 53 101 106 106 -9 -53 -145 -111 -114 -59 57 98 147 62 65 -30 -113 -135 -143 -71 11 91 95 91 75
7735 75 42 -64 -74 -177 -81 -32 39 76 94 124 59 15 -101 -144 -106 -68 -18 68 119 110 71 -8 -40 -71 -153 -66 -42 -12 52
7764 52 116 112 45 23 -90 -141 -95 -115 -50 47 99 100 105 34 -42 -76 -98 -98 -26 33 73 100 87 101 -14 -22 -77 -121 -46 -90 45
7795 45 64 140 93 26 -42 -104 -95 -76 2 2 83 90 151 82 33 -45 -119 -64 -76 -26 17 93 133 127 65 -36 -83 -113 -127 -67 -22 54
7827 54 107 127 60 55 -18 -102 -82 -111 -46 7 98 101 104 40 -16 -37 -147 -82 -67 -4 34 96 149 126 35 -29 -61 -109 -170 -55 15
7858 15 126 133 108 69 -14 -23 -108 -129 -80 -55 -8 50 125 103 32 8 -68 -128 -71 -97 3 87 54 98 62 -2 -69 -69 -118 -121 -49
7889 -49 54 34 153 109 49 30 -95 -113 -152 -72 -20 62 100 119 88 33 4 -79 -99 -88 -20 26 81 108 98 52 32 -59 -93
7918 -93 -118 -105 4 47 90 92 107 42 -17 -55 -150 -70 -100 -2 39 126 133 52 71 -56 -81 -143 -51 -51 39 144 100 125 22 -31
7948 -31 -76 -115 -88 -92 6 89 102 115 78 15 -107 -76 -120 -40 -78 25 80 128 98 23 -8 -22 -117 -133 -71 -63 91 124 84 110
7978 110 13 -49 -58 -107 -86 -17 6 67 98 67 48 20 -46 -95 -99 -111 -62 32 111 122 79 45 -38 -102 -94 -103 -38 46 52 113 100 73
8010 73 56 -42 -73 -108 -71 17 70 71 126 121 5 -3 -57 -90 -96 -43 -21 44 122 92 142 -29 -33 -100 -108 -78 -22 40 92 105 88 67
8042 67 -33 -65 -59 -102 -32 -34 60 84 97 88 2 -47 -94 -79 -98 -32 28 33 94 51 23 -28 -39 -78 -121 -62 -37 62 101 132 64 43
8074 43 -21 -38 -110 -137 -70 -4 59 75 83 52 13 -42 -72 -101 -112 -75 12 97 89 103 48 -29 -61 -162 -98 -40 47 105 67 102 -7
8105 -7 -13 -47 -89 -105 -75 -13 1 47 83 125 66 -18 -72 -117 -39 -92 -20 18 79 73 39 68 -59 -64 -114 -125 -29 13 105 109 104 55 -16
8138 -16 -18 -102 -87 -87 -15 64 116 65 100 73 40 -37 -58 -95 -40 23 38 103 136 76 -20 -81 -122 -147 -77 -38 38 66 62 93 32 -11
8170 -11 -55 -83 -120 -83 -45 57 77 86 39 -27 -52 -131 -85 -39 -73 13 17 101 102 9 7 -82 -75 -93 -62 7 -3 121 131 78 -11 -53
8202 -53 -78 -79 -27 -63 32 60 63 95 42 17 -21 -47 -76 -16 43 44 80 88 65 67 -19 -68 -93 -98 -60 34 55 54 54 59 24 -20 -40 -118 -37
8237 -37 -8 34 119 90 59 81 -2 -43 -76 -76 -40 -53 49 72 90 77 19 -68 -51 -94 -99 29 59 73 111 44 118 -45 -80 -80
8267 -80 -134 -41 22 81 98 82 60 49 -25 -119 -89 -69 29 74 95 49 78 43 -7 -17 -117 -97 -19 -21 63 62 76 79 65 -34 -41 -60
8299 -60 -94 -7 23 76 18 69 68 12 -59 -88 -48 -45 -13 10 93 85 62 84 21 -81 -57 -73 -43 -14 41 109 140 50 -4 27 -50
8330 -50 -110 -69 -29 79 73 91 54 46 -28 -97 -55 -54 -67 -20 39 78 131 42 7 -16 -33 -135 -97 1 35 78 112 127 17 43
8360 43 -76 -106 -88 -43 31 25 137 89 33 14 -50 -96 -113 -49 -67 -18 83 48 94 45 35 -54 -45 -102 -52 -40 19 110 77 90
8390 90 47 34 -56 -112 -84 -60 3 37 68 149 44 56 -55 6 -51 -107 -36 -18 93 102 106 54 2 -60 -77 -109 -43 11 75 90
8420 90 101 88 17 -53 -72 -64 -108 -69 24 16 78 88 32 14 -56 -65 -66 -30 -17 46 47 76 96 5 6 -16 -111 -83 33 13 60 79 69
8453 69 52 -44 -38 -114 -83 -10 -30 21 91 110 62 58 13 -72 -68 -100 -38 -6 40 100 68 75 31 -52 -86 -76 -104 -39 47 54 101 60 27
8486 27 -52 -61 -46 -60 -32 25 42 77 121 54 2 -7 -51 -45 -74 -27 42 72 82 66 44 28 -36 -92 -61 -54 -31 67 63 88 49 17 -60
8519 -60 -66 -94 -74 -14 2 56 89 66 43 -11 5 -112 -83 -72 10 47 132 79 69 44 -25 -67 -82 -84 -43 -2 47 74 103 48 34
8550 34 16 -49 -52 -99 -72 28 56 76 108 58 -17 -14 -71 -46 -62 28 75 39 115 105 42 -9 -60 -71 -53 -29 32 103 67 135 25
8581 25 -8 -19 -95 -32 -102 -29 28 76 121 31 38 -36 -80 -64 -91 3 72 35 41 75 67 -28 -29 -75 -89 -61 -49 14 35 80 57 15
8613 15 -20 -90 -93 -139 -62 -6 38 110 62 66 63 13 -58 -124 -58 -53 42 65 109 62 33 14 -90 -50 -77 -81 7 18 82 67 81 22
8645 22 -57 -60 -111 -67 -52 14 61 82 40 80 -10 -36 -60 -77 -39 -1 13 36 55 104 21 -24 -49 -78 -54 -46 50 63 94 59 33
8676 33 22 -86 -68 -99 -72 -27 36 67 95 160 28 25 -53 -71 -61 -20 37 35 52 82 90 52 -16 -59 -79 -70 -55 25 77 76 81 76 -17
8709 -17 -63 -103 -48 -50 -6 47 76 100 34 39 -47 -45 -22 -63 -9 -46 81 81 90 35 -12 -54 -73 -75 -14 10 55 78 117 80 29 5 -59
8742 -59 -71 -118 -7 -33 72 83 74 59 44 4 -54 -35 -50 -90 34 61 106 75 28 -14 -41 -95 -107 -41 1 50 18 75 102
8771 102 57 -38 -100 -76 -45 -11 67 87 39 69 9 18 -23 -114 -70 -37 -30 8 124 92 10 20 -35 -71 -109 -70 -10 12 33 55
8801 55 32 7 19 -23 -119 -100 -107 -42 20 111 107 49 28 -43 -20 -64 -76 -57 54 7 95 98 21 27 -73 -74 -121 -134 -19 27 55
8832 55 88 44 36 -7 -92 -63 -43 -41 16 55 41 41 44 63 -37 -66 -127 -71 8 16 55 62 101 28 43 -49 -97 -81 -77 14 68 -9 71
8865 71 83 4 -36 -41 -63 -115 -39 3 56 109 68 -15 1 -69 -68 -74 -73 -15 -16 66 34 56 58 -17 -64 -29 -89 -62 13 14 74 115 47 8
8899 8 -11 -43 -123 -74 -49 9 47 109 79 27 13 -100 -81 -63 12 -39 62 78 76 63 -53 0 -70 -52 -23 -101 3 16 130
8928 130 49 51 47 -91 -59 -89 1 8 25 76 48 54 -14 -33 -16 -54 -37 -52 22 3 118 65 28 29 -58 -63 -91 -41 -34 21 95 54
8960 54 77 45 -24 -25 -90 -68 -62 1 2 54 152 25 -3 -5 -97 -37 -16 18 15 66 40 88 59 -13 -20 -72 -62 -45 -19 29 52 121 81
8993 81 36 -27 -30 -31 -82 -50 46 53 44 100 63 -29 -35 -50 -100 -49 -13 33 95 118 57 0 -107 -52 -75 -93 34 29 62 55 46 4 -17
9026 -17 -13 -63 -84 -33 34 77 47 57 -11 2 -8 -23 -49 -81 -82 -13 51 61 96 72 58 -25 -64 -70 -74 -2 20 65 39 37 45 -29 -24 -56
9060 -56 -98 -44 -8 48 58 37 71 28 -38 -53 -120 -46 -18 -1 52 52 84 -4 43 -52 -98 -72 -64 -25 -8 85 51 48 12 -54 -23 -101
9092 -101 -24 -38 1 25 47 38 22 57 -62 -51 -60 -50 -5 15 34 74 92 -22 -27 -50 -65 -86 -24 29 31 54 76 11 4 -25 -48
9123 -48 -81 -27 -16 -17 114 58 81 13 -53 -54 -66 -20 17 16 41 43 83 -7 13 -20 -45 -27 -18 -41 -28 39 96 81 29 14 -53 -61 -82
9156 -82 -57 -45 35 57 68 -3 0 37 -39 -89 -40 -43 -1 13 93 87 76 -52 -62 -66 -26 -14 -26 48 57 65 52 -9 -18 -55 -29 -92 -39
9189 -39 -57 59 61 55 9 -43 -7 -58 -52 -54 -57 -12 8 60 45 59 -12 -72 -55 -61 0 -11 31 68 34 112 -38 -39 -54 -44 -65 -58 23
9222 23 56 99 27 69 13 -77 -31 -94 -10 -35 24 47 66 4 -34 -17 -92 -65 -65 -54 -7 61 63 51 -1 0 -62 -63 -49 -46 15 44 27
9255 27 52 15 3 16 -36 -102 -67 -38 42 2 55 69 54 -10 -40 -53 -88 -68 -1 20 27 91 75 56 -30 -33 -98 -47 -15 -23 9 15
9287 15 64 8 51 -35 -55 -53 -52 -35 24 88 14 40 22 -4 -15 -38 -57 -59 9 46 57 79 38 4 -34 -3 -53 -19 -23 12 31 66
9319 66 77 37 16 -39 -57 -97 -48 14 35 76 53 51 6 7 -36 -20 -60 -43 -4 68 41 32 46 -22 -15 -82 -56 -92 -64 21 17 75 52
9352 52 20 -39 -71 -73 -64 -65 -4 27 38 51 51 -15 -46 -58 -57 -50 1 -9 24 77 61 -13 -60 -55 -23 -79 -48 9 6 80 52 39 24 11
9386 11 -36 -114 -1 -35 53 73 74 6 3 -4 -7 -19 -73 17 0 42 30 76 53 30 -53 -76 -56 -54 -29 19 20 80 8 41 18 -39 -45
9419 -45 0 -70 -18 42 65 83 51 27 1 -81 -75 -47 -45 -4 31 65 95 51 10 -25 -54 -21 -33 -7 -1 25 26 70 54 1 -65 -79
9451 -79 -51 -71 -28 73 44 40 36 -27 -23 -41 -28 -32 -13 -5 99 81 65 43 10 -8 -96 -39 -37 7 62 38 60 28 36 16 -42 -69 -63
9484 -63 13 23 64 60 40 33 -8 -59 -77 -72 -29 -6 6 95 74 37 41 37 -3 -55 -65 -1 -9 50 27 71 43 36 -45 -34 -46 -41 -52 -19
9518 -19 61 34 59 9 -8 -21 -78 -112 -30 12 23 30 82 32 47 -70 21 -79 -23 -37 17 26 56 51 0 57 -60 -56 -27 -21 -31
9549 -31 35 60 67 59 8 -32 -32 -69 -28 -23 -10 3 -20 67 48 -19 -66 -65 -40 -56 7 21 52 67 43 15 -7 -51 -96 -52 -55 -29 27
9582 27 72 48 22 18 -28 -27 -79 -44 6 16 84 71 66 25 2 25 -57 -41 -14 -17 20 48 76 67 -26 -35 -95 -36 -22 -10 26 13 52
9615 52 34 10 17 -36 -42 -46 -2 -35 -5 65 82 30 -31 20 -73 -89 -76 -31 -36 10 17 22 41 29 22 -45 -54 -66 -45 4 72 77 50 24 -37
9650 -37 -41 -37 -83 -33 7 7 38 19 75 -31 0 -39 -59 -58 -7 5 3 80 -1 29 2 -82 -47 -98 5 -17 -3 10 33 65 29 20
9682 20 -52 -85 -63 -3 7 29 99 74 16 37 -72 -49 -53 -84 2 24 14 21 52 -21 37 -62 -107 -28 -3 36 46 41 84 -19 -32
9713 -32 -59 -21 -22 -20 32 1 66 50 47 27 -24 -7 -92 -16 -4 30 48 10 56 -10 -11 -32 -8 -51 -36 -3 -38 43 72 57 51 17 -12
9746 -12 -18 -51 -57 -7 39 6 19 27 28 -15 -4 -39 -17 -51 6 49 3 16 74 -8 26 -46 -9 -39 30 34 -16 33 58 42 -31 -14 -18
9779 -18 -36 -13 -69 26 49 55 49 -2 -34 -51 -55 -62 -4 43 56 6 59 15 26 -42 -1 -93 -80 -23 40 52 94 79 10 -37 -35 -96 -3
9812 -3 -5 3 27 12 32 8 -42 -6 -95 -98 -18 -3 30 39 47 27 10 -74 -43 -39 -39 -18 10 4 41 51 -17 32 8 -27 -92 -74 15 -11 74
9847 74 42 38 -1 -49 -18 -45 -3 -28 5 21 32 21 43 -27 -23 -63 -86 -28 1 33 -5 49 31 14 -10 -11 -15 -54 -66 0 10 28
9879 28 31 13 57 -13 9 -98 -67 -5 5 70 39 16 77 21 -56 -30 -20 -57 -33 54 52 54 16 23 -33 -41 -89 -82 -44 -8 38 64 27
9912 27 7 -44 -7 -33 10 9 -26 0 33 55 28 11 -13 -68 -66 -87 -16 -42 27 32 38 29 -3 -4 -21 -25 -71 -28 26 22 26 35 12 -29 2
9947 2 -62 -10 -4 12 69 14 32 48 2 17 -64 -61 -31 -61 -9 51 50 64 26 -11 -41 -45 -24 -11 19 42 -11 24 42 21 -9 -25 -60
9980 -60 -33 -6 4 53 54 22 -3 63 -52 -31 -47 -33 27 -17 6 -17 21 -9 -28 -15 -97 -78 -23 -38 15 71 36 5 -20 -47
10010 -47 14 -79 -23 -44 -11 23 29 57 -16 -1 -16 -51 -44 -73 27 18 28 -1 22 8 -47 -31 -56 -6 -55 -31 40 30 -5 17 -26
10041 -26 -29 -70 -52 -38 -8 70 45 27 -7 -35 -20 -32 -15 -48 -53 -7 -43 38 30 14 -6 -10 -42 -46 -45 -21 -18 23 24 19 2 -18 -48 -88
10075 -88 -81 -28 -42 -3 53 40 33 -32 -20 -53 -53 -59 -19 -23 7 28 21 8 9 -80 -37 -11 -14 -9 24 73 23 35 -15 1 -91 -72 -6 -56
10109 -56 37 -3 26 6 20 32 -41 -19 -34 1 -17 16 38 35 72 16 22 -46 -35 -71 -10 -17 17 9 22 14 12 -62 -41 -49 10 -41 -2
10142 -2 42 48 48 26 0 9 -53 -26 -12 -6 50 20 26 14 2 2 -36 -74 -27 -23 -1 50 19 55 21 -25 21 -49 -8 6 14 16 41 -6 4
10177 4 -12 -14 -29 -27 -46 -27 -9 46 30 18 11 -80 -48 -69 19 -22 -3 25 55 62 -6 38 -55 -30 -48 -71 9 29 32 43 65 29 -24
10210 -24 -29 -29 -58 -16 -33 -1 25 11 42 43 7 -35 24 -35 -37 -30 4 48 33 58 -5 -55 -36 9 -50 -39 4 53 67 43 5 -11
10242 -11 -20 -38 -55 -41 55 37 39 41 24 -23 -40 -46 -48 -28 1 10 -7 1 72 1 -31 -23 -10 -43 -35 -11 -66 54 14 39 3 -22 -25 -66
10276 -66 -67 -37 -11 8 44 45 1 8 -43 -23 -50 -14 5 -10 48 8 -5 15 -11 -62 -31 -32 -44 -41 -35 36 81 52 2 -38 -49 -6 -37
10309 -37 1 -5 -28 51 28 15 3 -61 -64 -48 -1 -28 47 49 13 27 8 18 -9 -29 -9 3 5 13 -15 -1 29 16 -17 -20 -63 -51 9
10342 9 46 -5 49 17 -28 27 -34 -54 -38 5 31 12 19 4 12 -18 -14 -47 -15 -10 -17 -3 21 10 -8 24 -4 -51 20 -52 -21 -39 -22
10375 -22 17 -4 32 -14 -32 -27 -2 8 -20 10 31 41 0 -4 56 -28 13 -27 -13 -34 9 -14 51 20 -13 5 -46 -36 -51 29 -27
10406 -27 -15 47 -7 -18 -56 13 -35 -17 -51 -45 -46 32 17 -38 -13 -25 -26 -73 -20 -37 9 14 8 13 -5 18 -23 -52 -27 -35 -33 -56 24 40
10440 40 62 24 3 13 -88 -64 -48 22 70 -12 -11 29 -1 -41 -11 -49 -62 -8 -28 26 28 44 44 5 -17 -88 -1 -14 -14 42 6
10471 6 49 5 19 -9 29 -11 -69 -67 -15 45 -6 3 42 3 -68 -36 8 0 -14 30 73 37 37 28 -41 -65 -53 -59 -65 18 5 46 30 -2
10505 -2 5 -38 -35 -29 -14 -35 -9 11 29 48 32 -8 -77 -53 -44 -34 9 37 24 38 50 -35 4 -9 -15 -66 -43 41 1 13 11 60 -44
10538 -44 -70 19 -17 -21 4 48 56 -17 28 -4 -16 -27 -1 -28 -61 -38 8 96 10 57 15 -52 -37 -74 3 -51 49 27 31 35 -22
10569 -22 -34 -32 -15 -48 -14 -1 -11 22 44 18 -4 14 1 -24 24 -54 -43 44 11 51 -11 -18 -13 -23 -46 0 -21 -4 41 8 41
10600 41 -3 -5 -29 -57 -11 11 -3 18 31 -20 10 18 -13 -33 -25 -24 28 -16 27 63 33 -14 -21 -41 -46 -27 36 5 1 4 -11 -9 -25 3
10634 3 -42 -50 -76 15 5 64 51 -24 32 -22 -29 -4 -12 43 -66 -37 17 16 30 -1 7 -35 -25 -37 -39 -8 6 55 -24 -37 -15 -47 -42
10667 -42 -50 -28 -21 3 -19 53 67 1 -1 -27 0 -50 1 17 19 6 10 -7 33 -11 -39 -17 -68 4 -14 35 3 18 16 -40 -42 -15 6
$$ [...]
16383a2
##END NTUPLES=NMR FID
##END=
