##TITLE=31P_DE-80H_X3
 64 sc D2O
 26.2.2025
##JCAMPDX= 6.0         $$ Bruker NMR JCAMP-DX V2.0
##DATA TYPE= NMR FID
##DATA CLASS= NTUPLES
##ORIGIN= UXNMR, Bruker Analytische Messtechnik GmbH
##OWNER= root
$$ XWIN-NMR		Version 3.5
$$ Wed Jan 28 16:01:58 2026 Russian Standard Time (UT+4h)  Yarkov@DPX200
##.OBSERVE FREQUENCY= 81.013821
##.OBSERVE NUCLEUS= ^31P
##.DELAY= (6, 6)
##.ACQUISITION MODE= SIMULTANEOUS
##.ACQUISITION SCHEME= undefined
##.AVERAGES= 64
##.DIGITISER RES= 17
##SPECTROMETER/DATA SYSTEM= spect
##.PULSE SEQUENCE= zgpg30
##.SOLVENT NAME= CDCl3
##.SHIFT REFERENCE= (INTERNAL, CDCl3, 0, 243.863)
##AUDIT TRAIL= $$ (NUMBER, WHEN, WHO, WHERE, WHAT)
$$ ##TITLE= Audit trail, XWIN-NMR		Version 3.5
$$ ##JCAMPDX= 5.01
$$ ##ORIGIN= Bruker BioSpin GmbH
$$ ##OWNER= Yarkov
$$ C:/Bruker/XWIN-NMR/data/yarkov2/nmr/P31/2/audita.txt
$$ ##AUDIT TRAIL=  $$ (NUMBER, WHEN, WHO, WHERE, WHAT)
(   1,<2026-01-28 16:01:04.93 +0400>,<Yarkov>,<DPX200>,
      <created by zg, POWCHK disabled, PULCHK disabled
       configuration hash MD5:
       00 E9 B6 7A A2 85 ED C7 34 08 36 98 17 FE 4E 26
       data hash MD5: 32K
       1D 29 F3 44 0F 0D B9 0C 63 61 5E 8C 97 9B 63 FD>)
$$ ##END=
$$ 
$$ hash MD5
$$ 60 9E 2F EC 4A A5 19 30 0B B7 91 76 88 D8 06 6B
##$RELAX= 
##$RELAX= 
##$RELAX= 
##$RELAX= 
##$RELAX= 
##$RELAX= 
##$RELAX= 
##$RELAX= 
$$ Bruker specific parameters
$$ --------------------------
##$DU= <C:/Bruker/XWIN-NMR>
##$EXPNO= 2
##$NAME= <P31>
##$PROCNO= 1
##$TYPE= <nmr>
##$USER= <yarkov2>
##$AMP= (0..31)
100 100 100 100 100 100 100 100 100 100 100 100 100 100 100 100 100 100 
100 100 100 100 100 100 100 100 100 100 100 100 100 100 
##$AQSEQ= 0
##$AQ_mod= 1
##$AUNM= <au_zg>
##$AUTOPOS= <>
##$BF1= 81.014009
##$BF2= 200.13
##$BF3= 200.13
##$BF4= 200.13
##$BF5= 200.13
##$BF6= 200.13
##$BF7= 200.13
##$BF8= 200.13
##$BYTORDA= 1
##$CFDGTYP= 0
##$CFRGTYP= 5
##$CHEMSTR= <none>
##$CNST= (0..31)
1 1 145 1 1 1 1 1 1 1 1 1 1 1 1 1 1 1 1 1 1 1 1 1 1 1 1 1 1 1 1 1 
##$CPDPRG= <waltz16>
##$CPDPRG1= <>
##$CPDPRG2= <waltz16>
##$CPDPRG3= <>
##$CPDPRG4= <mlev>
##$CPDPRG5= <mlev>
##$CPDPRG6= <mlev>
##$CPDPRG7= <mlev>
##$CPDPRG8= <mlev>
##$CPDPRGB= <>
##$CPDPRGT= <>
##$D= (0..31)
0 1 0 0 0 0 0 0 0 0.06 0 0.03 2e-05 3e-06 0 0 0.0002 0 0 0 0 0 0 0 0 0 
0 0 0 0 0 0 
##$DATE= 1769601664
##$DBL= (0..7)
120 120 120 11 120 120 24 19 
##$DBP= (0..7)
150 150 150 150 150 150 150 150 
##$DBP07= 0
##$DBPNAM0= <>
##$DBPNAM1= <>
##$DBPNAM2= <>
##$DBPNAM3= <>
##$DBPNAM4= <>
##$DBPNAM5= <>
##$DBPNAM6= <>
##$DBPNAM7= <>
##$DBPOAL= (0..7)
0.5 0.5 0.5 0.5 0.5 0.5 0.5 0.5 
##$DBPOFFS= (0..7)
0 0 0 0 0 0 0 0 
##$DE= 6
##$DECBNUC= <off>
##$DECIM= 4
##$DECNUC= <off>
##$DECSTAT= 4
##$DIGMOD= 1
##$DIGTYP= 9
##$DL= (0..7)
0 0 52 120 120 21 21 25 
##$DP= (0..7)
150 150 150 150 150 150 150 150 
##$DP07= 0
##$DPNAME0= <>
##$DPNAME1= <>
##$DPNAME2= <>
##$DPNAME3= <>
##$DPNAME4= <>
##$DPNAME5= <>
##$DPNAME6= <>
##$DPNAME7= <>
##$DPOAL= (0..7)
0.5 0.5 0.5 0.5 0.5 0.5 0.5 0.5 
##$DPOFFS= (0..7)
0 0 0 0 0 0 0 0 
$$ [...]
##$SUBNAM1= <"">
##$SUBNAM2= <"">
##$SUBNAM3= <"">
##$SUBNAM4= <"">
##$SUBNAM5= <"">
##$SUBNAM6= <"">
##$SUBNAM7= <"">
##$SUBNAM8= <"">
##$SUBNAM9= <"">
##$SW= 400.765351723535
##$SWIBOX= (0..15)
0 1 3 0 0 0 0 0 0 0 0 0 0 0 0 0 
##$SW_h= 32467.5324675325
##$TD= 32768
##$TD0= 1
##$TE= 0
##$TE2= 300
##$TE3= 300
##$TEG= 300
##$TL= (0..7)
0 120 53 12 22 120 120 120 
##$TP= (0..7)
150 150 150 150 150 150 150 150 
##$TP07= 0
##$TPNAME0= <>
##$TPNAME1= <>
##$TPNAME2= <>
##$TPNAME3= <>
##$TPNAME4= <>
##$TPNAME5= <>
##$TPNAME6= <>
##$TPNAME7= <>
##$TPOAL= (0..7)
0.5 0.5 0.5 0.5 0.5 0.5 0.5 0.5 
##$TPOFFS= (0..7)
0 0 0 0 0 0 0 0 
##$TUNHIN= 0
##$TUNHOUT= 0
##$TUNXOUT= 0
##$USERA1= <user>
##$USERA2= <user>
##$USERA3= <user>
##$USERA4= <user>
##$USERA5= <user>
##$V9= 5
##$VALIST= <valist>
##$VCLIST= <CCCCCCCCCCCCCCC>
##$VD= 0
##$VDLIST= <DDDDDDDDDDDDDDD>
##$VPLIST= <PPPPPPPPPPPPPPP>
##$VTLIST= <TTTTTTTTTTTTTTT>
##$WBST= 1024
##$WBSW= 4
##$XGAIN= (0..3)
0 0 0 0 
##$XL= 0
##$YL= 0
##$YMAX_a= 1652
##$YMIN_a= -1566
##$ZGOPTNS= <>
##$ZL1= 120
##$ZL2= 120
##$ZL3= 120
##$ZL4= 120
##$ABSF1= 60
##$ABSF2= -190
##$ABSG= 5
##$ABSL= 3
##$ALPHA= 0
##$AQORDER= 0
##$ASSFAC= 0
##$ASSFACI= 0
##$ASSFACX= 0
##$ASSWID= 0
##$AUNMP= <proc_1d>
##$AZFE= 0.1
##$AZFW= 0.5
##$BCFW= 1
##$BC_mod= 2
##$BYTORDP= 1
##$COROFFS= 0
##$CY= 9.86611175537109
##$DATMOD= 1
##$DC= 1
##$DFILT= <>
##$DTYPP= 0
##$F1P= 182.462994727601
##$F2P= 168.069089081705
##$FCOR= 0.5
##$FTSIZE= 0
##$FT_mod= 0
##$GAMMA= 1
##$GB= 0
##$INTBC= 1
##$INTSCL= 1
##$ISEN= 30
##$LB= 1.5
##$LEV0= 0
##$LPBIN= 0
##$MAXI= 11.51145
##$MC2= 0
##$MEAN= 0
##$ME_mod= 0
##$MI= 1.244541
##$NCOEF= 0
##$NC_proc= 0
##$NLEV= 6
##$NOISF1= 0
##$NOISF2= 0
##$NSP= 1
##$NTH_PI= 0
##$NZP= 1
##$OFFSET= 243.8632
##$PC= 1.4
##$PHC0= 1694.973
##$PHC1= 24.15952
##$PH_mod= 0
##$PKNL= yes
##$PPARMOD= 0
##$PSCAL= 0
##$PSIGN= 0
##$REVERSE= no
##$SF= 81.0140731611343
##$SI= 65536
##$SIGF1= 0
##$SIGF2= 0
##$SINO= 80
##$SIOLD= 65536
##$SREGLST= <31P.CDCl3>
##$SSB= 0
##$STSI= 0
##$STSR= 0
##$SW_p= 25641.0256410257
##$SYMM= 0
##$S_DEV= 0
##$TDeff= 0
##$TDoff= 0
##$TI= <>
##$TILT= no
##$TM1= 0
##$TM2= 0
##$TOPLEV= 0
##$USERP1= <user>
##$USERP2= <user>
##$USERP3= <user>
##$USERP4= <user>
##$USERP5= <user>
##$WDW= 1
##$XDIM= 64
##$YMAX_p= 0
##$YMIN_p= 0
$$ End of Bruker specific parameters
$$ ---------------------------------
##NTUPLES= NMR FID
##VAR_NAME=  TIME,          FID/REAL,        FID/IMAG
##SYMBOL=    X,             R,               I
##VAR_TYPE=  INDEPENDENT,   DEPENDENT,       DEPENDENT
##VAR_FORM=  AFFN,          ASDF,            ASDF
##VAR_DIM=   16384,         16384,           16384
##UNITS=     SECONDS,       ARBITRARY UNITS, ARBITRARY UNITS
##FACTOR=    3.08e-05,      1,               1
##FIRST=     0,             0,               0
##LAST=      0.5045964,     0,               0
##MIN=       0,             -1566,           0
##MAX=       0.5045964,     1652,            0
$$ Real data points
##PAGE= N=1
##DATA TABLE= (X++(R..R)), XYDATA
0@%%%%%%%%%%%%%%%%%%%%%%%%%%%%%%%%%%%%%%%%%%%%%%%%%%%%%%Mj2J6k2L4m6
60b6N3n3O4q8J23k13p03J866j184p47n96j7L46P90Q59O90L87r2o08p54q01p02
82a406j36K18O80Q78P85N10o7m37q04q38o33k18K39N53Q08P42N10J49l71o66q84
103c88o61m90J72N54P68Q03N47J90k88o75p85p02m59k0M43O92Q17P11K88q6o66
124G65p83q26n64p3L99P42P64P50L21r4n19p74p32n29k66J75O84P45P75M56om02
146A008p68q02o28k70J56O12P72P49M75J02k87o87p89p42l48N2M88P67Q86O18
166A364J90k29p18q27p51m52M2L78P83P48O34K63o2n77p94p98o43m2L17P36Q12
187C74P04L94j21n39p44q21n30j67J82O57Q42O92M99M1m02p30q54o35l23J53N70
$$ plain form
0 0 0 0 0 0 0 0 0 0 0 0 0 0 0 0 0 0 0 0 0 0 0 0 0 0 0 0 0 0 0 0 0 0 0 0 0 0 0 0 0 0 0 0 0 0 0 0 0 0 0 0 0 0 0 0 4 -8 8 -14 20 -26
60 -26 27 -26 38 -50 73 -140 -843 1023 -161 -908 -1504 -1521 -1175 -385 474 1164 1551 1459 851 97 -704 -1406
82 -1406 -1542 -1324 -644 234 1019 1529 1462 1025 221 -617 -1250 -1468 -1229 -676 132 874 1384 1533 1162 496 -388
103 -388 -1049 -1539 -1367 -813 -45 758 1305 1495 1207 532 -253 -955 -1414 -1434 -991 -299 518 1229 1517 1431 765
124 765 -18 -844 -1408 -1481 -1082 -340 424 1174 1495 1401 882 108 -624 -1153 -1419 -1244 -560 185 960 1416 1410 1008
146 1008 240 -562 -1190 -1460 -1304 -692 80 829 1304 1406 1119 432 -357 -1099 -1447 -1395 -907 -140 746 1364
166 1364 1554 1325 607 -220 -971 -1423 -1381 -1003 -220 528 1162 1425 1363 786 -8 -806 -1449 -1491 -1174 -438 374
187 374 1078 1472 1351 812 68 -753 -1283 -1450 -1268 -611 231 923 1422 1463 1061 331 -523 -1158 -1481 -1328 -758
208g58Q63Q12M67J7l27o72p58p19l60J8M42Q09P36O83K27k31o31q22p60n13nM56
230a026P98P62O49K43j32n15p71p17o01j41L21O61Q32O97L46m2m53q09q83n21
250a302k35L11O41P88P03M19M9l84o89q14o40l05Q7N85P69Q21N92O9l30o71q26
271c62p42k99JN11P86P21O04K19k09o19p51p78m66j07L49P94Q65O80K34j72n71
292F88p76o94n12j60K83O38Q38O31M49m6m27p83p53o46k06K53O33Q16P20M59o5
313A340l80o53p58o32l59J38M84P48Q26N51J80l25p05q62o64l71P0M75P68P56
333F27N80K00k00n48q22p02n05j1L61O82Q76O68L17j53n84q37p17n03j34L22O01
354d82P97O43L89k4m21p44p54n87l37J98P33P42Q21M67j8l87p47p26o74k30N5
$$ plain form
208 -758 105 917 1384 1401 1074 402 -356 -1075 -1435 -1417 -975 -166 570 1253 1480 1249 618 -204 -964 -1477 -1482 -1026
230 -1026 -228 534 1183 1426 1294 779 8 -709 -1310 -1451 -1130 -469 363 1060 1406 1364 911 102 -781 -1302
250 -1302 -1537 -1226 -585 203 906 1325 1374 990 301 -513 -1153 -1458 -1371 -786 -17 804 1396 1465 1135 464 -362
271 -362 -1104 -1403 -1402 -891 -105 616 1220 1439 1230 611 -140 -918 -1384 -1491 -1142 -348 517 1197 1431 1259 688
292 688 -88 -782 -1294 -1454 -1171 -533 305 936 1385 1339 912 129 -624 -1270 -1476 -1223 -590 226 946 1405 1340
313 1340 960 307 -451 -1083 -1442 -1304 -820 -72 754 1305 1485 1160 455 -407 -1071 -1442 -1372 -897 -129 627
333 627 1207 1407 1207 659 -163 -865 -1370 -1381 -1020 -338 538 1206 1523 1370 786 -51 -768 -1271 -1405 -1083 -482
354 -482 315 958 1347 1323 902 158 -596 -1183 -1520 -1322 -589 153 974 1441 1423 1036 289 -437 -1111 -1341 -1286
375a286M86Q07P25N81J86k83o79q06p48m41J7N08P93Q04N60J48j96n57p67p33
395h81m71l7L42O67P90O74L59j15m95q20p60n65j11K94P01Q09O71L92j06m01p09
416B28p57o06k55J47N52Q11P60N49L9l79p96p52o87l20J35N58P21P71N46J65k76
437A154o15p72o89m37m8M76P46Q04O47K15k26o03p86p03l66j53L41O75P55O39
457A054K42k6n09o70q07n62k02L02O52P73P13M09Lm76p06p49n91j85J33N92P06
478I6P42N54M1k72p43q25o46l63Q1N36P92P14N32J55k48o54p40o78m04m1M02P12
500b57P43O73L16k16n92p71p65m49r3L67P10P94N87L29j43l87p13p23o14j99K01
521a202O57Q08P31M36o4l80p93q35n59k95K57N51P39P32N08J12l21o63p85o75
$$ plain form
375 -1286 -800 7 732 1313 1499 1216 537 -269 -1017 -1458 -1441 -933 -140 664 1224 1372 1176 619 -148 -881
395 -881 -1352 -1389 -1047 -380 410 1084 1443 1328 833 13 -747 -1312 -1423 -1129 -428 381 1052 1444 1338 937 228
416 228 -529 -1135 -1390 -1243 -691 120 880 1429 1468 1089 293 -459 -1146 -1466 -1331 -773 -52 719 1265 1430 1154
437 1154 539 -233 -922 -1359 -1407 -931 -185 619 1266 1481 1255 652 -134 -837 -1203 -1356 -1015 -340 415 1054
457 1054 1296 1270 761 91 -716 -1278 -1480 -1178 -526 247 960 1369 1372 896 190 -559 -1150 -1335 -1202 -610 96
478 96 838 1392 1433 1161 418 -407 -1053 -1416 -1335 -799 -7 707 1239 1394 1146 492 -248 -926 -1330 -1371 -969 -257
500 -257 486 1159 1475 1259 667 -104 -869 -1318 -1411 -1044 -334 460 1047 1376 1233 846 133 -590 -1204 -1403 -1202
521 -1202 -545 263 994 1430 1366 986 193 -642 -1201 -1496 -1239 -688 51 783 1291 1403 1082 419 -366 -1041
541a041m04R4M84P93Q31N24K24l72o62o87p28l29j3L62P20P07O47K55j21n50p66
562c2q40n09q8L70P39P47O84L09q0n30p40p05n38j96K15O08Q09P04M84L2l97q12
584B34p43o66k77K02O46P32P32M75Q2m10n93p62o33m42L7M87P42Q40N80J56k36
605A183o59p37p74l89MM77P24O57O34K33p2n34p32o99n66j86L02O75Q43P01M15
626A500j59n07p33p77n35j59K52N82O94P01M85K7l88o56q71o67k86J91N86P99
646G9P30M91J13m02o13p24o47l79O8M74O51Q40N37K02j86o43p64p71m70%M11Q09
668a94O51O92K09j54n33p71o54m90j41K20P05P70P45L37j3m85p77q02n77j32K27
689a167O48P51P17M38Kl85p01p83o51l12J01N24Q34P49N16J42l22p14p74p38k30
$$ plain form
541 -1041 -1445 -1351 -867 -74 757 1281 1505 1133 471 -216 -944 -1273 -1286 -924 -204 503 1150 1405 1284 734 -32
562 -32 -872 -1381 -1469 -1099 -360 387 1071 1380 1300 770 30 -675 -1213 -1409 -1194 -586 223 927 1411 1443 1046 234
584 234 -509 -1175 -1452 -1250 -604 128 860 1335 1417 1007 414 -348 -981 -1423 -1386 -899 -157 683 1263 1419 1183
605 1183 524 -213 -987 -1376 -1372 -895 -171 486 1120 1353 1281 747 15 -684 -1250 -1436 -1134 -459 384 1085 1500
626 1500 1341 834 101 -676 -1211 -1370 -1118 -536 158 859 1344 1371 983 327 -544 -1211 -1497 -1306 -720 79
646 79 809 1300 1413 1011 398 -326 -973 -1352 -1284 -810 -159 681 1218 1420 1234 591 -173 -944 -1414 -1414 -1003 -194
668 -194 457 1149 1358 1204 671 -100 -754 -1244 -1385 -1165 -460 310 1055 1392 1379 894 117 -685 -1262 -1394 -1167
689 -1167 -519 232 949 1387 1389 1004 303 -480 -1131 -1443 -1342 -818 16 765 1281 1423 1101 387 -387 -1125 -1355
710a355K7N13O55P32O16J79j55n38q43p32m82m4M39P30Q49N96K85j72o02p80o74
731g56m86j35L10O26P42O91M05m6m76p68p52o36k52K27O83Q13P05M23O6l84p01
752B99p35o55l01J23N14P50P92N24J04k55o24q44o82l45J0N12P39O96N05K62k41
773A148n45p56p77l39j06L00P33Q01O47L60j38n65p58p88m62j57L58O30P57P10
793A053L31l8m11o79q05o39j85J40N91Q47P41M05M7m32p22p26o13k89P4N94O57
814e9P22O45Q6k35o72p05p42m32O3M40P58Q29N19J99k83n38p00o92m97o2L51O35
836c70Q09O21L41q8n23p95p41n23j64K82P15P58O15L81l5m43o61p34n94j90J34
857a205M88Q38P19M90J24l80o93p58o78k72J45M70P51O75N37J20k81o09p06p27
$$ plain form
710 -1355 -1328 -815 -160 572 1188 1367 1212 674 -169 -901 -1383 -1427 -988 -258 591 1187 1472 1300 698 -82 -756
731 -756 -1242 -1377 -1067 -441 301 992 1397 1351 875 107 -645 -1281 -1533 -1306 -623 190 895 1318 1384 1000 299
752 299 -436 -1091 -1392 -1269 -755 -5 787 1311 1415 1160 536 -308 -990 -1335 -1325 -813 -74 622 1127 1389 1148
773 1148 603 -153 -930 -1269 -1375 -1075 -342 459 1106 1466 1328 763 5 -783 -1245 -1402 -1044 -414 343 1053
793 1053 1384 1346 935 256 -549 -1188 -1373 -1233 -642 205 946 1351 1398 966 244 -482 -1095 -1384 -1310 -716 -59
814 -59 663 1308 1394 1159 487 -218 -960 -1392 -1329 -889 -131 698 1217 1416 1133 595 -105 -797 -1294 -1356 -1005 -370
836 -370 439 1060 1401 1313 790 -5 -746 -1269 -1433 -1151 -436 322 937 1318 1283 840 179 -555 -1149 -1339 -1205
857 -1205 -717 121 840 1330 1454 1074 381 -377 -1055 -1327 -1182 -712 39 714 1251 1371 1090 481 -225 -952
877i52m64L1M52O89P82O76K53k42o33p51o95m29q7L60O54P90N69L40q4m83o93
898H3p58n71j99L17O56P38P00L88q9l92p06p13n66k45J49N17P38O88M59J69l37
919A026o90p69o30l40J10N10P55P18N65Q9k27o27o88o42m43L1L73O29P46O25L06
940A427j64o31p12p40m80l5L27O51P32O17K98n1n00o31p66n31k23K10O55P89P15
961I57L96m4l81p39p52n53k57K04N82O76O92M76M4k85o19p61o85l54O6N67O94
982g6P65M52J70k62o32p43o16l42p9M60O53P17N72K64q2n42p30p33m70n1K74P00
1004c31P16O34L14n5n33p05o64n08j95K31N45P03O72M62j8m00o59p45n89k52J57
1025a220N30Q12O27M73R0l76n49p43n91l42O4L91P20P74N31K13k47o70p19o63
$$ plain form
877 -952 -1416 -1385 -933 -244 538 1214 1467 1225 592 -159 -854 -1283 -1370 -1010 -356 434 1003 1343 1259 776 83
898 83 -675 -1246 -1445 -1128 -472 266 966 1354 1265 873 167 -546 -1112 -1357 -1208 -691 47 735 1194 1363 1026
919 1026 336 -433 -1063 -1403 -1293 -783 -28 690 1255 1344 1117 490 -198 -840 -1283 -1252 -879 -250 496 1121 1427
940 1427 1263 632 -80 -820 -1300 -1335 -1008 -357 375 992 1290 1239 739 108 -658 -1189 -1412 -1202 -547 242 957
961 957 1353 1309 928 189 -563 -1116 -1373 -1169 -587 89 781 1257 1301 1016 397 -364 -1049 -1403 -1337 -770 -76
982 -76 689 1141 1311 1049 417 -326 -942 -1284 -1363 -903 -250 467 1039 1303 1221 679 -51 -784 -1254 -1305 -1031 -331
1004 -331 385 1019 1333 1278 745 40 -624 -1132 -1327 -1096 -551 152 824 1286 1268 868 209 -536 -1125 -1377 -1220
1025 -1220 -690 122 749 1222 1312 936 387 -356 -947 -1289 -1225 -834 -114 660 1191 1404 1157 487 -232 -895
1045h95m13j0M49O49O88N61K61j60m99o96o78n19j28L27O40P36O67L40n3m72p41
1066E4p00n39r8K03N32P19O71M13M0l53o39p94n79l28J90N23P43P19M42J07l51
1087I75o72o80n84l29L1M67O08P56N34K40k12o00p22o84m18j3L91P07O96N95K98
1108A384k74m40o79o98n39l8K60O07P40O18L95o6m94o72p56n39j55K40N59P40
1128A93O02L81N3l81n57p06o05l32J30N36P10P34M88J23k72o85p13o57k93M8M48
1149g55O27P51M79J93j87n30p51o55l99j13L95O36P37N76L12j73m57p43o12m89
1169a158j36L86N16O81O37L78K3m49p26p10n39k22K25N73P61O34L61N0l87o28
1189B70p04n75k87R4M80O34P86M96J42k70o23p35o60l36O1M58O59P03N12K00j61
$$ plain form
1045 -895 -1308 -1318 -869 -220 468 1029 1290 1130 631 -65 -743 -1262 -1390 -1063 -423 313 980 1320 1267 795 54
1066 54 -646 -1185 -1283 -1080 -548 171 842 1255 1295 942 303 -491 -1070 -1398 -1208 -685 58 777 1219 1326 975
1087 975 303 -377 -961 -1290 -1259 -792 -184 572 1106 1346 1134 534 -188 -872 -1290 -1303 -912 -205 491 1086 1384
1108 1384 1110 670 -9 -707 -1246 -1284 -1024 -417 323 941 1336 1270 776 104 -652 -1191 -1346 -1106 -547 193
1128 193 795 1176 1229 848 291 -415 -1020 -1352 -1222 -686 24 758 1246 1369 1097 412 -301 -958 -1251 -1203 -755
1149 -755 -128 623 1102 1295 1108 578 -173 -828 -1227 -1340 -945 -309 428 1004 1316 1143 686 -57 -669 -1158
1169 -1158 -1294 -908 -392 289 926 1304 1327 878 152 -558 -1097 -1319 -1094 -521 240 874 1235 1285 898 270
1189 270 -434 -1009 -1296 -1202 -722 -88 698 1194 1336 1066 443 -292 -952 -1288 -1227 -769 -110 593 1105 1305 1144
1210A144n31o80p26m16n4L63O14P61N61L30j39n26p45o72m53j34K40O31O95O43
1230I06L50rl92o49p04o15j97J32O11P02P05M53L8l44p07p07n62k44J33M35P02
1251C7O14N20J52k05o14p62o70l56K0M24O54P65M85K49k01n61p28o46m27k0L42
1272i28O12P52N38L62q6n06o73p55n31j36L57N78P17O72K87l5m03p00o26n44k35
1293a283J28N17P06P26M66K5l35o88o90n98k74J36M66O93O64M81J31k11o01p25
1313b66n93l55n4M35O92P26N60K53k19o50o85o47m51m9L96N88O64N90L06l6m71
1334G34o55p11n04j75K06O18O85P06L80o6m58n93o74n63k12J68N34P03N68M91
1354A182J22k88o60p66n79l50Q7N01P24O76M99J16k95n51o91o02l89K5L60N94
$$ plain form
1210 1144 613 -67 -793 -1209 -1263 -900 -286 475 1036 1366 1227 701 -44 -716 -1169 -1303 -1063 -432 263 906
1230 906 1256 1247 855 206 -498 -1113 -1310 -1178 -567 135 840 1293 1331 987 280 -427 -989 -1233 -1100 -665 37
1251 37 651 1171 1323 1118 504 -258 -928 -1284 -1264 -840 -186 579 1064 1313 1112 551 -177 -823 -1250 -1270 -928
1272 -928 -316 436 974 1336 1250 744 71 -684 -1215 -1351 -994 -416 301 973 1260 1225 822 122 -504 -1048 -1283
1293 -1283 -1155 -638 68 794 1260 1285 950 262 -428 -1026 -1300 -1164 -698 -5 659 1140 1271 1060 459 -266
1313 -266 -859 -1214 -1268 -833 -141 585 1145 1398 1179 529 -156 -803 -1254 -1303 -907 -319 345 935 1241 1205 734
1334 734 79 -632 -1136 -1311 -1105 -487 198 904 1284 1218 760 167 -507 -1070 -1282 -1114 -580 123 691 1182
1354 1182 1304 1016 356 -410 -989 -1339 -1252 -751 -27 649 1148 1264 969 418 -273 -875 -1264 -1239 -879 -285
1374b85P63O10K21j23n27p55o85m43o4L46O06P25N87K58rm53o77o73n65j54K12
1395a085N61P32P03L19Km44o60o87n95j64J86N45O30P15M33K5k67n29p52o39l23
1416a294L7M49P49P36N17J47k74o11o47o44l65k8L77O32O83N46K12m7n44o62p45
1437g76m24j64L01P46O84O34K76p7m49p26o21n35r4J85N58P27N81M32K4l49p01
1458B32p86m88k60J85N04P18O65M21M5l37n66p07n94k83PM09O73P44N72J60k26
1479A088o03p08o64l49l0L99O58P07N07K26p9m98o28p34m57j34K90O30P04O21
1499I46L09p4m25p32o65m87j87K54N25P07N82M62K6l45o36p08n64l01J54N01P39
1520H1P04L62J34k94n91o70n92k67L7L70O09O41N96J68j43o00o97p55l36j9L64
$$ plain form
1374 -285 478 1088 1309 1186 659 -96 -781 -1224 -1288 -942 -336 389 976 1234 1225 772 95 -578 -1143 -1297 -1085
1395 -1085 -524 208 911 1230 1232 788 128 -559 -1154 -1318 -1132 -587 43 758 1191 1216 949 420 -332 -971 -1294
1416 -1294 -1257 -808 -59 677 1194 1341 1067 456 -191 -835 -1200 -1228 -851 -219 464 1010 1222 1175 631 -31 -776
1437 -776 -1200 -1364 -1063 -317 367 1001 1277 1200 751 25 -596 -1131 -1225 -1040 -482 245 826 1258 1282 933 232
1458 232 -554 -1042 -1302 -1117 -613 105 770 1191 1236 899 333 -374 -968 -1251 -1244 -835 -162 582 1154 1314 1088
1479 1088 485 -223 -887 -1236 -1266 -867 -209 498 1005 1231 1152 654 26 -708 -1165 -1299 -1009 -379 325 946
1499 946 1255 1181 756 24 -641 -1128 -1315 -1061 -536 171 753 1215 1241 896 260 -448 -1012 -1313 -1159 -658 81
1520 81 785 1147 1281 987 396 -274 -866 -1133 -1096 -726 -117 524 1120 1288 1145 545 -152 -907 -1243 -1262 -898
1541h98P21N77O58K31j57n19o07o38n22o3K23O02O87O05L79Jm63o63p19n09j48
1562a222J56N64O96N99L66L0l47n51o93n69k98J02M29O87P79M26J45k97o11p16
1582c25n88k85K7M13O67O57N34J32j86m62o74o40m41r7L23O66P50N54K54j40m60
1603F79p36o13m08j17J98N25P47O15K88Ml23p01p55m91j39J94N34O94O53L02N7
1624A207l21o22o35n20k36N5M23N99P10N08Q4k52n61p12o79k84K2M17P00O49N13
1645A065J08j75m40o70o64l75p8L48N87O62N95L15r0m98p05o36m62o7K46N40O64
1666B70O04K96kl46o41p20n23k16J56N49O57O99L90N9m14n84o73n26k40J02M61
1687f42N82O41M74J51j92n60p05n84l74O0L57O81O73M94J99j85n02o67o18l89
$$ plain form
1541 -898 -177 400 1058 1289 1132 613 6 -632 -1154 -1217 -994 -392 295 900 1279 1280 817 154 -565 -1074 -1222
1562 -1222 -1066 -502 194 793 1159 1189 842 291 -402 -971 -1269 -1167 -738 -51 728 1154 1299 1002 391 -325
1582 -325 -913 -1198 -1171 -758 -91 566 1100 1232 1046 584 -90 -730 -1171 -1268 -945 -279 471 1025 1279 1139 679
1603 679 -57 -670 -1078 -1195 -997 -472 275 890 1178 1182 859 158 -597 -1088 -1227 -1033 -499 195 848 1150 1207
1624 1207 886 264 -371 -891 -1127 -1072 -649 -50 660 1168 1252 1000 439 -273 -952 -1236 -1214 -797 -97 552 1065
1645 1065 1173 998 558 -112 -776 -1151 -1229 -881 -294 368 963 1278 1188 690 -15 -651 -1113 -1180 -934 -394 270
1666 270 874 1170 1168 822 181 -539 -1062 -1278 -1122 -573 84 783 1173 1232 818 234 -439 -965 -1205 -1103 -642
1687 -642 -60 581 1055 1206 1014 454 -251 -835 -1209 -1149 -792 -111 562 1056 1255 1070 568 -99 -717 -1106
1707a106r5K80N90O33N79L42n9n35o05o77n19j24L12N82O48O00L16o8l41o13o57
1728e17m84j93J26N00O54O10M51O6l00o35o82n99k65J94L83O75O21M26P6j85n34
1749C88o52n50m00M8L09O60O48N49K61k41m80o58o30l17m1K63N70O44N24L00l8
1770A157m86n55o87n14j27K13N28P22N81L04%m36n80o55m80k03K01M20O40O13
1790F56L79J28k56o01o35o43l05J52M62O40O69L97J74k39m95o93n72l04m6L43
1810g89N50O98N03K04j22m66o62o31m23j11L30O29N59N88K69l0m27n91o29m77
1830a028j41J61N45O43O57L95k8l92o21o69n02j60J23N27N83N95L83J16k76n35
1850C76p10n69l09K3M17O83O51N06J82k74n25o62n71l35l5L83N85O46M79K52o3
$$ plain form
1707 -1106 -1201 -921 -331 302 881 1223 1164 629 24 -653 -1172 -1296 -984 -402 246 846 1162 1094 753 140 -517
1728 -517 -1001 -1194 -1068 -568 86 696 1147 1213 913 278 -404 -1003 -1268 -1074 -691 -16 605 1031 1107 922 388
1749 388 -264 -814 -1214 -1166 -857 -197 451 1000 1261 1020 540 -118 -748 -1065 -1106 -843 -273 371 895 1195 1157
1770 1157 671 116 -571 -1085 -1212 -999 -471 251 832 1136 1136 700 120 -535 -1015 -1218 -1017 -597 43 656
1790 656 1035 1163 907 306 -329 -972 -1277 -1125 -663 -23 646 1043 1217 978 483 -210 -782 -1086 -1132 -789
1810 -789 -239 459 962 1166 1044 578 -84 -715 -1138 -1249 -919 -290 269 857 1126 1096 669 78 -551 -1028
1830 -1028 -1169 -1008 -463 180 837 1232 1204 812 191 -478 -980 -1140 -1017 -490 93 688 1071 1187 911 376
1850 376 -334 -903 -1212 -1189 -772 -89 562 1068 1250 976 451 -211 -782 -1117 -1152 -769 -184 462 941 1193 1130
1871A130n22o08o39n10m0K92N63P02N52K99j28m31n94o19m58j52J88M84O20O24
1891G53M13Pl47n98o82n41k47K03N02O31O10L89O1k06n90n77n84k85kL00P06O70
1913E86M74J53j78n41o80n93l74jL94N73O68N28J55j25m60n53o60m20j60K76N76
1934c62O87N59L35j09l82o28o54m41j89K42N14O37N40L44P8k71o20p01n55k30
1954a206J18M44O76O74L69J07l50n65n58n80k96J9M60N56O37N00K23j72n50o02
1974i6o45m27K8L10O39O64N08K16j28m33o83n24m79p0J91N35N98O51L33jm28o49
1996A10o53m94j25J84N12O61N60L85J0l35n28o82m78k76K3N00O99O11M47J11k53
2017I89o19p14n37k32m5M77N61O56M82J05j17m98o23o68l80k6L39O14O51N36K35
$$ plain form
1871 1130 608 0 -639 -1149 -1189 -897 -334 368 920 1219 1091 660 66 -553 -1011 -1163 -975 -491 129 753
1891 753 1166 1173 826 228 -454 -995 -1242 -1039 -537 94 704 1093 1154 948 358 -219 -803 -1088 -1090 -790 -84 586
1913 586 1060 1213 1035 494 -186 -779 -1153 -1154 -760 -187 481 1009 1164 1039 579 26 -634 -1054 -1214 -938 -362
1934 -362 325 884 1219 1110 728 100 -554 -995 -1184 -942 -428 209 749 1093 1171 900 280 -421 -976 -1206
1954 -1206 -1088 -644 32 706 1075 1182 832 267 -291 -871 -1167 -1148 -688 -132 505 1005 1228 1056 506 -96
1974 -96 -741 -1168 -1140 -830 -191 473 981 1197 1069 636 -47 -571 -1050 -1120 -929 -394 204 855 1188 1187 759 110
1996 110 -543 -1037 -1162 -978 -466 195 755 1140 1150 815 287 -395 -873 -1149 -1126 -626 73 684 1131 1242 989
2017 989 370 -344 -881 -1113 -1158 -681 -120 536 1018 1123 1006 508 -115 -783 -1163 -1189 -850 -236 415 951 1186
2038A186p9m98o31o16l91j00K43N24O36N69L51Qm12n98p00m86k05J91M88O66O10
2059G56L32N0l35n85o40n10k26Q2M48N68O78M85J02k23n37o55o65k88J7L79O79
2080h8O06M60J76j73m51o18n97l87p2K39N81O74N87K73j27m33p09o26m24j10K75
2101i44N47O63M98L58om09n24o50m72k61J85M71O37O59M37Jk98o42o47n39j71
2122a107L2M56O09O05L46J69j96m81o20o79l13j4L48O34O85N16J71j89m67o13
2142a08o27l45n1K76N47O42N75K31m2m34o36o54m30j70K90N09O64N70L04l3l69
2163G09n26o90m63k42J12M54O93O04M14J13k77o11o67n43k98J22M16O75N74M28
2183I97J88k66n18n32n80l84o9M16N79O38N09K08j92m71o68n74m09m1K97N73O09
$$ plain form
2038 1186 1107 609 -22 -638 -1029 -1129 -886 -362 274 843 1194 1202 790 192 -508 -994 -1199 -1008 -520 146 756
2059 756 1088 1138 803 218 -422 -932 -1158 -1076 -628 -60 618 1103 1205 982 445 -210 -875 -1163 -1146 -767 -88
2080 -88 518 978 1154 981 530 -88 -685 -1072 -1144 -905 -324 350 937 1210 1083 650 -59 -685 -1109 -1219 -944
2101 -944 -397 266 764 1122 1116 707 183 -467 -939 -1200 -1015 -544 93 752 1189 1190 892 250 -397 -936 -1107
2122 -1107 -1075 -619 -10 595 941 1110 914 433 -187 -866 -1179 -1193 -845 -211 474 990 1161 972 505 -108
2142 -108 -735 -1080 -1131 -855 -308 334 909 1140 1098 664 28 -626 -1056 -1226 -936 -427 237 807 1111 1078 709
2163 709 183 -507 -970 -1212 -1100 -646 47 651 1065 1178 901 290 -377 -920 -1218 -1096 -680 -5 569 997
2183 997 1185 919 401 -131 -711 -1095 -1164 -748 -169 469 978 1186 994 523 -145 -719 -1128 -1169 -872 -299 310
2204C10N18K70m2m19n37o90m42j60J85N60O26O49L45n9l74n91n92n34j78J99M02
2225e54O23N76M14M9k33n80o30n79l06Q4M40O38O18M29J51k77m98n64n99l10J8
2246a090K89O04O35M53K46p3m82o52o00m04r1L28N69O29M95K54o1m29n45o40m32
2267i97j62J95N07O08N86L66K4l48o50o15m79k28K27M31O00O01L39O7j63n73n71
2288b35n37l43O9L72O20O11M63J50k57m85o08n25l88L2L12N57N63M53L03q1m99
2309E47n59o38m03o7K42N67O35N57K53o9m09n72o27l67k05K15N01N85N94K81N8
2330A119k85n86o67n02k34J31M80O39N10L57J76k93n45o22m12l44M7L58M96P43
2350E66L82K36k20m54o59n61l27J0L15N67O00M09K03k3m09o42n63m23j22K00N63
$$ plain form
2204 310 828 1098 1056 637 100 -590 -1032 -1192 -1007 -447 179 828 1173 1114 740 149 -443 -977 -1155 -956 -554
2225 -554 69 645 1059 1108 875 295 -335 -914 -1220 -1136 -696 -58 560 989 1140 863 365 -199 -798 -1108 -1090
2246 -1090 -801 -197 438 891 1137 1064 582 -70 -670 -1074 -1165 -837 -268 361 856 1110 1049 620 75 -565 -997
2267 -997 -1159 -964 -457 151 737 1103 1127 779 129 -486 -965 -1193 -966 -535 65 666 1005 1072 909 336 -235
2288 -235 -772 -1115 -1046 -674 -54 557 1020 1170 913 428 -180 -705 -1093 -1061 -749 -192 371 824 1127 1046 547
2309 547 -12 -650 -1053 -1120 -878 -311 324 881 1134 1065 656 84 -543 -910 -1115 -900 -399 186 780 1061 1119
2330 1119 834 248 -419 -921 -1155 -1024 -544 95 605 962 1138 845 300 -322 -734 -1078 -1031 -673 -177 566
2350 566 948 1184 964 510 -149 -710 -1037 -1027 -712 -145 455 864 1067 1044 635 -7 -570 -993 -1115 -915 -352
2371c52O29N43K81m1m40n75n78m55j29K11M67O12M89L50P1k99n05o54m71k59J32
2392i73L84O56O02M01P2k67n59n97n14k70lM29N14O07M56J82j62m81o61n41l58
2413a083o7L88N93N67M68K95j66m33o15n23l97n9K15M56O39N05L10Kl87n99o15
2434e06m49j54K07M42O16N33L39J7l07m92o04n40k16N5L95O61O31L90J24k37n57
2455C48o58m92l28J06L61N63O01M15J81j54l91o60n48m07l5K91N77N73N79K05
2475A127j16m94n37o02l98n4K05N03N56N25L04K5l50n86o24m53j65K11M66O48
2495A91N80K68N7l38n19o32m26j93K1M58N34N60M13J65k50n31o16n68k91M7L65
2516g05N66O36M41J39j50m97n43n27l91k5K47N59N74N43K56o9m54n80o05l86q6
$$ plain form
2371 -352 277 820 1101 1060 620 45 -533 -988 -1117 -906 -439 173 662 1012 1083 784 279 -375 -846 -1105 -973
2392 -973 -589 67 669 1070 1142 875 316 -281 -795 -1065 -1068 -639 -125 482 938 1120 958 477 -184 -725 -1083
2413 -1083 -1150 -762 -169 398 866 1161 995 562 -53 -576 -973 -1032 -817 -361 278 783 1093 1095 708 109 -506
2434 -506 -955 -1109 -902 -460 156 689 1028 1045 738 246 -358 -898 -1114 -1059 -664 -3 628 1018 1142 905 348
2455 348 -310 -802 -1130 -1024 -663 -100 501 916 1097 943 552 -108 -656 -1063 -1098 -807 -230 343 922 1127
2475 1127 1011 517 -20 -622 -1020 -1074 -869 -366 190 715 1019 1044 694 108 -516 -969 -1134 -923 -457 191
2495 191 771 1039 1096 758 239 -393 -819 -1012 -991 -533 1 561 974 1139 889 358 -258 -826 -1117 -1070 -705
2516 -705 -139 497 938 1077 927 430 -113 -640 -1031 -1056 -809 -250 324 867 1123 1054 600 20 -585 -971 -1057
2537a057K49M10O40M99K50j6k92n79n62m59k20J13M86O28N90L61M8l17n69n39
2557c36n70j74J13L93N29N25M61J39k12m41o33n36l32m4L83O10N92M69J76j02
2577A010n05n95n77l48n2K58N02N93N20K56m4m07n58o37m55j42K98N37N60N54
2597G68L23m5l81n45n59m57k18J70M36N89N59L72J02k22o53n84m86l00R4M68N66
2618cN25M01J10j92m15o04n64l76NL73N37O10M99K13j48l96o82n28l68k6K78M81
2640b70N71M97K77jl94n52o59m10j54J93M96O18N18L38Ol52n62n65n16j29J00
2661i50M54N67N02M29J18k33n73n72n52k25J3M06O02O43L43J56k34m93n76m97
2681f72l75jL02N67N66N19J53j02l92o19o09l86l1K62N28O11M92K17Qm26m81o12
$$ plain form
2537 -1057 -808 -398 242 741 991 975 683 104 -458 -917 -1137 -1024 -538 90 680 1041 1089 772 203 -336
2557 -336 -906 -1080 -967 -574 -45 480 941 1080 868 427 -206 -742 -1074 -1118 -735 -125 467 936 1112 1010
2577 1010 505 -90 -667 -1015 -1067 -809 -307 286 806 1062 1018 611 53 -584 -1039 -1181 -883 -346 214 768
2597 768 1091 1046 665 120 -439 -896 -1114 -944 -508 81 640 1012 1114 892 239 -345 -831 -1131 -1037 -569 -3
2618 -3 522 923 1033 841 426 -178 -742 -1118 -1113 -740 -203 407 906 1119 971 575 -107 -635 -1003 -1029 -751 -270
2640 -270 301 798 1075 1074 680 128 -531 -941 -1095 -902 -406 212 730 1068 1074 722 160 -405 -921 -1050 -950
2661 -950 -496 71 573 1002 1120 887 314 -258 -810 -1035 -1022 -616 -14 629 972 1128 894 401 -175 -672
2681 -672 -1047 -1048 -746 -179 387 906 1059 957 565 -54 -663 -1049 -1080 -818 -290 321 813 1030 1038 612 131 -481
2703d81m39j49J74N11N38O47L24Ql51o34n52n05j68J36M42N89M81M30N8k54n24
2724B81n99m66l28J22L26O05N75M55J93k34m84o18n12l09j3L01N33O13M53K35
2744A129j31l97n71o65l39j04K30N19O32N11K84r5l85n90n18m52j47J67N11N36
2764A25N39L52R5l39n36o23m40k75J36M32O42N52L77J0k38m45n88m90l07j3L80
2785f54N44N85M77J85j98m80o37n88k51nL41N21N34M79K13r2m47n43n43m11j04
2806a074K15N28N92N78L23j41l23o46n48m65p2J48M43O14M95L29k3k02n29o28
2826c86m76k57P7M06O10O09M19O9k73n36n25m73k84M3L44M97N63M62J70j13m62
2847D84o09n60l24q3L41N64N42M66K12q3m11n39n58m35o5J38N43N85N02L26m2
$$ plain form
2703 -481 -920 -1069 -895 -384 154 801 1125 1133 782 148 -404 -909 -1077 -941 -499 90 571 1001 1059 805 281
2724 281 -318 -784 -1112 -990 -664 -59 516 971 1164 930 446 -172 -684 -993 -1006 -705 -172 441 894 1129
2744 1129 998 601 30 -635 -974 -1078 -848 -329 303 814 1098 1003 618 28 -490 -942 -1089 -922 -411 125
2764 125 664 1016 1111 772 236 -387 -827 -1102 -966 -534 108 660 1037 1047 809 364 -224 -714 -1021 -1034 -654
2785 -654 -110 475 952 1137 939 459 -178 -766 -1017 -1022 -681 -160 374 853 1066 974 527 -16 -559 -970 -1074
2806 -1074 -859 -331 261 839 1162 1021 698 52 -496 -961 -1033 -885 -442 172 667 996 973 771 242 -386
2826 -386 -862 -1119 -1042 -636 -26 583 1002 1071 798 262 -263 -736 -1020 -977 -633 -136 427 889 1059 946 484
2847 484 -125 -685 -1009 -1092 -751 -187 355 821 1033 950 539 0 -558 -993 -1058 -920 -377 208 710 1036 994
2868I94l06o21o37m10j82K87M69N48N16L27O7k82n26n93m39k73R2L59N69N85M18
2889I62J46k54n42n57n08k45m7L86N73N41M11J23j25m09n68n36l85k9K93N30O01
2910C61M97K12j04l78o26n26m17j6J63M68O24M38K97j0l45n61n43m21k25J75M42
2931d95O03N32L46M0l42m80n48m61k60Q5L75N65N62L89J62j63n39o04n26k77P
2952a029M26N51N23M27J30j42m04n90n28l60m6K63M72O25M00L15p4l58o33n39
2972e71m36n3K73M83N60M13L35k8k46n68n70m82j94J14M87N82N62L72J0k83m86
2993B74o36m63k06N7M14M52O17M00R6j85m34n50n89k57jK99N76N52M52J80j14
3014I34m50n69n54k52j49L10M92N52M32L02n2l77n66n75l74j37K07M68N71N14
$$ plain form
2868 994 688 67 -570 -980 -1162 -875 -406 142 658 985 1052 770 244 -349 -788 -1061 -969 -610 -41 544 962
2889 962 1108 854 312 -245 -753 -998 -1045 -659 -86 455 866 989 864 455 -113 -649 -1034 -1063 -770 -240 361
2910 361 858 1070 966 588 -38 -564 -981 -997 -834 -366 258 696 993 983 638 77 -466 -887 -1112 -937 -495
2931 -495 108 640 986 1026 684 204 -344 -805 -1065 -980 -605 -40 522 911 1073 910 371 -233 -759 -1036 -1029
2952 -1029 -603 -52 471 898 1028 886 482 -108 -636 -996 -1042 -779 -307 318 718 1033 959 601 -32 -571
2972 -571 -1007 -1060 -787 -304 256 669 1004 976 730 162 -408 -890 -1084 -970 -483 99 661 1033 1043 760 274
2993 274 -362 -825 -1031 -974 -560 -108 509 909 1005 820 386 -164 -753 -1010 -1011 -712 -136 416 868 1048 934
3014 934 484 -85 -639 -891 -1040 -730 -238 314 746 1048 996 619 53 -522 -896 -1033 -826 -358 213 727
3034G27K86k8l59n47n01m24j49P1M04N82N63L75L6k33n41n30n41k33J01M18N28
3055EN30M04J04j81m78n68m45l67RK52N40O13M38K20j77m50n40n40l47p6K89M78
3077b87N54M77K45k6l54n20n70l92j55J68M76O06N02L16k5l51n22m99m25j74R1
3098h65L50N81M90L97O4k10n04n65n12k90J06L59N79N10M70J07k09m42o07m21
3118f12l54J0K52N60N41M81J87j61l68n67n63k99j50K92N07N69M54J68j6l47n18
3139F6n44m16j47J70M87N56N21K89K1l19n33n52m25j99J69M22M81N66L29O0k01
3160H01m78n19m89k86K6L71M85O15L90J90k85m04o02n13k70oK94M34N96M28K01
3181I79q8l59n14n72m24l6K25N49N09M93L02o1l76n28n44m04j07Q9M40N33M85
$$ plain form
3034 727 1013 985 626 79 -422 -846 -995 -924 -520 62 625 1000 1036 803 262 -268 -809 -1042 -941 -523 5
3055 5 535 939 1043 862 384 -184 -629 -996 -987 -735 -195 418 856 1076 899 449 -91 -631 -978 -1054 -765 -287
3077 -287 267 744 989 963 609 89 -481 -873 -1028 -860 -384 222 724 1040 1015 664 142 -357 -782 -956 -865
3098 -865 -515 66 556 953 1017 807 303 -262 -774 -1064 -958 -599 -20 490 960 1067 858 416 -191 -612
3118 -612 -966 -956 -704 -144 397 878 1065 904 536 -31 -594 -893 -1043 -751 -244 325 779 947 931 584 66
3139 66 -478 -894 -1041 -871 -384 172 693 982 1003 684 151 -401 -826 -1025 -856 -434 47 613 942 1002 801
3160 801 323 -196 -685 -971 -945 -574 -89 526 916 1106 821 417 -185 -698 -968 -974 -680 -246 350 778 979
3181 979 891 532 18 -554 -978 -1014 -789 -240 269 762 1064 1003 627 99 -445 -849 -956 -867 -427 106 591
3202E91M04lk50n58n31n10j99J03M22N85N22L28Q7k30m68n55m63k57L6K97N18
3223a31N98M17J31j32m37n77n64l16k8L31N58N15M56J83j22l51n71n38l53o6J37
3244h60N25N46M87L00j6l74n72n42m10j49K21M28N61M94K99R9k53n23n89m54k21
3265a003J01L34N99N45L44J25k99m37n46m97k98P3L13M69N92L52K22j53m15n61
3285a40n60l31j4L00N25N82M73J66j01m01n26n35l19j22K30M08N43N59K16L4l35
3306F52n47n65m22j33J09M79N58M51L11M1k34m76o32l84k05J04L00N56N45M57
3326I65Q7k39m61n61n19k70L8L48N22N28M21J76j92l60n86n19l64l0K35N14N94
3347C27M37K55j29l62n77m85l92l1J11N00N45M53L09j9k75m99n59m91j81K55L95
$$ plain form
3202 591 995 992 742 184 -347 -857 -1056 -953 -531 54 576 904 991 761 293 -262 -725 -982 -946 -649 -131
3223 -131 467 884 1015 883 446 -131 -695 -1011 -1039 -708 -150 365 821 1004 882 531 -40 -578 -931 -997 -860
3244 -860 -335 211 698 998 982 608 36 -506 -916 -1065 -844 -416 145 639 938 1037 784 261 -328 -782 -1003
3265 -1003 -902 -568 31 576 920 1045 746 309 -237 -734 -1032 -959 -646 -177 415 767 989 836 421 -140
3285 -140 -700 -1031 -1045 -745 -220 362 835 1001 900 499 -27 -562 -881 -1003 -773 -365 178 737 953 987 652
3306 652 105 -460 -882 -1015 -906 -427 131 582 893 934 700 224 -408 -792 -997 -893 -593 -37 508 965
3326 965 1052 813 352 -209 -728 -998 -960 -612 -90 438 859 1035 843 483 -103 -622 -986 -1016 -781 -267 327
3347 327 764 1019 890 528 -49 -534 -926 -957 -846 -346 199 652 961 942 667 168 -391 -882 -1063 -808 -413
3368d13N47N51L03L9l35m55n51m39k14L4L79M82N52M23P4j24m80o08n24k33m3
3389a035L78N07N91M28J19j11m63m99m90l44l6K12M73N79M97K46p0l71o25n61
3409e75l19r3K02M66N74M69K38o1k66m84n23m59k25J47L90N67N68L84M2l14n24
3430B04n33m87j50K9M10N26N03L93R1j43m64n54n01l37K2K97N86N34M18J41r0
3451H95m26o32m84l11K2J87M84N32M31K71l3l21n41n73m41j18K59M13N92N70K47
3472A023Ol64m78n87l45k39J61L28M84N99L40J24k73m98o02m35k25M3L67N83M96
3493E08L47J22j92m18n18m53l77k7L39M88N96M43J89j11m48n21n58l43l8K23M55
3514b94N92M19K07Ml58n16n00m50j51J69M76N73M96K85Ql25n00n00m34j17M7L76
$$ plain form
3368 -413 134 685 988 1027 692 237 -314 -753 -967 -933 -554 -72 480 903 977 853 373 -235 -759 -992 -1035
3389 -1035 -657 -150 441 869 988 877 414 -85 -575 -919 -955 -743 -270 309 806 1052 982 611 -14 -575
3409 -575 -894 -987 -785 -319 255 724 962 901 635 151 -372 -831 -1056 -909 -519 48 616 1000 1042 728 204
3430 204 -329 -816 -966 -937 -527 -1 502 895 986 843 379 -175 -676 -1013 -991 -694 -108 426 844 985 895
3451 895 469 -163 -647 -958 -936 -749 -265 267 698 969 936 615 74 -499 -940 -1058 -799 -386 206 776 1023
3472 1023 1029 665 187 -400 -745 -984 -823 -495 -11 588 928 1052 779 281 -321 -756 -981 -938 -571 12 508
3493 508 855 977 785 367 -151 -604 -981 -1008 -669 -181 415 858 1047 936 488 -33 -591 -934 -972 -749 -294
3514 -294 298 717 924 928 570 54 -446 -896 -1047 -878 -402 171 667 952 960 635 135 -365 -799 -916 -869 -493
3536d93N50N48L11N9k26m33n38n17k22k3L40O03N21M32R4k28m25m97n13k97lL09
3558f48L84O11M25K04q7l60o01n69k97q6K71N05N67M58K02l2l89m89n06l65j72
3579i74J14M78M51N64L45kk85m95n74m93j51J63L70N23N26K73R7k12m49n00m58
3600f89l45R8L11N28N91M13J10k08m07n91m61k46n4L05M46N27M18J91om08n44
3621b1n01m08j11K71M65N41N00J81n0l36n38m67l53j48J84L76N23N03L12L4k67
3642F90m88n04n14j66Q9M15N13N14L89J1k37m65n06m78k05m0L40M95N10M56K05
3663A024k26m08n80m88k97k8L27M65M99M61J70m3m03m91m59l97q7K07M35N34M62
3684F77K76k2l38n37n02m00j48J66M25N18M10L44Q3k78n21m92m73k07J25L55N46
$$ plain form
3536 -493 57 605 916 975 749 316 -222 -739 -961 -984 -644 -41 480 912 1006 778 353 -144 -657 -954 -957 -648
3558 -648 -264 347 772 976 889 529 -72 -641 -938 -1024 -753 -248 319 777 979 947 558 69 -437 -802 -974
3579 -974 -860 -382 69 633 978 976 691 196 -378 -871 -1022 -859 -489 34 560 833 930 718 269 -231 -689
3600 -689 -1034 -936 -625 -97 494 907 1017 809 402 -189 -650 -896 -950 -645 -199 328 746 937 931 523 -21
3621 -21 -522 -930 -1041 -770 -305 236 736 917 867 531 -7 -474 -827 -975 -791 -415 108 611 923 957 690
3642 690 202 -302 -816 -982 -893 -478 35 549 938 949 712 247 -259 -737 -942 -982 -642 -147 363 819 1024
3663 1024 798 390 -190 -678 -975 -1003 -676 -211 288 749 919 876 473 -18 -477 -874 -961 -754 -319 215 677
3684 677 953 931 593 56 -446 -846 -994 -828 -403 115 525 869 952 674 153 -339 -812 -1019 -894 -539 7
3705GN44L41R0l03l92n66l93k33j4L52M44N59L62J69j22m38n05n14l40k2L11M26
3727b37N77M35J60j48l35n06m92l54m8J79M42M96M75K75%k98m97n42m07j41J37
3748h29M35N53M64K42K5k36m41n03m39k64J25L23N52N01L33J14j50n00n36m43
3768f74k98J7L62N29N13L24J79j63l52n34m75k98p1K82M46N56M74J92j25l31n61
3789hm57l99p3J62M62N05M38L12k4k74m76n53l94k15J22M57N55M92K62M3k37m77
3811B23n43l81k47J05L50M81M67L90J92k05m75n33n06k47j6L20N37N12L26J87
3831I37j45l81m97m98k57j00K83L88N92M47K05p0l58n65m96l42n0K11L79N80M10
3852F73K48l9k54m81m69l76k02Q4L34N42N61K88P6k82m76n04m71j28j2L75N25
$$ plain form
3705 7 551 892 982 679 287 -279 -672 -905 -919 -567 -123 436 798 967 845 407 -98 -612 -952 -974 -663 -237
3727 -237 340 775 935 787 452 -54 -546 -900 -948 -769 -327 169 644 919 919 621 124 -418 -825 -966 -829
3748 -829 -394 159 623 865 890 654 213 -290 -729 -993 -868 -545 7 508 841 955 805 305 -231 -674
3768 -674 -972 -955 -593 -64 449 773 952 789 437 -97 -572 -870 -941 -659 -213 343 817 1009 884 553 -8
3789 -8 -465 -864 -937 -775 -313 192 630 942 918 644 168 -385 -779 -994 -872 -415 140 632 894 937 700 223
3811 223 -320 -701 -948 -843 -493 -12 455 845 1037 832 357 -176 -682 -929 -945 -625 -88 424 750 937
3831 937 792 411 -86 -584 -841 -941 -658 -270 322 769 974 904 546 -19 -515 -857 -907 -696 -317 263 673
3852 673 921 882 628 147 -322 -698 -900 -816 -482 60 621 909 985 703 227 -277 -748 -876 -888 -513 12
3873A2M42L23J71j50m26n39m55k99J9K41N74M87M40J62j57l98n45m25l38m2K46
3894f57M13N66L37K80o5k82n45n42l41j55J91M34N57M52K83L0l54m62m81l91j75
3915i07P1L53N00M97M03O9k03m98n87m32j89K6L91M99M93L60J03j89l98m78m71
3936e87l31m2K93M81N23M25K24j43m28m83m98l43q7K94M70N09L84K37m3k75m79
3957A01n01m15j58J78L81O45M21K92Jl19m69n25m13j40Q2M21M42M70M07Nj45m57
3979C04n88l95l15Q2L05N67M88M05J08k05l94n26l92l29j7K40M99N07M04K30j14
4000H64l37n93m64l85q5K58M74N71L29K51m9l46l81n64l57j40J31M32M89N38K67
4021I03O7l21m71n70l77j87J04L56N26M62M01L0k05m18n35m85k31k1L49M96N17
$$ plain form
3873 12 454 777 948 798 372 -167 -622 -921 -902 -661 -87 400 840 1002 845 447 -98 -523 -861 -903 -657
3894 -657 -244 322 659 939 874 592 47 -495 -836 -991 -800 -366 191 643 926 956 602 140 -341 -732 -907
3915 -907 -836 -483 17 514 917 986 783 285 -302 -734 -923 -897 -506 -7 486 846 949 760 362 -116 -587
3936 -587 -918 -960 -667 -186 337 762 986 843 415 -68 -566 -909 -996 -702 -232 277 661 898 855 580 101
3957 101 -400 -815 -973 -795 -414 231 652 944 945 626 157 -368 -781 -921 -839 -418 24 494 901 906 761 304
3979 304 -284 -679 -994 -912 -607 -40 448 853 961 756 362 -164 -556 -885 -902 -662 -163 344 748 978 864
4000 864 527 -66 -530 -915 -1000 -742 -268 303 632 883 834 488 107 -457 -814 -954 -823 -391 98 636 903
4021 903 970 649 178 -392 -769 -956 -852 -496 30 492 893 923 718 300 -235 -720 -951 -972 -623 -127 390
4042C90M20J75j77m57n41m95k87N6K72M47N10M19J94q8l04n10n33l65j17K34M12
4063c45N99N11J51o6k79n29m73m53n1R0M43N35M67K91Rj81m95n81l90k28N9M32
4085d84N57M00M07J5j76m36n24m67k29Q4K40N18N03L84J55j08m11n67n19k91j2
4106i61K87M81N11L82J99r7l61m72m89l32j02J92M35N07M47L41j4l69n03n60l58
4127h36q4J38L87N33M37K58J03k67m21n31m59j72K1L92M84O07K72Q9j91m77n48
4148b65m32k09N0L01M16M98L82K09j44l76n09n34l01k3J97N64N30M20J95j14l40
4169E15m81n09l42p1J40M79M04M70L22o5k41m91n50m07j66J61M05N74M76K53J6
4190H92k41m49m87m32k20P9L11N25N18L45J25j73m36n71m33k59N4L43M37M72L84
$$ plain form
4042 390 810 985 808 351 -190 -685 -972 -916 -644 -197 313 732 926 838 534 24 -509 -874 -991 -757 -345
4063 -345 254 765 916 850 571 42 -431 -884 -935 -845 -402 133 600 891 900 719 224 -357 -747 -975 -916 -484
4085 -484 73 473 880 895 719 283 -241 -708 -937 -853 -613 -95 408 792 947 839 428 -139 -658 -949 -961
4106 -961 -674 -193 318 700 899 802 441 -31 -520 -852 -954 -762 -327 180 627 968 954 585 82 -478 -836
4127 -836 -920 -782 -395 138 575 833 936 669 248 -283 -742 -914 -893 -501 -17 590 862 951 760 283 -265
4148 -265 -697 -906 -856 -555 -139 359 741 950 806 430 -79 -613 -914 -937 -740 -176 354 774 969 855 515
4169 515 34 -475 -817 -888 -748 -269 135 605 927 862 621 130 -420 -827 -993 -832 -427 147 623 876 892
4190 892 651 202 -285 -717 -937 -858 -547 -22 496 841 966 793 357 -214 -647 -906 -852 -509 -72 400 784
4211G84R9q2l77m73n20k90j01K44M73N41M42K05m8m23m51n12l63o5K23M28M37
4232A71M56K89j7k54m23o08l54k38J50L87N69M49L21M4l08m81m24m37j99P3L75
4253d59M02M74M11P2j25m49n08n57j86N1K92M57N16L84J22r2m25m20m86k81j17
4274i24K22M66M66M61K67l8l88n17m80l83q6K13M00N09M03L15l0k79m53n25l58
4295g39j76Q2L76M81N23L32Q3k69m79n41l37k04Q4L36M33M43L92R1j63l98m80
4316a30m89k77K3K29M97N25M23Q1j30l77n06m42k80l3J92M13N44L58K70j6l33
4337E42m80n17l94o7J45M13N81M64K25n2k63m82m83l39j80Q5L60M73M28L72M9
4358H80k08m58n26m47k18J03L00M98N27L65N0j40m43m42m58k55MK04M84N30M14
$$ plain form
4211 784 883 801 424 -49 -569 -859 -960 -716 -243 298 740 945 897 474 23 -489 -852 -917 -694 -266 171
4232 171 627 916 899 645 222 -386 -740 -978 -828 -441 128 577 898 942 634 153 -271 -708 -907 -834 -459
4253 -459 -57 417 828 900 775 326 -182 -739 -925 -874 -582 -125 391 775 897 805 380 -40 -526 -807 -924
4274 -924 -702 -236 230 691 958 920 532 15 -465 -848 -934 -721 -321 188 591 906 876 597 144 -381 -739
4295 -739 -915 -833 -457 24 547 879 962 693 214 -327 -664 -868 -784 -448 -15 428 820 911 748 350 -130
4316 -130 -619 -896 -873 -644 -147 378 801 882 752 375 -131 -573 -853 -886 -694 -281 263 621 891 875 542
4337 542 62 -455 -849 -916 -771 -358 223 687 912 860 597 115 -368 -707 -887 -802 -442 31 459 831 880
4358 880 672 214 -312 -759 -977 -874 -574 -76 451 816 866 726 283 -159 -617 -872 -868 -664 -180 350 764
4379G64J76j10m08n19m53l04q4K65M19N03L56K30k6k94m53m67l88j86J56M21N18
4400A16M91K82m7k20n05m81l96j31J08M02L95M77L46O6j86m50n05m50k49K0L56
4421e61N00M83L87J00j77m25n35l39k85k0K50M19M92L92K18r7k98n19n35k81o7
4442h98K27L82N36M09K13o7k88m32n07l33j40J47L86M45M59L64l2k66m57m90m46
4463g88j63J12M10M48M39L06P6j28m69m56m15k65J8K95M88M83M00J42j61m02n35
4484a65m53k50M0K56L57N17M35J19o2l16n01m84l27j30K46M07N08M61K44r7k75
4505E30m88m52l47j12J59L97M21M22L25K3j82m89m17m97k11R9L08N72M42L31R4
4526I28k52m00m87m28k36J6L29M05N39L40J46j36l64n37m39l24qK96M82M50M19
$$ plain form
4379 764 940 830 422 -97 -550 -854 -938 -673 -254 249 605 835 809 515 62 -405 -793 -979 -823 -402 116
4400 116 607 889 842 622 117 -364 -760 -891 -783 -381 14 491 837 903 717 267 -238 -688 -937 -917 -561
4421 -561 -61 422 809 909 732 307 -228 -567 -852 -872 -622 -203 289 681 899 802 504 -15 -550 -831 -898
4442 -898 -671 -289 247 656 869 802 514 82 -425 -758 -898 -751 -365 80 539 903 871 605 148 -342 -788
4463 -788 -951 -839 -429 19 458 764 840 712 243 -213 -628 -893 -875 -580 -92 391 791 933 772 370 -165
4484 -165 -618 -868 -828 -572 -215 302 737 856 794 478 -23 -507 -834 -964 -718 -311 197 658 902 805 530
4505 530 42 -410 -757 -869 -710 -313 108 530 855 878 696 207 -210 -707 -918 -819 -511 61 503 834 928
4526 928 676 276 -211 -639 -875 -859 -530 -125 414 754 900 764 400 -137 -576 -900 -908 -612 -130 320 739
4547G39J55q7l26n15l99l18j47K06L97N05M52K46J8l87m95l96m14j63K18L32M68
4568H9M41K81K5k35l89m56m37k10O3L10M98N58L31O6j99m51m97m16k49O3L64L48
4590a02M92L34J54j10l59m98m66k96o3K43M63N41L93J97j47l19m14m58l91l6J21
4611g21M44M55M40K92n4k29m65n60l37j65J48L95N19L97L06K8k39m60m40l95k65
4632i06J13K83N15M45L84R4k11m31m95m64j83PL20M42M59L30K01j29l10n00m84
4653e20k44j16K57L60O14M24J59m5m14m93m53l27m8J82L47M85M17K51L5k66m75
4674A30m58m00k12J43L70N83M03L14k3k31m19m51l94k00Q3K86M33N26L25J13j94
4695G27m23m60m52k94pL11M80N19L64N1q7l27n12m27k74r2J90M80M87M04K57o7
$$ plain form
4547 739 894 807 481 -34 -433 -751 -898 -692 -295 210 662 908 926 539 44 -352 -766 -929 -711 -379 89
4568 89 530 811 836 601 212 -244 -681 -891 -828 -518 -20 538 869 935 736 285 -212 -628 -877 -814 -450 -102
4590 -102 390 724 878 768 409 -89 -555 -851 -914 -671 -208 333 726 923 776 457 43 -415 -806 -842 -721
4611 -721 -277 178 618 910 856 627 162 -398 -735 -900 -752 -357 162 559 865 893 654 194 -246 -641 -906
4632 -906 -793 -510 5 450 834 928 717 286 -209 -673 -856 -849 -529 -87 372 702 903 774 464 -36 -520
4653 -520 -764 -880 -623 -263 351 775 934 889 475 -18 -471 -798 -846 -664 -317 168 585 836 871 605 130
4674 130 -328 -728 -940 -797 -427 156 559 873 850 619 200 -251 -645 -845 -762 -476 -43 483 808 921 727
4695 727 304 -156 -608 -902 -909 -598 -118 401 765 816 729 402 -110 -537 -811 -903 -713 -233 254 658 915 848
4717H48l30m80n29l46n7K21L45N46L83K85o1k38m00n28l94j84J42L38M70M62L44
4738H37J26l10m39m76m49j68L8L40M03N09L59Q3r6m45m41m67k65r3L34M68M72
4759C20M12J80j12m05m69m86k64k1J92M23M79L74J98jk99m84m83l55j61J90M20
4780c52M84M87K33K2l23m44m60l71j82P0L55M97M55L42R7k16m29n30m55j83L7
4801h66L64M52M34L91R3j58m18m93l72l27kK52M84M15M46J92n7l71n54m16l74
4822h85j5K01M42N04L66K27n2k87l75n15m23j45J56L93N34N04J80N9l02m51n08
4843c92l49j66P5L98M53M35K71J20j86l81n32m11k23RL23N27M41L64J54k19l41
4864C70n43l68l08j8K57M25M54M16J60l6l13n06n07l43j07K65M18M76M41J99J4
$$ plain form
4717 848 518 38 -491 -837 -894 -673 -328 218 601 886 825 587 187 -341 -735 -919 -777 -439 31 493 837
4738 837 963 653 214 -262 -711 -879 -841 -501 -98 411 770 853 757 312 -129 -596 -861 -954 -620 -152 320
4759 320 732 912 800 395 -74 -560 -824 -845 -653 -230 249 623 821 820 521 37 -446 -801 -962 -772 -352
4780 -352 132 619 852 874 551 107 -353 -724 -906 -836 -481 16 471 813 910 694 265 -265 -720 -903 -866
4801 -866 -502 -50 384 775 868 710 292 -201 -573 -900 -902 -650 -166 249 695 887 830 459 -95 -511 -885
4822 -885 -900 -699 -257 247 613 840 788 501 126 -389 -812 -957 -801 -408 126 630 810 869 567 116 -392
4843 -392 -741 -907 -832 -434 19 454 725 845 659 278 -254 -665 -888 -879 -556 -29 412 776 930 711 370
4864 370 -173 -541 -849 -867 -610 -185 269 685 845 809 496 -10 -517 -860 -967 -702 -284 192 633 832 846
4885H46l94l65n03l35j14J22L29N16M79K40N4j79n47m59m35j28P5M09M21M62L04
4906G98N3j62m23m38m32k79MK87M88M69L92J30j43l56n29m48k91J0K62M51M65
4927C08L54J85n2k73m81m84l24q8J52M10N00M48K51j01l07m30m59l61r4J05M03
4948c38M14M26L47j8j97l86n52m10j26L3L57N09M39L11J00k54l59m93l47k58K6
4969g76K16M47M72L79J71j24l49n49m06l03l4K59M39N02L49J78j19k95m66m54
4989d63l00n8J55L81M56M83J94N3l45m23n38l90j05J90L72N13L56K87K6k16m25
5010B03m67l93j75O5K65M93M80L19J22k55l89n00l64k80P7K78M49M41L39J51m7
5031H12l80m68m94k74o1K51M51M89L96J70j15l08m75m20l21j12J93L83M56M04
$$ plain form
4885 846 452 87 -416 -751 -865 -743 -414 102 581 821 875 696 149 -310 -745 -873 -798 -389 32 494 798
4906 798 851 689 266 -172 -604 -883 -879 -592 -104 365 757 887 744 388 -141 -589 -880 -870 -608 -157 308
4927 308 662 847 795 522 41 -443 -767 -855 -703 -293 207 655 906 805 498 68 -391 -752 -846 -741 -338
4948 -338 76 502 849 831 634 248 -304 -714 -840 -807 -450 59 498 809 909 655 296 -197 -544 -802 -776
4969 -776 -560 -113 359 738 909 785 436 -113 -519 -822 -856 -597 -158 344 693 871 752 457 -9 -463
4989 -463 -763 -821 -666 -285 171 654 848 901 556 133 -405 -795 -900 -710 -338 175 531 818 844 628 203
5010 203 -264 -657 -832 -767 -502 -9 471 790 912 657 268 -232 -596 -876 -799 -521 -72 369 708 859 812
5031 812 432 -36 -530 -804 -865 -614 -163 326 722 892 777 469 -6 -426 -747 -859 -666 -283 173 577
5051E77K60K2l10m52m42m12j21J33L83M91M11K92j2k47l77m51l11k58N1L17M51
5072eM76L03J25j96l94m89l93k61NK99M27M65L46J05q6l36l93m52l51n5K19M03
5094b38M69M39K05j05l11n06m18l11l8J26M02M89L63K89k5k51m05m91m09j26R6
5115g56L72M56M67L03N0l02m11m27m33j77P8K84M69M13L03J43j63l69m83l74l12
5136h69J1K85M73M19M13J15j73k71m41m34k73o3J31M14M95L75K36q4k48n07m60
5157d56l63m8J59L84N07L97K00k9k17l80m67l85j19R3K76N08M32L29R0k59m44
5178B08m30m02k49J04L47M51L79L38O5j48l70m60l89k41m4K27M51N31L26J31p2
5199G53l70m95m20k47n0K08L63M70L93K23ql48l96m47m04r6J85L51M92M11K45
$$ plain form
5051 577 837 859 549 97 -345 -757 -878 -745 -362 129 540 832 820 573 196 -255 -566 -824 -773 -456 -5
5072 -5 471 774 899 703 309 -180 -573 -834 -829 -530 -103 362 708 813 727 391 -2 -454 -805 -860 -641 -238
5094 -238 231 670 875 770 459 -47 -465 -776 -814 -688 -286 203 566 855 830 579 174 -317 -726 -852 -756
5115 -756 -384 72 539 842 892 590 179 -248 -681 -858 -780 -496 -27 386 689 832 669 300 -183 -557 -869
5136 -869 -858 -573 -100 319 732 847 674 403 -38 -472 -745 -808 -677 -263 232 607 843 759 511 4 -456
5157 -456 -819 -867 -708 -324 183 580 780 751 534 154 -313 -698 -817 -724 -448 60 492 821 911 652 208
5178 208 -222 -624 -873 -769 -422 29 408 746 811 663 293 -167 -556 -797 -841 -614 -163 368 694 825 753
5199 753 383 -112 -532 -779 -829 -621 -258 212 605 828 820 472 76 -371 -775 -871 -686 -335 157 568 813
5220H13p5k30l52n26k92j76N3L16M80M22K86J37j93m38m53m09k21R8K79M29N04
5241D52K81J19j48l93m33l95k88rK03M72M13M13K21j42l33n02l95l38p0K81L62
5262b29M44M13J59l7k97l61m65l68j09J09L85M66M67K22O5k95m12m72l62j35P5
5283g37L52M51L92K64J09j72m04m78m09k28J0L48M28M51L85R4j59m12m43m24k46
5304h28J6K58M09M26L80J74o9k87m74m71k94q3J93M12N13L65J76n9k64m67m12
5325c86k84j71J38M00M19L83L04Q4k35n04m23m39j19J29K93M55M45K84O8j81m10
5346B50l99m09k37N8K21M50L82M29J42j31m14m16m47k82J2K56L44N09L01K08j38
5367F89k53m12m47l66r6K19M08M66M18K05l4k75m84m03l32q6Q4L79M27L62L32
$$ plain form
5220 813 738 508 156 -370 -662 -838 -785 -469 11 433 719 856 663 225 -228 -637 -858 -760 -481 -52 452
5241 452 733 852 704 311 -122 -517 -805 -814 -611 -139 274 687 908 766 433 -69 -464 -802 -872 -591 -229
5262 -229 215 628 787 750 453 92 -373 -741 -850 -741 -356 110 577 799 864 569 157 -315 -677 -812 -737
5283 -737 -385 66 458 722 831 659 255 -223 -632 -860 -850 -502 -74 377 762 856 697 285 -158 -582 -828
5304 -828 -812 -554 -145 281 661 835 766 479 5 -466 -760 -843 -650 -238 275 640 816 757 493 26 -386
5325 -386 -670 -841 -703 -303 116 499 803 887 652 148 -275 -714 -833 -704 -411 44 489 773 841 660 250
5346 250 -149 -558 -795 -737 -516 -66 316 745 887 756 342 -74 -521 -803 -791 -535 -191 318 619 827 689
5367 689 436 24 -423 -789 -885 -666 -258 208 626 831 797 522 38 -365 -697 -783 -699 -320 107 469 801
5388H01P4k30m69m23m22j61N7L81M60L96K81R9k03l55m77l57k64N4K52M18M16
5409C28L44K23j38l43n20m49k11m4K15M63M55L46J89q9l44l67m80l28mM3M27M17
5431A33M37K97o6k42m97m28l63j23J51L69M23L84K77L6j62m50m00l97k42N4K98
5452e11M98M69L73J8j58l75n65l36k46L0L20L61M68L04J79j22l00n37m15k45l6
5473h26J53M69M77L84J83n8l05n12m50k50n9R0M34L84M59K29M6l03m06m88l73
5494g22r8Q9L47M84M20K69k7k39l39m61l68j51J2K72M19M14L68J40j56m22l88
5515a37m67k28mK94M46M09L09J73o6l76m16m18k81n5J41M49M25M27K09o6l09m47
5537A2m82l37%J16M29L63M00K38M3k60l78m66l81j53J12L17N10M04K95M5k51m13
$$ plain form
5388 801 875 645 176 -247 -669 -830 -773 -392 68 464 745 844 641 286 -191 -548 -812 -758 -506 -88 328
5409 328 672 895 757 414 -106 -555 -766 -810 -595 -132 323 669 858 769 425 58 -422 -750 -754 -711 -284 133
5431 133 570 867 801 559 62 -366 -729 -852 -701 -332 91 475 752 788 626 176 -224 -621 -863 -809 -511
5452 -511 -13 456 829 847 689 314 -251 -587 -833 -803 -483 -122 346 650 829 707 407 -130 -545 -790 -826
5473 -826 -673 -204 273 657 840 782 477 -35 -485 -735 -794 -704 -270 114 573 802 848 545 139 -349 -722
5494 -722 -820 -731 -384 100 520 789 762 523 184 -277 -645 -796 -784 -512 -93 321 689 829 673 251 -137
5515 -137 -604 -832 -836 -542 -96 313 622 795 729 353 -63 -481 -762 -817 -676 -227 198 625 834 768 459 12
5537 12 -470 -807 -807 -691 -262 101 501 739 782 522 144 -322 -703 -856 -744 -427 83 487 782 827 576 163
5559A63m67k97j99R8K66L38M51L28J50p9m79m02m32k07q1L37L55M64L66J20j03
5580F90l45m39m05k79J2R0M30M87L53K41p9k43m43m77l18j09J95L64M97L06K67
5601G95j20j31l65n00l11k40J62L12L98M13L89L7k31m07m42m08j88J06K48M20
5621f3M63K63J27j03m22l37n14k29j3K27M74M41M06J21r1l61n05l89k39MJ61L25
5643b54M35L89J73j5k64m04m18l39j29R4L91M90L83K40J8k39m53m17l17j33P7
5664f92K87M29M38K92P1j49l71n17l55k07l0L40M62M03L21L8j31k98m24m29k50
5685g72j3K27L79M69L63J58q5k94m51m50k69k0J82L37N03L24K17o0k39l95m46
5706c35l02j53J37L05M52M19K46N2k63m26m52l09j69Q6L56L54M50K94N4j66l88
$$ plain form
5559 163 -304 -601 -800 -702 -436 -98 353 681 831 752 273 -129 -561 -768 -849 -512 -157 307 673 793 690
5580 690 345 -94 -499 -778 -766 -676 -246 241 594 835 756 513 70 -407 -725 -834 -639 -275 222 528 795
5601 795 675 544 179 -321 -632 -872 -710 -398 0 413 802 839 608 201 -241 -649 -837 -731 -483 -63
5621 -63 400 663 790 687 265 -72 -586 -815 -828 -601 -127 314 720 841 750 389 -116 -505 -744 -740 -579 -254
5643 -254 181 570 743 728 464 60 -358 -697 -826 -732 -341 149 532 772 790 551 98 -319 -636 -769 -692
5664 -692 -405 24 462 754 825 676 305 -212 -567 -774 -804 -464 -2 401 722 760 629 331 -93 -522 -772
5685 -772 -785 -558 -179 290 653 811 726 432 -19 -469 -738 -758 -576 -239 264 588 805 745 506 111 -335
5706 -335 -637 -790 -653 -348 104 523 769 821 558 132 -320 -629 -798 -712 -356 -2 448 742 796 630 242
5727B42l65m13k63M9K79M58M25L16J02j23l95m09l76k51j7K27L92L44M06J47n6
5748G19k86m09m34l35p5J51M23M61L65K09l0l04l70m26k95j82J79L02M51L89K71
5769G74R0k67m09m39l76j78J20L15M09M21K52O4j52m04l99l64j92PJ80M25N11
5790C88K76J60j22l49m81l31l01j0K68L61M08L17K19r5k57m36m17k79j28J98L44
5811b67M45M28J80Ol19m16m52k84j28J64K73M30M47K05R1j69m28m16m14j57L4
5832g47K76M78M41K93L4j71l50m08l66k27N6J95L79M26L16J92j16l42m19m54k64
5853g78L7J71M11M14L61K04j27k98l59m46k62j02J56L63M02L68K76m6k50m07m31
5874c43l41p7J08L23L87M45K03J5j64l78m45l46j61K2K89M35M41K80Q9j46m40
$$ plain form
5727 242 -123 -536 -799 -750 -471 -13 412 728 830 707 312 -97 -473 -724 -741 -514 -122 222 628 775 719
5748 719 433 24 -410 -745 -820 -669 -246 215 580 789 759 455 85 -341 -636 -818 -639 -337 114 503 774
5769 774 864 597 188 -251 -627 -805 -685 -370 39 460 712 776 624 220 -179 -543 -735 -728 -548 -123 388
5790 388 664 824 702 353 -128 -459 -760 -770 -502 -141 267 584 803 708 451 15 -402 -681 -809 -611 -267
5811 -267 178 606 786 792 473 57 -395 -679 -807 -643 -370 60 507 712 803 634 206 -210 -624 -781 -747
5832 -747 -471 7 448 741 775 604 254 -154 -520 -747 -691 -496 -117 309 625 817 701 359 -60 -514 -778
5853 -778 -741 -570 -159 255 616 820 693 395 36 -410 -672 -774 -618 -255 147 515 791 745 495 88 -343
5874 -343 -684 -761 -653 -330 57 502 705 720 556 178 -267 -613 -774 -752 -463 -28 413 693 782 636 196
5895A96m02l12k65L6K44M12L94L01J52r0k98m18m69k14m5K03L54M85L31J61r6
5916F60k69m20l86k48j25J71K83M21M44J77Q8k58m34m32l38j48O0M27M41L67K46
5937G27pj79m00l44l67j84O8K40M24M16L04J30j67l39m97m01k26J7K92L86M35
5958C28L01J06o4l27l91m05l04o0K20L66M11M11J79k6l14l83m63k86o1J08M41
5979b13L63L76J87J6j79m20m56k76j36JL23M70M03K83L5k40l65m42l29k01P4K79
6001d47L59M34L04J43j59l15m19m25k18n1K54M23N00L02J59j51l35l95m25k45
6021g07l6J40L83M10L99J44Lk70m42m09l31n0J24L81L80M60J76l9k22l26m44l42
6043f18j23N5K65M30M60K79L7j96l40m59m09j67M7K80M35M02K50J58j84l12l68
$$ plain form
5895 196 -206 -518 -783 -747 -503 -91 303 604 756 666 368 -50 -519 -733 -778 -575 -221 264 595 756 660
5916 660 391 -29 -415 -663 -788 -617 -334 87 531 708 796 538 104 -328 -666 -814 -754 -327 114 481 727
5937 727 720 541 141 -203 -570 -754 -686 -446 -22 394 698 828 661 322 -175 -576 -802 -785 -493 -107 328
5958 328 629 735 671 344 -47 -452 -756 -816 -596 -230 181 592 771 745 431 48 -415 -701 -762 -654 -213
5979 -213 150 526 713 729 550 130 -326 -602 -738 -737 -414 56 459 742 777 537 172 -270 -599 -800 -726 -447
6001 -447 -88 346 650 793 634 319 -100 -525 -743 -794 -540 -117 383 685 844 693 358 -37 -462 -707
6021 -707 -743 -603 -220 190 589 733 736 466 24 -385 -716 -766 -642 -261 119 579 755 716 494 168 -276 -618
6043 -618 -741 -686 -421 9 469 748 785 589 249 -210 -619 -786 -739 -459 -24 378 628 786 602 290 -78
6064g8m41j79n2J93M17M23L62J60j05l65l39m50k20o2K05L45L86L59J98l0k07
6085E20m66l66l61j19J41L39M76M00K25n5k22l68m30l20j48O6K97M06M37K50J11
6106H13k14l42m48l69k42O7K47M53M33K84J13j51l32m26l57k28k2J56M58L49L76
6127F18K21j19k84m64m22k70l2J65L71M33L59J74l1k70l56m24k92j18P8K88N07
6148A32L30L03Q4k75m13m47l48j26R3K93L97M07K45R3j48l38m45m41j39k2K55
6169e10M35M34L47Q6j34l52m02m01k12k6J83M47L75L72R1n0k48m23m51k57j02
6190g98J90L77M31L48K29q6k10m10m06k74j76J56K75L91M43K26J04k73l68m28
6210b59l82j35P2K91M56M19K26J07k12l08m26l82j81l2K36L84M19L89J02j21l36
$$ plain form
6064 -78 -519 -698 -750 -557 -140 283 645 805 700 335 -4 -454 -674 -736 -531 -186 200 559 757 727 520
6085 520 54 -312 -673 -792 -651 -312 164 564 789 734 512 144 -286 -606 -754 -688 -391 15 452 702 813
6106 813 599 257 -191 -560 -802 -735 -488 -35 398 682 795 644 312 -114 -471 -699 -721 -565 -107 242 618
6127 618 839 720 436 -28 -450 -720 -752 -587 -216 217 576 750 719 449 93 -331 -623 -741 -663 -375 132
6148 132 462 765 849 574 161 -286 -634 -760 -667 -374 23 430 675 768 620 282 -163 -604 -743 -765 -510
6169 -510 -75 359 706 792 658 306 -96 -497 -709 -735 -552 -105 270 642 733 683 435 12 -439 -696 -798
6190 -798 -608 -231 200 548 777 691 481 71 -335 -609 -785 -629 -354 37 480 706 810 537 169 -259
6210 -259 -641 -776 -704 -413 43 462 688 795 583 275 -151 -533 -714 -746 -510 -126 293 682 784 663 327
6231C27m54l58k49p5K53L75M32K98J95j00k12m37m02k61j37J90L16M27M08K29
6251G65%k73m25m13k87p3N9K85M09L94J83J01j58l98m08l45j88K0K73M32M74K40
6273F67Q6k09k87m29m11k22J14J88L83M02L30K03j26l09m75m17k11l6K05L52M65
6294B63L55J00j7l18l89l59l29n4J60K52M21M24J68M7k42m18m28k97j50J54L40
6315c17L66L71K87J5j44l63m10m01j30QK57M36M24K96R8j96l08m59l60k27O1J90
6337e06L76M03L14J17p2l16m39l64j97j02K19L65M36L76J96r6l58l68l94k33r7
6358g40J24L12M45L58J95L2k02m14m30l16j42J17L02M33L85K63J5k46l54l82l42
6379e87j44M5K08M11M14K47J79j66l48l95l72k15k1L00L27M60K95P8j5l46m58
$$ plain form
6231 327 -127 -485 -734 -809 -556 -181 251 549 744 644 432 -5 -407 -668 -805 -615 -299 128 536 765
6251 765 765 492 67 -346 -633 -706 -647 -362 47 441 624 725 567 169 -239 -584 -772 -752 -479 -47 427 667
6273 667 753 544 257 -172 -583 -805 -691 -503 -120 282 612 815 689 380 -95 -512 -723 -759 -554 -202 263
6294 263 618 718 701 383 -6 -365 -694 -748 -588 -336 85 509 677 724 482 64 -364 -661 -811 -657 -317
6315 -317 49 420 707 722 578 215 -195 -596 -726 -718 -461 -25 399 695 793 597 289 -170 -530 -757 -696 -506
6337 -506 -130 273 587 704 632 316 -123 -487 -684 -786 -567 -202 234 610 806 710 352 -16 -410 -643 -740
6358 -740 -616 -304 141 499 694 726 524 110 -320 -636 -778 -661 -359 74 459 722 737 491 137 -245 -587
6379 -587 -731 -686 -478 -67 347 594 773 607 259 -136 -508 -723 -744 -444 -117 343 638 716 701 355 -103
6400a03l09k64r0J97L32M20L86J77l2k46m55l76k79q6J06L76M02L35J92qj84l18
6422A73m20l50j42O8K85M57L87K83N9k23l89l90l73j23K7K63L71L91K84J44j61
6443F21l30m23l68k31J1K48L48M11L29J71j50k91l85l82k30k4J64K82M60L21K09
6464G61k2k90l42m53l09j19J51L82L92L91K17m0k05l73m08l11j93J27K96L17M58
6485D27K65P3j80l67m67l28j32K9K86L41M36K38J11j27l22l02l88k54m4J37M49
6506a19M07L44J59j52k45m41m08k06p4K46L00M16L23J47k9j44m32l79l45j47J55
6527f24L17M58K97K94Jk03l97l75l43j57J29K72L77L86J84J40j77l21m23l99j71
6548g35J0L23L72M22K68O8r8l39l65l94j96m6J99L94L79L40J37j8k70m30m10l25
$$ plain form
6400 -103 -412 -676 -766 -569 -237 183 569 746 714 468 13 -363 -642 -728 -622 -246 156 491 683 675 491 173
6422 173 -247 -597 -739 -671 -386 71 458 741 800 577 188 -202 -575 -698 -671 -408 -37 354 638 782 621
6443 621 291 -132 -500 -731 -720 -472 -124 287 616 787 637 346 -39 -421 -651 -675 -511 -229 231 552 761
6464 761 739 449 107 -346 -655 -774 -623 -241 151 542 759 719 514 141 -267 -578 -771 -644 -348 -31 427
6485 427 692 765 585 218 -249 -577 -709 -680 -394 -53 383 621 732 605 283 -19 -407 -661 -705 -568 -119
6506 -119 288 632 791 639 394 -47 -455 -661 -735 -489 -189 227 550 697 668 524 92 -287 -632 -779 -624
6527 -624 -307 151 448 742 743 540 143 -232 -575 -732 -603 -331 46 432 616 756 579 258 -165 -564 -735
6548 -735 -725 -402 -30 392 660 728 630 291 -74 -468 -664 -710 -511 -117 262 602 739 721 451 21 -389 -714
6570g14j8J89L55M25L44J16ok77l23l99k81j57J43K64M60L36K29O5k23l75m43
6591b90l56j08J15K81L86L54K60P4j41l63l68l90j25p9K97L85M34L10M2o0l91
6612B67l63l75k21J3J81L44L55L43J84p8k28m27l80l16rJ17L33M85K93K09q1k17
6634D29l85l38k57j94J24L45L39L91K38N3j90l76m20l53j44J02K48M22L45K36
6654F15J20k05l18l67l36k20M0J83L76M23L18J16j38l11l82l85k20j0K16L56L68
6675B39L11J25j2k84l49l88k79j07J40L09M09L85J78L7k70m10l72k95j74J81K76
6696c50M04L28K71J7j58l25m05l64j35J6K38M64L71L00M5j50l81l55l19k26P4
6717f40J66L65L90L09J53p5l15m24l89k78m0J96L87L77L33J91q0k62l90l78k48
$$ plain form
6570 -714 -732 -543 -188 237 581 697 691 414 91 -308 -589 -746 -603 -339 121 457 686 751 528 153 -290
6591 -290 -646 -754 -639 -358 28 382 642 716 575 212 -156 -546 -671 -750 -453 -68 366 676 718 658 267
6612 267 -96 -471 -692 -679 -498 -154 201 544 728 650 422 -5 -385 -701 -710 -593 -260 225 518 727 646 429
6634 429 44 -294 -551 -745 -621 -276 63 454 692 745 555 179 -241 -594 -738 -636 -388 34 379 615
6654 615 735 530 212 -155 -491 -711 -671 -488 -112 311 629 745 607 296 -86 -471 -691 -701 -485 -129 239
6675 239 550 675 663 379 30 -358 -637 -744 -604 -295 114 499 677 714 444 34 -338 -633 -807 -626 -350
6696 -350 54 382 653 670 512 187 -218 -582 -717 -701 -463 1 372 672 717 567 186 -169 -488 -714 -640
6717 -640 -474 -109 281 590 743 668 353 -71 -460 -738 -778 -582 -195 182 515 706 626 364 -26 -404 -652
6738f52p7J18L58L28L82K54M4k40m01m00l21j58J10K60M55L74J98N0j74l26m03
6759b21l34j62L3K51L75M44K73O6j08l72l83l61k38%K69L49L95K93J07l8k88l63
6781a3m05k50r5J92L59M03L54J55l3l21l51l76k85q5J75L21L34M15J45N8k09l33
6803A55m41k98j73J04L06L90L92K30P2k60l06l49l63j16oK67L66L62L21M2q7k83
6825C25m39l81k25M7K26L30L84L28Q2r4k25m05l45k42l0N7L80M51L10K06l8l08
6847C94l60m14k28r6J41L12M04L31J49O6j62m24l66l48j37R6K55M34L70K53M6
6868G16j68l63m00l19j73N7K65L21M44K18J26j16k90l81l96k39rK06M08L56L72
6889F35J33j17k76m31l77j92n7J37L51L55M21J27J5k35m44l97k79r7J06L57M25
$$ plain form
6738 -652 -729 -611 -253 75 457 711 755 515 114 -286 -607 -765 -655 -395 60 434 632 682 508 182 -221
6759 -221 -555 -717 -684 -433 -58 386 659 725 617 245 -138 -499 -737 -737 -468 -119 276 569 676 638 350 -13
6781 -13 -418 -668 -763 -571 -212 191 545 700 667 346 -5 -381 -666 -751 -576 -255 79 494 639 697 488 155
6803 155 -286 -584 -757 -653 -347 43 435 665 737 477 171 -178 -541 -657 -663 -396 -30 332 653 695 608 325
6825 325 -114 -495 -720 -673 -447 -117 267 595 677 583 358 -47 -392 -634 -664 -607 -227 224 534 740 702 394
6847 394 34 -380 -608 -704 -563 -251 153 484 633 699 537 113 -253 -601 -738 -642 -387 47 417 670 716
6868 716 548 185 -215 -534 -707 -650 -385 -64 380 598 724 608 318 -63 -459 -698 -707 -501 -93 263 635
6889 635 768 651 375 -56 -433 -625 -682 -545 -194 161 582 709 724 489 45 -352 -631 -728 -622 -265 160
6910A60L16K11j4j82l68l32l32j29N8K43M05L78K72N8j62l68m29k52k34L6L11
6931c54L29L20L21O4j16k97l42m03j99m6K18L16L91M29Q2q9k62l98l45k73k2J05
6953e71L96L42L13K18k4k11l85l34l54j13J23L22L87L51K18jk18l12m01l20j54
6974g28J16K65L48L79K22J49k02k99m06l42j68n3L04L40M42K56P4j08l32l42l86
6995d71j69m6J65L54L68L78J26j00k39m09m12k64l3J98L67M07K24K49m8k44l46
7016E5l56k37j69J37K50L92L87K22P2k45l95l64l26j38P1L02L43L41K16R6j45
7037E09k42m18l60k07NK53M05L18L44J09j10l17l95l58j95NJ57L26L50L43J21
7058F43qk36l95l45l31m4J32L60L96L09K16p8j65l89m15k38j53J82K11L70M17
$$ plain form
6910 160 476 687 673 491 123 -209 -541 -670 -612 -369 36 414 686 744 582 214 -215 -467 -701 -665 -354
6931 -354 -25 295 616 680 564 267 -75 -478 -677 -723 -505 -189 202 631 713 624 362 -36 -381 -654 -676 -571
6953 -571 -175 167 480 698 674 463 78 -256 -610 -723 -600 -278 109 460 678 677 459 147 -254 -574 -728
6974 -728 -612 -347 1 380 602 751 549 250 -156 -498 -666 -719 -415 -75 367 623 697 589 257 -85 -471
6995 -471 -640 -686 -521 -167 201 579 705 605 366 -43 -455 -719 -752 -554 -187 220 444 693 645 401 55
7016 55 -301 -538 -707 -570 -320 72 459 681 753 508 113 -251 -577 -715 -644 -342 1 342 558 654 509
7037 509 267 -151 -511 -718 -713 -460 -55 263 607 716 606 289 -106 -464 -659 -654 -497 -171 179 522 643
7058 643 635 399 4 -341 -672 -716 -584 -224 172 481 697 619 454 65 -350 -588 -741 -559 -348 22 439
7079D39J99O8j79l77l95k75k49J42L01L28L79K68L6j30l06l62l84j59JJ80L72
7100a03L65L23J10r2l30l78l60k44M2J53L88K92K96K17m4k49l35m04k60r8J13
7121e98L38L66L87J86J1k64l04m00l06q1J00K81L32M18J98j6j42l35l74l37k14
7142g54J11K81L64L94K39M7j43l00m17k95j31K2J29L20L99K81J07k4k79m02l70
7163d21k29k9J82L39M12K73K01j38k11l48m19k16p0J12K96M20K95J80O2j90m02
7184I9l93l22o2P4L10L66L94J88P1k12l24l57l19j62J7K07L90L87L08O1j70l11
7206B40l83l20k01J5K27L17L87K72J40q9l35l14l23k58q6J97K71N10K73J21J3
7227F74l02l07l75k78n8J33L05L59L26J61N8k52l46l60l31j04J07K85L48L37K43
$$ plain form
7079 439 638 706 527 150 -245 -520 -769 -627 -326 2 381 649 685 555 249 -113 -497 -656 -655 -475 -103
7100 -103 262 585 695 603 273 -105 -465 -709 -667 -514 -126 166 462 679 635 386 51 -353 -613 -711 -598
7121 -598 -260 106 493 679 690 426 122 -278 -584 -665 -565 -284 48 466 664 648 506 171 -203 -540 -754
7142 -754 -643 -362 2 396 635 682 539 239 -178 -473 -604 -582 -453 -133 266 547 654 630 351 -51 -421
7163 -421 -650 -679 -497 -158 254 527 728 590 379 31 -388 -604 -674 -562 -266 154 449 629 691 501 99
7184 99 -294 -616 -678 -604 -294 72 466 654 725 513 189 -168 -487 -649 -632 -425 -35 352 660 721 551 240
7206 240 -143 -463 -664 -649 -422 -105 282 554 694 605 270 -44 -367 -625 -711 -514 -243 267 540 661 674
7227 674 372 65 -310 -588 -646 -513 -208 151 477 638 696 444 98 -262 -593 -697 -590 -305 43 380 623
7248F23R9j91l22l92l09j50M7J83L78L86K34J81k10k02m61l30k69N0K49L47L55
7269B96L19J08j18k96l21l65k08q4J15L64L60L69J73m5k61l46l85k54j21K17K12
7290b71L97L29J97K9j99l12l66l80j51J08K46M44L19K52J27k62k65m46l09j64
7310f77J15J46L72L56K72R0j34k73l42l42k48m1K22L75L85K95J38j15k56l37m00
7331c99k03o9J66L11L45L47J85n2j86l98l62l24o0J14L11L97L28K51m7k38l47
7352G0l65k27j45Q8K24L36L92K72O0j40l34m22l31j62M6K42L54L72K21J27j46
7373E32k28l84l81j53q2J99L24L99L13J12o3k42m09l27k57o0K04L20L18L25J54
7394F14k9j64l64l62k99r4J13K89L86L72K63m9j47l61m42k48j68J4L22L48L29
$$ plain form
7248 623 722 531 209 -183 -492 -642 -595 -412 -34 352 586 767 557 355 -106 -436 -705 -655 -406 -59 296
7269 296 615 723 605 309 -12 -377 -585 -669 -554 -190 170 539 712 667 406 60 -325 -579 -700 -483 -271
7290 -271 126 455 652 681 482 170 -196 -576 -727 -619 -373 71 390 642 769 507 242 -204 -513 -677
7310 -677 -562 -416 -44 312 584 674 540 267 -75 -417 -665 -706 -484 -109 276 571 709 594 338 1 -399
7331 -399 -602 -671 -505 -194 151 498 683 631 445 47 -315 -639 -699 -585 -274 123 451 702 655 417 70
7352 70 -295 -522 -667 -579 -355 -19 373 645 705 565 231 -191 -522 -684 -638 -396 -42 330 551 678 532
7373 532 304 -80 -461 -614 -696 -497 -173 226 539 651 588 346 -63 -390 -647 -707 -503 -183 135 460 614
7394 614 585 421 57 -305 -604 -698 -585 -296 90 462 725 676 529 168 -274 -522 -690 -676 -354 -6 323
7415C23K71R0j64k96l80l75j50j4K48L53M13L11L5j09l01l70l06k28l1K18L24
7436a38L89L12J06n8k33m26l62k27qO6L84L61L20J30k1j71l92l16l13j18J10K89
7458c16L81L28K36N2j84l72m21k49j78J25K66L73K84K60L7j05k62m14k92j90j5
7479f56K13L59L83K86J04j34k92l84k97k37RJ66K77L78L34J61k8k70l58l78k59
7500f23p6J22L49M17L06J89q3k05l25l66k27j34Q9K50L45M01K12J9j08l84m16
7521b48k83j78N0K64L41M01K42O2j56k94l37l30j49l1J97L21M20K89J04j02k76
7542C07l83l59k15n4J97L90L01L00J73r2j96l81l34k87q4J65L03L57L20K68Lk39
7564D60l76l84k36j39O3L26L13L92K32M9j93l11l56l25j88J6K93L51L90K39O0
$$ plain form
7415 323 594 684 520 224 -156 -531 -681 -695 -447 -94 319 630 665 556 255 -115 -421 -649 -680 -462 -138
7436 -138 251 563 669 611 378 -48 -410 -637 -645 -579 -195 166 486 616 595 424 32 -284 -597 -715 -605 -316
7458 -316 65 393 629 681 497 125 -296 -545 -723 -598 -332 41 325 585 622 517 255 -159 -451 -641 -656
7479 -656 -443 -84 299 585 689 555 263 -121 -418 -655 -646 -480 -203 175 509 670 642 372 14 -364 -623
7500 -623 -699 -577 -228 189 495 684 601 396 71 -295 -522 -656 -567 -317 28 429 641 660 552 168 -248
7521 -248 -531 -709 -659 -395 -54 347 589 651 495 201 -136 -466 -615 -646 -449 -128 292 581 685 583 307
7542 307 -76 -435 -650 -704 -507 -117 184 484 657 565 369 -12 -346 -633 -717 -552 -249 108 428 696 699 460
7564 460 84 -300 -536 -675 -612 -286 27 419 651 700 507 196 -160 -485 -673 -657 -364 -13 377 616 676
7585F76j01l84l29l05j92L0K10K87L42K90J72j45k14l92l00l23jJ54L35M58K56
7606E24J71l8k66l58l45k29j28J25L11L65L31J94L2k68l36l77l06q5J13L36K96
7627F2M23J17k4j04k74l45l68k08R0K22M06L28L35J9j02l21l67l08k19L0K13L80
7649a5K86K38J66p2k84l00l88k20k7P0L90L57L03J81m7k88l42k88k96j11J35K89
7671b63L71L25K39l2j69l38l63l17j43J01K70L75L74K42nj84l12l36l17j81O7
7692e96K34L05M00K29Q1o2l19l70l65k25L1K22L41M19K04P9k1k84l14l64j82n3
7714f10J36K89L65L41J78j3k25m08l75k70m7R4L25L42L34K04m2j73l05l88k17
7735d65j78M5K13M07L78K40j4j19k93m23k83j89O0K35L34L93K39K7p8k40l54l16
$$ plain form
7585 676 575 191 -138 -443 -635 -605 -395 -108 234 524 696 551 337 -55 -355 -678 -679 -525 -190 268 524
7606 524 695 657 391 33 -312 -541 -669 -544 -233 132 463 657 689 421 85 -292 -598 -683 -570 -234 62
7627 62 485 602 578 474 200 -145 -513 -721 -631 -409 -3 325 660 679 577 256 -111 -419 -638 -608 -395 -15
7649 -15 271 509 675 603 319 19 -369 -589 -616 -546 -156 201 504 685 638 350 8 -280 -576 -687 -552 -263
7671 -263 108 433 672 640 471 133 -230 -547 -690 -589 -319 56 430 672 667 483 171 -165 -482 -663 -596
7692 -596 -362 -57 343 572 653 591 272 -98 -463 -688 -657 -435 -94 325 529 608 587 303 -11 -375 -557 -610
7714 -610 -474 -185 180 521 699 686 461 53 -322 -592 -639 -545 -220 122 456 660 618 445 140 -248 -465
7735 -465 -643 -598 -385 22 400 640 626 507 214 -209 -492 -681 -621 -386 -52 341 580 607 529 289 -65 -381
7757c81k84KJ99L43L44L21Q1l8k97l55l46j64p9J25L42L28L44J54l4k37l06l76
7779c14l01q3J73K90L67K78K24nj69l70l35k56j57P0K39L40L69K18O5j56k78l95
7801a86l41j52N5K69L11L66K02Q5r3k53l61l59j50m3J50L55L73L37R1o9k50l57
7823b0l44k64J2J89K23L61L46J27j4k35l35l43l07o8O3K69M11L57J96J9k21l29
7845I3l46k71j13L9K66L05L97K09Q0j42k83l82l47j27k1K59L30L39K57J25j07
7866E60l13l16l44j52j3J38K89K73M10J55q3k51l36m03k51j0J49L45L15L31J75
7887F68j21j15l80l69k46q5P2K50L80L73K03M7k37k84l62l14j42P0K46L59L46
7908C59J98O3j25k49l83l08j85k7J79M49L26L05K6n8k84l92k92k14j4J77L16L30
$$ plain form
7757 -381 -665 -663 -464 -121 223 544 625 587 290 -65 -411 -575 -654 -529 -187 141 485 639 605 368 62 -314
7779 -314 -615 -698 -525 -235 132 410 634 629 460 90 -245 -501 -658 -588 -349 -9 360 578 643 487 209 -186
7801 -186 -527 -679 -624 -355 -44 322 524 609 516 263 -98 -457 -607 -650 -500 -145 228 565 656 587 337 -20
7823 -20 -364 -628 -616 -427 -204 157 503 630 616 381 46 -297 -604 -672 -609 -340 71 428 624 643 422 93
7845 93 -253 -524 -637 -598 -332 -27 370 579 659 517 234 -148 -495 -622 -643 -384 -54 285 542 667 560
7866 560 247 -69 -413 -565 -578 -440 -151 122 532 687 604 353 17 -386 -637 -647 -498 -153 162 493 668
7887 668 547 432 52 -317 -563 -648 -576 -326 54 427 630 677 440 156 -206 -520 -662 -592 -346 13 359
7908 359 557 620 495 246 -137 -445 -630 -657 -478 -29 297 602 628 570 286 -106 -398 -612 -626 -449 -133 197
7930A97L21P7k5k05l53l30k81r3J10L46L82L46J41j8k00l45l65k30j14J38K20
7951b81L21L50K15M2j43l44l49l14j32L6L09L24L40K57L4j38l44l16k76j93RJ54
7973d39L50L55K43J52p2k99l22l41k97O4J56L16L67K54J71q7k32l69k62k35j42
7994f69J67K37M21K92K23m7j57l88l25l32m9J12K21L74K93K28L1j38k83l72k95
8015d56j85J8K65L41M03K43L3j66k99l34l20j76R5J36L53L36K40J75r1k70l61
8036b0l34k64rJ49L02M12L03Q7m8k34k89m34j77p3R2K74L47L63J81L8k11l41l31
8059b17l34r3R1K92L69L04J76M3j39l44k80l43j84O2J77L56L98K89K6j20k73m33
8081a77k98j96J9K55K79L68K38J25l6k74l31k92k96m3J95K40L94L00K04l3k89
$$ plain form
7930 197 518 595 570 365 12 -318 -599 -692 -582 -236 146 492 633 615 415 70 -295 -525 -639 -501 -281
7951 -281 40 390 605 647 504 160 -189 -503 -635 -599 -290 34 374 631 665 527 183 -133 -409 -602 -593 -439
7973 -439 -89 266 509 661 589 290 -32 -373 -670 -606 -450 -134 233 487 658 571 339 -30 -292 -527 -669
7994 -669 -502 -265 156 448 671 624 467 79 -246 -578 -627 -515 -294 80 373 601 632 494 211 -161 -456
8015 -456 -641 -623 -358 -17 386 629 662 496 197 -137 -457 -633 -538 -402 -49 287 527 702 611 341 -20
8036 -20 -354 -618 -627 -478 -176 236 539 626 578 344 55 -379 -556 -629 -537 -263 84 447 628 666 455 114 -217
8059 -217 -551 -644 -553 -261 108 412 588 631 492 148 -132 -475 -659 -597 -420 -64 334 623 649 529 256 -177
8081 -177 -475 -671 -652 -397 -118 250 488 613 577 303 -28 -320 -616 -659 -464 -224 170 470 674 641 352
8102C52l19l50k59q3J42K87L43L21J50L5j34l55l64l15j48J14K42L94L26K42J0
8123F31j88k99l20k70j57J8J97L38L03L34L1p4k38l87l65k22J8K20L42L36K55
8144E03J66j46j97l90k95k33o7J31L08L35L88J40j2k46l55l07k93m8Q7L45K76
8165I0L38J82N2k28l37l08k85j38N4K33L10L65K47J06j80l11l94k76j62L9K78
8186c25L31K55K61O1p4k38l76l50j75m7J98L67L50K97J18p6l04k77l79j95q0K08
8208d50K32L91K76J59Kk28l08l65k63j51J21L27K98M20J51j1j45l56l65k89r7
8229f51Q8K05L44L64K29O3j30k98l95k96j50QK37L14L68K10J25j17k72l57k95
8250d06j81p9J93L12L57L34R0k4k70l76l08k31n4J28L47K98L19J57n1j38l38l53
$$ plain form
8102 352 33 -317 -576 -659 -517 -230 113 434 584 619 485 130 -234 -549 -697 -583 -341 53 379 621 631
8123 631 443 144 -176 -446 -603 -585 -388 -50 253 587 618 544 306 -81 -446 -668 -650 -430 -88 248 503
8144 503 669 523 326 -64 -359 -592 -659 -528 -220 115 503 643 631 385 30 -277 -570 -618 -531 -186 90
8165 90 428 610 662 434 97 -211 -496 -634 -580 -347 -37 328 575 681 501 190 -204 -480 -642 -603 -325
8186 -325 6 261 522 583 509 271 -105 -455 -630 -677 -479 -112 238 535 653 577 273 -4 -383 -578 -658 -450
8208 -450 -218 173 449 608 610 382 74 -291 -554 -705 -584 -257 41 461 612 601 456 100 -265 -554 -651
8229 -651 -563 -358 -14 350 579 642 512 214 -181 -477 -627 -619 -382 -68 300 510 635 518 246 -111 -406
8250 -406 -587 -666 -473 -161 196 530 620 596 326 -50 -358 -589 -643 -515 -168 130 449 606 555 417 79 -274
8272b74k62j55J19K90L66L63K20l7j72l46l83k51j28P3K64L07L46J74R2r9k97
8293B10l51k83k54K8K75L13L55K71O9j09k80l27l11j28q9J63K79L10L45J32n9
8314E59j70l64l99k35m2J75L11L30K64J91m7j58k87l53l05r6R7K44L06L64J85
8335E70P8k04l13l65k96j19Q6K35L23L89J36R6j24k50l75k61k13MJ95L12L56L31
8357E91R4j49k46l77l57k00P0J56K97L16K70J53n4j63l59l03l26o0J26L03L52
8378A34L89J54k4k04l59l41k19j35J15K45L17K80K27Q1j89k73l89l05j40N1K69
8399c16L26L18K80J2j50k76l09k73k01L4J49L11L16L13J13p9k39l66l25k36l3
8420f31J75L11L61L11P5m7k30k67l19k60j04J63K26L43L52J31Jk19k51l40l14
$$ plain form
8272 -274 -536 -691 -572 -282 84 447 667 630 458 112 -271 -522 -650 -577 -313 -6 340 514 606 507 210
8293 210 -141 -424 -678 -650 -375 -62 293 564 633 524 244 -83 -394 -522 -611 -448 -169 141 486 618 559
8314 559 389 25 -374 -609 -651 -476 -165 165 429 620 573 415 128 -225 -530 -626 -529 -285 21 385 570
8335 570 648 444 131 -234 -530 -649 -563 -328 -5 384 520 616 492 242 -133 -394 -607 -603 -408 -96 260 591
8357 591 685 536 290 -87 -444 -644 -574 -418 -121 195 465 618 564 401 42 -261 -587 -647 -521 -218 134
8378 134 523 677 653 449 90 -251 -470 -605 -490 -245 72 352 579 660 471 198 -191 -496 -636 -585 -316
8399 -316 10 328 608 620 470 194 -115 -388 -589 -555 -406 -95 221 534 647 568 329 -37 -362 -598 -631
8420 -631 -456 -145 216 527 602 555 325 58 -261 -521 -625 -462 -236 107 459 590 591 372 121 -219 -533
8441e33q8R1K97L47K94J90nj47k22l38l56j44L0K33L07L87K62P4j66k94l58l24
8463d63j59Q6J50L16L09K54J78j55k02l34l43k37m2K03L05L08L36J23m7k37l67
8484a8k55k39p7J27K26L37K92J88K8k07k95l47k96j31R9K82L09L82J78J5j17l41
8506A40k75l43j22K8J72L31L75K71O9j38k25m08l24j96J9J94L32L42K62R4p3k25
8528C00l69k82k79K3R0L13L55L45J33m9k30k91m08k18J3L6L02K75L39J81N9k19
8550D19l24l25k66j34K5K98L44L13K48l2q9l32l53k31j75pK18L41L08K64J13j28
8572D95k36l24l66k31M7J76L34K97L00J30p6k41l50l14j85q9J36L34K83L25J51
8593E96k1k18l07l67k71m5Q1L65K47L28J87jj85k83l57k66j10L9K71L74K79K25
$$ plain form
8441 -533 -621 -530 -233 114 408 598 593 446 224 -114 -470 -614 -584 -351 -44 343 605 679 513 219 -139 -463
8463 -463 -622 -536 -386 -70 239 493 671 516 314 -20 -363 -600 -642 -439 -134 174 510 633 586 349 -18
8484 -18 -273 -512 -589 -462 -236 101 393 581 609 402 107 -240 -536 -667 -568 -286 23 405 583 598 481 140
8506 140 -135 -478 -600 -572 -400 -69 306 577 646 508 283 -125 -449 -645 -626 -432 -100 242 504 598 525 300
8528 300 -69 -351 -630 -607 -517 -204 151 496 629 580 350 59 -349 -567 -554 -518 -216 59 398 579 638 419
8550 419 95 -230 -496 -630 -605 -307 37 350 598 566 477 145 -208 -439 -614 -621 -403 -62 246 510 623 495
8572 495 259 -65 -431 -662 -615 -439 -105 192 492 622 546 305 -45 -359 -544 -633 -497 -163 120 445 596
8593 596 575 357 50 -317 -588 -633 -552 -187 60 388 575 574 389 106 -251 -517 -627 -588 -317 57 336 561
8615E61O7j73l43l09k46k16J17J52L63L30K10Q7o7k51l43l66j90k4J67L48L70
8636B44K06J37j8k59l12l56k27o3J58L15L10L07J09K8j57l32l85k64j08J14L22
8657b31L40K77J98l3j14l13l43k68j32R2K03K92L69K08N5m8l68l84k21k27O2K24
8679c62K98L54K11O3k3k67l20l17k00k9J58L24L14L02J55o6k58l34l64k45L7J12
8701d57K83L19K63J37K0j96l29k52l59o7J13K57L34K96K83k9k08l09l20k65j12
8722e98O9K16L11L01K34Q0j04l24l11l05j69j8K45K96L19K90J10j53k34l45k95
8743c85j83k2J23L07L49L31R3j2k60l24l37k63o6J66L02L28L13J63l5j78k82l60
8765b32j98j57P6K58K72L76J79Q6k03l30l51k81j07R8J89K99L85J80O5j17k24
$$ plain form
8615 561 628 455 112 -197 -443 -659 -542 -390 -27 303 513 600 533 282 -61 -427 -617 -641 -474 -126 244
8636 244 450 587 569 310 -2 -358 -585 -648 -490 -175 135 442 551 579 422 90 -295 -559 -667 -553 -231
8657 -231 109 386 584 551 437 124 -219 -487 -619 -527 -324 -32 337 545 600 552 184 -200 -421 -648 -586 -362
8679 -362 -64 290 501 564 541 274 -46 -363 -563 -592 -434 -110 204 506 661 595 337 3 -361 -606 -569 -457
8701 -457 -174 145 408 545 565 369 40 -212 -571 -638 -525 -268 66 362 645 616 408 99 -221 -486 -598
8722 -598 -529 -313 -2 299 533 613 509 185 -126 -431 -600 -618 -373 -77 242 532 642 489 255 -90 -385
8743 -385 -568 -590 -467 -160 189 520 613 601 341 17 -320 -583 -649 -483 -181 147 460 623 588 410 128 -232
8765 -232 -430 -587 -511 -253 19 395 574 660 457 127 -224 -505 -612 -514 -325 -26 359 539 604 487 263
8786B63l26l41j73m3K02L46L39K93J65j74l09l01l37j89K7J14L26K44L34J57k4
8807E93k27l05l72k73n0J21L29L02L01J89Mk35l33l07k57l5P4K29L13K99K29J1
8829F00j50k82l63l12j39Q3K94K84L41J55P6j08k91l11k63j80kJ56L34K83K79
8850D84J32r0j72m38l29j51k3J20K86L94K72J23m0j65l88l11k51q5J43K44M05
8871A60K33K19mj96l18l49k58j26R9K70L49K82J69M6j45k23l57l59r6MK22L15
8893f3L58K59N2j33k89l11l11j62J4J17L80L09K24J48k8k39l61l06k19q4J36L26
8915a83L39K78K17j17k31l15l28k19n5J29K20L73K64J90M2k09k92l65k57j02J
8936f20L22L04L46K47j6j19k88l37k90j63K9J87K93L22L28N6q5k78l85k83j85
$$ plain form
8786 263 -63 -404 -577 -620 -418 -72 267 560 725 551 242 -59 -396 -585 -558 -444 -118 126 460 617 593
8807 593 366 61 -311 -584 -634 -513 -184 118 419 608 612 377 44 -263 -520 -555 -481 -252 61 360 589 600
8829 600 450 168 -195 -507 -646 -563 -269 15 356 511 587 479 188 -123 -386 -566 -568 -412 -78 205 484
8850 484 616 526 354 -84 -413 -564 -587 -467 -181 213 485 608 568 403 15 -296 -547 -632 -489 -245 160
8871 160 393 612 608 412 94 -255 -513 -639 -540 -270 79 361 530 576 431 208 -149 -508 -604 -600 -378 -63
8893 -63 295 554 606 473 184 -127 -438 -600 -586 -469 -89 220 444 592 564 325 -36 -342 -561 -645 -509 -183
8915 -183 156 434 651 534 303 -12 -340 -559 -614 -485 -265 108 372 562 604 395 103 -262 -519 -621 -620
8936 -620 -298 6 352 599 583 464 176 -161 -451 -614 -585 -398 -105 217 545 601 516 238 -147 -430 -615
8957f15lK11L16K93K69J50j04k50k86l02k29p7J77K36L90K82J83n4k50l02l87
8978c52k00o1J51K22K99K81K11M6j85l18l09k68j38J7K66L95K66K75j0j22l30
8999A36k80l25j51R5J30L18L09L15N0p3k70l70k72k39jK09K67L55K98J07q4k32
9021B92l62k75j77j00J45L20K96L37J19Jj83l90k85k69o6R4K67L32L66J00K4j48
9043D38l02l13l13j41O7K09L61L10K82kj06l12l05k76k16Q5K14K77K93K98P6j52
9065D72j86k81l36k56NJ51L01L78K21J88j07k25l36l12k39l2J03L18K89K96J91
9086F03k4k15k72l71k75q5J09L06L12K92J48P8j90k73l05k56j27J7K24L24L01
9107C21K02J05j26k69l60l20j94M6K43K96L04K76J16j23k68l00k95j98j7J71K32
$$ plain form
8957 -615 -618 -407 -91 202 471 621 517 267 -19 -321 -550 -627 -450 -214 176 458 641 587 337 35 -352
8978 -352 -552 -613 -462 -240 59 340 551 597 412 94 -215 -483 -621 -604 -338 57 323 598 588 466 136
8999 136 -144 -469 -620 -525 -395 -77 232 547 597 524 254 -116 -388 -627 -628 -419 -152 203 501 608 524 292
9021 292 -70 -345 -522 -622 -477 -157 139 476 595 596 413 23 -262 -531 -597 -503 -236 96 462 562 586 438
9043 438 136 -177 -490 -631 -564 -355 6 316 598 596 490 178 -127 -403 -619 -534 -320 -43 250 548 624 472
9065 472 286 5 -331 -587 -582 -431 -130 248 469 657 550 325 -11 -323 -562 -594 -491 -173 116 412 603
9086 603 579 364 92 -279 -554 -639 -530 -224 88 380 528 606 416 143 -162 -418 -545 -528 -304 20 321
9107 321 523 628 502 233 -127 -447 -641 -595 -352 -56 248 524 640 517 249 -51 -346 -544 -561 -390 -158
9128a58L69K49J39j9k46l32l40j78m7J32K83L07K84K01o6j65l26k79k50j34Q1
9149d95J87L98K90K14Rk13k58l17k86j04Q4J93L60K66J76J06j31k34l86k93j54
9170e88oK23L17L46K40J05j23k72k69l45j60m6J45K90L00L30J56o3k12l45l07
9191b84k52p5J26L19K84L30J34j9j74l05l30k41p9Q0K12L26L10K32J2j60k94l38
9213a86k63j21L3K46K78L35K08N3j25k36l16k77k05j5K05K76M18K62L5l3l30l28
9235h6l03j82L0J29L13L01K55J30m2k01l17k73k64p2J09K33L89K86J66m3j23l67
9257F8l27k03q8L9K41K93L12J89N4j46k46l50l26j24O6J95L13M01J73M6j25l04
9279A51k44k75j82j4J56K74L46K80J03p0k25l48l26k01J5J09L03L25K51J31q0
$$ plain form
9128 -158 211 460 599 580 334 2 -338 -516 -563 -431 -148 159 443 644 578 413 87 -192 -442 -576 -495
9149 -495 -308 90 380 594 603 390 132 -185 -471 -575 -491 -298 62 328 504 610 479 245 -141 -434 -588
9170 -588 -594 -371 -54 292 532 637 514 242 -27 -372 -532 -578 -433 -143 157 487 643 580 368 23 -284
9191 -284 -536 -611 -485 -166 118 448 582 563 389 84 -246 -487 -566 -486 -274 52 362 594 606 446 152 -186
9213 -186 -449 -570 -537 -291 -13 322 530 583 458 222 -94 -371 -576 -591 -386 -110 308 570 605 572 242 -86
9235 -86 -389 -571 -541 -412 -99 202 457 587 545 344 27 -246 -510 -582 -473 -240 149 435 601 558 435 68
9257 68 -259 -462 -550 -511 -270 23 335 524 578 432 186 -164 -490 -614 -548 -353 -40 361 534 580 455 151
9279 151 -93 -368 -550 -564 -408 -134 212 492 595 525 300 -48 -374 -575 -560 -451 -148 177 428 559 479
9300D79j80l23k94j51j17P6K50L45K61K04Nj79k98l65j99j32R8K62K93L10J74
9321E19L2j13l19k86k78j81K3K30L04L20K29J03j23k60l33k63j70MJ32L45K78
9342A93K35J23n7j48l76k98k54o0J97K25L94K47J51m7k14l23l02k25p1R9J81L78
9364D8L43J80pj90k61l23k71j26L8K68L18L28K02Qj68k51l12k95o7L4J51K84L30
9387B61K80M6r6k57l79k21k62L2K00K44L49K38J44q3k85k18l73k23m1J51K70L70
9409A47K46J55j0k23k81l56j99n6J05K55K64L09J52P9j94k68l34k88j04L1L04
9430b66K87L45J78J9j40l07l13k41j18kJ74L30K69L13N8n7k46l67k81k05LJ28
9452d39L30L24K62J28j22j78l68k63j38j40J40K71L42K59J58j6j51l45l24l30
$$ plain form
9300 479 299 -24 -318 -469 -586 -510 -260 85 346 550 555 376 78 -287 -486 -618 -520 -258 35 345 519
9321 519 551 438 119 -167 -445 -626 -603 -373 -69 251 480 583 460 200 -133 -396 -566 -562 -430 -85 193
9342 193 428 551 494 346 -30 -328 -582 -642 -445 -220 174 421 572 525 311 -12 -314 -539 -610 -511 -330 48
9364 48 391 571 564 374 113 -210 -481 -607 -569 -301 17 345 547 555 387 136 -176 -471 -538 -504 -353 -69 261
9387 261 541 587 491 234 -145 -366 -628 -596 -396 -152 197 435 579 496 211 -7 -380 -603 -644 -493 -223 147
9409 147 393 548 538 315 34 -322 -521 -577 -472 -217 47 356 508 587 393 125 -209 -497 -601 -570 -266
9430 -266 21 366 544 563 423 116 -197 -438 -556 -558 -384 -54 215 528 586 529 283 -84 -365 -570 -567 -439
9452 -439 -109 215 477 605 483 305 -63 -326 -464 -604 -464 -193 149 408 566 550 399 54 -270 -600
9472f00m9J57K95K87K87J87l6j03l13k63k96j08K3J85L79K86K24N0j06k42m37
9493a93k70r6N9J55K61L36K17J40j46j88l19k77k70%J69K57M31K03J14q4k37k50
9515A2l17k04p9J25K91L11K59J92j6j95k60l25l12j00J36K44L30K97J83j5j18
9536D39l09l12k92r8O1K33K17L54J88J23j02k74l93k62j66J4K09L04L92J29J54
9557F09j38j85l42k88j53n4J53K71K72L02J67o3j97l39l00k84PJ03K96K68K85
9578C90J65m4r9l52l01k22j04L1K33L58K87K20K4j73l01k79k81j12N2J71L49K68
9600B80K11R5j21k50k82l86j17l8K29L27K94K13J12q2k46k87l31j56j4J68K23
9621a58L36K57J51n4j84k97l34k34j02J28L49K85K90J62Jk39k87l26j69j38N4
$$ plain form
9472 -600 -649 -492 -197 90 377 564 528 425 112 -151 -447 -555 -532 -347 32 318 542 592 486 244 -193
9493 -193 -463 -559 -500 -345 -84 252 469 609 463 275 -44 -321 -591 -591 -422 -165 266 469 583 499 262 12
9515 12 -305 -509 -588 -463 -172 139 398 590 574 379 119 -206 -518 -618 -482 -238 92 389 572 557 439
9536 439 130 -182 -474 -572 -511 -278 -61 293 481 604 502 228 -165 -427 -593 -579 -370 -66 326 455 609
9557 609 471 286 -56 -344 -497 -551 -398 -127 145 447 614 551 354 15 -285 -569 -562 -459 -163 105 390
9578 390 555 511 412 60 -241 -463 -567 -536 -303 55 342 562 586 413 112 -167 -448 -560 -508 -337 12 280
9600 280 491 586 465 215 -67 -453 -570 -608 -379 -52 242 455 567 485 239 -48 -379 -535 -549 -381 -158
9621 -158 178 435 586 532 348 51 -283 -517 -619 -491 -142 143 433 595 596 357 70 -256 -425 -563 -509
9642e09K39K86L49J95M4j53l39l38k44j16O3K21K94K72K08J03j26j93l37l07j94
9663e82L9J25L41K92K73J80j12l27k54l70j35QQ7L54K20K99J40q0j91k81k97k87
9685e58m9Q7L28L00K91K03k7j95l10l15k16j07Q9K00K88L37J44P9j39k42l67k46
9707d25j88N2K55K88L06K38O2j44k89k55k94j34l3K07K38L16K47J26m4k88k80
9728c9k83k38J7J14K86L08K84J06n4j93k84k54k31r3N8K77L08K90J82k5j54l04
9750G8l09k45q7J14J87K59L20J76M5j39k49k77k75j51RJ75L49L01K41N0q8k89
9772A95l13l46o8J4J31K83L31J76J79p1k54k96l25k07J2J29K06L85K78J29n4j87
9794C27l69k46j83q7J31J98K93K75J74N1j47l23l10k32j47M3L47K27L73J18K4
$$ plain form
9642 -509 -270 16 365 560 604 451 112 -226 -470 -586 -523 -302 -8 264 472 575 449 256 -81 -388 -582
9663 -582 -543 -418 -77 215 488 668 556 229 -25 -395 -530 -522 -435 -81 139 438 578 498 307 26 -271 -558
9685 -558 -607 -520 -192 108 399 602 575 380 70 -245 -461 -568 -479 -279 9 346 490 569 430 188 -179 -425
9707 -425 -613 -561 -306 -18 288 526 588 444 155 -100 -394 -528 -561 -354 -116 200 447 573 529 241 -39
9728 -39 -322 -560 -543 -429 -143 165 449 555 501 308 24 -230 -461 -554 -496 -219 89 379 561 536 382 78
9750 78 -231 -476 -563 -449 -262 -3 317 493 538 399 150 -127 -402 -553 -544 -369 -20 281 522 572 484 195
9772 195 -118 -464 -532 -518 -387 -104 227 403 582 511 257 -39 -364 -571 -559 -430 -224 161 439 568 514 327
9794 327 -42 -288 -471 -558 -427 -229 64 339 513 564 417 94 -216 -448 -595 -552 -205 22 395 513 537
9815E37j41k67k52k76j48qJ71L42K51K84J05j19k79k67l32j72PK00K66L05K23
9836D30J37r5j93k86k42k37j18J69K43L42K75J67r0j78l03k98k47l0J20K26K73
9857F5K97J15N3j35l12k27l14j03O5J97L22K77K55J4j23k46l17k83j44M9K14K47
9879c4K83K44Q8o9k68l37k63j77j6J41L06L50K04J17j25j65k75l09j50q4Q6L00
9901a53K65K92J72Lj94k93l49k68m0J11K63K69L16J55J2j95k42l03k12j47%K33
9923c05K98K83K71L7j57k12l03l41j36N0K08K50L26J52J37q0j96l60k50j87j3
9944e28J36K88L25J87J95j08j76l18k98k01p5J21K79L24K19J21N1j54l20l28k10
9965d70p3K7K77L13L16J55j3j05l20k44k95q3L4K03K84K52K92L1j36k21l35l11
$$ plain form
9815 537 396 129 -123 -399 -547 -555 -384 -42 209 493 598 479 200 -67 -399 -571 -564 -364 -98 207 430
9836 430 567 472 279 -7 -249 -486 -604 -435 -192 150 425 592 502 324 21 -277 -524 -554 -434 -208 65
9857 65 362 477 530 395 83 -144 -458 -561 -496 -299 23 300 555 569 446 200 -117 -400 -544 -495 -281 -34
9879 -34 249 493 581 512 244 -93 -356 -533 -549 -408 -102 248 452 569 444 279 4 -305 -455 -539 -453 -153
9901 -153 112 404 576 579 385 92 -257 -525 -565 -454 -191 78 394 549 561 366 124 -179 -391 -538 -538 -305
9923 -305 -7 276 547 584 427 215 -88 -429 -565 -515 -307 -57 269 421 558 478 282 -78 -328 -515 -528
9944 -528 -392 -104 221 408 603 495 319 1 -297 -498 -573 -452 -173 151 370 491 542 388 68 -260 -470
9965 -470 -543 -516 -239 74 390 545 532 427 107 -137 -432 -515 -481 -278 6 258 550 581 445 224 -111 -422
9987d22j64O3K04L04K52K45O7j33j97k94k50k28j4J44K45L60K28J38m0j62l73
10008b7k99k16oJ01K80K69L14Q9k8j01l28k61k38j01M5K48K98K81K23kj49k57
10030A35l21k25j87J06K02K82L20J65J08j18k59l14k76j93QJ80K65L16K70J05
10050E69o1k81k80k99j68l0J45K47L20K28J57l8k27k89k98k12q8J57K45L04K62
10071C63J93l7j80k69k94k02j53N7K49K93K31K83J4j55k28l41k72j30R9J48L00
10092c1K86K04R3j65j76l03l01j55k7K13K02L33L13M8lk27l70k58k20J2J28K85
10114a19K77K74Q0m9j59k74k55k73o2M7L03K81L05J64J6j89l16l20j59j24O2K29
10136b61K62K31K64O3j54j75m22k33j68N1K52K40L47J89L6o7k41k79l62o8LJ15
$$ plain form
9987 -422 -586 -523 -319 -15 237 482 549 416 219 -75 -325 -553 -567 -423 -178 182 410 548 508 346 -27
10008 -27 -326 -542 -548 -447 -167 102 416 505 477 376 48 -213 -451 -552 -507 -259 39 320 543 541 392 135
10030 135 -186 -411 -598 -492 -290 -8 312 477 585 467 208 -106 -382 -575 -567 -387 -122 194 464 569
10050 569 508 227 -53 -352 -520 -550 -405 -158 162 390 547 509 282 -7 -305 -517 -605 -448 -203 101 363
10071 363 556 519 339 70 -224 -426 -579 -522 -273 20 251 534 548 393 165 -176 -448 -578 -479 -331 -31
10092 -31 255 459 552 387 211 -92 -393 -548 -575 -362 -160 173 486 534 531 304 -66 -324 -544 -532 -404 -119
10114 -119 158 432 512 463 304 30 -225 -498 -560 -513 -210 71 376 540 556 367 51 -269 -428 -552 -490 -261
10136 -261 1 232 496 559 405 230 -192 -425 -593 -542 -290 -50 297 486 522 455 214 -65 -427 -495 -492 -377
10158c77L22K19L10N6m0k15l38k51j96l3J09K64L59K44P6j9j88l15k79j79j15
10179e86J20K36K98L00J84jj50l36l43k02j29J46J38L46K85J41J15j43k47l39
10199a67k27j60RJ99K73L14K27O9p3k84k95k66j80K5J98K25K89K66P9j1k03k85
10221B2k84l06L4M5L11K72L09J61j6k30k98k78j89j11J27J85L11K91J70N5j83
10242C98k32l87k03j38O6K26L14K66K03N0j21k94k66k30j45k2K12K47K87K78P6
10263E85r9k30l69k30j84K2J35K89K84K51R3p1j99k76k80k31LO7K59L51K78J22
10285E70m4j63k87l44k14q5J58K08K54L13J24O4j37k85l02k75j26R5J97K67L08
10306B96K01O4p5l43k65k94j51Q6J84K41K43L16N8q5k07l24k25k71N3J37K50L72
$$ plain form
10158 -377 -55 164 474 530 490 275 -63 -314 -510 -543 -434 -170 189 433 509 490 302 -13 -292 -471 -586
10179 -586 -466 -230 68 368 552 551 401 65 -278 -480 -609 -463 -325 21 306 447 562 419 172 -167
10199 -167 -394 -554 -545 -346 -73 241 468 537 464 180 -115 -381 -561 -536 -338 -113 176 442 521 510 307 22
10221 22 -262 -568 -534 -489 -178 94 403 564 548 318 20 -258 -447 -558 -431 -246 65 356 526 581 398
10242 398 166 -221 -424 -562 -496 -270 44 310 513 563 442 148 -118 -348 -493 -515 -303 -56 231 509 585
10263 585 486 256 -113 -343 -527 -505 -370 -81 203 454 547 476 277 1 -279 -510 -507 -440 -181 170 448 570
10285 570 526 363 76 -268 -482 -567 -409 -201 53 366 490 554 417 132 -170 -445 -571 -476 -279 -12 296
10306 296 497 561 486 143 -122 -416 -567 -481 -297 -56 187 503 561 476 269 -55 -280 -551 -498 -361 -111 261
10328B61K18J23j09k10k78l11k01qR7K21L15K55J55k0j84k08l60j88j37J15K48
10349b06K52K67K42k9j70k66k72j35j90J2J68L54K79J99N5j32k33l24k69j73N2
10370e19J83K34L20K44Q4o5k30k82k51k10n6J51K75K89L28P4q2k08k69k89k11
10391d90oP8K29L26J87K00j7j78k51l02k43q4L2K88K99K69J94m5j43k48k63k50
10413d18j07OK39K79K24K46N0j01k39l08k79j67K3J84K90L18K08P0p0k01k82k42
10435b77j86n5J13J65M14K06J74m0k27k94k94k20n8J39K51L18K36J41j3j66k49
10456G8k76k28j21Q3K22K45L52J84%j63k59l00k36j59Q5J96K80K95J92K6p6k18
10478B02k87k94j86OJ79K94L35K31L0o3k05l41k61j09l0J14K17K97K82J00qk39
$$ plain form
10328 261 479 602 493 283 5 -306 -507 -515 -418 -197 118 373 528 508 324 116 -244 -432 -569 -454 -206
10349 -206 46 313 555 526 356 90 -182 -317 -507 -495 -327 27 306 505 560 428 195 -129 -398 -571 -519
10370 -519 -336 -102 218 462 546 481 251 -31 -282 -492 -548 -397 -122 167 495 569 487 279 10 -279 -490
10391 -490 -496 -418 -189 137 324 524 507 329 78 -224 -467 -551 -519 -231 68 337 531 486 343 95 -168 -418
10413 -418 -525 -519 -280 -1 223 469 519 418 179 -129 -408 -575 -552 -368 -78 240 448 518 448 247 -35 -277
10435 -277 -463 -518 -405 -240 174 380 554 514 287 -7 -301 -521 -579 -440 -189 129 365 506 493 327 78
10456 78 -198 -426 -547 -464 -242 3 355 539 539 376 117 -183 -419 -578 -493 -297 -17 278 470 496 420 202
10478 202 -85 -379 -565 -559 -380 -86 249 480 510 447 242 -99 -360 -469 -499 -385 -168 129 411 511 503 264
10500B64k39l02j98p1P3K58L40K67Q1O3j99k76k52k26j33J03J86K90K43K26P5
10521E73j44k80l37k19j32O6J67K74L50J48O2j07k28l11j63k07l5J46K98K38K92
10542D51O4o3j89l11l00j49l9J65K35K53K49J28oj99k64k83k35j4L7K52K79L49
10564D10J07Qk01k92k30k27p9O7J99L00K95J25O5j39k30l24k11j65jJ98L31K84
10586B90J89O4p6k93k97k51j10l7J55L15K41K28J23j6k58l00k44k32j6J46K60
10607a19K47K69J16k4j65l04k31k81l9P8K53K85K50K54o8j84k73k75k42q4J08
10628d29K19K53K72J51N7j30j82l56k05j24k8J76K42L23K23P6l0k88l36k49j43
10649e08kK00K29L00J91J25n8k10l08k46k16m0J26K87K70K58J04l9j72k32k59
$$ plain form
10500 264 25 -277 -475 -546 -473 -215 125 392 473 536 337 61 -191 -417 -550 -447 -261 29 272 498 573
10521 573 429 149 -188 -407 -539 -473 -306 -32 318 466 528 421 193 -118 -281 -488 -523 -377 -79 159 451
10542 451 515 452 263 -48 -348 -497 -536 -371 -136 117 366 494 488 289 25 -258 -493 -507 -470 -218 61 410
10564 410 517 525 324 32 -198 -425 -504 -437 -238 62 357 482 547 408 178 -146 -357 -522 -523 -325 6 290
10586 290 479 543 467 174 -123 -374 -484 -521 -366 -51 190 418 541 525 267 -33 -277 -509 -525 -379 -119
10607 -119 128 397 513 489 324 20 -211 -492 -531 -453 -200 85 335 589 521 337 64 -211 -453 -537 -429
10628 -429 -210 43 315 466 523 393 211 -145 -350 -474 -502 -326 -84 239 462 538 508 220 -116 -365 -508
10649 -508 -510 -310 -81 219 410 535 477 267 -41 -287 -503 -543 -417 -130 140 398 502 463 291 59 -200
10670b00k10p5R8J65K51L40J30J0j13k48l11k66j11Q5K12K42L06J57M9j71k21
10691A19k56k47r3qJ54K58L22K28J4Jl08k43l04j62K0J24L06K49K86L1Pj44l60
10714fk55k33l8J22K38L18K47J14J7k08k55k81k28r5O8K57K62K66K26k8k16j65
10736A27k67k33j63M0J82K82L08K15M8r1k40l33k36j19J6J72K48K37K54M8l8k06
10758B51l13k53j95m8J58K80L27J73J38r4j50l14k13j79o1J02J87K71L10J66k2
10779E21j94k55k98k24q7O7K21L11K64K00jj92k08k81k60j30O8J64K99K75J54
10800D14R2r1k55l11k04k03Q0J75K57K48K24Q9j22j31k81k58k53k4J40K91K97
10821A74K26J40o6j90k75k94k11o1J31K00L01K31J40L3j54k45k22l12q4M3K02
$$ plain form
10670 -200 -410 -485 -387 -222 29 369 499 509 396 148 -163 -429 -540 -455 -243 -1 305 462 511 340 119
10691 119 -137 -384 -477 -485 -331 -73 249 477 491 492 184 -59 -363 -525 -505 -381 -75 174 460 491 498 354 -6
10714 -6 -261 -494 -532 -410 -172 146 393 507 524 316 61 -220 -448 -543 -475 -218 44 310 536 508 292 127
10736 127 -140 -373 -536 -496 -314 -32 276 491 539 448 208 -125 -361 -480 -464 -292 -44 193 447 495 457 251
10758 251 -62 -315 -510 -558 -400 -120 207 380 518 424 274 -40 -253 -432 -493 -391 -204 67 377 543 521
10779 521 327 72 -226 -450 -537 -470 -249 62 326 526 525 333 125 -156 -416 -546 -478 -314 -15 260 414
10800 414 506 415 160 -151 -355 -558 -478 -303 -46 202 426 515 393 262 -19 -277 -530 -554 -414 -123 174
10821 174 400 540 474 284 9 -285 -496 -557 -426 -226 75 306 446 479 325 80 -142 -454 -538 -495 -293
10842b93L35K78J94l9j21k56k94k32j47J12R1L31K80K17J8m2k53k64l48j01J7
10863e17J76K88K75K25N1p5j54l08k46j65r2J28K60L06K64R6nj96k54l01k35p4
10885e53J43K25K71K43J55J1j99k39k76k25j17N3K60K03L16K41k9n6l21k61k62
10906d17j18J10J32K74L04J67P6j11j81k87l01j02o6J90K37L17K27P9o6k02l04
10927d2l11n1n9N3L04K28K19J86n4j42k91k39k54n8O5K54K79K74J60k9j82k49
10949F1k74k02j03P8J52K79K90J88N1j19k34l09k43j08M7J51L15K49J83L9p9k60
10971A52k32k48j90L5J56K33K74K10J39j2k36k66k90j76k3J12K43K94K18Q7k6
10992D54j60k07k85j97o4L9K51K69K38K27o4j36l19k22k00r8O1J67L00K16K07
$$ plain form
10842 -293 42 320 514 475 354 98 -196 -428 -575 -463 -372 -41 239 456 474 432 179 -85 -433 -534 -517
10863 -517 -341 -53 222 447 498 423 269 -39 -285 -450 -542 -414 -154 152 416 512 507 311 57 -244 -479 -553
10885 -553 -410 -185 86 329 484 495 296 57 -219 -444 -561 -508 -248 -45 271 512 483 427 106 -155 -417
10906 -417 -535 -425 -293 -19 285 452 528 417 236 -51 -352 -454 -520 -330 -93 224 451 530 464 262 -42
10927 -42 -353 -404 -463 -410 -106 122 341 527 473 331 40 -199 -453 -511 -446 -192 87 361 521 492 310 61
10949 61 -213 -415 -518 -440 -288 -9 281 469 520 401 167 -142 -385 -493 -446 -295 20 269 452 491 412 152
10971 152 -80 -328 -518 -483 -327 -94 180 390 529 517 281 15 -275 -451 -474 -362 -119 175 393 480 454
10992 454 294 87 -198 -395 -459 -420 -169 100 338 565 501 365 46 -176 -376 -474 -413 -246 54 270 477
11013D77P1j06k70k76k66j41K0J37L09L42J74O3j22k41k23k42j81K4R5K16K71
11034A31K74R1J6k33l11k69j68k7R5K50L52J80J35pj94k70k76k34J5P2J98K02
11056B2L23J76K3j60k80k88k26q4O6K06K42L02J76j3r1k32k40k73j48pK13K33
11078f0L01K53L5n2k68k72k80q9j4J17K33K49K66N8jj96k82k49j65j18R2K85K84
11101A27K49J97m6k09k93k55k31l5L4K66K60K39J88j3r4k63l12k30q9J2K76K88
11123F6K29J91M7j67k61j61l52p4JJ75K29K72K36Q9p5k78k07k60j89L3J00L16
11145d0K34J88P9j0j67k98k38j95k4J15J56L21K27K07m0k03k27l28j75r8J18J83
11167b15K76K13J43L6j41j92k66j92j62k4K66K52K68J75N8j35k31k74j99j12L7
$$ plain form
11013 477 548 442 172 -104 -370 -511 -491 -354 -45 297 471 534 412 171 -52 -294 -475 -451 -356 -140 131
11034 131 405 496 512 279 -32 -301 -469 -496 -401 -151 201 381 516 509 315 45 -231 -465 -450 -378 -180 22
11056 22 345 521 544 384 104 -184 -410 -494 -428 -222 20 322 498 485 394 162 -78 -351 -499 -506 -293 -60
11078 -60 241 494 529 477 209 -63 -343 -432 -446 -329 -96 153 419 477 476 280 -2 -251 -416 -534 -442 -157 127
11101 127 376 573 527 318 25 -230 -461 -496 -462 -196 64 303 491 478 384 121 -191 -421 -510 -498 -222 66
11123 66 295 486 533 366 105 -56 -408 -482 -481 -306 -77 195 431 520 445 167 -40 -300 -489 -456 -356 -40
11145 -40 194 382 461 451 284 -14 -252 -447 -471 -356 -200 121 348 555 515 312 85 -243 -418 -516 -398 -215
11167 -215 61 274 417 453 312 120 -146 -338 -500 -524 -258 -6 262 437 495 360 129 -145 -344 -456 -419
11188d19J12K55K31K42Q1n0k18k28l14j86J6P6K94K57K47J38j13j49k80k57j70
11209d35j11J27K27K28K93J43qj44k97k20k28j03N8K56K54K86J58j4j61j71l20
11230a82j80j32K8J41K60K95K62k0o9k85k41k50j66N9J67K55K69J71J02p0k34
11251A80k21k74k04k0J30K64K73K34J43j03j58k71k74j68j1O7K48K30K68J24O2
11272E19j59k91k18k28j50N9K12K83K53J54L9j82j96k32k84p6K8J61K78K15K55
11293D40Q3j18j95l26k40j89P1J24L08K62J93R9j23j99k15k56j90m1J56K21K79
11314A44K33J18kk31k64k51k39oP2K42K59K84R0n0o3k77k35k02j24J1K77K42K92
11337C20J78J8j66k10k76k72q2M8J76K91K20J70P1p4j98k96k47j57K6R6K78K63
$$ plain form
11188 -419 -307 -52 179 421 502 452 234 6 -308 -494 -478 -402 -108 149 396 534 421 272 -8 -265 -435
11209 -435 -546 -419 -192 36 329 472 464 320 23 -197 -425 -528 -470 -214 40 326 484 470 309 138 -182
11230 -182 -362 -494 -466 -325 -65 230 492 472 403 118 -123 -373 -539 -480 -313 -58 211 382 484 414 180
11251 180 -41 -315 -519 -539 -409 -145 128 362 505 402 244 -27 -301 -469 -480 -413 -165 65 333 457 519
11272 519 360 69 -149 -377 -527 -468 -256 27 280 434 473 291 95 -137 -421 -497 -469 -308 -30 185 440
11293 440 523 405 210 -116 -356 -545 -474 -350 -42 220 413 512 389 190 -25 -281 -471 -512 -356 -135 144
11314 144 377 495 493 262 -2 -253 -492 -498 -426 -184 75 359 449 399 336 59 -176 -378 -502 -491 -214 28 320
11337 320 498 516 350 140 -136 -408 -490 -442 -266 25 245 415 486 412 214 -82 -329 -486 -460 -364 -86 177
11359A77K33Q7nk69k95k03k18K9J40J98K46K30J45l6j74k56k87j63p0L8K75K96
11381A18K50J03mj14k64k47k31p7L8J60L14K16K18J1j18k26k84k19k11J13K65
11402a89K18K50K05K8p7k17k90k06j76J6Q0K60L09K29N9n9k43k93j95j78rR7K41
11425a40K47K36J17j9j65k23k63j72j27Q6K13L05K63J58m7j21k55k97j59j21J09
11446c75J51K64K49J63N7j39j76k80k73j08PJ67K65K63K15O4j25j46k84k54j14
11467d09q3J53K29K72K04J52n7j76k75k48k22m4J30K49K76K12J36n1j44k56k45
11488a97k04j03J11J64K91K54J18M2j07k58k60k65r2N8K26K35K87J62M6j11j84
$$ plain form
11359 177 410 497 492 223 -72 -275 -493 -464 -324 -126 120 350 495 459 285 29 -258 -421 -491 -453 -178 118
11381 118 368 471 467 353 89 -158 -389 -466 -428 -268 46 262 480 491 373 147 -137 -356 -567 -454 -189
11402 -189 29 279 484 512 435 218 -72 -278 -454 -438 -358 -98 211 440 499 440 197 -96 -291 -469 -478 -381 -140
11425 -140 107 343 460 441 276 53 -210 -382 -509 -423 -210 95 358 516 469 348 93 -204 -363 -484 -375
11446 -375 -224 40 289 452 509 370 194 -86 -359 -467 -460 -293 -28 235 450 514 389 243 -41 -295 -409
11467 -409 -492 -339 -110 162 366 518 461 285 10 -238 -460 -504 -374 -125 151 363 499 448 304 48 -197
11488 -197 -401 -504 -393 -229 62 316 434 476 369 111 -149 -414 -506 -448 -222 13 300 462 508 397 213
$$ [...]
16383B34
##END NTUPLES=NMR FID
##END=
