##TITLE=31P_DE-80H_X3
 64 sc D2O
 26.2.2025
##JCAMPDX= 6.0         $$ Bruker NMR JCAMP-DX V2.0
##DATA TYPE= NMR FID
##DATA CLASS= NTUPLES
##ORIGIN= UXNMR, Bruker Analytische Messtechnik GmbH
##OWNER= root
$$ XWIN-NMR		Version 3.5
$$ Wed Jan 28 15:55:55 2026 Russian Standard Time (UT+4h)  Yarkov@DPX200
##.OBSERVE FREQUENCY= 81.013821
##.OBSERVE NUCLEUS= ^31P
##.DELAY= (6, 6)
##.ACQUISITION MODE= SIMULTANEOUS
##.ACQUISITION SCHEME= undefined
##.AVERAGES= 64
##.DIGITISER RES= 17
##SPECTROMETER/DATA SYSTEM= spect
##.PULSE SEQUENCE= zgpg30
##.SOLVENT NAME= CDCl3
##.SHIFT REFERENCE= (INTERNAL, CDCl3, 0, 243.863)
##AUDIT TRAIL= $$ (NUMBER, WHEN, WHO, WHERE, WHAT)
$$ ##TITLE= Audit trail, XWIN-NMR		Version 3.5
$$ ##JCAMPDX= 5.01
$$ ##ORIGIN= Bruker BioSpin GmbH
$$ ##OWNER= Yarkov
$$ C:/Bruker/XWIN-NMR/data/yarkov2/nmr/P31/2/audita.txt
$$ ##AUDIT TRAIL=  $$ (NUMBER, WHEN, WHO, WHERE, WHAT)
(   1,<2026-01-28 15:54:51.84 +0400>,<Yarkov>,<DPX200>,
      <created by zg, POWCHK disabled, PULCHK disabled
       configuration hash MD5:
       00 E9 B6 7A A2 85 ED C7 34 08 36 98 17 FE 4E 26
       data hash MD5: 32K
       A2 B1 60 38 35 9E 74 C3 0A 25 FC 26 52 0C A9 EC>)
$$ ##END=
$$ 
$$ hash MD5
$$ 92 AA 52 94 5F 04 33 34 47 27 B0 A7 F6 61 1C 83
##$RELAX= 
##$RELAX= 
##$RELAX= 
##$RELAX= 
##$RELAX= 
##$RELAX= 
##$RELAX= 
##$RELAX= 
$$ Bruker specific parameters
$$ --------------------------
##$DU= <C:/Bruker/XWIN-NMR>
##$EXPNO= 2
##$NAME= <P31>
##$PROCNO= 1
##$TYPE= <nmr>
##$USER= <yarkov2>
##$AMP= (0..31)
100 100 100 100 100 100 100 100 100 100 100 100 100 100 100 100 100 100 
100 100 100 100 100 100 100 100 100 100 100 100 100 100 
##$AQSEQ= 0
##$AQ_mod= 1
##$AUNM= <au_zg>
##$AUTOPOS= <>
##$BF1= 81.014009
##$BF2= 200.13
##$BF3= 200.13
##$BF4= 200.13
##$BF5= 200.13
##$BF6= 200.13
##$BF7= 200.13
##$BF8= 200.13
##$BYTORDA= 1
##$CFDGTYP= 0
##$CFRGTYP= 5
##$CHEMSTR= <none>
##$CNST= (0..31)
1 1 145 1 1 1 1 1 1 1 1 1 1 1 1 1 1 1 1 1 1 1 1 1 1 1 1 1 1 1 1 1 
##$CPDPRG= <waltz16>
##$CPDPRG1= <>
##$CPDPRG2= <waltz16>
##$CPDPRG3= <>
##$CPDPRG4= <mlev>
##$CPDPRG5= <mlev>
##$CPDPRG6= <mlev>
##$CPDPRG7= <mlev>
##$CPDPRG8= <mlev>
##$CPDPRGB= <>
##$CPDPRGT= <>
##$D= (0..31)
0 1 0 0 0 0 0 0 0 0.06 0 0.03 2e-05 3e-06 0 0 0.0002 0 0 0 0 0 0 0 0 0 
0 0 0 0 0 0 
##$DATE= 1769601291
##$DBL= (0..7)
120 120 120 11 120 120 24 19 
##$DBP= (0..7)
150 150 150 150 150 150 150 150 
##$DBP07= 0
##$DBPNAM0= <>
##$DBPNAM1= <>
##$DBPNAM2= <>
##$DBPNAM3= <>
##$DBPNAM4= <>
##$DBPNAM5= <>
##$DBPNAM6= <>
##$DBPNAM7= <>
##$DBPOAL= (0..7)
0.5 0.5 0.5 0.5 0.5 0.5 0.5 0.5 
##$DBPOFFS= (0..7)
0 0 0 0 0 0 0 0 
##$DE= 6
##$DECBNUC= <off>
##$DECIM= 4
##$DECNUC= <off>
##$DECSTAT= 4
##$DIGMOD= 1
##$DIGTYP= 9
##$DL= (0..7)
0 0 52 120 120 21 21 25 
##$DP= (0..7)
150 150 150 150 150 150 150 150 
##$DP07= 0
##$DPNAME0= <>
##$DPNAME1= <>
##$DPNAME2= <>
##$DPNAME3= <>
##$DPNAME4= <>
##$DPNAME5= <>
##$DPNAME6= <>
##$DPNAME7= <>
##$DPOAL= (0..7)
0.5 0.5 0.5 0.5 0.5 0.5 0.5 0.5 
##$DPOFFS= (0..7)
0 0 0 0 0 0 0 0 
$$ [...]
##$SUBNAM1= <"">
##$SUBNAM2= <"">
##$SUBNAM3= <"">
##$SUBNAM4= <"">
##$SUBNAM5= <"">
##$SUBNAM6= <"">
##$SUBNAM7= <"">
##$SUBNAM8= <"">
##$SUBNAM9= <"">
##$SW= 400.765351723535
##$SWIBOX= (0..15)
0 1 3 0 0 0 0 0 0 0 0 0 0 0 0 0 
##$SW_h= 32467.5324675325
##$TD= 32768
##$TD0= 1
##$TE= 0
##$TE2= 300
##$TE3= 300
##$TEG= 300
##$TL= (0..7)
0 120 53 12 22 120 120 120 
##$TP= (0..7)
150 150 150 150 150 150 150 150 
##$TP07= 0
##$TPNAME0= <>
##$TPNAME1= <>
##$TPNAME2= <>
##$TPNAME3= <>
##$TPNAME4= <>
##$TPNAME5= <>
##$TPNAME6= <>
##$TPNAME7= <>
##$TPOAL= (0..7)
0.5 0.5 0.5 0.5 0.5 0.5 0.5 0.5 
##$TPOFFS= (0..7)
0 0 0 0 0 0 0 0 
##$TUNHIN= 0
##$TUNHOUT= 0
##$TUNXOUT= 0
##$USERA1= <user>
##$USERA2= <user>
##$USERA3= <user>
##$USERA4= <user>
##$USERA5= <user>
##$V9= 5
##$VALIST= <valist>
##$VCLIST= <CCCCCCCCCCCCCCC>
##$VD= 0
##$VDLIST= <DDDDDDDDDDDDDDD>
##$VPLIST= <PPPPPPPPPPPPPPP>
##$VTLIST= <TTTTTTTTTTTTTTT>
##$WBST= 1024
##$WBSW= 4
##$XGAIN= (0..3)
0 0 0 0 
##$XL= 0
##$YL= 0
##$YMAX_a= 250
##$YMIN_a= -1351
##$ZGOPTNS= <>
##$ZL1= 120
##$ZL2= 120
##$ZL3= 120
##$ZL4= 120
##$ABSF1= 60
##$ABSF2= -190
##$ABSG= 5
##$ABSL= 3
##$ALPHA= 0
##$AQORDER= 0
##$ASSFAC= 0
##$ASSFACI= 0
##$ASSFACX= 0
##$ASSWID= 0
##$AUNMP= <proc_1d>
##$AZFE= 0.1
##$AZFW= 0.5
##$BCFW= 1
##$BC_mod= 2
##$BYTORDP= 1
##$COROFFS= 0
##$CY= 9.86611175537109
##$DATMOD= 1
##$DC= 1
##$DFILT= <>
##$DTYPP= 0
##$F1P= 182.462994727601
##$F2P= 168.069089081705
##$FCOR= 0.5
##$FTSIZE= 0
##$FT_mod= 0
##$GAMMA= 1
##$GB= 0
##$INTBC= 1
##$INTSCL= 1
##$ISEN= 30
##$LB= 1.5
##$LEV0= 0
##$LPBIN= 0
##$MAXI= 11.51145
##$MC2= 0
##$MEAN= 0
##$ME_mod= 0
##$MI= 1.244541
##$NCOEF= 0
##$NC_proc= 0
##$NLEV= 6
##$NOISF1= 0
##$NOISF2= 0
##$NSP= 1
##$NTH_PI= 0
##$NZP= 1
##$OFFSET= 243.8632
##$PC= 1.4
##$PHC0= 1698.773
##$PHC1= 24.15952
##$PH_mod= 0
##$PKNL= yes
##$PPARMOD= 0
##$PSCAL= 0
##$PSIGN= 0
##$REVERSE= no
##$SF= 81.0140731611343
##$SI= 65536
##$SIGF1= 0
##$SIGF2= 0
##$SINO= 80
##$SIOLD= 65536
##$SREGLST= <31P.CDCl3>
##$SSB= 0
##$STSI= 0
##$STSR= 0
##$SW_p= 25641.0256410257
##$SYMM= 0
##$S_DEV= 0
##$TDeff= 0
##$TDoff= 0
##$TI= <>
##$TILT= no
##$TM1= 0
##$TM2= 0
##$TOPLEV= 0
##$USERP1= <user>
##$USERP2= <user>
##$USERP3= <user>
##$USERP4= <user>
##$USERP5= <user>
##$WDW= 1
##$XDIM= 64
##$YMAX_p= 0
##$YMIN_p= 0
$$ End of Bruker specific parameters
$$ ---------------------------------
##NTUPLES= NMR FID
##VAR_NAME=  TIME,          FID/REAL,        FID/IMAG
##SYMBOL=    X,             R,               I
##VAR_TYPE=  INDEPENDENT,   DEPENDENT,       DEPENDENT
##VAR_FORM=  AFFN,          ASDF,            ASDF
##VAR_DIM=   16384,         16384,           16384
##UNITS=     SECONDS,       ARBITRARY UNITS, ARBITRARY UNITS
##FACTOR=    3.08e-05,      1,               1
##FIRST=     0,             0,               0
##LAST=      0.5045964,     0,               0
##MIN=       0,             -1351,           0
##MAX=       0.5045964,     250,             0
$$ Real data points
##PAGE= N=1
##DATA TABLE= (X++(R..R)), XYDATA
0@%%%%%%%%%%%%%%%%%%%%%%%%%%%%%%%%%%%%%%%%%%%%%%%%%%%%%%%%JoJ2j6J9
$$ 0 0 0 0 0 0 0 0 0 0 0 0 0 0 0 0 0 0 0 0 0 0 0 0 0 0 0 0 0 0 0 0 0 0 0 0 0 0 0 0 0 0 0 0 0 0 0 0 0 0 0 0 0 0 0 0 0 1 -5 7 -9 10
61A0k4K9l8N0q1L02n2j41j8n4kp%j0P8n0J7p4K9p2j5j0J7K3M2P3m0N7O8o5rj1
$$ 10 -14 15 -23 27 -54 248 196 55 37 -17 -19 -26 -26 -36 42 -8 9 -65 -36 -108 -123 -133 -116 -93 -51 22 -18 39 107 42 33 22
93B2K9J7J3JM0m0L7m9j1k0mm1m9L9L7Po0J6L6k4k2k8m9OO0L6M0l5J3JOk7L5l4
$$ 22 51 68 81 82 122 82 119 70 59 39 35 -6 -55 -16 21 28 -32 -16 20 -4 -26 -54 -103 -97 -37 -1 39 4 17 18 24 -3 32 -2
127bL9J7K3K8j8J8l7K0l5Qn2Oj4k0M9ln2l1N0n2L5k5l4K8KL6L7K6l7NMnr1P0j0
$$ -2 37 54 77 105 87 105 68 88 53 61 9 15 1 -19 30 27 -25 -56 -6 -58 -23 -48 -82 -54 -52 -16 21 47 10 15 19 14 -77 -7 -17
162a7M3L1M4k0J8l6m8M7p0M6Qm6MK4Qn4M0r5J1k9rj5M4kM7L8J6j4K2j10N4j1O
$$ -17 26 57 101 81 99 63 15 62 -8 38 46 0 4 28 36 -18 22 -73 -62 -91 -100 -115 -71 -73 -26 12 28 14 36 -74 -20 -31 -25
195b5N0L2n5J14Pj2jq1lj2%n1M1OJ3l5Jkl2p3J0N8m9K0K2oR0k2mRj6k0K4K6J4
$$ -25 25 57 2 116 123 111 110 29 26 14 14 -37 4 10 23 -12 -11 -13 -45 -118 -108 -50 -99 -79 -57 -63 27 5 1 10 -6 -26 -2 24 38
230C8O0J4L1j9m0j6k7oj6j5k4K2L8o2rNl4lp0M9k8O8n4O8j2K1P1o8L5k4L9m5O8
$$ 38 98 112 143 124 84 68 41 35 19 4 -20 2 40 -22 -31 -26 -60 -63 -133 -84 -112 -44 -98 -30 -42 -21 50 -18 17 -7 32 -13 55
263E5l3M9M5j6J3o6mj5kK1n2J0J5J7m9kK1l0j7l4nKk7P9L3kpLo3M7k6qM6j3K3
$$ 55 22 71 116 100 113 47 43 28 26 47 -5 5 20 37 -12 -14 7 -23 -40 -74 -79 -77 -104 -25 8 6 -1 2 -61 -14 -40 -48 -2 -15 8
298HM7L1n4M9m9Ml4j2j9L6L1k3K8l1k3j7pl0k4L5k1OPM1j3j0K8oMl8O1k7R0k5
$$ 8 55 86 32 81 32 36 2 -10 -29 7 38 15 43 12 -11 -28 -35 -65 -89 -54 -75 -69 -62 -21 -34 -44 -16 -22 -18 -56 5 -22 68 43
332D3L3L9n7Njm9M0k0lqK8j8K3m4qm2J6m8%JOMM9PLj2l1nJ9J2oN2J2ML2n4O6k8
$$ 43 76 115 58 63 62 13 53 33 30 22 50 32 55 11 3 -39 -23 -71 -71 -70 -64 -60 -11 -4 -1 -13 -44 -49 -30 -18 -24 28 40 44 76 22 88 60
370F0K1m0o2M8l8O7o7N1n9J0l3k9Rk0kN3j1j1j3L1om0Q9q2N3JN7K6mJ0K2L4q2
$$ 60 81 41 -21 27 -11 56 -11 40 -19 -9 -42 -71 -62 -82 -84 -31 -42 -53 -66 -35 -41 -81 8 -74 -21 -20 37 63 59 69 91 125 43
403D3J5j5m0P2m6Jlj0k9Ol0J9j5k1jj4K2J0K9kJ1l5Mj6N1m3J0N3J5J8J6mml1m9
$$ 43 58 43 3 75 29 30 27 17 -12 -6 -36 -17 -32 -53 -54 -68 -46 -36 -7 -9 2 -33 -29 -45 6 -37 -27 26 41 59 75 71 67 36 -13
438a3K3Nn7R7j3j2Jm9K5n1N5n1L1%o3NQ2pk3jJ5m1j8O8n6N3J8QkL0k5K2Pj5N3
$$ -13 10 15 -42 55 42 30 31 -18 7 -44 11 -40 -9 -9 -72 -67 15 8 -15 -16 -1 -42 -60 8 -48 5 23 31 29 59 34 56 63 48 101
473A01q9L6k2J2K1j6l5J3l6l1J3j4K1RlJ6l1J2qN9o0l2J7L4L7J2J6j7%L4k3RK1
$$ 101 12 48 26 38 59 43 8 21 -15 -46 -33 -47 -26 -17 -20 -4 -35 -23 -31 28 -32 -64 -47 -13 24 36 52 35 35 69 46 55 76
506G6m9J7m1K9R%No2M2o5Lj3nL7n2Q9o0PM1n3oNO2l9N4k6N2MJ6K7m8j2Nl9L6k9
$$ 76 27 44 3 32 41 41 46 -16 26 -39 -36 -49 -54 -17 -69 20 -40 -33 8 -45 -51 -46 16 -23 31 5 57 61 77 104 56 44 49 10 46 17
542A7jK9j2Pnj0k9j0j4jk2PJ3J6lk2J7Rk9RL8J0K0J5qPpJ6m4Mj9oM6mJNn5J9J4
$$ 17 16 45 33 40 35 25 -4 -14 -28 -29 -51 -44 -31 -15 -18 -40 -23 -14 -43 -34 4 14 34 49 41 48 41 57 13 17 -2 -8 38 34 35 40 -15 4 18
581A8k2j4k6J4kk6L6M9k0l5M0p0N0L8m2k4M6J6N5o7N9l2j8K4n5O2k7K7l2M3Rm0
$$ 18 -4 -18 -44 -30 -32 -58 -22 27 7 -28 12 -58 -8 30 -12 -36 10 26 81 14 73 41 23 47 -8 54 27 54 22 65 74 34
613C4l5rL1p7L4J2k4J5nM0j2m6lJ9Kk0M2k4K8J2Jm0KP7n4jk0K4M3m4L1j0K4j1
$$ 34 -1 -10 21 -56 -22 -10 -34 -19 -24 16 4 -42 -45 -26 -24 -44 -2 -26 2 14 15 -25 -23 54 0 -1 -21 3 46 2 33 23 47 36
647C6ql0k5Rj1K3r3L2L3j7rMk6N1l4L8n0P5JJ4J3ljK9l3JJ8PMJ8Kl9M3n7K2q1
$$ 36 28 -2 -27 -18 -29 -6 -99 -67 -34 -51 -60 -56 -82 -31 -65 -27 -77 -2 -1 13 26 23 22 51 18 19 37 44 48 66 68 29 72 15 37 -44
683d4L6o1M7j9J8O1q2%Nm5O7l2Ml6L7M6k7nQ2rk9K1k2j6L0kk4K1K1m2M6m1J2j2
$$ -44 -8 -69 -22 -41 -23 38 -44 -44 -39 -84 -17 -49 -45 -81 -44 2 -25 -30 52 43 14 35 13 -3 27 25 1 22 43 1 47 6 18 6
717Fj9m3j1QO4Onj7m0N2jl6m8P6j3N1j4J3n0K4k2m9R3j8L3j9M0k7Rl5L0l4j3j6
$$ 6 -13 -56 -67 -59 5 11 6 -11 -51 1 0 -36 -84 -8 -21 30 16 29 -21 3 -19 -68 25 7 40 21 61 34 43 8 38 4 -9 -25
751b5l3J3k5M5KL1pm3L0p6N2om4M0J6j6N0LK1qj1k9kL5L3m7K9L3J0l8l2M3p0M4
$$ -25 -58 -45 -70 -25 -23 8 1 -42 -12 -88 -36 -42 -86 -46 -30 -46 4 7 28 20 9 -20 -22 13 46 -1 28 61 71 33 1 44 -26 18
785A8m1KJ0J8m2jqK6l4J4J7J4q2Q2kPK1j7j0L3l0j9L6K8pL0%oJ2j6m9LL4m2K1
$$ 18 -23 -21 -11 7 -35 -36 -44 -18 -52 -38 -21 -7 -89 -7 -9 -2 19 2 -8 25 -5 -24 12 40 33 63 63 57 69 53 4 7 41 -1 20
820B0m4k4K3oM3k4j4K0k4j8jL5j0J0L1mL3M%l3K7k4J4M4Pl2K0o2K7n2K7Jm0OM7
$$ 20 -24 -48 -25 -31 12 -12 -26 -6 -30 -48 -49 -14 -24 -14 17 13 46 50 50 17 44 20 34 78 85 53 73 11 38 -14 13 14 -26 -20 27
855B7m3qM8o5pJ4K9k8Kq%OK3K6K4n1L3m7P3rk0M3k3J9l5j0J2kk3K5Ln9L5K3m1
$$ 27 -16 -24 24 -41 -48 -34 -5 -33 -31 -39 -39 -33 -10 16 40 -11 22 -25 48 39 19 62 39 58 23 13 25 23 0 25 28 -31 4 27 -14
890a4K0k6M3n1j1PrK8l6N5pJ8L5j8k5k2L6l5O2o3K1K7p2Q2l2j1M8j2Km9M6k9m0
$$ -14 6 -20 23 -28 -39 -32 -41 -13 -49 6 -1 17 52 34 9 -13 23 -12 50 -13 8 35 -37 45 13 2 50 38 40 -9 37 8 -32
923c2qL9L6p9K4J8n2QL2J6n0R2k1k4K7o9L2L6k5j1J6L9k4NNk8K5k1L3o3L1qNp
$$ -32 -40 -1 35 -44 -20 -2 -54 -46 -14 2 -48 44 23 -1 26 -43 -11 25 0 -11 5 44 20 25 30 2 27 6 39 -24 7 -1 4 -3
957cK0J1k7Kj4m2%j0R1n2K2kk9O0qpl0K9L0k9K9l0N8l3jk3J9k8j8J5k0J6Rj9L
$$ -3 17 28 1 3 -11 -53 -53 -63 28 -24 -2 -4 -33 27 19 12 -18 11 41 12 41 11 69 36 35 12 31 3 -15 0 -20 -4 5 -14 -11
992a1l6O7q8M8Kn1R2l9k3J2J5l7J02j1o2K3O6o3J7k3L7MLm8k4Q3k1j7j9l0N5n2
$$ -11 -47 20 -68 -20 -18 -69 23 -16 -39 -27 -12 -49 53 42 -20 3 69 6 23 0 37 41 44 -4 -28 55 34 17 -2 -32 23 -29
1024b9K7%kn0N1k7k4J6j3jK4K8L1j7L5n0j7K8Pj7K4Lj0M8j7m1j1JlNL1n0J7kl4
$$ -29 -2 -2 -4 -54 -3 -30 -54 -38 -51 -52 -28 0 31 14 49 -1 -18 10 17 0 24 27 17 65 48 7 -4 -3 -6 -1 30 -20 -3 -5 -39
1059c9O0m0k3K6j5K0mjoQj3RM4q0M8k1kl5J0R0n6P5p6N6Ro9M2r1J03l4J9pj2M
$$ -39 21 -19 -42 -16 -31 -11 -15 -16 -22 -14 -27 -18 26 -54 -6 -27 -29 -64 -54 36 -20 55 -21 35 44 -25 17 -74 29 -5 14 7 -5 -1
1093amK1q0L8j6j9K3k6L5Lj9Qj5L7K1L4q9M5L9jl%J6l1L4oj4pk4k1O1J0q7j3N7
$$ -1 -5 16 -64 -26 -42 -61 -38 -64 -29 -26 -45 -37 -52 -15 6 40 -49 -4 35 34 31 31 47 16 50 44 30 23 -1 -22 39 49 -38 -51 6
1128Fn2L9m9k5N3l2Q9n0nK7mRk7OK5l3N2NL6l9N5j7l3K6l6L5m1n1P1j9J5m7Q4
$$ 6 -46 -7 -56 -81 -28 -60 29 -21 -26 1 -3 6 -21 -15 10 -23 29 34 70 31 86 69 36 62 26 61 20 -31 40 21 36 -11 73
1161G3q5m2J5l3j2Q3l3J0K9j0L7n0JO0k9rL4j8K1k2M7k0qnm4M0o3P5m2QO5l4l8
$$ 73 -12 -54 -39 -72 -84 -1 -34 -24 5 -5 32 -18 -17 43 14 5 39 21 42 20 67 47 39 34 -10 30 -33 42 0 8 73 39 1
1194Aj6lj4QJ6j5L0j0m2P3L8l2m1K1j1m9P7pPJ4k6M1o3M0l5J9k1pj8M1j6K6lk4
$$ 1 -15 -18 -32 -24 -8 -23 7 -3 -45 28 66 34 -7 14 3 -46 31 24 31 45 19 60 -3 37 2 21 0 -7 -25 16 0 26 23 -1
1228aQl0kNPk2J3j0N%J0j3N4m2K2k2L0QrL2k7M8j4l1k6JK2j6M2J8m9K5m5K0Kj
$$ -1 7 -23 -25 -20 -13 -35 -22 -32 -27 -27 -17 -30 24 -18 4 -18 12 20 11 43 16 64 50 19 -7 -6 16 0 42 60 11 36 -9 11 13 12
1264A2m2Qol6L4JO0p3L4L9n3mk5O8k7J6O9o6RN5l7Oj8j1kN7n2rL7o2L5n2P4l4
$$ 12 -30 -22 -28 -64 -30 -29 31 -42 -8 31 -22 -26 -51 17 -10 6 75 9 18 73 36 42 24 13 11 68 16 7 44 -18 17 -35 39 5
1298El4K0j5L1k4K3j6K3j2NK6l2mJ2L0j9K4j3LrJ5j4j6%J3m6N4L5j0l3Rk2L5j12
$$ 5 -29 -9 -24 7 -17 6 -10 13 1 6 32 0 -4 8 38 19 43 30 33 24 39 25 9 9 22 -24 30 65 55 22 31 9 44 -68
1332f8P9n2L8l3NQ5n3M1p4Q7m1Qk6j0pK6MPKK3k2L8n4nnL6Lj4k0J4l4K6MpJ2j4
$$ -68 11 -41 -3 -36 -31 54 1 42 -32 55 14 22 -4 -14 -21 5 9 16 18 41 19 57 3 -2 -7 29 32 18 -2 12 -22 4 8 1 13 -1
1368aKQJ0oj7L8l4Mj8k6j6N2K2N2l9l0N9n7j0K7k2J7K0k0l4L3j0K7po2O4l5l6
$$ -1 1 9 19 13 -4 34 0 4 -14 -40 -56 -4 18 70 31 1 60 3 -7 20 -2 15 35 15 -19 14 4 31 24 -38 26 -9 -45
1401d5l2P2j9J5J9m5k4O0K4l8q8Q6J6LoK1MqnJ8k5j5J3J6L3pqn8L7Qo0JL8m1L9
$$ -45 -77 -5 -24 -9 10 -35 -59 1 25 -13 -101 -15 1 4 -2 19 23 15 10 28 3 -12 1 17 50 43 35 -23 14 22 -38 -37 1 -40 -1
1436aj5kK7k6j3l0O5k5J4JPP8p4N0k7j5Kk2J9k5P9r5K9kk0PJJ8k6K4k4k8j7MQ1
$$ -1 -16 -18 9 -17 -30 -60 5 -20 -6 -5 2 80 6 56 29 14 16 -6 13 -12 67 -28 1 -1 -21 -14 -13 5 -21 3 -21 -49 -66 -62 19
1471A9k9rOK2n0L7J2k5qK7J7L7m7qK4j8j1k2J6J6n0L2M2l6K5Np9M9l7J1J8qL4
$$ 19 -10 -19 -13 9 -41 -4 8 -17 -25 2 19 56 9 1 25 7 -4 -26 -10 6 -44 -12 30 -6 19 24 -55 -6 -43 -32 -14 -22 12
1504A2m9M9rl9L6p2N9%Pj3LK8K4Jn4K6j0k0NK8m1M3L8l1j2K2J1om3%Om3O9o3O6
$$ 12 -37 12 3 -36 0 -72 -13 -13 -6 -19 -16 12 36 37 -17 9 -1 -21 -16 12 -29 14 52 21 9 31 42 36 -7 -7 -1 -44 25 -38 28
1539B8j4l5L0n9L6k5j0M3J0L3nm6K4j4K1l0J0K2QkJ5j9qm1L6J2n2K1Ll7L6l6K4
$$ 28 14 -21 9 -50 -14 -39 -49 -6 4 37 32 -14 10 -4 17 -13 -3 19 27 25 40 21 13 -28 8 20 -32 -11 -8 -45 -9 -45 -21
1572b1M1o2L0k6RN0j6k4jK8j6P5o3L6l2j1J9o8Q3p1M6QJ8j0k2K3o3N4pm1K4k8
$$ -21 20 -42 -12 -38 -29 21 5 -19 -20 8 -8 67 4 40 8 -3 16 -52 31 -40 6 14 32 22 0 23 -40 14 7 -34 -10 -38
1604c8L2j0M5l7k2N7n9M9l4J1j8J4%NNJ1K0L4l7L2r5N4J3j4Nl4P0q3O2l4k2J9
$$ -38 -6 -16 29 -8 -30 27 -32 17 -17 -6 -24 -10 -10 -5 0 11 31 65 28 60 -35 19 32 18 23 -11 59 -24 38 4 -18 1
1636AJ6j5l0K6k2J9Rl0j4M0k6O4j7jJNm1K6M6Rm3NQl8M3l4L0kpL9o5nK6K1m2L1
$$ 1 17 2 -28 -2 -24 -5 4 -26 -40 0 -26 38 21 20 21 26 -15 11 57 66 23 28 36 -2 41 7 37 35 28 67 2 -3 23 44 2 33
1672C3pMm1K6pRj4L1o3M4J5l8Kl3M6j3L4j1pL3k5Ln9Q2k6l%j7J3nj4L3Moqj8l
$$ 33 26 30 -11 15 8 17 3 34 -29 15 30 -8 -6 -39 7 -6 28 17 10 43 18 21 -38 44 18 15 15 -2 11 6 -8 25 29 23 15 -3 -6
1709fJj2j8j3pM0K1L2mK1j7k0Kk6K6K3l9LJ6K5k8j2J8ql4j8O5k9L1k1ok0j1%k5
$$ -6 -5 -17 -35 -48 -55 -15 6 38 34 55 38 18 20 -6 20 43 4 7 23 48 20 8 26 18 -16 -34 31 2 33 12 6 -14 -25 -25 -50
1744e0L9K3l2J8K7J2k2L0j8m9MN4K1k2n5OO1m3j8jpj8N5pJ3m4K9j3l4L2j3k6K7
$$ -50 -11 12 -20 -2 25 37 15 45 27 -22 -18 36 57 35 -20 -14 47 4 -14 -15 -22 -40 15 8 21 -23 6 -7 -41 -9 -22 -48 -21
1777b1j0LOnK8K4k7O2o1rK9K1n1j1O7n0L0Ql0QK7k8K6m0K0Kl5J1L1n2K4J1JjM
$$ -21 -31 -28 -22 -27 1 25 -2 60 -1 -10 19 40 -11 -22 45 -5 25 33 3 11 38 10 36 -4 16 18 -17 -6 25 -27 -3 8 9 8 12
1812A2j8k0J0N5k9J6l8K5J2m6Mj5K5J1j4N1n2L2K5o6M8k0J1J%k9nK5n5K2%Jj6
$$ 12 -6 -26 -16 39 10 26 -12 13 25 -21 -17 -32 -7 4 -10 41 -11 21 46 -20 28 8 19 20 20 -9 -14 11 -44 -22 -22 -21 -37
1845c7M0Oj7j6L1k5M4n0L9Pk4KqM0jPK3l5k1K5Rj2k6L7k1J4o0M1l3M5rm6J1J9
$$ -37 3 9 -8 -24 7 -18 26 -24 15 22 -2 0 -8 32 31 38 61 26 5 30 39 27 1 38 17 31 -29 12 -21 24 15 -31 -20 -1
1879aj9oJ8j4Mj8RN9m1J9ml5J9L7N%L0n2Lok7k3L2Mj0K7J6m3k6J0M0j7k0K4J5
$$ -1 -20 -26 -8 -22 -18 -36 -27 32 -9 10 6 -29 -10 27 32 32 62 10 13 7 -20 -43 -11 -7 -17 10 26 -17 -43 -33 7 -10 -30 -6 9
1914IK8k5k5J1kJ8j3%Jn1M9rL4J1k7jK2l7M5n4RN5m7K0k6l0K3L0m9L4n4P1o3q
$$ 9 37 12 -13 -2 -4 14 1 1 2 -49 0 -9 25 36 9 8 30 -7 38 -16 -7 48 1 21 -5 -35 -12 18 -31 3 -51 20 -43 -51
1948e1L0J8l9P6j3l7N5j5j6k6K4l4M0J9n9L5K1k0L6k0J3p2P4oj8j0j5L7Jl6k1
$$ -51 -21 -3 -42 34 21 -16 39 24 8 -18 6 -28 12 31 -28 7 28 8 44 24 37 -35 39 33 15 5 -10 27 28 -8 -29
1979b9J2PJ2l3L1oLL3rk9O5o5l3R5n8M3k0l0M2mk4J9J2j5Lrj1J6o5Q1p3N3J3m4
$$ -29 -17 -10 2 -31 0 -6 -3 30 21 -8 57 -8 -41 54 -4 39 19 -11 31 27 3 22 34 19 22 13 2 18 -47 34 -39 14 27 -17
2013a7oN0m4K9j0J8L2k6m5l2O6j3nL4qj1O6m0k5L7j0k0j4J4kj7J0L2l3k5j7J9
$$ -17 -23 27 -17 12 2 20 52 26 -19 -51 15 2 -3 31 23 12 78 38 13 50 40 20 6 20 18 1 11 43 10 -15 -32 -13
2045a3l3j7O7j9J3Qjj8j9L6K1l6J2K2k4J8K3Kl8J2m0J5j6J4j0K2K0l1L0lj8K1
$$ -13 -46 -63 4 -15 -2 6 5 -13 -32 4 25 -11 1 23 -1 17 40 42 4 16 -24 -9 -25 -11 -21 1 21 -10 20 17 -1 20
2077B0m4O0l0k6LK4%l8P7k0k7j8J5j6L4J4k9J5Nj1jj4M9k2Jj6L0m3j0J7J8j1l6
$$ 20 -24 36 6 -20 -17 7 7 -31 46 26 -1 -19 -4 -20 14 28 -1 14 19 8 7 -7 42 20 21 5 35 -8 -18 -1 17 6 -30
2110c0K0kj6L2nm2J9K5k5kJ4K5jqj3j1J6m1K8L4l1N8l9k7O6k4J5l0l7L4K3j0j9
$$ -30 -10 -12 -28 4 -1 -43 -24 1 -24 -26 -12 13 12 4 -9 -20 -4 -45 -17 17 -14 44 5 -22 44 20 35 5 -32 2 25 15 -4
2143dk6pO5l0l4L2l0L7JqJ3m2j7N4m3N4Pk5M5o4N0l9K1Jn3R8l0k3J4j7k2qJ0O
$$ -4 -30 -37 28 -2 -36 -4 -34 3 4 -4 9 -33 -50 4 -39 15 22 -3 42 -22 28 -11 10 11 -42 56 26 3 17 0 -22 -30 -20 -14
2177a4j8Lj1JM9nK9n5J3j2kQj2L5j1j0K8l7L3k0J8m1L8k0K1j9K9l2N4o0j0O2m9
$$ -14 -32 -29 -40 -39 10 5 34 -21 -8 -20 -22 -14 -26 9 -2 -12 16 -21 12 -8 10 -31 7 -13 8 -11 18 -14 40 -20 -30 32 -17
2210a7j9LL2K1l1j3k0%K5K3k3K3j5J4j0J8j0rL6k1Mr%K4j9j9K7p7M9k0RN5n1K5
$$ -17 -36 -33 -1 20 -11 -24 -44 -44 -19 4 -19 4 -11 3 -7 11 1 -8 28 7 11 2 2 26 7 -12 15 -62 -13 -33 -24 31 -20 5
2244Ek7L2Pj7J6l0L1k1Jk9j6K5m0O5m1R5n6krL2j3m2J1pJ6L3j7l6K7J5j7k7L9
$$ 5 -22 10 17 0 16 -14 17 -4 -3 -32 -48 -23 -63 2 -39 56 0 -2 -11 21 8 -34 -23 -30 -14 19 2 -34 -7 8 -9 -36 3
2277CK6l3L8j9m9N1m3l4P0k9O7p2j2J4j1Lj5M7L7ql8l6O7j9jK8mK3m0m0M9J7l4
$$ 3 29 -4 34 15 -34 17 -26 -60 10 -19 48 -24 -36 -22 -33 -30 -45 2 39 31 -7 -43 24 5 4 32 28 51 11 -29 20 37 3
2310Cj6M6n7L5j0J4l4l2M2J8nj4J8Jl4K9Mj7M7n6K7m9L1Q9m1j5n1M8k5pN8o8P1
$$ 3 -13 33 -24 11 1 15 -19 -51 -9 9 4 -10 8 9 -25 4 8 -9 38 -18 9 -40 -9 80 39 24 -27 21 -4 -11 47 -21 50
2343E0q1M0rPk3M6k5j6M4k5Rj6k3K4mKj3mJ9M2J4m0L8q2O7j6k1l9K4J7K6k0K8
$$ 50 -31 9 0 7 -16 30 5 -11 33 8 17 1 -22 2 -2 0 -13 -17 2 44 58 18 56 -26 41 25 4 -35 -11 6 32 12 40
2376D0n2oOj1M0k3m1L0J9L0l4pMNJK0ql7L1Mj3k8J8lK0qRPJ0l7N4jl1J8nl8N0
$$ 40 -12 -18 -12 -23 17 -6 -47 -17 2 32 -2 -9 -5 0 1 21 13 -24 7 11 -2 -30 -12 -15 5 -3 6 13 23 -14 40 39 8 26 21 -17 33
2413C3m8J2J7kK1n5N4j1j4J8nJ7n1M8pk7L0j0K4k1j0m4K4J9qM1l2jj8K5j4%K1
$$ 33 -15 -3 14 12 33 -22 32 21 7 25 20 37 -14 34 27 0 30 20 44 23 13 -31 -7 12 4 45 13 12 -6 19 5 5 26
2446B6k6PpK4m4K2J6mo3P7k2Jk1M8k2J1n8K1%K6Mj9M2p4Q6Mn4j4M5ll8J6J2j7
$$ 26 0 7 0 24 -20 2 18 14 -49 28 6 7 -14 34 12 23 -35 -14 -14 12 16 -3 39 -35 51 55 1 -13 32 29 -9 7 19 2
2480Bl3N6n9QN%K6L3j8l2L0l7J0J2j0K6J5jk5J2k3J8k8K7k7K7k4L3Pj2j8J1j9
$$ 2 -31 25 -34 -26 -21 -21 5 38 20 -12 18 -19 -9 3 -7 19 34 33 8 20 -3 15 -13 14 -13 14 -10 23 30 18 0 11 -8
2513hk4j5J4L8l3J1LK6l0RrJ5j2qK6l1L3Ok5kL2j4J1k9J8M1k0ol4jM0l3k7K8N
$$ -8 -32 -47 -33 5 -28 -17 -14 12 -18 -9 -18 -3 -15 -23 3 -28 5 11 -14 -16 16 2 13 -16 2 43 23 17 -17 -18 22 -11 -38 -10 -5
2548eM0l0j9l3nL5N7%m4qpJ1nk7JK7L9J6r4P0j4k3J9j0J5Qj1K4j1k6L5ql9J3r
$$ -5 35 5 -14 -47 -52 -17 40 40 -4 -12 -19 -8 -13 -40 -39 -12 27 43 -51 19 5 -18 1 -9 6 14 3 27 16 -10 25 17 -22 -9 -18
2583a8J3lj8M0m6K8M3n4oj8K8M8o2Pk4O2Qk6Qk9j3L5rKM3n0L1qkj3QK0k9K5j7
$$ -18 -5 -8 -26 14 -32 -4 39 -15 -21 -39 -11 37 -25 -18 -42 20 28 2 10 -19 -32 3 -6 -4 39 -11 20 12 10 -3 5 25 -4 21 4
2618Dn7N7M4k4l4j1K0J7K1l3Mk4M0l6j1J4K2j3%Qk7jM6l5N5k7Ll1L1m8L2jMk6
$$ 4 -53 4 48 24 -10 -21 -1 16 37 4 8 -16 24 -12 -23 -9 13 0 0 8 -19 -20 26 -9 46 19 22 -9 22 -26 6 5 9 -17
2652a7M0n9J9k5mM1J0j2l0J5L3Rl2K3K0rk8L9k2k7K1l0L5J5k1MkK1Mm8N1j1j9
$$ -17 23 -36 -17 -42 -46 -5 5 -7 -37 -22 11 20 -12 11 31 22 -6 33 11 -16 5 -25 10 25 4 8 6 27 31 -17 34 23 4
2685DJl3M0o0M6OJJpKoJ5k8j5P7r0L8Jm3N0NRk1MK8m5J2M4n2J9j5K7JJ0l0O9o8
$$ 4 5 -28 12 -48 -2 4 5 6 -1 1 -5 10 -18 -33 44 -46 -8 -7 -50 0 5 14 -7 -3 25 -20 -8 36 -16 3 -12 15 16 26 -4 65 -3
2722cK9j8k9L6Oj4K1j5L2k9M1p8J7k8Q9o4OmJL1m1L7Nl7K1L6o2NJ1OK7m9K0J1
$$ -3 26 8 -21 15 21 7 28 13 45 16 57 -21 -4 -32 57 -7 -1 -5 -4 27 -14 23 28 -9 12 48 -14 -9 2 8 35 -14 6 17
2756A7k8l%j0J1L3k5k2M4K7nm3mK2k0NJ1j1N2m3k9J5M5j9j4K3Jm2K6L6j9o1P5
$$ 17 -11 -14 -14 -24 -13 20 -5 -27 17 44 39 -4 -8 14 -6 -1 10 -1 51 8 -21 -6 39 20 6 29 30 -12 14 50 31 -30 45
2789D5k1k6L5j8j6lK3j6nK4K2kk2k0oK0j2K1K9o0J2jJnk8J1N0n7NL0K1m3%k3O5
$$ 45 24 -2 33 15 -1 -4 19 3 -2 22 44 42 20 0 -6 14 2 23 52 -8 4 3 4 -1 -29 -18 32 -25 -20 10 31 -12 -12 -35 30
2824C0Jjl6J0J5k9%k8N9l0L7l4M2k0j8L1j4l7%L1j0jj7O9p7N3kq6N4J4k4L2k8
$$ 30 31 30 -6 4 19 -10 -10 -38 21 -9 28 -6 36 16 -2 29 15 -22 -22 9 -1 -2 -19 50 -27 26 24 -62 -8 6 -18 14 -14
2857a4L1k5R0q7kK6j6j7J9J4j8K9o7RJ9k3lK5K8kn4l1N4M9l3Rj3L6m4K3l9RJ3
$$ -14 17 -8 82 -5 -7 19 3 -14 5 19 1 30 -37 -28 -9 -32 -35 -10 18 16 -38 -69 -15 34 1 10 -3 33 -11 12 -27 -18 -5
2890eJ4J0n3N2n6OK7o2J22k5k5j3OLml4O6J3m9j8J8l5N1k6RJ1k4JL0Nn8N1qk7
$$ -5 9 19 -34 18 -38 -32 -5 -67 55 30 5 -8 -2 1 -3 -37 29 42 -7 -25 -7 -42 9 -17 -8 3 -21 -20 10 15 -43 8 0 -27
2924b7L9k5Lm1L9%j2Lj7O0j6n2K3J6k3P0m5Mj6K7k4O7m0l4J7lO4p8N1MJl9Qk2
$$ -27 12 -13 -10 -51 -12 -12 -24 -21 -38 22 6 -46 -23 -7 -30 40 -5 -1 -17 10 -14 53 13 -21 -4 -7 57 -21 30 34 35 -4 4 -18
2958a8k6O8J1n2k0P0n3J5Jk5J8pj4M1lRJ3l7L7j3J0m0L8p8P5k4Nk3j6L2JKK1m5
$$ -18 -44 24 35 -17 -37 33 -20 -5 -4 -29 -11 -18 -32 9 6 15 28 -9 28 15 25 -15 23 -55 20 -4 1 -22 -38 -6 -5 -3 18 -27
2992b7L4qnl0K7K1n0K0KM5j6j8k9J2orK6Mm5P8k1L3o5N1m8J2kJ3J3k2j9mRL2k0
$$ -27 7 -1 -6 -36 -9 12 -38 -18 -16 29 13 -5 -34 -22 -28 -37 -11 -7 -52 26 5 38 -27 24 -24 -12 -14 -1 12 -10 -29 -33 -24 8 -12
3027a2k3L0K2J5l6j0K4j3M2l5jPl6M1m9L0K0k6n8M6L1rJ6kn0N0qjJ3Pn3N8lk0
$$ -12 -35 -5 17 32 -4 -14 10 -3 39 4 3 10 -26 15 -34 -4 16 -10 -68 -22 9 0 16 14 -36 14 6 5 18 25 -28 30 27 7
3061GK9l0k5OOK1k3j7L2j8J5Lk8K3J3j3O3r6P1o6L6K5o6L3K0m0j8N7km0N7k9o
$$ 7 36 6 -19 -13 -7 14 -9 -26 6 -12 3 6 -22 1 14 1 64 -32 39 -27 9 34 -32 1 21 -19 -37 20 18 -22 35 6 0
3094@j4J6J3l2J2rN0l9J6j7mL2Np3L0j3L0K7rrJ0Pn8O0p7M3J6jl6N9pk4m2O2k3
$$ 0 -14 2 15 -17 -5 -14 36 -3 13 -4 -8 24 29 -44 -14 -27 3 30 21 12 22 29 -29 31 -46 -3 13 12 -24 35 28 4 -38 24 1
3129Aj2K3k8J9j6KL6Qo7M7k1L7J9lJ8m5l3j8M1J0k5J0j8omM6j0j1M6p4K8Kk8L3
$$ 1 -11 12 -16 3 -13 -11 25 33 -34 13 -8 29 48 45 63 18 -15 -33 8 18 -7 3 -15 -21 -25 21 11 0 46 -28 0 2 -26 7
3163Gj4K6k8l0M0rJ3NQJ3l1j1K9j7PJ6m3L1j3J0J3j7Qk1M4l5L9p2L6m6L8J7m3
$$ 7 -7 19 -9 -39 1 -8 5 10 18 31 0 -11 18 1 8 24 -19 12 -1 9 22 5 13 -8 36 1 40 -32 4 -42 -4 13 -30
3196c0M2K5j4k9K1j9LJ4K2k9MRk6L0%N5o3m6O8k5j6k2L3j6rMJ9oJ4L4m2K7k5l2
$$ -30 12 37 23 -6 15 -4 -1 13 35 6 10 19 -7 23 23 78 15 -31 37 12 -4 -26 7 -9 -18 -14 5 -1 13 47 5 32 7 -25
3230b5l0N8Jk2rK9J2pK2l9K6J5k7j3K5L6r7L7Rj0lK9n3L0M8j5n5K5N9r4L7oP3
$$ -25 -55 3 4 -18 -27 2 14 7 29 -10 16 31 4 -9 16 52 -45 -8 1 -9 -12 17 -36 -6 42 27 -28 -3 56 -38 -1 -7 66
3263F6p1J8J1j5L0j5m2j7L2K2j6MNK6n8J2K7K0pj2Ol5nO9n8Lk4NJ7oJ4J9j4%k5
$$ 66 -5 13 24 9 39 24 -18 -35 -3 19 3 7 12 38 -20 -8 19 39 32 20 26 -9 -14 55 -3 0 -24 -19 -2 -8 6 25 11 11 -14
3298a4j9LRJ7j6J9LJ9k4jkLl9M2j5K1rk9pR0p5OK0o0L5nN3k7LmJ1l6M8q5J3J09
$$ -14 -33 -30 -21 -4 -20 -1 2 21 -3 -4 -6 -3 -42 0 -15 6 -3 -32 -39 51 -24 -18 2 -58 -23 -28 25 -2 1 -3 8 -28 20 -65 -52 57
3334E7m3pok8K6j3O0o6J1Mj8J1k4MK3K4mL1l3n5N2J0l4K0k2K9o9R7o7O0j8l3K7
$$ 57 14 7 1 -27 -1 -14 46 -20 -9 -5 -23 -12 -36 -32 -9 15 11 42 9 -46 6 16 -18 2 -20 9 -60 37 -30 30 12 -21 6
3367Fn1M8k1J2Rl0nK9K0n2P1m7Kj2L7n2M8L4n0pL9p0O1J9q3L0l9J5M0m3M3qL8
$$ 6 -45 3 -18 -6 3 -27 -32 -3 17 -35 36 -11 -9 -21 16 -36 12 46 -4 -11 28 -42 19 38 -45 -15 -54 -39 1 -42 1 -7 31
3400C1o6O2l6l8O0o4N0j7l1M2M1n0K7j1oJ9l3M8k2n3L7OL2k8J4jj7M5k6j9K8m7
$$ 31 -35 27 -9 -47 13 -51 -1 -18 -49 -7 34 -16 11 0 -6 13 -20 28 6 -47 -10 -4 28 0 14 13 -4 41 15 -4 24 -23
3432b3L3m8M2KLk8LL9n3L2J3j6kL1m1j5N1j9omJ3l7K3NlJ9k8lJ8nm2J0N3K2n6
$$ -23 10 -38 4 6 9 -19 -16 23 -30 2 15 -1 -3 28 -13 -28 23 4 -2 -6 7 -30 -7 -2 -5 14 -14 -17 1 -4 -46 -36 17 39 -17
3467a7L7k2M8m0%J7k3o0M4N3l5NPlMm0K0m9N8PK9ol4k7M3lj5J3J4l6K4qk2O0j9
$$ -17 20 -2 46 6 6 23 0 -60 -16 37 2 7 14 11 15 -25 -5 -54 4 11 40 34 0 -27 16 13 -2 11 25 -11 13 5 -17 43 24
3502B4j1PK0j7n7L4LOj3K2k7j0K4oQJ5k9L5l5K1k9K0k6K9MJ2qj6K1k1M2j9p0L4
$$ 24 13 20 40 23 -34 0 3 9 -4 18 -9 -19 5 -1 7 22 -7 28 -7 14 -15 5 -21 8 12 24 16 0 21 0 42 23 -47 -13
3536a3k1N2j3K1j2nj1o2Q5lm1P2p2J6k2O1J1o6K5jJJ6J7ll0J5k2J0mk2M4kK4j5
$$ -13 -34 18 5 26 14 9 -2 -64 21 18 -23 49 -23 -7 -29 32 43 -23 2 1 2 18 35 32 2 17 -5 5 1 -21 23 21 45 30
3570C0J7m7K4m5O8m1k0N6n4O3J0n0Ql9J8mMJjM9p6M0J2m8M4J1k7j8RL9m5J1L2
$$ 30 47 0 24 -21 47 6 -14 42 -12 51 61 11 19 -20 -2 -6 -2 -1 -2 47 -29 11 23 -25 19 30 3 -15 -6 33 -12 -1 31
3603C1j7k5lOJ2J4m8K4m3L6M9o5O8n7K5l6K5J7oJ6k6J6p0P5mlKl5J0mK1K3l6K6
$$ 31 14 -11 -14 -8 4 18 -30 -6 -49 -13 36 -29 39 -18 7 -29 -4 13 7 23 -3 13 -57 18 14 11 13 -22 -12 -16 5 28 -8 18
3637A8m5L2K5p4oL7K0k0N8k0m0J1lj1K7l8K9J3Qk1Pk2K3J7J6j6m4J7L7J0m4J2
$$ 18 -27 5 30 -44 -50 -13 7 -13 45 25 -15 -4 -7 -18 9 -29 0 13 21 0 7 -15 8 25 41 25 -19 -2 35 45 1 13
3669A3K3n0N1J6n6pJ4Ol7L6l8L6l1J0N6n4k8M9j2KpL3lq2O6NJ2n4J8l0M1J6n9
$$ 13 36 -14 37 53 -3 -10 4 10 -27 9 -29 7 -24 -14 42 -12 -40 9 -3 -1 -8 25 22 -60 6 11 23 -31 -13 -43 -2 14 -45
3702d5M7J1k1Nj6K2Jj0j8LK8jm%L1k6Qk0J4kKLk2L9l1K1n5NJ7J7j2oQQk7L8kk2
$$ -45 2 13 -8 -3 -19 3 4 -6 -24 -21 7 6 2 2 33 7 15 -5 9 7 9 12 -10 29 -2 19 -36 -31 -14 3 -9 -15 -7 1 -26 12 10 -12
3740a2oO4p0MJ9k5M8Jj4k1j3J2K8m0L6j0om8Q1Jl3J4j0J8Pk2j4j7M9m2K7n5J9
$$ -12 -18 46 -24 -20 -1 -26 22 23 9 -12 -25 -13 15 -25 11 1 -5 -53 28 29 -4 10 0 18 25 3 -11 -28 21 -21 6 -49 -30
3773c0O2q8O4l2K3J2J9o6k9N7L0kj01R5k7J4J6k6LKRj5J9mj1J6oj2LL6j8kkJ4
$$ -30 32 -56 8 -24 -1 11 30 -36 -65 -8 22 20 -81 14 -13 1 17 -9 -6 -4 5 -10 9 5 -6 10 4 -8 -5 31 13 11 9 23
3807B3j1k2o4R3m0K6j0M5n3J6J1Nnjl6O9l3J8j7mmM3j7qo6R4p4K2K0j9j5M0j7
$$ 23 12 -10 -74 19 -21 5 -5 40 -13 3 14 19 14 13 -23 46 13 31 14 10 6 49 32 24 -42 52 -22 0 20 1 -14 26 9
3840INno2M1PL2Qj4Jk3K1m2j2O1k4j1j9M6J0pk8K8K5l7L8q9M7J7K2p3K3M1n3L6
$$ 9 14 9 -53 -12 -5 27 35 21 22 -1 20 -22 -34 27 3 -8 -27 19 29 22 -6 22 47 10 48 -41 6 23 45 -28 -5 36 -17 19
3874A9j9j3K4J1lk5L4l1Kk0P6Jl8j9L1m5J1K4%m2J0M5n3kk5M4L2n5oL4K6o6P8
$$ 19 0 -13 11 22 19 -6 28 -3 -1 -21 55 56 18 -1 30 -15 -4 20 20 -22 -12 33 -20 -22 -47 -3 29 -26 -32 2 28 -38 40
3907D0k0j9N1l6lLNmno5O0J7m1J0L8k6K2l1kK6k0jqNKK8j7Kj7K6k0qkN2m5N2q7
$$ 40 20 1 52 16 13 16 21 17 12 -53 7 24 -17 -7 31 5 27 -4 -6 20 0 -1 -9 -4 -2 26 9 11 -6 20 0 -8 -10 42 -3 49 -38
3944c8Q0l5rpO5l1n3L7qMn0L3J3Ol9K7M1l2l0N7J8l0ok2K1k4o%J5J8l8j0N1Qn8
$$ -38 42 7 -2 -9 56 25 -28 9 1 5 -45 -12 1 7 -32 -5 36 4 -26 31 49 19 13 -9 12 -12 -18 -18 -3 15 -23 -33 18 26 -32
3979c2M1l5Q0q9N0k0pK0n6P6m2j6O2j6Ql2NmM2J1n9M3j6j0Nk2P2k6k3K3n2j4P
$$ -32 9 -26 54 -35 15 -5 -12 8 -48 28 -14 -30 32 16 24 -8 -3 -7 35 46 -13 30 14 4 9 -13 59 33 10 33 -19 -33 -26
4012b6QL7l6j3j6J2N1l4K6k2l9K1M9k1Jj6J8k1K4Nl2K2j1m8P0L0k6j0K3k7J6j3
$$ -26 -18 19 -17 -30 -46 -34 17 -17 9 -13 -52 -31 18 -3 -2 -18 0 -21 3 8 -24 -2 -13 -61 9 39 13 3 26 -1 15 2
4044BM7m1ll5O2o4O5k4n3L5K2k5qJ5J1J4m7L3j6rk5J9K3m1M9n4M2m1L7Mn3N9R
$$ 2 49 8 5 -30 32 -32 33 9 -44 -9 13 -12 -20 -5 6 20 -27 6 -10 -19 -44 -25 -2 -43 6 -48 -6 -47 -10 -6 -59 0 9
4077Il9J0K6L7m9J0K6l8K2k5K7m0j3M9jm9L8J3k1M1m6M1k0k1mMKl0M3k2L1l5J3
$$ 9 -30 -20 6 43 -6 4 30 -8 14 -11 16 -24 -37 12 11 -38 0 13 -8 33 -13 28 8 -13 -17 -13 -11 -41 2 -20 11 -24 -11
4110a1j4l2J6O3l3j8K9m9N3l7J0qJ2l6J6O3n2Nk9O5Lj9j6L3KjPn2K1K9m5J7L7
$$ -11 -25 -57 -41 22 -11 -29 0 -49 4 -33 -23 -31 -19 -55 -39 24 -28 -23 -52 13 16 -3 -19 14 16 15 22 -30 -9 20 -25 -8 29
4143B9o4J8nJ0k4N0l6L5j9L0n8lL1rQ%m1O4m2J6ML0m1k2N5k6j2J9l5N1k5L0k4
$$ 29 -35 -17 -22 -12 -36 14 -22 13 -6 24 -34 -37 -6 -15 -7 -7 -48 16 -26 -10 -6 24 -17 -39 16 -10 -22 -3 -38 13 -12 18 -6
4176fk4K1jMj8k0P5q9J9M7Mj0PnoNL3j9n8N9j7qJ9MJ5o4Q2n2m8R6o1L5Nq1L5N5
$$ -6 -30 -9 -10 -6 -24 -44 31 -58 -39 8 12 2 9 4 -2 3 36 17 -41 18 1 -7 12 16 31 -33 49 -3 -51 45 -16 19 24 -57 -22 33
4212C3n9K1N3l0l2K7n9Q1k5PKNj5k0J4K1j0m7KL7j6KJM6l9j2L0k6M2n6K0QNj9
$$ 33 -26 -5 48 18 -14 13 -46 35 10 17 19 24 9 -11 3 24 14 -33 -31 6 -10 -8 -7 39 0 -12 18 -8 34 -22 -2 6 11 -8
4246hkK0m2J0MM9Lmnm4J9L4k1k6J6j6qM5n1J6L5Ll2j8O4m4K8k2M2m4j0j0jPJ8
$$ -8 -10 10 -32 -22 -18 31 34 30 25 -19 0 34 13 -13 3 -13 -21 24 -27 -11 24 27 -5 -23 41 -3 25 3 45 1 -9 -19 -20 -13 5
4281Ej7nN1Oll0PMOkl1j4O7l2J5qn2O2jj0j3l3Q3n4K1k4RJ4j7K1l2rL7j2rJ6k
$$ 5 -12 -17 34 40 37 7 14 18 24 22 -9 -23 44 12 27 19 -33 29 28 18 5 -28 55 1 22 -2 7 21 4 25 -7 -16 21 9 0 16 14
4318A4m0J0M5l5K6J8Ro4jK3K8%k4k1QNK7m5O1l8Ok3%Kk7O2l4L1k3k3M9m6Q4j31
$$ 14 -26 -16 29 -6 20 38 47 -17 -18 5 33 33 9 -12 -4 1 28 -17 44 6 12 -11 -11 -9 -36 26 -8 23 0 -23 26 -20 64 -67
4352f7P9J7k6j9j0L5QN0q4OK2KK0k5k2J8ML3l6Ll6P9Lk9m1jL6ln4K9P1r1M4l0
$$ -67 12 29 3 -16 -26 9 17 67 -17 -11 11 13 33 8 -14 4 8 41 5 8 -28 51 54 25 -16 -17 19 16 -38 -9 62 -29 15 -15
4386a5j0K9rK1Rj3L0j5j5l4K4Jo1N7K3n2M0k9L6k3J5k7K7ml3M8k0Qm5lQ0o6lM3
$$ -15 -25 4 -5 16 25 12 42 27 12 -22 2 3 -58 -1 22 -30 10 -19 17 -6 9 -18 9 5 -28 20 0 8 -37 -40 40 -26 -29 14
4420A4l8L6J0k4j1K3m1L3JLJ0j2L1l9J7j6k0PJJ8J2rk8J3K9n5L1j1j0L7m0Q3r1
$$ 14 -24 12 22 -2 -13 10 -31 2 3 6 16 4 35 -4 13 -3 -23 -16 -15 3 15 6 -22 -9 20 -35 -4 -15 -25 12 -28 55 -36
4453c6mN2l8J2lK6l5K0J2jljrj4%K2rK3j0J9n2L0j1l5jJ2M5OJ0o8M6k8nNpM5j4
$$ -36 -40 12 -26 -14 -17 9 -26 -6 6 5 2 1 -8 -22 -22 0 -9 14 4 23 -29 1 -10 -45 -46 -34 11 17 27 -41 5 -23 -28 -23 -30 15 1
4490AK3l0rM1m0oK6J5J4j9j1L3%j2l1MJ1l5L7m4L4k0M8m2l5N9j6J9j5QLk3J5k8
$$ 1 24 -6 -15 26 -14 -20 6 21 35 16 5 38 38 26 -5 -1 10 -25 12 -32 2 -18 30 -12 -47 12 -4 15 0 8 11 -12 3 -25
4524b5L4m2M5m3L9j3j7Jj1J4rK5pOO5p5J5m0P0m4L2J0p3O5p1J3L8j7Qm9O7o4K7
$$ -25 9 -33 12 -31 8 -5 -22 -21 -32 -18 -27 -2 -9 -3 62 -13 2 -38 32 -12 20 30 -43 22 -49 -36 2 -15 -7 -56 11 -53 -26
4557b6J9J2L3q1M2MK9K8p0Pj3MMk5Q7o9j5n1P7mJ4Rj4k0L1J8m3NK6Jl3N8m6nj5
$$ -26 -7 5 38 -43 -1 3 32 60 -10 -3 -16 -12 -8 -33 54 -15 -30 -81 -4 -8 6 15 1 -19 12 30 -13 -8 18 19 -14 44 -2 -7 -22
4592b2L4m2N5l2K8kJ7j7l2M2n0oN6m7J0%J2J6l8K9J2K8n8K4k8l6M5l0J1J4kJ7
$$ -22 12 -30 25 -7 21 19 36 19 -13 29 -21 -27 29 -18 -8 -8 4 20 -18 11 23 51 -7 17 -11 -47 -2 -32 -21 -7 -9 8
4624Hj2jj1%L3L7k7j8K4k3J0J7j5J5j4K0j2l3jK3j2jJ7J6k9M6l5j5j4J6Nk1J8
$$ 8 -4 -5 -16 -16 17 54 27 9 33 10 20 37 22 37 23 43 31 -2 -3 20 8 7 24 40 11 57 22 7 -7 9 14 -7 11
4657A1j7M9o6J8J4J4k3nO4o0K8k8K4J0J7k9j1JM1j10J01k7n9K4L2JJ1KJ9k9JO
$$ 11 -6 43 -23 -5 9 23 0 -5 59 -1 27 -1 23 33 50 21 10 11 52 -58 43 16 -43 -19 13 14 25 27 46 17 18 24
4689B4k3L4m0J5K7l1l7L6Kk0J1J1l9N6k8j5Q3p6J0oJ2j3k6N2K3nk7M7n3KK0p4
$$ 24 1 35 -5 10 37 6 -31 5 7 -13 -2 9 -30 26 -2 -17 66 -10 0 -6 6 -7 -33 19 42 37 10 57 4 6 26 -48
4721d8M8K6p3R2l8jk4K3Ml6N9q7J03l1rQl7L1j2k1K1LPl2J6K4J5n3M2l8jmK6l9
$$ -48 0 26 -47 45 7 6 -18 5 9 -27 32 -55 48 17 8 16 -21 10 -2 -23 -2 1 8 -24 -8 16 31 -22 20 -18 -19 -23 3 -36
4755c6N3n4N1j9pJ9%m4O2n1L0J9l9LnjK0lOn0K4PMj9K8Lk8K8K3k2j5pK7m1O9J2
$$ -36 17 -37 14 -5 -12 7 7 -37 25 -26 4 23 -16 -13 -18 -19 1 -2 4 -46 -22 -15 -11 -30 -2 1 -27 1 24 2 -13 -20 7 -34 35 47
4791D7p7L0Pk0l4J7QJ8p0R3Lj1M0o6K8Pl4k4L3Rll2l1M4j0mL5m0K1J7l4L0%Rk9
$$ 47 -30 0 7 -13 -47 -30 -22 -4 -74 19 22 11 51 -15 13 20 -14 -38 -5 4 1 -31 -62 -18 -28 -32 3 -37 -16 1 -33 -3 -3 6 -23
4826b3jk6N5K4j6L1p2J5L2k2rpK0j1j0J5pm8M8j9L4k2J6j4rjlJ4nQn3P3On7M1
$$ -23 -24 -50 5 29 13 44 -28 -13 19 -3 -12 -19 1 -10 -20 -5 -12 -60 -12 -31 3 -19 -3 -17 -26 -27 -30 -16 -21 -13 -66 7 13 -44 -3
4861cmj3j4L0j5k1N3l1j0J2rK1K9l7jNJ4l5jK1K4k1m2L0K7J3m5j2J1JJ8J1J6k9
$$ -3 -7 -20 -34 -4 -19 -40 13 -18 -28 -16 -25 -4 25 -12 -13 -8 6 -29 -30 -9 15 -6 -48 -18 9 22 -23 -35 -24 -23 -5 6 22 -7
4895gLk8Rkj6M9l6J2l2L7J2m3J6j0LO0o2L1MMJ6J9l5j9J8m8M6oJ1l1J8l3K6M2
$$ -7 -4 -32 -23 -25 -41 8 -28 -16 -48 -11 1 -42 -26 -36 -33 27 -35 -4 0 4 20 39 4 -15 3 -45 1 -5 6 -25 -7 -40 -14 28
4929B8m6J3n1K5NLl3K5k4M9J1LJk6Pj7L6k7R%%m6P1j0J1m2K4Nk7M8l9n0Q1m6J1
$$ 28 -18 -5 -56 -31 -26 -23 -56 -31 -55 -6 5 8 9 -17 -10 -27 9 -18 -9 -9 -9 -55 16 6 17 -25 -1 4 -23 25 -14 -64 17 -29 -18
4964a8L1k7L5l5OK0oMlL3n1K6k7K9j3k5L2lJ9L1n8j0k0P6q0L3J3J5kj9N4m7J0
$$ -18 13 -14 21 -14 -8 12 6 10 7 40 -11 15 -12 17 4 -21 11 8 27 58 0 -10 -30 46 -34 -1 12 27 25 6 60 13 23
4997B3l7J0J3J7qK7q5Q3n1jK0K6n2N5p7L1l2J6J5K0m3P0l7l9N9L1l4k9Qm1R0n9
$$ 23 -14 -4 9 26 18 45 -40 43 -8 -9 11 37 -15 40 -37 -6 -38 -22 -7 13 -30 40 3 -36 23 54 20 -9 -1 -42 48 -11
5029a1K9lj8M5l7J4qJ3o4L7J4l8nK2k9P7l2lm3O2K0j6j0j4ok3P2n4k3PK9nk6M4
$$ -11 18 15 -3 42 5 19 11 24 -40 -3 11 -27 -32 -10 -39 38 6 3 -40 22 42 26 16 2 -4 -27 45 -9 -32 -25 4 -1 -27 17
5063A7lork9R2r4N0n1M1nJ2j2j4J6lJ6J5m1qL4ol4J6l2M6OoJ1J7m4m5K9M0J4q0
$$ 17 14 8 -1 -30 62 -32 18 -33 8 3 15 3 -11 5 2 18 33 -8 -16 18 12 -22 -6 -38 8 14 8 19 36 -8 -53 -24 16 30 -50
5098e0O2M%k5K6k4K7K0q1O0k3jM1n2K7L3Nn9NR%M1n9M3n3L4pj4pmL4m4K7j2j5
$$ -50 12 16 16 -9 17 -7 20 40 -41 19 -4 -5 36 -16 11 44 49 -10 -5 4 4 45 -14 29 -24 10 3 -11 -18 -22 12 -32 -5 -17 -32
5133c2Q1o4J2L7jl0J7J4n2L7l0M6rn8M8l5M7k8M1l5krJ0loK4m6J6jk4O5m4J1l9
$$ -32 49 -15 -3 34 33 3 20 34 -18 19 -11 35 26 -32 16 -19 28 0 41 6 4 -5 5 2 -4 20 -26 -10 -11 -35 30 -14 -3 -42
5167d2L4J5n1N1j1Q%J0j6kK1l5L4j4L2K8r1n1O6rM5o9Q9o9N9Po4Q4l4j3k4M0p4
$$ -42 -8 7 -44 7 -4 4 4 14 -2 -4 17 -18 16 2 34 62 -29 -80 -14 -23 22 -47 42 -27 32 39 -25 59 25 12 -12 28 -46
5200d6K9j2j0J6L1j5l2JL2J8rl1K5Ml5N8k6j5NK4n1M5M9p2K6ll2nOJ7l5J5N7m8
$$ -46 -17 -29 -39 -23 8 -7 -39 -38 -6 12 3 -28 -3 1 -34 24 -2 -17 -12 12 -39 6 55 -17 9 6 -26 -31 -25 -8 -43 -28 29 -19
5234a9M4o3K6k3N3J0p3O2p3M4Kj7K0Lj9j4M4n5N0l1L3L0p6M8n6K9l8O0j4N0J4
$$ -19 25 -38 -12 -35 18 28 -45 17 -56 -12 -10 -27 -7 -4 -23 -37 7 -48 2 -29 4 34 -42 6 -50 -21 -59 1 -13 37 51
5265E1o5K6mj3J9l9K6k6N0l0j0L5p3M3k9M4J2j8j1m3L9k2K8OJj8J3l0rJ0M7Ko
$$ 51 -14 12 8 -5 14 -25 1 -25 25 -5 -15 20 -53 -10 -39 5 17 -1 -12 -55 -16 -38 -10 -4 -3 -21 -8 -38 -47 -37 10 12 6
5298Fm1K7J5o4O1K9m0k8K8jK4%k8rqO3m8J4lj1Pl5J2L3J0j3pK1rML6r0O7j6j8
$$ 6 -35 -8 7 -57 4 33 -7 -35 -7 -8 16 16 -12 -21 -29 34 -14 0 -3 -14 -7 -42 -30 3 13 0 -7 14 5 9 45 -45 22 6 -12
5333a2L3m6K5m9L9k3Lk7K4NK0mj9K7Nj3Kn8K0Q3m4qK1Nj0K5l1j5K7K1rn1K4OK1
$$ -12 21 -25 0 -49 -10 -33 -30 -57 -33 -28 -8 -12 -31 -4 1 -12 -10 -68 -48 35 -9 -17 4 9 -1 24 -7 -22 5 26 17 -34 -10 -4 17
5368A7m0K5L6m8j0L6k1J0kJj3J2l0L3n3N2J7j5pl9N0kklk0QOrm3N2L0mk3K9j5
$$ 17 -23 2 38 -10 -20 16 -5 5 3 4 -9 3 -27 6 -47 5 22 7 0 -39 11 9 7 4 -16 -8 -2 -11 -54 -2 28 24 1 30 15
5403A5k4j9J3%J8m4N8m%j6L7rj0J4l8k7M6j4j9l7M2K9j8K4n5M7J4l0k3O7n4j1
$$ 15 -9 -28 -15 -15 3 -41 17 13 13 -3 34 25 15 29 -9 -36 10 -4 -23 -60 -18 11 -7 17 -38 9 23 -7 -30 37 -17 -28
5435b8K1L4k6%k1ML5Om6OL7lj2k5L6j9L5l7L2Lm6K6J6o6J04o9qk0JL2J4K5k3R
$$ -28 -7 27 1 1 -20 -16 19 25 -21 -15 22 19 7 -18 18 -1 34 -3 29 32 -14 12 28 -38 66 -3 -11 -31 -30 2 16 41 18 27
5469B7k1j0j8j1RJ0J1l2N4k0j9K7l0N2Nn2N7p4J4OO8k7j7j2k4J5Jk3N2l2Jnk7
$$ 27 6 -4 -22 -33 -24 -14 -3 -35 19 -1 -20 7 -23 29 34 -18 39 -35 -21 -15 53 26 9 -3 -27 -12 -11 -34 18 -14 -13 -18 -45
5502d5M0M6p0J4K1j1N6k1o3K0N0m7j5O1p8K3N4l7M2n0J7%K7l3k9M7L4o1JJ4j5
$$ -45 -5 41 -29 -15 6 -5 51 30 -33 -13 37 -10 -25 36 -42 -19 35 -2 40 -10 7 7 34 1 -28 19 53 -8 -7 7 -8
5533hRK2n7Q8l4o1O9l8j2L1pJ1l5K6n0L4JJ6Jk1lQoJ7k4kL5k5N1j2j6J4k2J0L5
$$ -8 1 23 -34 54 20 -41 28 -10 -22 9 2 13 -22 4 -46 -12 -11 5 6 -15 -18 -10 -16 1 -23 -25 10 -15 36 24 8 22 0 10 45
5568D5p6O6r3P3K3r3N3jpKm1R5n4j5N5l0j8J1kJ3k1K3l6M1L8m9K1Kk7l2Q8p4j3
$$ 45 -31 35 -58 15 38 -55 -2 -3 -10 -8 -49 46 -8 -23 32 2 -16 -5 -7 6 -15 8 -28 13 51 2 23 25 -2 -34 54 -20 -33
5601c3K0oJ2QJJ4k5k4O5o6M1L4m5Kk0K1l3L3l7M0jK5l3oPjn5O4m5K2m9M8QJ7K0
$$ -33 -13 -19 -7 1 2 16 -9 -33 32 -34 7 41 -4 -2 -22 -1 -34 -1 -38 2 1 26 -7 -13 -6 -7 -62 2 -43 -21 -70 -22 -14 3 23
5636B3m0lK3J8m3J2mNK1n1L5K6j3J7m8N2Oo6L3mJ4l7rL7l4O5J3k2o6K0K8m2M2
$$ 23 -17 -20 3 21 -22 -10 -14 -9 12 -39 -4 22 9 26 -22 30 36 -30 3 -1 13 -24 -33 4 -30 35 48 26 -40 -20 8 -34 8
5669HM1n0PJ2k1l6P3l5QrL6qj9Oj2j5M5m2nJ6Lj1Jj1J0K6k5Pk2L5Om4O9o1M5l5
$$ 8 49 -1 6 18 -3 -39 34 -1 7 -2 34 26 7 13 1 -14 31 -11 -16 0 3 -8 -7 -18 -8 18 -7 0 -22 13 19 -25 44 -17 28 -7
5705gM0l6J4N2k6l1Nk6J3J8j0l7L5k6NLj2O5m9%j9qN0L3n2RJ2m8K7OqJ0K5pj8
$$ -7 33 -3 11 63 37 6 11 -15 -2 16 6 -31 4 -22 -17 -14 -26 39 -10 -10 -29 -37 13 46 -6 3 15 -33 -6 0 -8 2 27 20 2
5740BK4l6J1rO0r6L9jM1m7M0l6mLM5qo3R0l2l4K5K5k2k1PM3mj0n0NN3ml6%Kj6
$$ 2 26 -10 1 -8 52 -44 -5 -6 35 -12 28 -8 -12 -9 36 28 -35 55 23 -11 14 39 17 -4 3 46 42 32 -18 -13 40 36 0 0 2 -14
5776a4J9OMm8K1oL1k9L4J4m8M8l7j0J6j1M6j9Mj0m0M5l1M0J9n0K1k9LNK0L4q3
$$ -14 5 11 15 -33 -12 -18 13 -16 18 32 -16 32 -5 -15 1 -10 36 17 21 11 -29 16 -15 25 44 -6 15 -14 -11 -6 14 48 -35
5809c5N0Lk8O4o5ML4qj0k6K1j1j7K5k0lK3J6j9NKM8q5J6K4j7L4n3K0qJN5K7l6
$$ -35 15 18 -10 54 -11 -7 27 19 9 -17 4 -7 -24 1 -19 -22 1 17 -2 3 5 53 -32 -16 8 -9 25 -28 -8 -16 -15 40 67 31
5843C1j1k7Ll6N5Plpll0Mj3L8J0J5m1J1Rm4J4RN5j2l3oK0rMl3l1K2J9J4nK1k3
$$ 31 20 -7 -4 -40 15 22 19 12 9 -21 -17 -30 8 18 33 -8 3 12 -32 -18 -9 46 34 1 -5 15 6 10 -23 -54 -32 -13 1 -4 17 -6
5879fLRk9J3K8J9m2M3p4M2ql3O8m3K1K6o8M9m6N7n5OP5n9L0j4Qn0J0J0l0K1J5
$$ -6 -3 6 -23 -10 18 37 -5 38 -36 6 -2 -35 33 -10 11 37 -31 18 -28 29 -26 -20 55 -4 26 12 20 -30 -20 -10 -40 -19 -4
5912dl2Q0m1k2M5no5P5l2LQp1Q1jl0L4n6R2o3K6j6J9l9J0m9O0k0K3k5j2J1o%K
$$ -4 -36 44 3 -19 26 21 -44 31 -1 2 10 -61 20 19 -11 23 -33 59 -4 22 6 25 -14 -4 -53 7 -13 10 -15 -27 -16 -22 -22 -20
5946b0J4NK2J8pl9o0M7j0N1j3J7o5L2Lj6PK3M2m8K1l6j9K4Qj9KMK4Qj8k4ML6m
$$ -20 -6 -1 21 39 32 -7 -67 -20 -30 21 8 25 -40 -8 -5 -21 -14 9 51 3 24 -12 -31 -7 1 -18 -16 -12 12 20 2 -22 -18 18 14
5981A4j0o3N9k6Kj3L3l9J9L2o5N5JK2m4J7L0j0j7Kl5K4%J7j6l2M5Qj2K8k0j5r
$$ 14 4 -59 0 -26 -24 -37 -4 -43 -24 8 -57 -2 -1 21 -23 -6 24 14 -3 -1 -36 -12 -12 5 -11 -43 2 10 -2 26 6 -9 -18
6014a8K9K2n6J9K2m1OOJ5l8KK0j6L5n5J8kJ6K2p0N5K5J0n3M4oNo4Q7q3M2l5J5
$$ -18 11 33 -23 -4 18 -23 -17 -11 4 -34 -32 -12 -28 7 -48 -30 -32 -16 6 -64 -9 16 26 -27 17 11 16 -48 39 -44 -2 -37 -22
6047b2l0J5P1m1K0l4N0n7L0j3Lj0RJ7j1J6m1K0oj0L7j6l0L9l5K3J0M0m9%j7n1
$$ -22 -52 -37 34 -7 13 -21 29 -28 2 -11 -8 -18 -9 8 -3 13 -28 -8 -14 -24 13 -3 -33 6 -29 -6 4 44 -5 -5 -22 -73
6079g3O4J1pl1JmN2L3q1L1Jl8K9NK8l4J5J6k3%J4J4Mn8L8kM9p4qoKL7lj8qN5k7
$$ -73 -9 2 -5 -36 -35 -39 13 46 -35 -4 -3 -41 -12 -7 21 -13 2 18 -5 -5 9 23 27 -31 7 5 54 -20 -28 -34 -32 5 2 -16 -24 31 4
6116Dqk0K8J5ko5K8mJ4l2N0jl8N7k5k2K8J3m7j3L2NOMoK1l1K4KKjpOl0N6l2Nk7
$$ 4 -4 -24 4 19 17 -48 -20 -24 -10 -42 8 7 -31 26 1 -21 7 20 -27 -40 -8 -3 3 7 1 22 -9 15 17 19 18 11 17 -13 43 11 16 -11
6154a1L5K0m9jk1M7ol5K5J1k6PK8k7j9J8L9j7j8rJ7ooOJ2Oj5J6j7J8l0P5q5M8
$$ -11 24 44 -5 -6 -27 20 14 -21 4 15 -11 -4 24 -3 -22 -4 35 18 0 -9 8 2 -4 2 14 20 5 21 4 22 -8 67 -18 30
6188C0k0k3J9Ll8K8N0k7k3L6k6jN2n3POJ5k4J9qLj0m6L9j4j3N1j3l2M4J5j3k4
$$ 30 10 -13 6 9 -29 -1 49 22 -1 35 9 8 60 7 14 20 35 11 30 22 25 15 -31 8 -6 -19 32 19 -13 31 46 33 9
6221Ik5OK0N0n9l2PN1o7M5m1M6l6Q8o2K6k7j9Q1p5K1K9k7kN8m2l1O2l4nj5J3L0
$$ 9 -16 -10 10 60 1 -31 -24 27 -40 5 -36 10 -26 62 0 26 -1 -20 61 -14 7 36 9 7 65 23 -8 54 20 15 0 13 43
6254D3q7M0K8j3l1L8l8L2l9K8jJ4m9M0K5k6l9M9j0PL3k8m7L1Pl0M9LJ2k9rj9L0
$$ 43 -44 -4 24 11 -20 18 -20 12 -27 1 0 14 -35 5 30 4 -35 14 4 11 44 16 -31 0 7 -23 26 29 41 12 3 -16 14
6287A4j8K7oL2j4k3j0K1j3k8J7kJ0j1K4m1L2oJ7%%m8P0m9k3M1o7O6k6K5k3L9j6
$$ 14 -4 23 17 49 35 12 2 23 10 -18 -1 -3 7 -4 20 -21 11 5 22 22 22 -26 44 -5 -28 13 -54 12 -14 11 -12 27 11
6320A1k0JOJ4j1Ql2J7Qj6k6J5K5N4o8L2n1J1J0k8mL0PMJ9l8K7n0L5m8P8m8K2k9
$$ 11 -9 -8 -2 12 1 9 -23 -6 2 -14 -40 -25 0 54 -14 18 -33 -22 -12 -40 -44 -14 -7 -3 16 -22 5 -45 -10 -58 20 -28 -6 -35
6354c5K7kJ5m9N2j5%kqK6nk4Pnj1J7k3M0Pk9L6l3%J1j4qK3nK2m1N3m7K1L9p5K0
$$ -35 -8 -10 5 -44 8 -7 -7 -9 -17 9 4 -20 -13 -18 -29 -12 -35 5 12 -17 19 -14 -14 -3 -17 -25 -2 -7 15 -26 27 -20 1 40 -35 -15
6390a5J0j2L2j3nM4m2oKJ3Mk7J0K9m1J8J7j5LL6m9qnP7l5k6L7l0k1J1Nj6O4m0
$$ -15 -5 -17 15 2 -3 41 -1 -7 -5 8 12 -15 -5 24 -17 1 18 3 6 42 -7 -15 -20 57 22 -4 33 3 -18 -7 -2 -18 46 6
6424FNnroK2kj5K9j8l0L6k5QK1k2J5o3N0M5k0k6Oj8L9J%j2ql4NL5K6n6Lk3N1l6
$$ 6 11 6 -3 -9 13 11 -4 25 7 -23 13 -12 -4 17 -5 10 -53 -3 42 22 -4 2 -16 23 24 24 12 4 -30 -25 10 36 -20 -17 -40 11 -25
6461b5M5QnL6n1J9j9J3n9J8K7pN6p9K4L2l5j7J1M3j9k0k9K6J4Pn4N2k5oj2J7o
$$ -25 20 28 23 59 8 27 8 21 -38 -20 7 0 56 -23 1 33 -2 -19 -8 35 16 -4 -33 -7 7 14 -40 12 -13 -19 -31 -14 -20
6494b0N2Jk2N2o9K1j9M4Jo3J5K5j0J7m1j4J9OM1m7N9m6L2n6RM9j2Rn4K9J8k2j3
$$ -20 32 33 11 63 -6 15 -4 40 41 -22 -7 18 8 25 -16 -30 -11 -5 36 -11 48 2 34 -22 -13 36 24 33 -21 8 26 4 -9
6527iJ4K8l5K3k2j2L7p4J00l7kK6Pm6OJ9Lj7kQl3K2Lk9L6k2L9j6oj6K1k0K2j0
$$ -9 5 33 -2 21 -1 -13 24 -50 50 13 11 37 44 -2 4 23 26 9 7 15 -18 4 7 -22 14 -8 31 15 9 -7 14 -6 16 6
6561FJ6k3J9l0J7k5K5OpLl9qOO0l9L9Lk1j4J5l0L8n1N3J0m3LJ0K5J2k0k9j8O5
$$ 6 22 -1 18 -12 5 -20 5 11 4 7 -32 -40 -34 26 -13 26 29 8 -6 9 -21 17 -34 19 29 -14 -11 -1 24 36 16 -13 -31 34
6595C4n4L3qj5J9J2J7j2j4j9PL0rj7qL1Ok6j4qJ5Pmj2j5L3L4Mm3j6j8M5k8mL1
$$ 34 -20 13 5 -10 9 21 38 26 12 -7 0 30 21 4 -4 27 33 7 -7 -15 0 7 3 -9 -24 9 43 47 4 -12 -30 15 -13 -17 14
6630A4l2K4K0j8j8K6rj3j1pMK5m1P0J8l9j1k2N5m1loj9J5M5j7J4j1j5J9k7L0m8
$$ 14 -18 6 26 8 -10 16 7 -6 -17 -24 -20 5 -36 34 52 13 2 -20 35 -6 -9 -15 -34 -19 26 9 23 12 -3 16 -11 19 -29
6663b9L6n5NRJ5J2MqK3l1J3nJ9K8q7M1o%L0l4oL7j1l2K5N2q1K8k9jP6o9R0j26
$$ -29 7 -48 -43 -34 -19 -7 -3 -11 12 -19 -6 -11 8 36 -51 -10 -16 -16 14 -20 -26 11 0 -32 -7 45 -36 -8 -37 -38 38 -31 59 -67
6697f7J06k7l4QLPn0M9j7M1n4jL4j7%J1J3Lm0L5K4Qo9L5o7K7L9q7P8j3j7N8lL8
$$ -67 39 12 -22 -14 -11 -4 -54 -5 -22 19 -35 -36 -2 -19 -19 -8 5 8 -32 3 27 35 -34 1 -66 -39 0 -87 -9 -22 -39 19 16 54
6731E4m2k9l%L8p3P8o5K4rQQL1m9L8J4l3L8l1m1RNJ9j3KL2l9N8n4QM4r5N7l2K4
$$ 54 12 -17 -20 -20 18 -55 23 -42 -18 -27 -19 -11 20 -29 9 23 -10 28 -3 -44 -35 -30 -11 -24 -22 10 -29 29 -25 -17 27 -68 -11 -43 -19
6766a9k0L4j4K8l7pM6k3J9k6qM4k7Nl7M6PRl0r8P3J5J6Oj9M8j6pl4QP6r6J8mK8
$$ -19 -39 -5 -19 9 -28 -35 11 -12 7 -19 -27 17 -10 -5 -42 4 11 20 -10 -108 -35 -20 -4 2 -17 31 15 8 -26 -18 58 -38 -20 -24 4
6801DJ2j5N4q9K0j6j5N0lk7J8K7n0PO2n4j4L9p5N9j0J7J3k5j1M1o3M9J3l5m7K3
$$ 4 16 1 55 -34 -14 -30 -45 5 2 -25 -7 20 -30 -23 39 -15 -29 10 -65 -6 -16 1 14 -11 -22 19 -44 5 18 -17 -64 -41
6833d1N8k8J1Kqj3K3qj0MJ7K7J1n1k3K5rj7l1J9rJ7K8j8O8k1pl0jL0k0kPk1K0
$$ -41 17 -11 0 2 -6 -19 4 -4 -14 -10 7 34 45 -6 -29 -4 -13 -30 -61 -42 -51 -34 -6 -24 44 23 16 -14 -15 15 -5 -7 0 -21 -1
6868aj6O1m7%L1k3l1J3M1j8ko6L8K7K2l0k6M2okk7N8q0J0N1J8q6M8J6L4l9J8l8
$$ -1 -17 44 -3 -3 28 5 -26 -13 28 10 8 -58 -20 7 29 -1 -27 15 9 7 -20 38 -42 -32 19 37 -49 -1 15 49 10 28 -10
6901a0J9o7O1rkkLm9P3l0RK9J6l8K0l6nj5L4Oj5KJ6j3QoL6n9K5Nk8O6Ln0k0J8
$$ -10 9 -58 3 -6 -8 -10 -7 -56 17 -13 -4 25 41 3 23 -13 -18 -33 1 7 -8 -6 10 -3 5 -1 35 -24 1 6 -22 44 47 -3 -23 -5
6937epj1J3MPnK0L6l6Lj2nL6k5K9l9Jp3P6k0k9P8n7J2kL1QRm6LK4j6%Jn0O8k4
$$ -5 -12 -23 -10 -6 1 -4 16 52 16 19 7 2 38 13 42 3 4 -69 7 -13 -42 36 -21 -9 -11 20 28 37 -9 -6 18 2 2 3 -47 21 -3
6974cj4L9l9K4l7Q2k5J2njp9PP2m7N2l3J9qo6M3J3j7k7N1m2nN0qqoK5j8K8K4l2
$$ -3 -17 22 -17 7 -30 52 27 39 34 33 -46 -39 33 -14 38 5 24 16 -50 -7 6 -11 -38 13 -29 -34 16 8 0 -6 19 1 29 53 21
7009B1k2jk2K4O7o0%J3l4J0L3%j1J2k5QJ6j1L9m0j0J3j5J2L3j6m1QmJ7n3O9Rl
$$ 21 -1 -2 -24 0 67 7 7 20 -14 -4 29 29 18 30 5 13 29 18 57 17 7 20 5 17 50 34 -7 1 -3 14 -39 30 39 36
7043C6n9K8K2k1M2o4J2K7J3k5k2K1J4n3M6l1K3lM7j05QO1k7Kk5J3K7l8%M0M2m5
$$ 36 -23 5 27 6 48 -16 -4 23 36 11 -11 10 24 -29 17 -14 9 6 53 -52 -44 17 -10 -8 -33 -20 7 -31 -31 9 51 6
7075Fk5l4M6J1njN2n2l0L7J8m4K2l3L4L1m0RqLk2J6L5j9K4j8k0L7k6m1O5n2LJ0
$$ 6 -19 -53 -7 4 -1 -2 50 -2 -32 5 23 -21 1 -32 2 33 -7 2 -6 -3 -25 -9 26 7 31 13 -7 30 4 -37 28 -24 -21 -11
7109a1l2N2j5L9n3O6l0m6O8o6K4k2J4L5km1J9L3n5K6k5J5jj0L2Jp1Q7m5M2l7k7
$$ -11 -43 9 -6 33 -20 46 16 -30 38 -28 -4 -26 -12 23 21 -20 -1 32 -23 3 -22 -7 -8 -18 14 15 -56 31 -14 28 -9 -36
7141c6K5k0M7n0J5J7j7P9j02N8k1pMLLm9O0m4K7N1m2j7K5l1jK1p2N3lOjJ4k2M5
$$ -36 -11 -31 16 -34 -19 -2 -19 60 -42 16 -5 -12 -8 -5 -2 -51 9 -35 -8 43 1 -16 9 -22 -23 -2 -74 -21 -24 -18 -19 -5 -27 18
7175A8j8j7K0J6kk8L9p4N9mJ7l9PJOJ3l5kJ4j3P1p7L0npNj5j5oN0J0k1J6rK2p9
$$ 18 0 -17 3 19 17 -11 28 -46 13 9 26 -13 -6 -5 1 14 -21 -23 -9 -22 49 -28 2 -3 -10 -5 -20 -35 -41 9 19 -2 14 5 27 -52
7211e2M5J5m3L5j2K8n7R5n6l5M8l8mM2k3K6l0Nj5M9p7J9J4k0J7J5OK5l8N0m1K9
$$ -52 -7 8 -35 0 -12 16 -41 54 -2 -37 11 -27 -31 11 -12 14 -16 -11 -26 23 -54 -35 -21 -41 -24 -9 -3 22 -16 34 -7 22
7243B2m6O1l5j1K5k9j9K5L8j4l0J3K1n9M3Km7O2jj4l9J4L7m0O1k2j9L9k1k0k1
$$ 22 -24 37 2 -9 16 -13 -32 -7 31 17 -13 0 21 -38 5 7 -40 22 21 7 -32 -18 19 -21 40 18 -1 38 17 -3 -24
7274b4K3L1j7n1P3m4M8l0j9qnK4qj0QM1j5RJ5m9KJ9Rn5j0N9ol4mM6k0k0L9L6j4
$$ -24 -1 30 13 -38 35 -9 39 9 -10 -18 -23 1 -7 -17 -9 32 17 26 41 -8 -6 13 22 -33 -43 16 10 -24 -28 18 -2 -22 17 53 39
7309C9n5J2K2J8Kl1K7K0nl1k5M3q5K3O4J1m0l4O5l5K7l1k0L2k2J3J9Lpo4R7p3
$$ 39 -16 -4 18 36 38 7 34 54 49 18 -7 36 -49 -26 38 49 9 -25 40 5 32 1 -19 13 -9 4 23 26 19 -45 52 -21
7341b1O7j18P3pN3o2J8l1RQJ7o8N4J1p0M1K0rQJ0j3Kk5N0j3J7Oj9oJ2k3K1m9O1
$$ -21 46 -72 1 -6 47 -15 3 -28 -19 -11 6 -62 -8 3 -67 -26 -6 -15 -7 3 -10 -8 -33 17 4 21 27 8 2 14 -9 12 -37 24
7375B4J4k6l5N8l8k2K8k9J8k8N9jk6%j0KJjK2j6K8n1M2j3j0J8n0K2l2J9K0l6Q1
$$ 24 38 12 -23 35 -3 -25 3 -26 -8 -36 23 22 -4 -4 -14 -12 -11 -12 10 -6 22 -29 13 0 -10 8 -42 -20 -52 -33 -13 -49 32
7408C2j6j6K7Noo0M0j8qN1k8%j5L7p2J2M1k8LJ2j0oK0rL0l3K2j2J3jp6N0K5J2
$$ 32 16 0 27 32 26 -34 6 -12 -20 31 3 3 -12 25 -47 -35 6 -22 -19 -7 -17 -23 -3 -12 18 -15 7 -5 8 7 -69 -19 6 18
7442A8%l5J4o1M3j5Q2m1m8Q0m3j1j2R1r4j9L8L1k1J6j4m0j1N9Kj7mNJ6l3L6p1
$$ 18 18 -17 -3 -64 -21 -36 46 5 -43 37 -6 -17 -29 62 -32 -51 -13 18 -3 13 -1 -41 -52 7 9 -8 -12 -7 9 -24 12 -59
7474e9P0k9K0l0nN7k4J6pl4oQRJ6l2N8o8J0L5n4L7J1N3p0m2Q3k5K1rQoo4N2M3
$$ -59 11 -18 2 -28 -33 24 0 16 9 -25 -31 -23 -14 2 -30 28 -40 -30 5 -49 -12 -1 52 -18 -60 23 -2 19 10 18 12 -52 0 43
7508D3n7l%NL0j6jj1j1nJ9j8nL0L2o0Pj2J3J2K4k8m3R4p6mqRj7K5N5q0N9qlj2
$$ 43 -14 -17 -17 -12 18 2 1 -10 -21 -26 -7 -25 -30 0 32 -28 -21 -33 -20 -8 16 -12 -55 39 -37 -41 -49 -40 -57 -32 23 -57 2 -6 -9 -21
7544b1O3Jp9N7k5pK1l0J2MK4j6m5M4pj2M2k4Kl5RN6k2J5l2K1k8k1J6j6M6L0k6
$$ -21 42 43 -36 21 -4 -11 10 -20 -8 -4 20 4 -41 3 -4 -16 26 2 4 -31 -22 34 12 27 -5 16 -12 -33 -17 -33 13 43 17
7577A7l2%k2jL0QL7k4k8QjL3j2j9m6N8J9k7K1m7QJ9Lj5J8m2RK4k8M5l1L3jQJ0
$$ 17 -15 -15 -37 -38 -8 0 37 13 -15 -7 -8 25 13 -6 -52 6 25 -2 19 -28 -20 -1 2 -13 5 -37 -28 -4 -32 13 -18 15 14 22 32
7612C2p7O2p1N9l2K9J3Mn2nL7J9l5l2M0J2k9K5L4l0L7kp7K5K6K7k3Oj7l1N3k3
$$ 32 -45 17 -54 5 -27 2 15 19 -33 -38 -1 18 -17 -49 -9 3 -26 -1 33 3 40 38 -39 -14 12 39 16 22 5 -26 27 4
7644Dl8J3K2J0j2k6qJ2N7j3lk6l5N3ml0O1n7KrL7K8n8RkP0m8j4lN0k0k4Jj8qO8
$$ 4 -34 -21 1 11 -1 -27 -35 -23 34 21 18 -8 -43 10 6 -24 37 -20 -18 -27 10 38 -20 -11 -13 57 9 -5 -8 42 22 -2 -1 -19 -27 41
7680D1lk3qK2l4N7o3J1j9N2j3J3j4l7Pj1K2k3M5l8J8l7NN3mkk1L9okj0k8L1k0
$$ 41 38 15 7 29 -5 52 -11 0 -19 33 20 33 19 -18 -11 -22 0 -23 22 -16 2 -35 -30 23 19 17 -4 35 29 27 17 -11 20 0
7714@M8o5L9ok1J8l2O9k5o2K3L4j9l6N9l7KO4l1n5j5N0K0k1j0M2Rk1Lj8rk6O3
$$ 0 48 -17 22 16 -5 13 -19 50 25 -37 -14 20 1 -35 24 -13 -11 53 22 -33 -48 2 22 1 -9 33 42 21 24 6 -3 -29 34
7747C4j6mJ7j6J7J1k2j2nQk2j6O5n2L6%pom3Q0j3J2o7K9K1k2QLJ1j2l8kOL4l3
$$ 34 18 14 31 15 32 43 21 9 4 12 -10 -26 39 -13 23 23 16 10 -33 47 34 46 -21 8 29 7 15 18 29 17 -21 -23 -17 17 -16
7782a6j6N1k9L3j2k1Nk8rN6j5jO0r3K6j1M2m8PO2q6M9j1QKj0J3m8K6L3J0J3k7
$$ -16 -32 19 -10 23 11 -10 -5 -33 -42 14 -1 -2 58 -35 -9 -20 22 -26 -19 43 -43 6 -5 3 5 -5 8 -40 -14 19 29 42 15
7815A5pOK6m0m9N6K5j0l9k0K0K5Qk2Nm8N2k1Rk3J6nON9n1n5L5J6J%L0o5N2k3J1
$$ 15 8 14 40 0 -49 7 32 22 -17 -37 -17 8 16 -6 -1 -49 3 -18 -9 -32 -16 -21 -15 44 -7 -62 -27 -11 -10 -10 20 -45 7 -16 -5
7850eKqJ1Ok7N0k6JL4o4MOK9j6n6P0K9m3l8M2q8Q6Qo2N2J3Qj9k4L4o1J3k7P8o1
$$ -5 -3 -11 0 6 -21 29 3 4 38 -26 -22 -16 13 -3 -59 11 40 -3 -41 1 -87 -1 7 -55 -3 10 18 -1 -25 9 -52 -39 -66 12 -49
7885d9L2Lk3M1m6R1q6NN5Lm7m3R7q8J1M2k0Ql0N5o4P2k6Nl9JN2j3m2Q1m8lKjJ5
$$ -49 -17 -14 -37 4 -42 49 -37 -32 23 26 -21 -64 33 -55 -44 -2 -22 -14 -44 11 -53 19 -7 -2 -41 -40 12 -1 -43 38 -10 -13 -11 -12 3
7920CL1l0j1L0m3jJ4J7PJl8K0l7M8j4l4j9M1K8mj1qk6K0K9j3J8l3J1l3mK6J5k4
$$ 3 34 4 -7 23 -20 -21 -7 10 17 18 -20 0 -37 11 -3 -37 -56 -15 13 9 -2 -10 -36 -16 13 0 18 -15 -4 -37 -41 -15 0 -24
7954b4J3m1O1m7%K6J8oNM3n2K4n2N0m3M0K1m9m2O9j3kJ8l8J1%PM7m1oK8k6jM3
$$ -24 -11 -52 9 -38 -38 -12 6 0 5 48 -4 20 -32 18 -25 15 36 -13 -55 14 1 -1 17 -21 -10 -10 -3 44 3 -3 25 -1 -2 41
7988D1Pk5k9mpK3j8j6M8k4M5oo5Q0o6PK1o2O9n4mO3QJ3l6m2K4jJ0m2P6k4m5M3
$$ 41 48 23 -6 -10 -17 6 -12 -28 20 -4 41 35 -30 50 -16 -9 12 -50 19 -35 -39 24 32 45 9 -33 -9 -10 0 -42 34 10 -35 8
8022HjQj8%Jj1M6l8k5K0l0M5Nk5J5l6L4J7o6R0p1N9j8j8L8J5l8nJK%J2kjk0lk7
$$ 8 7 15 -3 -3 -2 -13 33 -5 -30 -10 -40 5 10 -15 0 -36 -2 15 -51 39 -32 27 9 -9 29 44 6 1 2 4 4 16 14 13 -7 -10 -37
8059c7M3l6lL7j3M1l9K7JoJ8o4M3J7n1K8K0J0p5P0n5N3j0Lk5J3Rm1L1k1J6l6J
$$ -37 6 -30 -33 4 -9 32 -7 20 21 15 33 -31 12 29 -22 6 26 36 -39 31 -24 29 19 22 -3 10 19 -22 9 -12 4 -32 -31
8092c1N1k1J4k3L8J5n8P1j01O9po3O3j5NL1n1omK3K5k5L3k5j1m1N6K2m8LQO2o0
$$ -31 20 -1 13 -10 28 43 -15 56 -45 24 17 -46 17 2 7 38 -13 -19 -23 0 25 0 33 8 -3 -44 12 34 -14 -11 -3 59 -1
8125aN3n7J5j3j5L3m6L7qKK8lm4J2n3O9l0L0k0lQrk1M9k5k8M9j4LJ3nM0p1L9l7
$$ -1 52 -5 10 -3 -18 15 -31 6 -2 0 28 25 -19 -7 -60 9 -21 9 -11 -14 -6 -15 -36 13 -12 -40 9 -5 -2 11 6 46 -25 14 -23
8160b3j8J6J2K1j5J4mMk1qM7m0K6l4KL5Qk0J4k6l5K4L0Ml7M5l2M0k4k0J8K1j3
$$ -23 -41 -25 -13 8 -7 7 3 7 -14 -22 25 -15 11 -23 -21 14 22 2 16 -10 -45 -21 9 13 -24 21 -11 29 5 -15 3 24 11
8193A1pJ3j5j5oO8n1k1K5K8n9J6L1Jl8RlK0m4L8J7m8O1n6L5mJ1m0jM0l9RJ5k6
$$ 11 4 17 2 -13 -19 49 -2 -23 2 30 -29 -13 18 19 -19 -10 -13 7 -37 1 18 -30 31 -25 10 6 17 -23 -24 16 -23 -14 1 -25
8227b5J5LL0k1k2M3m2L8n8J4JL7k8J9K2j8J7n1M1n6M1J4j8J3k9M6l8N0n2oQk5
$$ -25 -10 -7 23 2 -20 23 -19 19 -39 -25 -24 13 -15 4 26 8 25 -26 15 -41 0 14 -4 9 -20 26 -12 38 -14 -20 -12 -37
8259c7K1K6J6p8N7Qj2N2p3O9mm5J4k1N6m3j1K3l8M1jJn6lRl7Q4K0p8L7k1K2ll5
$$ -37 -16 10 26 -52 5 13 1 53 -20 49 45 0 14 -7 49 6 -5 18 -20 21 20 21 -35 -38 -29 -66 18 38 -40 -3 -24 -2 -5 -40
8293d0L0J1J0j7L8o9K0J7j2k5O3m1J6k4MkPQK4rj9RLNk1K2K2m6j0PL8nJ3j3oJ0
$$ -40 -10 1 11 -6 32 -37 -17 0 -12 -37 26 -15 1 -23 -19 -21 -14 -6 18 9 -10 -1 2 7 -14 8 30 -16 -26 -19 19 14 27 14 8 18
8329A8K7j7k0J4J6J5k7k5Ko8P0j8M0n0K2J9j6L5o0L1Ql9K9j9N3k0ln7M7J9l0o
$$ 18 45 28 8 22 38 53 26 1 3 -65 5 -13 27 -23 -1 18 2 37 -23 8 16 -23 6 -13 40 20 17 -40 7 26 -4 -10
8361a0k5N6o6P5j8j8K1rM0o0N0o9L9J7k3J1%K5k0j7J7o8M5O0l8o7Q1l1j0N6k2
$$ -10 -35 21 -45 30 12 -6 15 6 46 -14 36 -33 6 23 0 11 11 36 16 -1 16 -52 -7 53 15 -52 29 -2 -12 44 22
8392B2jOk7o1J01n7K5j1K5l1N6Jol7l9N2j0JJ9n4O9m4KKj1J7l7L4j3N4m2K9M1
$$ 22 21 27 0 -61 40 -17 8 -3 22 -9 47 48 42 5 -34 18 8 9 28 -26 43 -1 1 3 -8 9 -28 6 -7 47 5 34 75
8425G5o4PqK0k2K2k7L0kMj8J0l5J7l5J8l5LN9L0rm4J6J3Nm0N3k1J1k6j2L1j5l1
$$ 75 11 18 10 30 8 30 3 33 31 35 17 27 -8 9 -26 -8 -43 -40 19 49 40 -4 12 25 30 -10 43 22 33 7 -5 26 11 -20
8459b0L8m7O0j2J2Pk1Nl8M6l0K9j3lL7o2J6K0k9M5j5j4l5JK3j2L1j5ll3N1jl3
$$ -20 18 -29 31 19 31 38 17 22 -16 30 0 29 16 13 50 -12 4 24 -5 40 25 11 -24 -23 0 -12 19 4 1 -32 19 18 -15
8492a5M2j0Pl9J3K8mJ6k8oQo5J08l5j3K3Ll5K5k9jN9m5j0J8n8O3j0j8J9k0K5l1
$$ -15 27 17 24 -15 -2 26 22 38 10 4 12 -53 55 20 7 30 33 -2 23 -6 -7 52 7 -3 15 -43 20 10 -8 11 -9 16 -15
8525a5N9l9j2ML0O4j10L3k2J9k6J6k5lJ7KM3k8J3l0J8Nl5K5j1QlJ5k5K8L4o6J8
$$ -15 44 5 -7 -3 27 91 -19 14 -8 11 -15 1 -24 -27 -10 -8 35 7 20 -10 8 13 -22 3 -8 0 -3 12 -13 15 49 -17 1
8558All4K9J6l3L3j7K7MPl7j4J4m0O1Pl9M7n7K5K3m3nN4j4o8P2k7Kj0L3k9PN6
$$ 1 -2 -36 -7 9 -24 9 -8 19 23 30 -7 -21 -7 -47 14 21 -18 29 -28 -3 20 -23 -28 26 12 -56 16 -11 -9 -19 14 -15 -8 48
8592D8n0j6K9k1k2P5l2k6Q0p6L6l6l5N9npl3N5j7k5k2M3j1m2M6jjk9qO9n1K9J3
$$ 48 -2 -18 11 -10 -32 43 11 -15 65 -11 25 -11 -46 13 8 1 -32 23 6 -19 -41 2 -9 -51 -5 -6 -7 -36 -44 25 -26 3 16
8625A6opj8j2RL3n9M2Ol4L3nj7K0m1K4JM6m1j5j4j5R6n0L5m3j5M5o0P0n0OJ0K9
$$ 16 10 3 -15 -27 -18 15 -44 -2 4 -30 3 -2 -19 1 -40 -16 -15 31 -10 -25 -39 -54 42 -8 27 -16 -31 14 -46 24 -26 -20 -10 19
8659A9L2l6j7l3K7k4k5P1m3jML7jk3m5K7K2J4k4J0Lk5jM9jm1M7j1Pq9N9J8n4L7
$$ 19 51 15 -2 -35 -8 -32 -57 14 -29 -30 -26 11 10 -13 -58 -31 -9 5 -19 -9 -6 -31 -32 17 16 -25 22 11 18 -71 -12 6 -48 -11
8693a1m6Q0p8L9J2J4k9rO0o9M1l7M1Qj4J9o6P1j6K5p3M9j0j6J8k6K8jj3k6N2p
$$ -11 -57 23 -55 -16 -4 10 -19 -28 32 -37 4 -33 8 16 2 21 -45 26 10 35 -38 11 1 -15 3 -23 5 4 -9 -35 17 10
8725A0j5J8j0l1K1m7M4J2k5L5k2J6m9P6j5k3J4k4K8j3L3m3k8P6l8l4J3k0J9M8
$$ 10 -5 13 3 -28 -7 -54 -10 2 -23 12 -10 6 -43 33 18 -5 9 -15 13 0 33 -10 -38 38 0 -34 -21 -41 -22 26
8755B6J6p5K4j1O2k6kl3NJ1M2l0J3m5M2k3l7O3l3L7n6K7Lm1O3l0J9jmo0K6M4q
$$ 26 42 -33 -9 -20 42 16 14 -19 -14 -3 39 9 22 -23 19 -4 -41 22 -11 26 -30 -3 0 -41 22 -8 11 10 6 -54 -28 16 8
8788HJ7rPp4R9k0l9L9l6M4m2kk2J1N0l0J2rrK6n3L7L0k8m1P4jo2M6k2onM0k2l
$$ 8 25 16 23 -51 48 28 -11 28 -8 36 -6 -8 -30 -19 31 1 13 4 -5 21 -32 5 35 7 -34 40 39 -23 23 1 -5 -10 30 8 5
8823EoN4l1Nk2K9n5M0Kj8mJ4k7J4K1rqM2J1m1j9qJ1j6L6l7L3l5J9nmL0k1K5m4
$$ 5 -1 53 22 27 5 34 -21 19 21 3 -1 13 -14 0 21 12 4 46 57 16 -3 -11 0 -16 20 -17 16 -19 0 -5 -9 21 0 25 -19
8858a9P6l7k7N6p5N0n7L7Om3Q2kl9m3O4k1jqlkL3j9j5j3L5k1j8lO8k8rll2K3J0
$$ -19 57 20 -7 49 -26 24 -33 4 10 -33 49 47 8 -35 29 8 7 -1 -4 -6 27 8 -7 -20 15 -6 -24 -27 41 13 4 1 -31 -8 2
8893BL1m9Mj0L2L1m8L0k3k3J0lLK0Pj0QKj9l6J9M0l9L1K9o4N8o3J2L2Rj2k6J3
$$ 2 33 -16 -12 -22 10 41 -7 23 0 -23 -13 -16 -13 7 14 4 12 14 -5 -41 -22 18 -21 10 39 -25 33 -30 -18 14 23 11 -15 -2
8927bj1m0M2J6k7L9j3QQLl9M7l3lk4L2KL7M2p9k5M9n8M7nl5L1l0nK9J4n1K6J4
$$ -2 -13 -53 -11 5 -22 17 4 12 20 23 -16 31 -2 -5 -29 3 5 42 84 5 -20 29 -29 18 13 -22 9 -21 -26 3 17 -34 -8 6
8961Fm5L7MJ0o0M6OlMJ6n1k8M3j5J5Kk5K4l0L3j0J3K2J2j5l5Q1k6n5kM1j7k5N4
$$ 6 -39 -2 2 12 -48 -2 4 1 5 21 -30 -58 -15 -30 -15 -13 -38 -14 -44 -11 -21 -8 14 26 11 -24 57 31 -24 -26 15 -2 -27 27
8995B7j5k9joPJ1J7l2J1K1l4%N7m7jJ4OJ7p6P6q3N5pJ0pKJ1j8j5N0knpj8J5l1
$$ 27 12 -17 -18 -24 -17 -6 11 -21 -10 11 -23 -23 34 -13 -14 0 6 23 -53 23 -60 -5 -12 -2 -9 -7 4 -14 -29 21 19 14 7 -11 4 -27
9031b7k2P2l8M7j6l4K0J7j9J1K9m5K7l6K8k4Ol4M4k9K6l5L6PJ7p9L0N4l8rJ6K5
$$ -27 -49 23 -15 32 16 -18 2 19 0 11 40 -5 22 -14 14 -10 -4 -38 6 -23 3 -32 4 11 28 -51 -21 33 -5 -14 2 27
9063B7m8J3mlK9k8OL6n8N7l5M3l7m6K6J3L0Pl5qJ6qk6P4l9k0J5K7Kk6N5r8L9j8
$$ 27 -21 -8 -12 -15 14 -14 -8 28 -30 27 -8 35 -2 -48 -22 -9 21 28 -7 -15 1 -7 -33 41 2 -18 -3 24 26 0 55 -43 -4 -22
9097b2j8O6n5K3m6L1K0pK4l6K3j3K6m8O9j3j8j2M9o3K2K4m4M4k7Nl2O6l1Nn7M3
$$ -22 -40 26 -29 -6 -52 -21 -1 -8 16 -20 3 -10 16 -32 37 24 6 -6 43 -20 2 26 -18 26 -1 4 -28 38 7 12 -45 -2
9129bqL8j2k4k3L6OL0r0O5l3Q4m6ll9J1Nj8L7l5LJ1J7Mj5jJ4QK0p6O6Pj4l6N0
$$ -2 -10 28 16 -8 -31 5 11 41 -49 16 -17 67 21 18 -21 -10 -5 -23 14 -21 -18 -7 10 14 -1 -2 12 20 40 -36 30 37 23 -13 37
9164C7ml8Qk8J4qQ4j09L4j9L4J0l1mK8MQLk4j6RK4m8M8J7Jn4K7jlL8j9m1L5K1
$$ 37 33 -5 3 -25 -11 -19 65 -44 -10 -29 5 15 -16 -20 8 12 20 23 -1 -17 -8 16 -32 16 33 34 -20 7 6 3 41 22 -19 16 37
9199C7rj4l6L8n9L5lL2j8j5M6o7N0Mj7J3lL7n8j8O9m3k9K2K1m4M0J8k4m2M5k0
$$ 37 28 14 -22 16 -43 -8 -11 21 3 -12 34 -33 17 21 4 17 14 51 -7 -25 44 1 -28 -6 15 -29 11 29 5 -37 8 -12
9231a2rLKL8j4JJ1k4KL5l2llJ2k9K5L0n2L4K0j9L3n3rK0Nk1O1o1M5l6M3k3jn6
$$ -12 -21 -18 -16 22 8 9 20 -4 -2 33 1 -2 -5 7 -22 3 33 -19 15 35 16 49 -4 -13 7 12 -9 52 -9 36 0 43 20 19 -37
9266c7kJ4lO0n1K3l7KL9l2M2k0j4J7lKJ9pj6J9k7kj7rK3M0mk1j3K7l2O3Np5J0
$$ -37 -39 -25 -28 32 -19 4 -33 -31 8 -24 18 -2 -16 1 -2 0 19 12 -4 15 -12 -14 -31 -40 -17 23 19 -2 -15 12 -20 43 48 -27 -17
9301a7pK5j8J3pJ7%n1Q1q4rN9l0MMpPnL4l6J8m6PO1k8J5nK8o4J3M9J3k4j0L9p9
$$ -17 -24 1 -17 -4 -11 6 6 -45 36 -48 -57 2 -28 -24 -20 -27 -20 -25 9 -27 -9 -55 -48 13 -15 0 -5 23 -41 -28 21 34 10 0 39 -40
9337d0MO8l9J7l2M9l1K5k1rJ3j7OK2Kj7j1KrMoO0j6l4L3k9L7Qn8JL1oJ0k0j1j0
$$ -40 -36 32 -7 10 -22 27 -4 21 0 -9 4 -13 -7 15 17 0 -11 -9 -18 -14 -20 40 24 -10 23 -6 31 39 -19 -18 13 7 17 -3 -14 -24
9373b4j1NQ8m2qj7l0K6J3l2P7j08M9mk0M3j7J6l9L2J9j9j8J7lJ1j9oJ9lk1M8p2
$$ -24 -35 -30 58 16 8 -9 -39 -13 0 -32 45 -63 -14 -18 -38 5 -12 4 -35 -3 16 -3 -21 -4 -7 4 -15 -21 -2 -5 -26 22 -50
9406e0L8l0O2l6J7j7j0M8m0QJ0k0L4pk6k4L8j8N0o9RL2%L1o0L6k9nj2%K2m2Q1
$$ -50 -12 -42 20 -16 1 -16 -26 22 -18 -10 0 -20 14 7 -19 -43 -5 -23 27 -42 -33 -1 -1 30 -30 6 -23 -28 -40 -40 -18 -60 21
9439B1j9l9K6k2K8k0Jj0RpM1L9n8J0M8k4jo9M1l3K8RK3j7L0n8l4O6mn7L7oL4l
$$ 21 2 -37 -11 -33 -5 -25 -24 -34 -25 -32 9 48 -10 0 48 24 23 -46 -5 -38 -10 -1 22 5 35 -23 -57 9 5 -52 -15 -21 13 10
9473A0j1LJm6JM3K3m9K7j9KK2KQl7j4M9J5m7L1m4K5Pk4J4K3rM8m8Pl5KL8l9J0
$$ 10 -1 2 3 -43 -42 1 24 -25 2 -17 -15 7 9 17 -20 -34 15 30 -17 14 -30 -5 2 -22 -8 15 6 54 6 13 -22 -20 18 -21 -11
9508a1lL5k2J6l0m0M0K3J7k7K0k4J8l1Njl4M7N7m5n9O5O1r6M1l7PK6oNl8M3J9
$$ -11 -14 21 -1 15 -15 -55 -15 8 25 -2 18 -6 12 -19 -14 -15 -49 -2 55 10 -49 16 77 -19 22 -15 -8 18 12 17 -21 22 41
9541D1n3pLk1K5KL7n7N0j2j5O1n8M1k1kJkm9M9l1N0l4k8N3k3%k4J9mkMOK2Kn2
$$ 41 -12 -19 -16 -37 -12 -10 27 -30 20 8 -7 54 -4 37 16 14 15 13 -36 13 -18 32 -2 -30 23 0 0 -24 -5 -9 -11 -7 -1 21 23 -29
9577b9N6o7L8njJ3oOmJK0o8N6k9J4k2J3N0n0K5m5N6mn1J8J4lpK6kk4L3Nj1qj9
$$ -29 27 -40 -2 -7 -8 5 -1 5 1 2 22 -46 10 -19 -5 -27 -14 36 -14 11 -34 22 18 -33 -15 -1 -4 -11 15 13 -11 22 27 16 8 -11
9613a1M0Mj0l6K8j9J9ll3nJ2J1k1j4M6k6L6j5ml0N8j8j6l3N6k7j4K6%L8m0jk6
$$ -11 29 33 23 -13 15 -4 15 12 -21 -26 -14 -3 -24 -38 8 -18 18 3 -1 -31 27 9 -7 -40 16 -11 -25 1 1 39 -1 -2 -28
9646b8j0N5m9O9k7m1Q4m3L1o4RL1j2j9M4o2P3q7M1K4j5L2q1P5k7j6N0j7n7lK1
$$ -28 -38 17 -32 37 10 -31 53 10 41 -23 -14 17 5 -14 30 -32 41 -46 -5 19 4 36 -45 30 3 -13 37 20 -37 -40 -19
9677a9oK6jnlL0%o4L1L3k3lJ6L5m5k1J6J8K8q7M7j0K5j8l1M5Nl5l9Q1n8N3oj7
$$ -19 -25 1 0 -5 -8 22 22 -42 -11 22 -1 -4 12 47 2 -19 -3 15 43 -44 3 -7 18 0 -31 14 19 -16 -55 26 -32 21 15 -2
9711bLL1l9j6J08n0n1L0n0P5o0J8j4RN3n4K8k9J7j2Jj2K5K6o4rN1n8J3K8Ko2N4
$$ -2 1 32 -7 -23 85 35 -16 14 -36 39 -21 -3 -17 -8 45 -9 19 -10 7 -5 -4 -16 9 35 -29 -38 13 -45 -32 -4 -2 -64 -10
9744a0ln5O4J4l2j9L7J4l3K9k9MJ7m5L4lL5j0l3J6J9K6o4M1l5k5rM2N8l3k9J5
$$ -10 -13 -68 -4 10 -22 -41 -4 10 -23 6 -23 -19 -2 -47 -13 -16 19 9 -24 -8 11 37 -27 14 -21 -46 -55 -13 45 12 -17 -2
9776bk5J6l8N5k4rM3jJ2k6k9J3Jmk3J3j3mN3l2K7k5M1l4K7n9N0J6o9O1m8K7k8
$$ -2 -27 -11 -49 6 -18 -27 16 15 27 1 -28 -15 -14 -18 -41 -28 -41 -45 8 -24 3 -22 19 -15 12 -47 3 19 -50 11 -37 -10 -38
9809c8OJ8Mj2K1qL5n4opL1J0J7K7k0k5k1K7K0m1rJJ6nnJ1qmjKqPrL8m5J6M2l1
$$ -38 -32 -14 -10 -22 -1 -9 26 -28 -34 -41 -10 0 17 44 24 -1 -22 5 25 -16 -25 -24 -8 -13 -18 -7 -15 -19 -20 -18 -26 -19 -28 10 -35 -19 23 -8
9847hj4QNpKO9o2L7m9lK6k7N3l1prRrk0L4K2j5k6j1N2nl3rL1l1L8o6L2lrM1M0
$$ -8 -22 -14 -9 -16 -14 55 -7 30 -19 -22 4 -23 30 -1 -8 -17 -8 -17 -37 -3 19 4 -22 -33 19 14 -19 -28 3 -28 10 -56 -24 -27 -36 5 45
9884D5r7J7ORQN2k8l4K2m8P4n8l4K1O7j3l6K0n0K9N0On0K2Pj7K6j6j5K7j2l1P5
$$ 45 -52 -35 -29 -20 -12 40 12 -22 0 -48 26 -32 -66 -45 22 9 -27 -7 -57 -28 22 28 -22 0 7 -10 16 0 -15 12 0 -31 44
9917D4l1J0p2P6ll5K2m1J4M8m7Mm3L2PnJ7L3m0nP9o0PJKl6K0L6j9jp6J9N8n0M
$$ 44 13 23 -49 27 24 -11 11 -30 -16 32 -15 -11 -54 -22 -15 -20 -3 30 -10 -15 64 4 11 12 14 -22 -2 34 15 14 -62 -43 15 -35 -31
9952c1M1m5J6QJ0j1J0J5pPk9Jm8O7j7k5J7pN4k8N6q6lL8j0RJ4m2MM8j0Kn2N2j4
$$ -31 10 -35 -19 -11 -1 -12 -2 13 6 13 -16 -15 -63 4 -13 -38 -21 -28 26 -2 54 -32 -35 3 -7 2 16 -26 -22 26 16 18 -34 18 4
9987DpOm8M3L8n1L8k3L1j9j0kJ1k4lM9l5O3o3K0qj4oJ8OL1m7L2l5LqM2l0K6n8
$$ 4 -3 3 -45 -2 36 -15 23 0 31 12 2 0 11 -13 -16 33 -2 61 -2 18 10 -4 -10 8 14 45 -2 30 -5 -2 -10 32 2 28 -30
10022c0K9m0j2N8JJ5k8nK7k2oJQO4p0lK5Kk8J2k6L6k1K5j3j1k0P2m2NJ6J7%m8
$$ -30 -1 -41 -53 5 6 21 -7 -12 15 -7 -13 -12 -4 60 -10 -13 12 14 -14 -2 -28 8 -13 12 -1 -12 -32 40 -2 3 19 36 36 -12
10056a2n2K2M7k3K3l3K5J6Qn3J8oL9l0RLM4m3m5L6Nl0J0J8j3m3N5qJ6J2j7rol0
$$ -12 -64 -42 5 -18 5 -28 -3 13 21 -32 -14 -20 19 -11 -2 1 45 2 -43 -7 -2 -32 -22 -4 -17 -60 -5 -13 3 15 -2 -11 -17 -47
10090d7J1K7k2L0Pkj0J6l6jO5n5j0Mk1N4Qp5N5j0j5J1oK6k8K4MJ0p2O4Qk9LM6
$$ -47 -36 -9 -31 -1 6 4 -6 10 -26 -27 38 -17 -27 -23 -44 10 18 -57 -2 -12 -27 -16 -22 4 -24 0 4 14 -58 6 14 -15 -12 34
10124C4m0K5l9O7n3J0ln2L4J2mJ7m7N7l1L7n0L6Km0L6k9pK0pj0L7Kl4l7J8J5l0
$$ 34 -6 19 -20 47 -6 4 1 -51 -17 -5 -9 8 -39 18 -13 24 -26 10 12 -28 8 -21 -28 -8 -15 -25 12 14 -20 -57 -39 -24 -54
10157e4N0l3O6o1K7j8N4Ko%j7jk1NPn1mR5q3M7rnl0J6M5n4O7m4Ok2RQj1k6K1O2
$$ -54 -4 -37 29 -32 -5 -23 31 33 27 27 10 9 -12 -7 0 -51 -55 40 -43 4 -5 -10 -40 -24 21 -33 34 -10 -4 -26 -17 -9 -20 -46 -25 37
10193C7p8N2J3l6k4l0N1l7K1l5O4J9k0k8K1RJ3J4o4J9L3Ok9L0m5L4Nql2J1M9p1
$$ 37 -41 11 24 -12 -36 -66 -15 -52 -31 -66 -2 17 -3 -31 -10 -1 12 26 -38 -19 14 20 -9 21 -24 10 15 7 -25 -14 35 -36
10225c6J5J5l6L4k6M0l4N5Oo5L0j3L4J8p0Q0p9L7p0R5j1qk5PO6p1Ok3J2J1J3j5
$$ -36 -21 -6 -42 -8 -34 6 -28 27 33 -32 -2 -15 19 37 -33 47 -32 5 -65 30 19 11 -14 -7 59 -12 -6 -29 -17 -6 7 -8
10257hJ8p3R4k2L4o3L3l0N2l4Jj2l1O3l3K2J0Mm3LL3n8O6k9M4j6k5PK1k4j7Rk9
$$ -8 10 -63 31 9 43 -20 13 -17 35 1 2 -10 -41 22 -11 11 21 25 -18 -15 18 -40 26 -3 41 25 0 7 28 4 -13 -4 -33
10290c3PP2m1j0Mqk2j3K9PL9k0Jj2k0M3o8L1L8l2K2l1K6KmPk8J1L5Qj0j8j5L8
$$ -33 -26 46 5 -5 -1 -9 -31 -44 -15 -8 31 11 12 0 -20 23 -45 -14 24 -8 14 -17 9 11 7 14 -14 -3 32 40 30 12 -3 35
10324C5j5j3%L1p6N4l1K6k7L0mrL0n4J4OKNM5Lm7j1k1P2l4J2l3Ql4J8J0oJ8K0
$$ 35 20 7 7 38 -38 16 -15 11 -16 14 10 1 31 -23 -9 -3 -1 4 49 52 5 -6 -27 45 11 23 -10 -2 -36 -18 -8 -14 4 24
10358B4j6om8M7L1m3M3m4J8l2L3J1n3P4n1N9m2mJ7m1L8qm3L6j6J6Rk4Qj3M0L4
$$ 24 8 2 -46 1 32 -11 32 -12 6 -26 7 18 -35 39 -12 47 5 1 18 -23 15 7 -36 0 -16 0 9 -15 -7 -20 20 54
10390E4p1J3J1LJ6l1L7m0J1J4j1JK8rk1m8N3NJ5l8kJ4m0L2RpO9p2lM0l6L3j3j5
$$ 54 -17 -4 7 10 26 -5 32 -8 3 17 6 7 35 26 5 -43 10 15 30 -8 -10 4 -36 -4 5 -2 67 -5 -8 32 -4 29 16 1
10424Aj4J6j5N4n1njMM7m7j1Rpj7O0j6l9jM1k0M1l6L9n2J3PM0o5k6O4k3N2o3M8
$$ 1 -13 3 -12 42 -9 -14 -15 -11 36 -11 -22 -13 -20 -37 23 7 -32 -33 8 -12 29 -7 32 -20 -7 0 40 -25 -51 13 -10 42 -21 27
10458B7klKl4k4N7Pl3k2QK1k1L1l5qJ2K2kj7M5n0qL8m1L7KJ2m1L9K7Ol2M%m4L0
$$ 27 25 22 24 -10 -34 23 30 -3 -25 -17 4 -17 14 -21 -29 -17 5 3 -14 31 -19 -27 11 -30 7 9 21 -20 19 46 52 20 24 24 -20 10
10494A0J2o5N5j9J1ok5jJL1j3J6nK9k2J6o6J0L1L5j3q0L4O8m9J1n7M9J7n8L8j2
$$ 10 22 -43 12 -7 4 -2 -27 -28 -27 4 -9 7 2 31 9 25 -41 -31 0 35 22 -58 -24 44 -5 6 -51 -2 15 -43 -5 -17
10526a7J0m5L7K2l2N6j07K8J0M9l0%K2j1Ol9J0kM5j7N7p9M8ql1L1J8m6K2njl0
$$ -17 -7 -52 -15 7 -25 31 -76 -48 -38 11 -19 -19 3 -8 -2 -41 -31 -33 12 -5 52 -27 21 13 -18 13 31 -15 7 2 1 -29
10558b9kJ4k8M4k3J3%lK4nJlj5Mk0M3Pl8L8l5RJ0J9q8P4m3j0O8mk3j2nL6k0l7
$$ -29 -31 -17 -45 -1 -24 -11 -11 -14 10 5 6 3 -12 -8 -28 15 22 -16 22 -13 -4 6 25 -63 11 -32 -42 26 22 -1 -13 -18 18 -2 -39
10593c9L7jk6JmJ1k1L2qJ9Pj9Onj8L8m3K4kJ0K6k3K7p0M8oJpJ0m8Q5m4J6k0M2
$$ -39 -2 -3 -29 -28 -32 -21 -42 -10 -18 1 8 -11 -5 -10 -28 10 -33 -9 -11 -1 25 2 29 -41 7 1 2 -5 5 -43 42 -2 14 -6 36
10628C6o4M3K1m9k6O4l0O2p6JPJ4k7L1l9K7j1LmqJ5k7M2k9M3qJ6j5rNQm6K3L6
$$ 36 -28 15 36 -13 -39 25 -5 57 -19 -18 -11 3 -24 7 -32 -5 -16 -13 -17 -25 -10 -37 5 -24 19 11 27 12 3 8 16 -30 -7 29
10662B9oLJ7l2j8j4J3J5K9j5l0o1M0KM0k1l4O0j3L0n5L1pl9J8J1J2j5j9N3J7n4
$$ 29 23 26 43 11 -7 -21 -8 7 36 21 -9 -70 -30 -28 12 -9 -43 17 4 34 -21 10 3 -36 -18 -7 5 -10 -29 24 41 -13
10694a3k4K3kl5N6qJ6k4L0l5K1k7rM9m4N9m7M6k1j0j7NL4k2k5N3k6J1qM2r5P3
$$ -13 -37 -14 -16 -51 5 -3 13 -11 19 -16 5 -22 -31 18 -26 33 -14 32 11 1 -16 -11 23 1 -24 29 3 14 6 48 -47 26
10726B6l8M8k2j9NK8kl5K6pn4NJ9mM4qNp3P2J1j5KPl4J6j1KJ7K0k7j1J7j0j3J3
$$ 26 -12 36 14 -5 0 28 26 -9 17 10 -44 -39 -20 -24 20 12 17 -56 16 27 12 14 21 -13 3 -8 -6 11 31 4 -7 10 0 -13 0
10761@j0LPK4l0L4l1M9q0lK8j8J1oO8n2KL7m2Om1O5l9N5l5J1J0m3k7K0MN9l3j
$$ 0 -10 -7 0 24 -6 28 -3 46 -34 -37 -9 -27 -16 -22 46 -6 -4 33 -9 -3 -44 21 -18 37 2 13 23 -20 -47 -27 -23 36 3 2
10795BLpK3p2N1l6J7NO0o3P1on2qM2p4M2K1m8K6PRl0KM6l9J7rL0J2n3qL7n6OL2
$$ 2 5 -2 21 -51 0 -36 -19 -14 46 -17 54 48 -4 -12 30 -44 -2 19 -29 -3 4 13 -17 -15 31 -8 9 0 30 42 -11 -19 18 -38 -32 0
10831@l2N5J1l1J4J6ql0Kj1L0j7j8N1Orj5k3K9l1J1M1j1o9L8J6j8K3l4Kj1K7%
$$ 0 -32 23 34 3 17 33 25 -5 -3 -14 16 -1 -19 32 38 29 14 -9 20 -11 0 41 30 -39 -1 15 -3 20 -14 -12 -23 4 4
10864Dn3Q8o4K2l3L7K9n0J0j5K0l0J6J9MK7p2N6k4K3qj3J4k1K1p2Q8p7M3Mj5J6
$$ 4 -49 39 -25 -3 -36 1 30 -20 -10 -25 -5 -35 -19 0 4 31 -41 15 -9 14 6 -7 7 -14 7 -65 23 -54 -11 -7 -22 -6
10896foJ8Qm0M2mJ3m5K4pj2mmK2oL0m8N1m0o4N9J7l1L1LNj1k6P0j6j2lRm6M6k0
$$ -6 -12 6 14 -26 16 12 25 -20 4 -3 -15 -19 -23 -1 -7 23 -25 26 -14 -78 -19 -2 -33 -2 1 6 -5 -31 39 23 11 8 17 -29 17 -3
10932ck1J7j1qO7k6m2J8N1m9M3l1l4K6n7M2j2N6m4K6n4K8K6l1K9o0O2k8J1N1n0
$$ -3 -24 -7 -18 -26 41 15 -27 -9 42 -7 36 5 -29 -3 -60 -18 -30 26 -18 8 -46 -18 8 -23 6 -54 8 -20 -9 42 -8
10963hJ7kk2J4j0j6J5K9n4L1J2KJ2Ok1k6PJ3J8k6m7N0k1Rl0N3N0p3K2lj8L3ql2
$$ -8 9 7 -15 -1 -11 -27 -12 17 -37 -6 6 8 20 26 5 -21 -14 -1 17 -9 -56 -6 -27 -18 -48 5 55 -18 4 1 -17 16 8 -24
10997b4K9L8j22J27m8j4J4j0K5Mo4L5l5P6on3M5J5p5O9J2j7k2qK5J4l1jM8p4L4
$$ -24 5 43 -79 48 0 -14 0 -10 15 19 -45 -10 -45 31 25 -28 17 32 -43 26 38 21 -1 -9 16 30 -1 -2 46 -28 6
11028FJ7m4M3k4K1%K6l4k5Nkmj0M7pM0q5N8j8J1l3k8K1nL3Jj9L6n1K3J1J7n2M1
$$ 6 23 -21 22 -2 19 19 45 11 -14 -9 -11 -15 -25 22 15 55 -30 28 10 21 -12 -40 -19 -24 9 10 -9 27 -24 -1 10 27 -25 16
11062A6m9l4P9j6Lql1L3jL9o4J5J2M0J4m9nL3m1J3lJ9%j7Njko6M3pO5m6L0m0M9
$$ 16 -33 -67 12 -4 -1 -9 -40 -7 -8 31 -33 -18 -6 34 48 -1 -6 27 -14 -1 -4 15 15 -2 3 2 0 -66 -23 -30 35 -11 19 -21 28
11097B8k2k0L9k7K2m2J0Kk2N8Rk2K3k7j8K5l0K4k6L1k5N8j8k8j4K9K3k9k2j0K3
$$ 28 6 -14 25 -2 20 -22 -12 -10 -32 26 35 13 36 9 -9 16 -14 10 -16 15 -10 48 30 2 -12 17 40 11 -11 -21 2
11128BK0%K2m6J0K0k3K5p1N1k5K9q8J13p2L3M2o2R3l0q1L4k8K3J5L6o6NJ2Qj7
$$ 2 22 22 44 -2 8 28 5 30 -41 10 -15 14 -74 39 -33 0 42 -20 73 43 -38 -4 -32 -9 6 42 -24 -19 -7 1 -16
11159a6L1Qk8K2k8L5j1mLj6JpM2n3L3L0n4n%J8J0k3J5k3K7k3jj1KP8n8J1ol6R0
$$ -16 15 23 -5 17 -11 24 13 9 12 -4 -3 -10 32 -21 12 42 -12 -17 -17 1 11 -12 3 -20 7 -16 -17 -28 -26 52 -6 5 -1 -37 53
11194E3p3MK7m9krO0j0J8l3RK6%J6n9PM1K4m3mnOk3rk8M5MM1o3M6L5n9K9K3p9
$$ 53 -20 -16 11 -38 -40 -49 11 1 19 -14 -5 21 21 37 -22 -15 26 50 7 3 -2 4 -19 -28 -56 -11 -7 34 -29 17 52 -7 22 45 -34
11229c4K6%J8J1m4L7k6J4J2m4PN8k7k4OPJ5k6%J4J5m6J0MML0m8M5m9J2K7Mr6N5
$$ -34 -8 -8 10 21 -23 14 -12 2 14 -30 -23 35 8 -16 -10 -3 12 -14 -14 0 15 -31 -21 -17 -13 17 -31 14 -35 -23 4 8 -88 -33
11263c3K7Kl7L2kj1J9k6M5k1j4qL5L6m8l6J0M3n0P5q3kL6j8N1l4J3j1MRj8Pn6
$$ -33 -6 -4 -41 -9 -11 -22 -3 -29 16 -5 -19 -27 8 44 -4 -40 -30 13 -37 38 -45 -47 -11 -29 22 -12 1 -10 -6 3 -15 -8 -64
11296f4P7jK1k4j4M8p7L7J7l4Nk2M0k3J5pJ0J5j1j3l1Mj3k0O2j8m1P9o5J5J2j6
$$ -64 13 12 33 9 -5 43 -34 3 20 -14 -9 -31 9 -14 1 -6 4 19 8 -5 -36 -32 -45 -65 -3 -21 -62 17 -48 -33 -21 -37
11328c7M1j3O0n3L6k6J3l9OKrOOnK6JlK9n9OL5k3mL6n1J2j5L0K4qJ3k6Ll4M6J4
$$ -37 4 -9 51 -2 34 8 21 -18 -12 -10 -19 -13 -7 -12 14 15 12 41 -18 -12 23 0 -4 32 -19 -7 -22 8 32 24 37 11 14 -20 26 40
11364D0l6koL6kj5%rl3K1l3O4l2k7L3l0M2j0l1K5M5nl7J3J6J5k7k4K5Pn1L6L0
$$ 40 4 2 -4 32 30 15 15 6 -27 -6 -39 25 -7 -34 -1 -31 11 1 -30 -5 40 35 -2 11 27 42 15 -9 16 23 -28 8 38
11397C8j6j4J1n1M7nj1J0KK0o6O5j9L8J1o7K2K5k4K9j8l9M9n2L2qL4n6J3lJ7k0
$$ 38 22 8 19 -32 15 10 -1 9 11 31 -35 30 11 49 60 -7 15 40 16 45 27 -12 37 -15 17 9 43 -13 0 -3 14 -6
11429fl6J2O2k4K9k9m6J0N9k1j3K3j3J8n9Q1o0N9Ro7M0l5L7RLPm0L0J6j4J1m0
$$ -6 -42 -30 32 8 37 8 -38 -28 31 10 -3 20 7 25 -34 47 -13 46 55 -12 28 -7 30 39 42 49 9 39 55 41 52 12
11461A2l0M8j4l2PQK8j4K4k3Nn2L7l0N4l3J9J2o1P2k4Jm5O9j3j7J5KJQo1Q5n8
$$ 12 -18 30 16 -16 -9 -1 27 13 37 14 19 -33 4 -26 28 -5 14 26 -35 37 13 14 -31 38 25 8 23 25 26 34 -27 58 0
11494@J9k1Mk9M0J3K8oj2l4k3J4L4KJ6j1l5J5K7pk4J7l0QJ3l5N1jj8J8k5rk3L2
$$ 0 19 -2 2 -27 13 26 54 48 36 2 -21 -7 27 29 45 34 -1 14 41 34 10 27 -3 5 18 -17 34 33 15 33 8 -1 -24 8
11528Hl3N5k8%J3J6k4K3j7j6J7Kj9K2kjl7MOkJ2PoL2m5L7M6n2n2L9j5L2Ko4Q0
$$ 8 -25 30 2 2 15 31 7 30 13 -3 14 16 -3 19 17 16 -21 -17 -11 -13 -1 6 0 32 -13 24 70 18 -34 5 -10 22 24 -40 40
11563D0j8m0J2j3L3lK9k9j0N6q8K3k7O1K3l1L7p5K5J9Ml7M2K1m8L0%m7jK5K9n3
$$ 40 22 -18 -6 -19 14 11 40 11 1 57 -31 -8 -35 26 49 18 55 -20 5 24 28 -9 33 54 6 36 36 -11 -12 13 42 -11
11595a1J9j7Qm3O8n8QK8L4J0n5J1m2L1K6Km7OKL0l2K9mj6K8mK3n4k0M6Qk8M2o2
$$ -11 8 -9 -1 -44 24 -34 -26 2 36 46 -9 2 -40 -9 17 19 -28 -22 -20 10 -22 7 3 -13 15 11 34 -20 -40 6 14 -14 28 -34
11629c4K1M3K7j8l3L8k4k2m9QK5J7k4J2J8j1K0k2L3k4j6M1prKK4l8OmL4j0k9L6
$$ -34 -13 30 57 39 6 44 20 -2 -51 -43 -18 -1 -25 -13 5 -6 14 -8 25 1 -15 26 19 10 12 36 -2 4 0 34 24 -5 31
11662C1n2J7k0N2k2KKjk5k5M6KML1o0RK0L4m2L0m4nL0k2J7J6j5mk1K4jK4mm8M
$$ 31 -21 -4 -24 28 6 8 10 9 -16 -41 5 7 11 42 -18 -9 11 45 3 33 -11 -16 14 -8 9 25 10 6 -15 9 8 32 28 -20 -16
11697a6K6j0K5%j2l5j3PM1k4J4j9K0Kl8L7Kj0Mj9K1l9QL9k3k8M6L2j7o7K0J5N2
$$ -16 10 0 25 25 13 -22 -35 -28 13 -11 3 -16 4 6 -32 5 7 -3 1 -18 3 -36 -28 11 -12 -40 6 38 21 -46 -26 -11 41
11730D1l9j1j0L5j4j8L9l4J0LMo3J00m1M0m1J5k9jJL6l2k7O1k1J7o1K5PL4K1o6
$$ 41 2 -9 -19 16 2 -16 23 -11 -1 2 6 -57 43 2 42 1 16 -13 -14 -13 23 -9 -36 25 4 21 -40 -15 -8 26 47 -19
11762a9J8K2%l8j2J2j7M4k3LM1jk2m2M5K8q2N7Rm8J8L5l0M2o5n9Q4K6m0J1J8k7
$$ -19 -1 21 21 -17 -29 -17 -34 10 -13 -10 31 30 8 -34 11 39 -43 14 23 -25 -7 28 -2 40 -25 -84 0 26 -14 -3 15 -12
11794a2L7l1k8J8J6lkj8K3k4J6MMk6j5O0K2mp4N1pL6%k7K3k1J5m1N6k3j9Nlj9
$$ -12 25 -6 -34 -16 0 -3 -5 -23 0 -24 -8 -4 0 -26 -41 19 41 37 -37 14 7 43 43 16 39 18 33 -8 48 25 6 11 8 -11
11828a1J7j0lM5n4K1J2j0rP9o4J5k8J8Ok6lk3N1Ok7MmK0%l9N0m1M4m5N5j6j7j
$$ -11 6 -4 -7 38 -16 5 17 7 -2 77 13 28 0 18 24 -2 -5 -28 23 29 2 6 2 22 22 -17 33 -8 36 -9 46 30 13 12
11862A2j7J9k5QKm5Q2j1o8K5K7j6%N0m0K9m9O1Om6J4m4K7M8o4N1NNo3J3rK7j3
$$ 12 -5 14 -11 -3 -1 -46 36 25 -43 -18 9 -7 -7 43 3 32 -17 44 50 4 18 -26 1 49 -15 36 41 46 -17 -4 -13 14 1
11895APj2%RnQp5J02n7jMK0l0KK4Ok6N8p6N8Ql7K4j1K9m4oL2k8K6qKNkj4L7mn0
$$ 1 8 -4 -4 5 0 8 -67 35 -22 -23 -19 1 -29 -27 -3 3 -23 35 -41 17 25 -12 12 1 30 -14 -20 12 -16 10 2 4 9 7 -7 30 26 -24
11933b4M3l1L6j8J9pp7Q0m3LL3m2M6J0o1P6m3KMk8J0K7n5L7M7l3l5M4J3m5J3P
$$ -24 19 -12 24 6 25 18 -59 21 -22 -19 14 -28 18 28 -33 43 0 2 6 -22 -12 15 -40 -3 44 11 -24 20 33 -12 1 8
11965HJ0m9lK3l3J4R2j18J5J9M3j1k2%kK0j0N5o0mkL0J5J1k5qM3q6K1M8l4L5o5
$$ 8 18 -31 -34 -11 -44 -30 62 -56 -41 -22 21 10 -12 -12 -14 6 -4 51 -9 -13 -15 15 30 41 16 8 51 -35 -14 34 0 35 -30
11998c0N3k7K6J6m8L4k7J5k2J6K0q7O0Qj8K8k6k5J9M2m0KJ1pjL0m4j4P5k6lK3
$$ -30 23 -4 22 38 -10 24 -3 12 -10 6 26 -61 -1 7 -11 17 -9 -34 -15 27 -13 -11 0 -7 -8 22 -22 -36 39 13 10 33
12030C3Jj4rl6R4q5L5m0OJ2k1kL2j0Nl3P2n7KM2j6M6r7M5M5p1Pmj2mK7K8m4Mn
$$ 33 34 20 11 -25 69 -16 19 -21 -15 -3 -24 -26 6 -4 1 -32 40 -17 -15 27 11 57 -40 5 50 -21 -14 -18 -30 -34 -7 21 -23 -19 -24
12065b4K0J4J9jl5J6pql7M4k5l1M1J3j0MJ7Ok0M1q6M4K9%j7k6k7R9l9m8N0k7j
$$ -24 -4 10 29 28 -7 9 2 -6 -43 1 -24 -55 -14 -1 -11 -7 10 16 -4 37 -49 -5 24 24 7 -19 -46 53 14 -34 16 -11 -12
12098a2Kj1l2M8K4ok3rK5k2K0j3m5L3L8n6J2M1rK9m7j7O6l7j6J8%nlK5m2J6kR
$$ -12 -10 -21 -53 -5 19 13 -10 -19 6 -16 4 -9 -54 -21 17 -39 -27 14 5 34 -13 -30 36 -1 -17 1 1 -4 -7 18 -24 -8 -10 -1
12132al6L3Nj6j6L8K3k3j7K3L8m5j9K0j7O5q9K5L2k7Lq3N7L7kj3J1pJ3l4L1j7
$$ -1 -37 -4 1 -15 -31 7 30 7 -10 13 51 6 -13 7 -10 55 -34 -9 23 -4 -1 -84 -27 10 8 -5 6 -1 12 -22 9 -8
12164hK5j1K1j0k3k1k3N4K9k7m4O6l9K4m2RlLL1OmJ1n3K6JL0o1K3qJ7k9M3Mk3
$$ -8 17 6 27 17 -6 -27 -50 4 33 6 -38 28 -11 13 -29 -20 -23 -20 11 17 13 24 -29 -3 -2 28 -33 -10 -18 -1 -30 13 17 -6
12198fM1p2O2m6N1%Mm0M5l8M1o2L2K0rNkj7J6j7K6okjOm9J3M0n3J2oL0j5mK2k9
$$ -6 35 -37 25 -21 30 30 34 -6 39 1 42 -20 12 32 23 28 26 9 25 8 34 28 26 25 31 -18 -5 35 -18 -6 -12 18 3 -1 21 -8
12234hj1N3m0L1k1k2J9K1m3K5l7K2K5k0O7n5L3o6N6pqJ1j1k6K9k5N2p0P5q4L2
$$ -8 -19 34 -6 25 4 -18 1 22 -21 4 -33 -11 14 -6 61 6 39 -27 29 22 14 25 14 -12 17 -8 44 -26 49 -35 -3
12265cLJ7k8M8j3J0j1m1M8nJ5k7qLK5l8J3n0O1j8J1k6L9Jl0K4J6n9P5n7K2OKl6
$$ -3 0 17 -11 37 24 34 23 -18 30 25 40 13 5 8 33 -5 8 -42 19 1 12 -14 25 26 -4 20 36 -23 52 -5 17 23 25 -11
12299a1J5K4m7N7l9nK6o1K1L0jqK6pnRJ5j1lm1KqL0l0M4n7M8kn1J1K7NJ3j5J8
$$ -11 4 28 -19 38 -1 -6 20 -41 -20 10 9 1 27 20 15 24 39 28 25 -16 -14 -22 8 -22 22 -35 13 11 -40 -29 -2 3 16 1 19
12334A9rK5k1l1ML4k9J3Nn4Q8m7qK9k7L1m4K1M7m0L3l2J1k9K9o9R1m2j5K9j7R
$$ 19 10 35 14 -17 -13 21 -8 5 10 -44 44 -3 -11 18 -9 22 -22 -1 46 6 39 7 18 -11 18 -51 40 -2 -17 12 -5 4
12366Dj3N1k5Kj9M9m0j4rM9j7j7n9K2QJ9mNK8j4rjj5mJ7l0K4Kl2N3k3kJ9Oj7m
$$ 4 -9 42 17 19 0 49 9 -5 -14 35 18 1 -58 -36 -28 -9 -13 -8 20 6 -3 -4 -19 -23 -6 -36 -12 -10 -42 11 -12 -14 5 11 -6 -10
12402a0J1N2o2J7l3K8j0L4k0m3K2k1M7j2m4L8l1MM0K0rp2O1l2N1l9M6m0j8L1j7
$$ -10 1 53 -9 8 -25 3 -7 27 7 -36 -14 -35 12 0 -44 -6 -37 -33 7 27 18 -54 7 -25 26 -13 33 -7 -25 6 -11
12433a1j2pK0J2j0L6l8J6Pj6K7l3J2j3k6N6%j7l9N0o5P8Om1J5m8L7lrJ8j2K8N
$$ -11 -23 -30 -10 2 -8 28 -10 6 13 -3 24 -9 3 -10 -36 20 20 3 -36 14 -51 27 33 -8 7 -41 -4 -7 -16 2 -10 18 23
12466B3k9OJ0J6k6J1klk6rL6N%j2Ljm2%L8n8Q1l7M3k4J7l1LnJ6rm3Q2m6K6l2L4
$$ 23 -6 0 10 26 0 11 9 6 -20 -29 7 12 12 0 3 2 -40 -40 -2 -60 21 -16 27 3 20 -11 -8 -13 3 -6 -49 33 -13 13 -19 15
12502A5l4MK7j6J0j6JNj3L5j7l5kL7k0ON1k7RpK2ol0N6o7M6k8nRl1N6k8l3L4q
$$ 15 -19 -15 12 -4 6 -10 -9 -4 -17 18 1 -34 -36 1 -19 -13 38 11 20 13 35 29 -1 55 -12 34 6 1 10 -21 35 7 -26 8 0
12537@L5j4K2n5L3n4QJ9l8K5nJ5pM4l5rRl0P0m7j9P1n3LJ3nl3K5nJ9l2L5K6k2
$$ 0 35 21 43 -12 21 -33 -25 -6 -44 -19 -24 -9 -16 28 -7 -16 -7 -37 33 -14 -33 38 -15 -12 1 -4 -37 -12 -17 2 -30 5 31 9
12571IMRl1%J8l9N7n3K5kL1j8J5J4nl8%pL0o0J02n3J9p7O9jm4PLqM8J9n3lL2l3
$$ 9 13 22 -9 -9 9 -30 27 -26 -1 -3 28 10 25 39 34 -4 -4 -11 19 -41 61 8 27 -50 19 18 -26 -19 -16 -24 24 43 -10 -13 19 -14
12607a4M1j8l6K6l3L9k4K6n6O3Kk5K7l6J8j8nQ2j17Q4j4n0NL3Qk2K5Mk2K3Pn2
$$ -14 27 9 -27 -1 -34 5 -19 7 -49 14 16 -9 18 -18 0 -18 -23 59 -58 26 12 -38 -33 0 8 -14 11 15 -7 16 23 -29
12639b9L7K5n3O7%l3J2m3PL9J7on6K9Ql1l6O6jl9M0o6P4l6KL5Pl5K6J6j1k0K6
$$ -29 8 33 -20 47 47 14 26 -17 -10 29 46 40 -16 13 21 -10 -46 20 19 -20 20 -46 28 -8 -6 29 36 1 27 43 32 12 38
12672C8o3NN3m2K4J0K3l9LK5m3J6oK7Kj9j9J1K6l0Rm7K0K4oKkN2k2j9kl9J08p1
$$ 38 -25 -20 33 -9 15 25 48 9 12 37 -6 10 4 31 33 14 -5 6 32 2 11 -36 -16 8 2 4 2 54 32 13 11 -28 80 9
12706Ij7N6l3pl3P1l5k4J8j2l0N2k2kJ5j0rj2P3r7N2Qp8L6P7m5K1k5L2k5k6M8
$$ 9 -8 48 15 8 -25 46 11 -13 5 -7 -37 15 -7 -9 6 -4 -13 -25 48 -49 3 11 -67 -31 46 1 22 -3 29 4 -22 26
12738B6k3O1p6J4j6N2L5p2Qmj4M4m1N9k2o7L1j2K3O%k1j3m9P1k3LN9j5K8q6M8
$$ 26 3 64 -12 2 -14 38 73 1 9 5 -9 35 -6 53 31 -36 -5 -17 6 12 12 -9 -22 -71 0 -23 -20 39 24 52 -34 14
12770A4K3Kn4K0K1l9PK7Jj7l1M5j7PJ3nj0mj0Rj1llM6p4K3OM3k9j1L5l3K0k3L
$$ 14 37 39 -15 5 26 -13 -6 21 22 5 -26 19 2 9 22 17 7 3 -7 2 -9 -12 -15 31 -43 -20 -14 29 0 -11 24 -9 11 -12 -9
12805iJ1K1pJ6j0l7J0on5Q1j6N2j00N7l7N0k9mkJ2J1k0J9n0M4Ok4jOj2M5k3m5
$$ -9 2 23 16 32 22 -15 -5 -11 -66 15 -1 51 -49 8 -29 21 -8 -12 -14 -2 9 -11 8 -42 2 8 -16 -17 -11 -23 22 -1 -46
12838d6P7j8j2OQK0k1k3k9L7M0m3OK4j1rL2l3n4N2k1L3j5K6n8QMJ9L1n1L0k9M2
$$ -46 31 13 1 7 15 35 14 -9 -38 -1 39 -4 2 26 15 6 38 5 -49 3 -18 15 0 26 -32 -24 -20 -1 30 -21 9 -20 22
12871B2k7j8J1j2L8j9l5P0n5J8k0O6m6Pj3K1k4L5k6j7N0j7J3J8l1Ml8K8J5k1J8
$$ 22 -5 -23 -12 -24 14 -5 -40 30 -25 -7 -27 39 -7 0 -13 8 -16 19 -7 -24 26 9 22 40 9 13 -25 3 18 -3 15
12902A5l5K8K2kj1k4K5l7N3n0L6k6p3K8R4m5K2j6j4mkNJJ2m9J8jN8m5M1j1K3P
$$ 15 -20 8 30 28 17 -7 18 -19 34 -16 20 -6 -79 -51 43 -2 20 4 -10 -14 -16 -11 -10 2 -47 -29 -30 28 -17 24 13 36 43
12935D3j7l4Rk1M5%l2O6m6j6K6pm1Kk6L7L8l9K0j2K5k3k9L9L1Lk4Nj8J7k5J5J6
$$ 43 26 -8 1 -20 25 25 -7 59 13 -3 23 16 -25 -23 -49 -12 26 -13 7 -5 20 -3 -32 7 38 41 17 22 4 21 -4 11 27
12968B7l4L7o8P8o3N1o1N9l6Pj1kK4%K9Rp1R2l1Rk6k7N4q4RM5K8m4JJ1l0M8l2
$$ 27 -7 30 -38 40 -23 28 -33 26 -10 -3 -14 -16 8 8 37 46 -25 67 36 45 19 -8 46 -38 -29 16 44 0 1 12 -18 30 -2
13001bK5k7l1N1m7N4o0L8OjJ1J4Jm6L9m7J1%j1J5J2K4k8Mk0L5l4N2n1J8J6L3l0
$$ -2 23 -4 -35 16 -31 23 -37 1 7 6 17 31 32 -14 25 -22 -11 -11 -22 -7 5 29 1 5 -15 20 -14 38 -13 5 21 54 24
13034B4j1Rl6N6k3J9Qj08P7pk6NmM7j3Kn7J3N1n0K0Kl0M4J5k8k8M1nKK0lJ7l2
$$ 24 13 22 -14 42 19 38 46 -62 15 8 -18 -13 -17 30 17 19 -38 -25 26 -24 -4 -2 -32 12 27 -1 -29 12 7 9 29 26 43 11
13068A1NoL0j1k6k1N9n5k5N2l3K0OJ1K7n8Rk8K2M2o8J2L0rJ4J8Ppm8K8%J3k1k4
$$ 11 16 10 40 29 3 -18 41 -14 -39 13 -20 0 6 17 44 -14 -5 -33 -11 31 -37 -25 5 -4 10 28 35 28 -20 8 8 21 0 -24
13102b4j4J5N0%o0L5JjJ2l5N5j7k3jrM1%K1k3j4J6m1J3j0nRl5O5l3oJ9RJ0o5N7
$$ -24 -38 -23 27 27 -33 2 3 2 14 -21 34 17 -6 -7 -16 25 25 46 23 9 25 -16 -3 -13 -18 -9 -44 21 -12 -18 1 10 20 -45 12
13137A2m1K6j6Qj4j3K3l0M3Nj0J6o7O0j1kK5pm4K3M0k7rj1M0k1j8K5mJ7k3j7l5
$$ 12 -29 -3 -19 -11 -25 -38 -15 -45 -2 3 -7 9 -58 2 -9 -11 14 7 -37 -14 26 -1 -10 -21 19 -2 -20 5 1 18 -5 -22 -57
13170e7K6K3L9j6Ppm4L4l7NJ2j9N1jn5M9l4j6j8L0mj0K7PQJ4l1kK3p1J8O4L0l7
$$ -57 -31 -8 31 15 22 15 -29 5 -32 -27 -15 -34 17 16 -39 10 -24 -40 -58 -28 -32 -42 -15 -8 0 14 -17 -19 4 -67 -49 15 45 8
13204HpKk0J4l0L0l4NO%k6P0J0n4nK9j7pL6j5J4k0J8o7L3K3M6l0k3j2J8K1J2r7
$$ 8 1 3 -17 -3 -33 -3 -37 -32 -26 -26 -52 18 28 -26 -31 -2 -19 -26 10 -5 9 -11 7 -60 -27 -4 42 12 -11 -23 -5 16 28 -69
13238f9M2M4j8JPK9n6%jK7k9O9n0kl9L6k1J1K5J6j2j5J7j3%l0N0j0n0lO3ol8N8
$$ -69 -27 17 -1 0 7 36 -20 -20 -21 6 -23 46 -4 -6 -45 -9 -30 -19 6 22 10 -5 12 -1 -1 -31 19 9 -41 -44 19 13 -25 33
13272C3k4KJ1J0k9k2L0J7%m0L3n8L5n7O4j7J5j9RJ9m3oL4k2RRj5kJ0J6n3K8K8
$$ 33 9 11 22 32 3 -19 11 28 28 -12 21 -37 -2 -59 5 -12 3 -16 -7 12 -31 -37 -3 -25 -16 -7 -22 -24 -14 2 -51 -23 5
13305EqJ4l3L0m2R7q0Ml8R6n0J3J2k6K2m2K4K6jqJ7q6Q8k4kk3L3m7N5k8K6lj2
$$ 5 -3 11 -22 8 -34 63 -17 -13 -51 45 -5 8 20 -6 16 -26 -2 24 23 15 32 -54 34 10 8 -15 18 -29 26 -2 24 21 9
13338INp2R2l2m7J06o5KJ4k3j7jM7l3N2k9KKl2L1NK1l7j0l1N9l7M1Nj8jJ4m2M3
$$ 9 14 -58 34 2 -45 61 -4 -2 12 -11 -28 -29 18 -15 37 8 10 12 -20 11 16 37 0 -10 -41 18 -19 22 27 9 8 22 -20 23
13372B3L1o4K7K0k5Jk5kQRL3j8pkoK1jl8P2p5L9jpj0K4j7m6O5m0jM9Jm9K2K8k1
$$ 23 54 -10 17 37 12 13 -12 -14 -6 3 36 18 11 9 3 24 23 -15 57 -18 21 20 13 3 27 10 -36 29 -11 -12 37 38 -11 11 39 18
13408A8Ol9J5O2o9Mj8MN0p0P8l0k2mM9n9L8J5n0JK9J6%LllMo4L5k4O1m1KJ2J7
$$ 18 24 -15 0 62 -7 -3 -21 -17 33 -37 41 11 -11 -15 34 -25 13 28 -22 -21 8 24 24 27 24 21 25 -39 -4 -28 33 -8 -6 6 23
13443B3k3J6j0Jk5O4k8K5m6LJ4j0l2J3N5m3p%J3k3JJ7J0k6L1j6l3QM0j2K0q3J02
$$ 23 0 16 6 7 -18 46 18 43 -3 0 14 4 -28 -15 40 -3 -10 -10 3 -20 -19 -2 8 -18 13 -3 -36 -28 12 0 20 -63 39
13476C9n0N0o0k7L0%Pk2M9k1Pj3lM5rl4L6J6n4K5j8J2L3j2K5p4K7pJ0j4k1oL2
$$ 39 -11 39 -21 -48 -18 -18 -11 -33 16 -5 2 -11 -14 31 22 -12 24 40 -14 11 -7 5 38 26 51 -23 4 -3 7 -7 -28 -34 -2
13509bK9k3l6N5n2K0l1M9J7l5K1j8%j0P4q7L3j4L7J4k8mk1L8k4l8K8J7k0L7o2
$$ -2 27 4 -32 23 -29 -9 -40 9 26 -9 12 -6 -6 -16 58 -29 4 -10 27 41 13 9 -12 26 2 -36 -8 9 -11 26 -36
13540c6K9RlKJ2k3k4K3l3M8K0l8l7M8j3K7Qo4L9k7J1Rj0K7k3J2KK3j1j8k9L6j9
$$ -36 -7 2 -1 1 13 -10 -34 -11 -44 4 24 -14 -51 -3 -16 11 19 -45 -6 -33 -22 -13 -23 4 -19 -7 -5 18 7 -11 -40 -4 -23
13573b3l3N0L4k7rJ3K3j8k8ML8n4N3m4OK1j3j5M1%l4L7k0kk2M5J6k4j3rK2J8l2
$$ -23 -56 -6 28 1 -8 5 28 10 -18 -14 24 -30 23 -21 -15 6 -7 -22 19 19 -15 22 2 0 -22 23 39 15 2 -7 15 33 1
13606AL1p1J6L9jm5M6j0j8J6O2q8N2k7Om6R0p4K2L1k1j4m1M6n6O7l0k5Q7n9J4
$$ 1 32 -39 -23 16 15 -30 16 6 -12 4 66 -22 30 3 9 -37 53 -21 1 32 11 -3 -44 2 -54 13 -17 -42 45 -14 0
13637@NJ1Rnk2jJ1j3j7M0J0n5K7k8J9J4n1N6K1m2P9p2j5N2o9N0ql0J0K3L5k7m4
$$ 0 5 16 25 20 -2 -3 8 -5 -22 18 28 -27 0 -28 -9 5 -46 10 31 -11 68 -4 -19 33 -36 14 6 -24 -14 9 44 17 -27
13670b7j4L3L7l1J4K1m4j0Jj4K8O5p0J3j6J6N7n2M6rl2j3k1P8m5Qj3kl2O3k3j8
$$ -27 -41 -8 29 -2 12 33 -11 -21 -20 -34 -6 59 -11 2 -14 2 59 7 53 44 12 -1 -22 56 11 19 6 4 -28 35 12 -6
13702fL2l6K0Qk1Qk0J9Qrk7K9lJ4K4j2ok3OL0m5J7M6n0j1K5J4n1J1KK9Ml6J5J7
$$ -6 26 -10 10 18 -3 5 -15 4 12 3 -24 5 2 16 40 28 22 -1 5 35 -10 7 53 3 -8 17 31 -20 -9 -7 22 26 -10 5 22
13737B2k3J3lQl2J1lL1%K9k5l9J1K0l1Kj2K6%j2K8o1L2PJ9L2l9mM1l0j2J3K5l
$$ 22 -1 12 9 17 -15 -4 -7 24 24 53 28 -11 0 20 -11 -9 -21 5 5 -7 21 -40 -8 -1 18 50 11 7 48 18 6 19 44 41
13771D1o6L7J7n2K1K9J0jj8k8J7pOpKM7o5NJ5oJ6K6k7L2j0p5M1j7L2l5j5M5M4
$$ 41 -25 12 29 -23 -2 27 37 36 18 -10 7 0 6 -1 1 48 -17 -12 3 -3 13 39 12 44 34 -41 0 -17 15 -20 -35 10 54
13804E4o9L3k0l3Q6n1oj0L8k1%J3J7J3o0K4K4m3K7jk2lL6L3j8k8K3l5%Nj2nK0
$$ 54 -15 18 -2 -35 51 0 -6 -16 22 1 1 14 31 44 -16 8 32 -11 16 15 -7 -10 26 59 41 13 36 1 1 6 -6 -11 9
13837IK9n2J5M0k3OJ4l1k0K6l0N6l8K1j4QJj6jk5j4J4K1OnM4n0J1l2J8N4n0M9
$$ 9 38 -14 1 41 18 24 38 7 -13 13 -17 39 1 22 8 16 17 1 0 -25 -39 -25 -4 2 -3 41 -9 2 -30 -12 42 -8 41
13870D1k5j9pk0N4Qk0K9j7J5p8Q0r8N3ML3L2o0L4l1Jj7J4K3n7RJ1L2qJoK4J6p2
$$ 41 16 -3 -10 -30 24 32 12 41 24 39 -39 41 -57 -4 0 33 65 5 39 8 9 -8 6 29 -28 -19 -8 24 16 17 11 35 51 -21
13904b1L3rk4K1mlK6m1%L0J4p7P4m5K0lK6j0Nql0J7ql3M0M3r0P6l8N7l8J3k8L6
$$ -21 12 3 -21 0 -4 -7 19 -22 -22 8 22 -55 19 -26 -6 -9 17 7 12 4 -26 -9 -17 -50 -10 33 -57 19 -19 38 0 13 -15 21
13938B1j9q%lK9j5J2m9j5O2o8Q3m8L0J0k6q%K9k2%o3P4k2j3M6j6jLpNj3Om8N1
$$ 21 2 -6 -6 -9 20 5 17 -32 -47 15 -53 30 -18 12 22 -4 -12 -12 17 -5 -5 -68 6 -16 -29 17 1 0 3 -4 1 -12 -6 -54 -3
13973cLR%Lk8J0J0j8PJ3j8L8n1L5J1J6n2QK6m9M5l0m2M6M1l5n3Q3Lp1R4q7M8l8
$$ -3 0 9 9 12 -16 -6 4 -14 -7 6 -12 26 -25 10 21 37 -15 -7 19 -30 15 -15 -57 -11 30 -5 -58 25 28 -43 51 -36 12 -26
14007b6N5n7Pj6N9m4j4OO8o1K4k0L1j4k4O2j03N3j1L8K7l4j3qM2j1p1J01k3k4
$$ -26 29 -28 -21 -37 22 -22 -36 -30 38 -23 1 -19 12 -2 -26 36 -67 -14 -25 13 40 6 -7 -15 27 16 -55 46 23 -1
14037aNk6L8j6j0K0k9L9k9k6J7ol8O4j8M0l0L8K3q3N1j7J5Mk7M1k0%qk4J9LJ3
$$ -1 4 -22 16 0 -10 10 -19 20 -9 -35 -18 -24 -62 2 -16 24 -6 32 55 -28 23 6 21 25 -2 39 19 19 11 -13 6 9 22
14070B2k9Rm5M0L4LMl9M2l7j0M7k9K4o9L7K9l3LJ7Pj2K3J2n0k5N8k5mRK8Pj8K0
$$ 22 -7 2 -43 -3 31 34 38 -1 41 4 -6 41 12 36 -33 4 33 0 3 20 27 15 38 50 0 -25 33 8 4 13 41 48 30 50
14104E0m6M1j0J7k7k2M9n5K8j4M0Ll8j5K2On0K8J7nnRj4Mk4QO2j00M0J7Lnk7N4
$$ 50 4 45 35 52 25 3 52 -3 25 11 51 54 16 1 23 29 -21 7 24 19 14 23 9 13 -11 -3 59 -41 -1 16 19 14 -13 41
14138D1p5L3pJ0jk9L4K8j1k5J4J7j6j3j5j8L1qJ5j2J6k3O2o3O5j1mJ3o4K8J8k2
$$ 41 -34 -1 -8 2 1 -28 6 34 23 -2 12 29 13 0 -15 -33 -2 -10 5 -7 9 -14 48 -15 50 39 35 48 -16 12 30 8
14170HJ9m3L0qm0L2K1l1lM0j3Kmk8O2k0k0k6O3j9n0O7j8k2k2K2M7j9Pm8K6k1K
$$ 8 27 -16 14 6 -34 -2 19 -12 -15 25 12 14 10 -18 44 24 4 -22 41 22 -28 39 21 -1 -23 -1 46 27 34 -14 12 -9 -7
14203gL7j8k1j2oN3l2K8K4m1j9PlJ2K0j9M2m9M3l9l5O0k0J8jKn2K6K1l4N0o5L2
$$ -7 30 12 -9 -21 -27 26 -6 22 46 5 -14 -7 -10 2 22 3 45 -4 39 0 -35 25 5 23 22 24 -28 -2 19 -15 35 -30 2
14236BLqJ1J5Ql2K8m7M1m4O2l8l1P5n0J2Oj6J0l0M1n0K6J0m3M5pqj3J1NKL7k1
$$ 2 5 -3 8 23 31 -1 27 -20 21 -23 39 1 -30 45 -5 7 13 -3 7 -23 18 -32 -6 4 -39 6 -1 -9 -22 -11 -6 -4 33 12
14270A2k5Nj3M2m3M4l5j9M2qj3o8P8J0RLk2J7Pm7K8J4j8J8j6lj4L9km6J7%m6P1
$$ 12 -13 -8 -21 21 -22 22 -13 -32 10 2 -11 -79 -1 9 18 21 -1 16 23 -24 4 18 0 18 2 -1 -15 24 22 -24 -7 -7 -53 18
14304A8k5k8L7j8j9N4k3K1LOm6L4Rl9K0j7L4l3oL2J9pk0K1k3j7k8O1n6K0N2m8
$$ 18 -7 -35 2 -16 -35 19 -4 17 20 26 -20 14 23 -16 4 -13 21 -12 -18 14 33 26 6 27 4 -13 -41 20 -36 -16 36 -12
14336a2jK5OJ7m7L1k6j2kk7J9K2J6k7Qj9J3M6pj2J1kk6J3L6K0q1K0J3k6mm4P4
$$ -12 -13 12 18 35 -12 19 -7 -19 -21 -48 -29 -7 9 -18 -10 -29 -16 30 23 11 22 20 -6 7 43 63 -18 2 15 -11 -15 -59 15
14369A5l2jjK0kl7L0JLJ9p2L2R7n3K4k4k2j7nK9J0LkJ6n9j3N7kl3k4k0R3m4j3
$$ 15 -17 -18 -19 1 -1 -38 -8 -7 -4 15 -57 -25 72 19 43 19 -3 -20 -25 4 14 17 15 31 -28 -41 16 14 -19 -43 -63 30 -14 -27
14403b7OK7j2j9K9M7ql9l8K1N3n6jK9%m4L1qM3o7L0rJ9j3j0K7k2L4p6L6j6RM0
$$ -27 -21 6 -6 -25 4 51 43 4 -34 -13 40 -16 -17 12 12 -32 -1 -9 34 -33 -3 -12 7 -6 -16 11 -11 23 -53 -17 -33 -24 16
14436A6k4K7m4L6KLK3l1qj0J8L0n6N2q7N4j6jJ7rQk9K4l1J7K6L8m7j0rK7K2n8
$$ 16 -8 19 -25 11 13 16 39 8 0 -10 8 38 -18 34 -53 1 -15 -16 1 -8 0 -29 -5 -36 -19 7 45 -2 -12 -21 6 28 -30
14469c0L8j7M0n5L6J5k9rLk9K8PJ2l0M2Oj1l0L8k4J4J3jj0Jk1k8M8j4J7K1m5K3
$$ -30 8 -9 31 -24 12 27 -2 -11 -8 -37 -9 -2 10 -20 22 28 17 -13 25 1 15 28 27 17 18 -3 -31 17 3 20 41 -4 19
14502A9pl0L8Oj4k6J0K5Lk8k9K9qN5l5k4MK5k6j2L5j4J0m3M4rJ7Pk3J9k5L1kn9
$$ 19 12 -18 20 26 12 -14 -4 21 24 -4 -33 -4 -12 43 8 -16 -12 13 -13 -25 10 -4 6 -37 7 -2 15 22 -1 18 -7 24 22 -37
14536c7L0N3l7L4m9j1M5n6J8J4pPK6l2L3q3K4RM1J0m4j2J7qL6m1J5k5K3%mK8k3
$$ -37 -7 46 9 43 -6 -17 28 -28 -10 4 -3 4 30 -2 31 -52 -28 -19 22 32 -12 -24 -7 -15 21 -20 -5 -30 -7 -7 -11 17 -6
14569fJ9k9L3om3K6l4M2kN5m7L6l7oJ9n3P1m7RlJ8rJ2J6k0m3K5K3K8o6P5j9l0
$$ -6 13 -16 17 11 -32 -6 -40 2 0 55 8 44 7 1 20 -33 38 -9 0 -3 15 6 18 34 14 -29 -4 19 47 -19 56 37 7
14602GN7r0K1m1J9M0m7K3j9O4p4K4N0n1M2k2oj1M0k2j4M5o6N9n7J5qL5M0j7Kl2
$$ 7 64 -26 -5 -46 -27 13 -34 -11 -30 34 -40 -16 34 -17 25 3 -3 -14 26 4 -10 35 -31 28 -29 -14 -22 13 53 36 38 6
14634FlK0J5p3O0k1L7n9K3j8J9K7o0N1m8J9k2L8K0p0M3oRl1Q9q1J0J4l0K4k3M0
$$ 6 3 23 38 -35 25 4 41 -18 5 -13 6 33 -27 24 -24 -5 -27 11 31 -39 4 -2 7 -24 65 -16 -6 8 -22 2 -21 19
14666A9k1pL4k0Lk4PO2m3rj7L2K4n4K7k1L9l7lj3O3n1l2K7pM6l3J2pL8kp2M6j3
$$ 19 -2 -9 25 5 8 -16 -9 53 10 1 -16 16 40 -14 13 -8 31 -6 -9 -22 41 -10 -42 -15 -22 24 -9 3 -4 34 32 -40 6 -7
14700gNJ5k9K7j2K2k0m6RLK7nL%j0J0o3P8m3L9L1k5m2O0n8L1l8L3j8K4K0oL2n2
$$ -7 -2 13 -16 11 -1 21 1 -45 -36 -33 -6 -11 -8 -8 -18 -8 -71 7 -36 3 34 9 -33 27 -31 0 -38 -5 -23 1 21 15 47 -5
14734eK1k8O1o4J6j8j3M1m1M9n8rO6k4K1k0J6nK1l3o%j9M3k7oJ7j1qkJ4Kj6K5
$$ -5 16 -12 49 -15 1 -17 -30 11 -30 19 -39 -48 18 -6 15 -5 11 6 27 -6 -12 -12 -31 12 -15 -21 -4 -15 -23 -25 -11 -9 -25 0
14768@l2M1j1M8m9k5L5n6K9K4Pl9J0J9k4J0J8K7j04R3k6Rj8RKJ5J3K8p0lj5N6
$$ 0 -32 9 -2 46 -3 -28 7 -49 -20 4 11 -28 -18 1 -23 -13 5 32 -72 21 -5 4 -14 -5 -3 12 25 53 -17 -20 -35 21
14800B1n5J9j9L3J9N1r5J0L1k0j8J9jK8Km1L1lk2l5P5p1N6l9J0L2Nj6L6k8kL2
$$ 21 -34 -15 -34 -1 18 69 -26 -16 15 -5 -23 -4 -5 23 25 -16 15 12 -10 -45 30 -41 15 -24 -14 18 23 7 43 15 13 45
14832D5Nqn3L0k7J7k2pL1J3J0l6l1M8k3j7J3N%L5j8K1k6J6k3J7L1o0O4j9rk7J8
$$ 45 50 42 -11 19 -8 9 -13 -20 11 24 34 -2 -33 15 -8 -25 -12 -7 -7 28 10 31 5 21 -2 15 46 -14 50 31 22 -5 13
14865A3J9n8M1oL1l5l0M8NL5l4o1J8K2L0m5L1k5M6l9RP4o9Rk2J9qKJ6n4N1JJ9
$$ 13 32 -26 15 9 40 5 -25 23 28 63 29 -32 -14 8 38 -7 24 -1 45 6 15 89 20 29 7 26 18 20 36 -18 33 34 53
14898E3k4k4J8k5K8m4N6Nk4J3K4k5J6l6K4l5OK9k1J0njK3l4jK8k3j3J1L7n9J7
$$ 53 29 5 23 -2 26 -18 38 43 19 32 56 31 47 11 35 0 6 35 14 24 19 18 41 7 6 34 11 -2 9 46 -13 4
14930DNm2O9m4J6K3l8J6m7K1j7K6K9J8j4l4J4J6n5K1J7RO9p1mj3M4m6pL9l2NL9
$$ 4 9 -33 36 -8 8 31 -7 9 -38 -17 -34 -8 21 39 25 -9 5 21 -34 -13 4 13 82 11 7 -6 38 -8 -15 24 -8 -3 36
14963C6m1N0o4M2l5K1J5k5L8k0Ql2O3q1K1O8o4Pn7J9L4j6Ml6M2oM7l2l0K6LJ4
$$ 36 -5 45 -19 23 -12 9 24 -1 37 17 25 -7 56 -25 -4 64 0 7 -50 -31 3 -13 -9 -45 -3 -9 38 6 -24 2 5 19
14995A9nj0J0KK3m2J3j1K2l6j2Q8r8K6k0J7L1nk7rK2j5Q0q2k0J4J1j7L6k4K1J2
$$ 19 14 4 14 16 39 -3 10 -1 21 -15 -27 61 -37 -11 -31 -14 17 12 -15 -24 -2 -17 63 -19 -39 -25 -14 -31 5 -19 2 14
15027A4J6k4QJ4k8Qj4LQl4K9J3j7j4npj7K5pL6Omk9N5k1n7M7m6O6Kn3N3n7O5o9
$$ 14 30 6 14 28 0 8 -6 -3 5 -29 0 13 -4 -18 -23 -30 -47 -22 -29 7 13 9 -20 35 14 -43 4 -42 24 26 -27 26 -31 34 -35
15062c5N4j5k4lK6J0l0N2J5p7O4kn9J1K5Ok2jk2L7l9L2p4O3OK0J3r1O9k5J6L9
$$ -35 19 4 -20 -23 3 13 -17 35 50 -27 37 35 -24 -13 12 18 -4 -5 -27 10 -29 3 -71 -8 -2 18 31 -60 9 -16 0 39
15094C9m1rQ4l7k7k5J5J5J0n2J4J9j3J6l3j5M5j0l3J4L1m3Q2m4rK5l1L9l8kM2
$$ 39 -2 -11 73 36 9 -16 -1 14 24 -28 -14 5 -8 8 -25 -40 5 -5 -38 -24 7 -36 46 2 -7 18 -13 26 -12 -14 28
15125B8o1N8n4K7qQ7j39N2Nj9N5m1k1K5J7MJ2k8k3J8J3K6m0j6J4L6l7k1M8Nl1
$$ 28 -33 25 -29 -2 -10 77 -62 -10 -5 -24 31 -10 -31 -6 11 15 27 -1 -24 -6 7 33 -7 -23 -9 27 -10 -31 17 22 -9
15156iK7n9J00r1K5PrRMoj9N1n9K3K0l6K3j7j5J13p5nOJ4m5J3l1Q0Lo2pN0K6p4
$$ -9 18 -41 59 -32 -7 0 -9 0 4 -2 -21 30 -29 -6 14 -22 1 -16 -31 82 7 2 8 22 -23 -10 -41 39 42 -20 -27 23 49 -25
15190b5lL3k1JN1l7N6j6n9M2jRk0ok7PM0k4K8n1J9M4k1Qj4l4NK8O1j02M3k3j4
$$ -25 -28 5 -16 -15 36 -1 55 39 -20 22 21 30 10 4 -23 -16 24 0 28 -23 -4 40 19 27 13 -21 -16 12 73 -29 14 -9 -23
15223b3mP3n1k2Q5k5o9M4jK2k7J5n1J12m8l9ok6M5lj0rL9Rj8Jm6N0l5N5rl7Q6
$$ -23 -27 46 -5 -27 58 33 -36 8 7 29 2 17 -34 78 30 -9 -15 -41 4 1 -9 -18 21 30 12 13 -33 17 -18 37 28 -9 77
15256G7q7J1%K3j7o%j1K2l0J1J2mK7kn4O2l5qJ8PM0m2L6m6K9j6k6J5L1m1RJ3j2
$$ 77 -10 1 1 24 7 1 1 -10 12 -18 -7 5 1 28 26 -28 34 -1 -9 9 16 56 14 50 4 33 17 -9 6 37 -4 5 18 6
15290Foj4N6o1J3N7Pl1j8L6J3l1n5N3j3KK1l5M5o5J4KL4k1J7l5L2K0Pk6j2NrL2
$$ 6 0 -14 42 -19 -6 51 58 27 9 45 58 27 -28 25 12 14 35 0 45 -20 -6 -4 30 9 26 -9 23 43 50 24 12 17 8 40
15324D0l6NkNM1o1NJ4QKmj2J2Nn0P2j4n3L4rj4L9k7j1J2m0L2M7l1jJ4m7M4m0M3
$$ 40 4 9 7 12 53 -8 -3 11 19 21 17 5 17 22 -28 44 30 -23 11 2 -12 27 0 -11 1 -39 -7 40 9 8 22 -25 19 -21 22
15359B2l5K4K8k9K3l7M8p7N9k7lK3k6M0j0K2m5K4j7J7m2N1k0K7oj2NnJ3m4M0%
$$ 22 -13 11 39 10 33 -4 44 -33 26 -1 -4 19 -7 33 23 45 0 24 7 24 -18 33 13 40 34 22 27 22 35 -9 31 31
15391C1Kr7N0J7pL3rL1m0l2L8m9pJ7P3o9J5K7l3L3l3O3p3%M7k2N4p8J8K1k2lk5
$$ 31 33 -64 -14 3 -4 29 20 51 11 -21 17 -32 -39 -22 51 -18 -3 24 -9 24 -9 54 -19 -19 28 6 60 -18 0 21 -1 -4 -29
15424b9K9j8MM7l1J2PJk2J7%l0K9k2Rml6K6k6M0K6k0pJ0l3kk5N8Prj7J7J7n6P9
$$ -29 0 -18 -14 33 2 14 21 22 0 17 17 -13 16 -6 3 -1 -37 -11 -37 3 29 9 2 12 -21 -23 -48 10 17 8 -9 8 25 -31 48
15459D8l8Knk1J3L3m5K4j2j4j7J4J2M9j1n8N8k0j8J8k9M0m8J7%ppj3M1L1n2M9
$$ 48 10 12 7 -14 -1 32 -13 11 -1 -15 -32 -18 -6 43 32 -26 32 12 -6 12 -17 23 -25 -8 -8 -15 -22 -35 6 37 -15 34
15491C4p2L4j8K4Rk7J6L2r3N2j1klL2L2n2j5K4%j5N3n1k7J0L6mKM3o0QMk6N4o5
$$ 34 -38 -4 -22 2 11 -16 0 32 -61 -9 -20 -22 -25 7 39 -13 -28 -4 -4 -19 34 -17 -44 -34 2 -2 0 43 -17 -9 -5 -31 23 -42
15525d2Q8n6J0M2p0JL9j7J2j3K3J4k2J1k2jM8p1kK0l0K7M1nj1k1K1m1K6M5n5K6
$$ -42 46 -10 0 42 -28 -27 12 -5 7 -6 17 31 9 20 -2 -3 45 -26 -28 -8 -38 -11 30 25 14 -7 14 -27 -1 44 -11 15
15557A5j2%rj4K5l9LM7K5n3L1Oo5M2%k2jPM1k1j0k8J9nk1LK6L4m6M4l2J2k2K5
$$ 15 3 3 -6 -20 5 -34 -31 16 41 -12 19 25 -40 2 2 -20 -21 -14 27 6 -4 -32 -13 -18 -39 -36 -10 24 -22 22 -10 2 -20 5
15591EJ0l1O5m1l4J2L4m3J5J9l7K1K2kj9j2K7Rkm0P3J5m3j2qlJ1qL4jk3K6l7n
$$ 5 15 -16 49 8 -26 -14 20 -23 -8 11 -26 -5 17 15 -4 -16 11 20 18 -22 51 66 23 11 3 0 11 3 37 36 13 39 2 -3
15625cMK5j0ll0M1m1LK6k0L3%m8RL6k6MJ0k3N7m8K6k4L9k2jK7nj0j0Rn1M8J8j5
$$ -3 1 26 16 13 -17 24 -17 -14 12 -8 25 25 -23 -14 22 -4 0 10 -13 44 -4 22 -2 37 15 14 41 36 26 16 25 -26 22 40 25
15660B5l6QLQM1j1l7kL5l1n0P1m3K5qK8m3l7R9q3K0J4J8Rl2K4j4mj9M6K0m9L3
$$ 25 -11 -3 0 8 49 38 1 -1 34 3 -47 24 -19 6 -2 26 -17 -54 45 -38 -18 -4 14 23 -9 15 1 -3 -22 24 44 -5 28
15693B8j9Nk3K2jL8m1n8R2oo7L8n6M3lK9m1L1m4J4M9l6K1J3m2J8M0m5K6k8K3q
$$ 28 9 14 -9 13 12 50 9 -49 43 37 -30 8 -48 -5 -8 21 -20 11 -33 -19 30 -6 15 28 -14 4 44 -1 25 -3 20 12
15725A2j7L7n9PO3k0k3J4o8Q3k0K9l8jk2l6N4Om0J8K7j6M0n6N7l7J6o8O6m0L5
$$ 12 -5 32 -27 -20 43 23 0 14 -54 29 9 38 0 -1 -23 -59 -5 1 -39 -21 6 -10 30 -26 31 -6 10 -58 8 -32 3
15756CK1p0N8l9N6o2L1J0j2L3j6J2l2J4J5l0Ro2N6jJ1lmmPj2J7nj9mkj1L7nN3
$$ 3 24 -46 12 -27 29 -33 -2 8 -4 29 13 25 -7 7 22 -8 1 -61 -5 -6 5 2 -2 -6 1 -11 6 1 -18 -22 -24 -35 2 -3 50
15791E0q3L6j4j6MJ6K4o5J4N0n1N5j0n1K9nJ7J2qJqj7LJ5l4mK9J6M3n4L9o9L5
$$ 50 -33 3 -11 -27 -23 -7 17 -48 -34 16 -35 20 10 -41 -12 -17 0 12 4 5 -3 -20 -17 -2 -36 -40 -11 5 48 -6 33 -36 -1
15824amK2m3J6M3n2K0k4M2l4NK8j1k7K4Qj1l0K1k2KM9j5nk7L4k0J2Rk2N6k4j2
$$ -1 -5 17 -26 -10 33 -19 1 -23 19 -15 -10 18 7 -20 4 12 1 -29 -8 -30 -28 21 6 1 -26 8 -12 0 9 -13 43 19 7
15857Gj8j3pM1J6k3lJ3j4J5j7J9m4O8p1k2Q7p5N0m0M5l8lM5rnl5L0Mj5%oL8n0
$$ 7 -11 -24 -31 10 26 3 0 13 -1 14 -3 16 -28 40 -31 -53 34 -41 9 -31 14 -24 -27 18 9 4 -31 -1 3 -12 -12 -18 20 -30
15891c0K8NL2n3J5l2N1k2k3K8k4l1L4J5Rk1k1NL6J8j2lrq0J01l3OJ6n2N5J3l3
$$ -30 -2 3 35 -18 -3 -35 16 -6 -29 -1 -25 -56 -22 -7 2 -19 -40 -35 1 19 7 4 -5 -85 16 -17 -11 5 -47 8 21 -12
15923a2J1K7J6o8J3L1k3j6K3J6m2K1LnNLqj1RK4k2L1k4K4m9QkOL6j9M8m5k4K8
$$ -12 -1 26 42 -26 -13 18 -5 -21 2 18 -24 -3 0 -5 0 3 -5 -16 -7 17 -5 26 2 26 -23 -15 -17 -11 25 6 54 9 -15 13
15957A3j6%lO3j07O3k3K0K1k9L7m1N7n5J0L3m5J3%J7m6O1n5ON0r7Q6p3Q0m0Rj5
$$ 13 -3 -3 -6 57 -50 13 -10 10 31 2 39 -2 55 0 10 43 -2 11 11 28 -18 43 -12 -6 44 -53 33 -40 40 0 9 -6
15989fQj5mO0k1l0Rj7J5k4K8l8L5j3J1K9mJ4n1K0PQm2O8n8L3m0J8RL5Kn5L3%K
$$ -6 2 -13 -17 43 22 -8 1 -16 -1 -25 3 -35 0 -13 -2 27 23 37 -14 6 13 21 -21 47 -11 22 -18 0 9 44 46 -9 24 24 26
16024B6n0L7m1N5Kn0M2oJ2j3k0K4J1J9l8pJ1k8L1k1kn2M5M1mRk9J0j3L1Noo8O2
$$ 26 -24 13 -28 27 29 -21 21 15 27 14 -6 18 29 48 10 3 14 -14 17 -4 -6 -58 -13 28 24 33 4 14 1 32 37 31 -37 25
16058B5j2lJ4kk8O0q1j5R8Ol4p3P5l8LK1k1J7K2l7j3M0Plm5N5n1LL2j2j5jM4o3
$$ 25 13 10 24 22 -6 54 -27 -42 56 62 28 -45 30 -8 -5 16 -5 12 34 -3 -16 24 31 28 -17 38 -13 -10 22 10 -5 -6 38 -25
16092b5L6l0RK2K4p8M5L5m4M2k6k3k9M5j5J3Qj2J0ql0M8l1J8OJ3J3j5K7p3M7n4
$$ -25 11 -19 -10 12 36 -42 3 38 -6 36 10 -13 -42 3 -12 1 9 -3 7 -1 -31 17 -14 4 10 23 36 21 48 -25 22 -32
16124c2P7o0K3m4N9J7n1K4j2K2OqK4k7k8jJ7lk4J0JPOJ1J0l3QJ7l8jL0L1l3J0
$$ -32 45 -15 8 -36 23 40 -11 13 1 23 29 21 45 18 -10 -11 6 3 -21 -11 -10 -3 3 14 24 -9 -1 16 -22 -23 7 38 5 15
16158A5l5N1m1LK5l9M4o1O1rj0N4q0K8k3QlO8m2k0oRJ1j6M3Kp0N5Lm9L5%qk9L
$$ 15 -20 31 -10 -7 18 -21 23 -38 23 14 4 58 -22 6 -17 -9 -12 56 14 -6 -12 -3 8 -8 35 37 -33 22 25 -24 11 11 3 -26 -23
16193b3K6j0N8p9O4m0K0l3LM3l5J8k3M7j1j3Ll2K9k0J6K5mrKk5l1j4K7J3J6j8
$$ -23 3 -7 51 -28 36 -4 16 -17 -14 29 -6 12 -11 36 25 12 15 -17 12 -8 8 33 29 20 22 -3 -34 -48 -21 -8 8 -10
16225a0j9Q3oj3m5L0k4k0L9k5k5k2R4n6nM0LLk8K2qk4J6j8K2J7j0rJ8k3K3nj3
$$ -10 -29 54 48 35 -10 20 -4 -24 15 -10 -35 -57 37 -19 -24 16 19 22 -6 16 8 -16 0 -18 4 21 11 2 20 -3 20 15 2
16258BJ5rn3N0JLrK0m1O3m1j3K1k7K0oK4l6K8K4l2m3N7k2%L1j9p5Q7l9L2Jk6M2
$$ 2 17 8 -45 5 6 9 0 20 -21 42 1 -12 9 -18 2 -4 20 -16 12 36 4 -39 18 -4 -4 27 8 -67 20 -19 13 14 -12 30
16292C0l3oM6m0Nj3N8l2j0l7L5k6QlM2J5m7K2mqkj9L8oj0M%J6lk2l7M7m0M1J1
$$ 30 -3 -9 37 -3 2 -11 47 15 5 -32 3 -23 -15 -18 24 39 -8 14 10 2 0 -19 19 13 3 7 7 23 20 -2 -39 8 -32 9 20
16327B0k9mL5l1J5m7M0QK2k5pK0k5j3J3K5m5K6pnN4q0M6K0o3L8k6J9J0M3n3N6
$$ 20 -9 -13 22 -9 6 -41 -1 7 29 4 -3 17 -8 -21 -8 17 -28 -2 -9 -14 40 -40 6 26 -37 1 -25 -6 4 47 -6 50
16359E0m9L1j0l4rK4R%j5J7Lj8J3o0J07j21R4k7k4k0L4L1pj9
$$ 50 1 32 22 -12 -21 3 12 12 -3 14 17 -1 12 -48 59 -62 32 5 -19 -39 -5 26 19 0
16383@
$$ Imaginary data points
##PAGE= N=2
##DATA TABLE= (X++(I..I)), XYDATA
0@%%%%%%%%%%%%%%%%%%%%%%%%%%%%%%%%%%%%%%%%%%%%%%%%%%%%%jLnNnQj2J4j6
$$ 0 0 0 0 0 0 0 0 0 0 0 0 0 0 0 0 0 0 0 0 0 0 0 0 0 0 0 0 0 0 0 0 0 0 0 0 0 0 0 0 0 0 0 0 0 0 0 0 0 0 0 0 0 0 -1 2 -3 2 -3 5 -7 7 -9
62iK6l3M3p1j307J601j16m6j2L3l6n4L6J7j9koJ9nJ5j38L8p0k4J3ML5M1J7l1k2
$$ -9 17 -16 27 -44 -1351 250 134 88 76 109 73 19 55 72 53 51 45 64 59 74 -64 -26 -96 -120 -107 -103 -68 -27 -10 -41 -63
93f3M6m4k1J5L0M6L6J0J0K5l7K0J6m9N5m4l6K8N3o7Oo5M8o1l1ok6O4mQK2k6L7
$$ -63 -17 -61 -82 -67 -37 9 45 55 65 90 53 73 89 40 95 51 15 43 96 29 35 -30 18 -43 -74 -80 -106 -42 -46 -38 -16 -42 -5
126el7k8M3m7P7j1LL4RL2J2k1J4n8Oj4j5P3OL9k9l7l0j9k2j9l6K2L6oJ1J1k9K6
$$ -5 -42 -70 -27 -74 3 -8 -5 29 38 70 82 61 75 17 23 9 -6 67 73 112 83 46 16 -3 -25 -44 -80 -58 -22 -28 -17 -6 -35 -9
160in9j6rK8J4J8M1O2Pjj2J1p9L2j5K9l0M5K6J8m7l5k5Lk4l1m8O4K3n6oM5on0
$$ -9 -68 -84 -93 -65 -51 -33 8 70 77 76 64 75 -4 28 13 42 12 57 83 101 54 19 -6 -3 -27 -58 -106 -42 -19 -75 -81 -36 -42 -92
194i2J2KlN0l4M6M6M2Jo2L8k0K5l1jJ3J6mO2l0l3nm3k8l9l0N0K4j5j6mJm1Q5n2
$$ -92 -80 -78 -81 -31 -65 -19 27 69 70 8 46 26 51 20 19 32 48 44 106 76 43 38 -5 -33 -72 -102 -52 -28 -43 -59 -63 -62 -103 -18 -70
229g0j3j9O6J8N8J8mj4J4j0pn3O0m3M4K3J4k4L0j4p9pm5J6J0m1M7Pj2%j8J4l8
$$ -70 -83 -102 -36 -18 40 58 54 40 54 44 37 -16 44 1 45 68 82 58 88 74 -5 -12 -57 -41 -31 -72 -25 -18 -30 -30 -48 -34 -72
262g2Rj0j1NR4Rj0M1l5J4K6l9KJ0M7o8O0J4l6Lrpj04mM4n1J03p0PJ9l4K9m9j1
$$ -72 -63 -73 -84 -79 15 24 14 55 20 34 60 21 23 33 80 12 72 86 50 53 44 37 -67 -71 -27 -78 25 -45 -38 -19 -53 -24 -73 -84
296h4jNM5oM4N9l2J0k0K9m3jJ9k5K4P5j7l0rJ8n0Jl7j7L7L1n5J0L7o5Qn1kJ8N
$$ -84 -85 -80 -35 -41 3 62 30 40 20 49 6 5 24 -1 23 98 81 51 42 60 10 11 -26 -43 -6 25 -30 -20 17 -48 -40 -91 -93 -75 -70
331g0K6K6O6o1L2n1O2m3K2K3m5O1OjM7Jk0l7j8k4Km2M2Qn0N8m7J2Km3qQk1K7j0
$$ -70 -44 -18 48 -13 19 -32 30 -13 9 32 -13 48 54 53 100 101 81 44 26 2 4 -38 4 12 -38 20 -27 -15 -13 -56 -64 -56 -77 -50 -60
366f0L9L6j3J6K9J4l0j3RK5L0m6K3K1j3J5J9j12J4K0o4K7J8m4RMK0n0pm4K1nM1
$$ -60 -21 15 2 18 47 61 31 18 27 52 82 36 59 80 67 82 101 -11 3 23 -41 -14 4 -40 -31 -27 -7 -57 -64 -108 -87 -92 -51
399e1K0L6K7J6K7m5K4j2o0N4j1K9L0Rj7J1l7k1Rk0o0K6L4K4o4L6Mn2o5K2P0r0
$$ -51 -31 5 32 48 75 30 54 42 -18 36 25 54 84 93 76 87 50 29 38 18 -42 -16 18 42 -22 14 18 -34 -99 -77 -7 -97
431i7P0PJ9PoKl0O5l2l7N7k7N1m2L1J1K6j5l6K7q5QK2mK0pK1%l5j8%j8m7O1m0
$$ -97 -27 -20 -1 6 0 2 -28 37 5 -32 25 -2 49 7 38 49 75 60 24 51 -34 -26 -4 -8 12 5 26 26 -9 -27 -27 -45 -92 -31 -71
466g1O2j4M6MNQk6k1kk7O2KJ9O0j5o4OJ9m4L4p0K2L0j2mo1L3j4k2qJ1qmrM3j3
$$ -71 -9 -23 23 27 32 40 14 -7 -9 -36 26 28 47 107 92 28 34 53 9 43 -27 -5 25 13 9 -52 -19 -33 -55 -63 -52 -60 -64 -73 -30 -43
502d3L0QN4l0%lj8K0j3M8K1n9L3K5Jk4j7j2O0r8k2N8kmo0N3m6j2k2j3M5n7M9K1
$$ -43 -13 -5 49 19 19 16 -2 18 5 53 74 15 48 73 74 50 33 21 81 -17 -39 19 17 13 -47 6 -40 -52 -74 -87 -42 -99 -50 -29
536b9KO1o8N2l3L3nl3Q0k1J5j5N3j3n2jl7Rj4J3K0l9j5O1o4J0Jk7lk9P5MJ5m2
$$ -29 -27 34 -34 18 -15 18 13 -20 60 39 54 39 92 79 27 26 -11 -2 -16 -3 17 -22 -37 24 -40 -30 -29 -56 -59 -88 -13 -9 6 -36
570c6K1pL6rk5O6o0M2k3M3J5ok5J2K0o5k6M1J5l4K0k2kj3l8nN3l9l4O1L2k7KL2
$$ -36 -15 -22 14 5 -20 46 -14 28 5 48 63 57 32 44 64 -1 -27 14 29 -5 15 -7 -9 -22 -60 -65 -12 -51 -85 -24 8 -19 -17 15
604A5kl5k4K3K1m4R0l2J7J7pl5J9K2j3J4j2j3Ok6O0q6Mn0Q5m3L1n2j9L1m1M6O9
$$ 15 13 -22 -46 -23 -2 -46 44 12 29 46 39 4 23 45 32 46 34 21 27 1 61 -25 -21 -71 14 -29 2 -50 -69 -38 -79 -33 36
637C6q7L8k5O6Rm5J2k2K9M1J6o7K1M8k8J7l9o0P9n1K2J7km5rjm0K8o5M2oO6m6
$$ 36 -51 -13 -38 28 37 -8 4 -18 11 52 68 1 22 70 42 59 20 -40 39 -12 10 27 25 -20 -29 -30 -70 -42 -107 -65 -71 -5 -51
670e1N4%k6N6l5nN5m2L8Ok0J3j1Q0q0J1m7K6qrL9Kn6K3Mm4n2M4m0M7opL6k1M2
$$ -51 3 3 -23 33 -2 -7 48 6 44 50 30 43 32 112 32 43 -4 22 14 5 44 46 -10 13 17 -27 -79 -35 -75 -28 -34 -41 -5 -26 16
705A6l3j2N3o%o5J16m3N5l8nK5n1J1K0Pn8rM6J5k8J2j3p4N0o5J8L2j4%L8n3P3
$$ 16 -17 -29 24 18 18 -47 69 26 81 43 38 63 12 23 43 50 -8 -17 29 44 16 28 15 -59 -9 -74 -56 -24 -38 -38 0 -53 20
738B0l2k0JL5m9K7K4RL9j6k9J4K4%n8L7lj0k0L9qN0o4k2K0n1jK4n1M3J1qL9m3
$$ 20 -12 -32 -31 4 -45 -18 6 15 54 38 9 23 47 47 -11 26 23 13 -7 32 24 74 10 -12 8 -43 -44 -20 -71 -28 -17 -25 14 -29
772b9N9r3N3J1ok8L0M1MJ1km0L8l4Ql3K2pOL0pL1o7K2po6K4MPj3J9K3n4K1j6O4
$$ -29 30 -63 -10 1 -5 -33 -3 38 42 53 51 11 49 15 23 -10 12 5 11 41 34 65 -2 20 13 -53 -29 -25 -18 -31 -12 11 -43 -22 -38 26
808B6l9olJ7N9m6J8K8J5Oj7o3M4K1k4Pk3j5LLj0k1qk4PJ1qK6k4K5l4M0k1LJ2j1
$$ 26 -13 -19 -22 -5 54 8 26 54 69 75 58 -5 39 60 36 43 20 5 8 11 1 -20 -28 -52 -45 -34 -42 -16 -40 -15 -49 -9 -30 -27 -15 -26
844b6M0j4N2qj1NM4k4l0L5m2LJ9p2P4l7j8L0m9Rk8J0jj7j2M2j1K8j5N6o4K1K1
$$ -26 14 0 52 44 33 38 82 58 28 63 21 24 43 -29 45 8 -10 20 -29 -20 -48 -38 -39 -56 -68 -26 -37 -9 -24 32 -32 -11 10
877A0lK6j0j2j1K7L4j04O7Rl8L3L5Kk7jn6M1QJ6l4r1N3j9M0o6M5KJ2L2l8k9K1
$$ 10 7 33 23 11 0 27 61 -43 24 33 -5 28 63 65 38 37 -19 22 30 46 12 -79 -26 -45 -5 -71 -26 -24 -12 20 -18 -47 -26
$$ [...]
16383E5
##END NTUPLES=NMR FID
##END=
