##TITLE=31P_DE-80H_X3
 64 sc D2O
 26.2.2025
##JCAMPDX= 6.0         $$ Bruker NMR JCAMP-DX V2.0
##DATA TYPE= NMR FID
##DATA CLASS= NTUPLES
##ORIGIN= UXNMR, Bruker Analytische Messtechnik GmbH
##OWNER= root
$$ XWIN-NMR		Version 3.5
$$ Wed Jan 28 14:08:47 2026 Russian Standard Time (UT+4h)  Yarkov@DPX200
##.OBSERVE FREQUENCY= 81.013821
##.OBSERVE NUCLEUS= ^31P
##.DELAY= (6, 6)
##.ACQUISITION MODE= SIMULTANEOUS
##.ACQUISITION SCHEME= undefined
##.AVERAGES= 64
##.DIGITISER RES= 17
##SPECTROMETER/DATA SYSTEM= spect
##.PULSE SEQUENCE= zgpg30
##.SOLVENT NAME= D2O
##.SHIFT REFERENCE= (INTERNAL, D2O, 0, 243.863)
##AUDIT TRAIL= $$ (NUMBER, WHEN, WHO, WHERE, WHAT)
$$ ##TITLE= Audit trail, XWIN-NMR		Version 3.5
$$ ##JCAMPDX= 5.01
$$ ##ORIGIN= Bruker BioSpin GmbH
$$ ##OWNER= Yarkov
$$ C:/Bruker/XWIN-NMR/data/yarkov2/nmr/P31/2/audita.txt
$$ ##AUDIT TRAIL=  $$ (NUMBER, WHEN, WHO, WHERE, WHAT)
(   1,<2026-01-28 14:07:59.65 +0400>,<Yarkov>,<DPX200>,
      <created by zg, POWCHK disabled, PULCHK disabled
       configuration hash MD5:
       00 E9 B6 7A A2 85 ED C7 34 08 36 98 17 FE 4E 26
       data hash MD5: 32K
       D9 C5 F1 3D 3D E3 0E EE 53 25 7C 86 8A AE 7A 0F>)
$$ ##END=
$$ 
$$ hash MD5
$$ 20 E4 19 C2 D1 9C B1 D2 BE EB D2 E6 46 0C 8B C1
##$RELAX= 
##$RELAX= 
##$RELAX= 
##$RELAX= 
##$RELAX= 
##$RELAX= 
##$RELAX= 
##$RELAX= 
$$ Bruker specific parameters
$$ --------------------------
##$DU= <C:/Bruker/XWIN-NMR>
##$EXPNO= 2
##$NAME= <P31>
##$PROCNO= 1
##$TYPE= <nmr>
##$USER= <yarkov2>
##$AMP= (0..31)
100 100 100 100 100 100 100 100 100 100 100 100 100 100 100 100 100 100 
100 100 100 100 100 100 100 100 100 100 100 100 100 100 
##$AQSEQ= 0
##$AQ_mod= 1
##$AUNM= <au_zg>
##$AUTOPOS= <>
##$BF1= 81.014009
##$BF2= 200.13
##$BF3= 200.13
##$BF4= 200.13
##$BF5= 200.13
##$BF6= 200.13
##$BF7= 200.13
##$BF8= 200.13
##$BYTORDA= 1
##$CFDGTYP= 0
##$CFRGTYP= 5
##$CHEMSTR= <none>
##$CNST= (0..31)
1 1 145 1 1 1 1 1 1 1 1 1 1 1 1 1 1 1 1 1 1 1 1 1 1 1 1 1 1 1 1 1 
##$CPDPRG= <waltz16>
##$CPDPRG1= <>
##$CPDPRG2= <waltz16>
##$CPDPRG3= <>
##$CPDPRG4= <mlev>
##$CPDPRG5= <mlev>
##$CPDPRG6= <mlev>
##$CPDPRG7= <mlev>
##$CPDPRG8= <mlev>
##$CPDPRGB= <>
##$CPDPRGT= <>
##$D= (0..31)
0 1 0 0 0 0 0 0 0 0.06 0 0.03 2e-05 3e-06 0 0 0.0002 0 0 0 0 0 0 0 0 0 
0 0 0 0 0 0 
##$DATE= 1769594879
##$DBL= (0..7)
120 120 120 11 120 120 24 19 
##$DBP= (0..7)
150 150 150 150 150 150 150 150 
##$DBP07= 0
##$DBPNAM0= <>
##$DBPNAM1= <>
##$DBPNAM2= <>
##$DBPNAM3= <>
##$DBPNAM4= <>
##$DBPNAM5= <>
##$DBPNAM6= <>
##$DBPNAM7= <>
##$DBPOAL= (0..7)
0.5 0.5 0.5 0.5 0.5 0.5 0.5 0.5 
##$DBPOFFS= (0..7)
0 0 0 0 0 0 0 0 
##$DE= 6
##$DECBNUC= <off>
##$DECIM= 4
##$DECNUC= <off>
##$DECSTAT= 4
##$DIGMOD= 1
##$DIGTYP= 9
##$DL= (0..7)
0 0 52 120 120 21 21 25 
##$DP= (0..7)
150 150 150 150 150 150 150 150 
##$DP07= 0
##$DPNAME0= <>
##$DPNAME1= <>
##$DPNAME2= <>
##$DPNAME3= <>
##$DPNAME4= <>
##$DPNAME5= <>
##$DPNAME6= <>
##$DPNAME7= <>
##$DPOAL= (0..7)
0.5 0.5 0.5 0.5 0.5 0.5 0.5 0.5 
##$DPOFFS= (0..7)
0 0 0 0 0 0 0 0 
$$ [...]
##$SUBNAM1= <"">
##$SUBNAM2= <"">
##$SUBNAM3= <"">
##$SUBNAM4= <"">
##$SUBNAM5= <"">
##$SUBNAM6= <"">
##$SUBNAM7= <"">
##$SUBNAM8= <"">
##$SUBNAM9= <"">
##$SW= 400.765351723535
##$SWIBOX= (0..15)
0 1 3 0 0 0 0 0 0 0 0 0 0 0 0 0 
##$SW_h= 32467.5324675325
##$TD= 32768
##$TD0= 1
##$TE= 0
##$TE2= 300
##$TE3= 300
##$TEG= 300
##$TL= (0..7)
0 120 53 12 22 120 120 120 
##$TP= (0..7)
150 150 150 150 150 150 150 150 
##$TP07= 0
##$TPNAME0= <>
##$TPNAME1= <>
##$TPNAME2= <>
##$TPNAME3= <>
##$TPNAME4= <>
##$TPNAME5= <>
##$TPNAME6= <>
##$TPNAME7= <>
##$TPOAL= (0..7)
0.5 0.5 0.5 0.5 0.5 0.5 0.5 0.5 
##$TPOFFS= (0..7)
0 0 0 0 0 0 0 0 
##$TUNHIN= 0
##$TUNHOUT= 0
##$TUNXOUT= 0
##$USERA1= <user>
##$USERA2= <user>
##$USERA3= <user>
##$USERA4= <user>
##$USERA5= <user>
##$V9= 5
##$VALIST= <valist>
##$VCLIST= <CCCCCCCCCCCCCCC>
##$VD= 0
##$VDLIST= <DDDDDDDDDDDDDDD>
##$VPLIST= <PPPPPPPPPPPPPPP>
##$VTLIST= <TTTTTTTTTTTTTTT>
##$WBST= 1024
##$WBSW= 4
##$XGAIN= (0..3)
0 0 0 0 
##$XL= 0
##$YL= 0
##$YMAX_a= 1124
##$YMIN_a= -1047
##$ZGOPTNS= <>
##$ZL1= 120
##$ZL2= 120
##$ZL3= 120
##$ZL4= 120
##$ABSF1= 60
##$ABSF2= -190
##$ABSG= 5
##$ABSL= 3
##$ALPHA= 0
##$AQORDER= 0
##$ASSFAC= 0
##$ASSFACI= 0
##$ASSFACX= 0
##$ASSWID= 0
##$AUNMP= <proc_1d>
##$AZFE= 0.1
##$AZFW= 0.5
##$BCFW= 1
##$BC_mod= 2
##$BYTORDP= 1
##$COROFFS= 0
##$CY= 9.86611175537109
##$DATMOD= 1
##$DC= 1
##$DFILT= <>
##$DTYPP= 0
##$F1P= 182.462994727601
##$F2P= 168.069089081705
##$FCOR= 0.5
##$FTSIZE= 0
##$FT_mod= 0
##$GAMMA= 1
##$GB= 0
##$INTBC= 1
##$INTSCL= 1
##$ISEN= 30
##$LB= 1.5
##$LEV0= 0
##$LPBIN= 0
##$MAXI= 11.51145
##$MC2= 0
##$MEAN= 0
##$ME_mod= 0
##$MI= 1.244541
##$NCOEF= 0
##$NC_proc= 0
##$NLEV= 6
##$NOISF1= 0
##$NOISF2= 0
##$NSP= 1
##$NTH_PI= 0
##$NZP= 1
##$OFFSET= 243.8632
##$PC= 1.4
##$PHC0= 1663.973
##$PHC1= 24.15952
##$PH_mod= 0
##$PKNL= yes
##$PPARMOD= 0
##$PSCAL= 0
##$PSIGN= 0
##$REVERSE= no
##$SF= 81.0140731611343
##$SI= 65536
##$SIGF1= 0
##$SIGF2= 0
##$SINO= 80
##$SIOLD= 65536
##$SREGLST= <31P.CDCl3>
##$SSB= 0
##$STSI= 0
##$STSR= 0
##$SW_p= 25641.0256410257
##$SYMM= 0
##$S_DEV= 0
##$TDeff= 0
##$TDoff= 0
##$TI= <>
##$TILT= no
##$TM1= 0
##$TM2= 0
##$TOPLEV= 0
##$USERP1= <user>
##$USERP2= <user>
##$USERP3= <user>
##$USERP4= <user>
##$USERP5= <user>
##$WDW= 1
##$XDIM= 64
##$YMAX_p= 0
##$YMIN_p= 0
$$ End of Bruker specific parameters
$$ ---------------------------------
##NTUPLES= NMR FID
##VAR_NAME=  TIME,          FID/REAL,        FID/IMAG
##SYMBOL=    X,             R,               I
##VAR_TYPE=  INDEPENDENT,   DEPENDENT,       DEPENDENT
##VAR_FORM=  AFFN,          ASDF,            ASDF
##VAR_DIM=   16384,         16384,           16384
##UNITS=     SECONDS,       ARBITRARY UNITS, ARBITRARY UNITS
##FACTOR=    3.08e-05,      1,               1
##FIRST=     0,             0,               0
##LAST=      0.5045964,     0,               0
##MIN=       0,             -1047,           0
##MAX=       0.5045964,     1124,            0
$$ Real data points
##PAGE= N=1
##DATA TABLE= (X++(R..R)), XYDATA
$$ plain form
0 0 0 0 0 0 0 0 0 0 0 0 0 0 0 0 0 0 0 0 0 0 0 0 0 0 0 0 0 0 0 0 0 0 0 0 0 0 0 0 0 0 0 0 0 0 0 0 0 0 0 0 0 0 1 -1 1 -2 5 -7 10 -15 18
61 18 -20 29 -36 48 -91 764 1048 380 -242 -793 -1036 -977 -475 102 652 943 976 663 80 -514 -943 -1028 -809
84 -809 -207 399 850 1047 837 332 -232 -720 -1011 -832 -433 84 643 925 910 702 118 -484 -896 -996 -736
105 -736 -200 393 866 1015 800 289 -322 -753 -951 -856 -453 122 663 949 945 649 139 -486 -919 -1002 -695 -200
127 -200 455 858 1037 872 339 -240 -751 -917 -898 -467 43 520 901 898 663 89 -512 -867 -963 -670 -228 368
149 368 821 974 848 249 -257 -720 -912 -826 -463 72 575 921 950 608 94 -491 -911 -1000 -706 -171 390
170 390 889 964 771 309 -240 -708 -890 -827 -470 77 603 950 932 675 92 -507 -847 -968 -718 -144 403
191 403 878 948 771 322 -246 -703 -955 -865 -555 72 602 909 949 577 96 -485 -894 -951 -691 -139 382 767
$$ packed form
0@%%%%%%%%%%%%%%%%%%%%%%%%%%%%%%%%%%%%%%%%%%%%%%%%%%%%JkKlPj2J7k5L3
61A8l8M9o5Q4j39Q55K84o68o22n51k43N9N02N77N50K91L3l13n83n94m29q5K19
84h09O02O06M51J97k10n05n64m88k91J79L99N17N59K82j5k08n84o02m12j00K60
105g36N36N93M73J49k15n11o11m31j98R5M03N75N41K86mk96n10o25m33q3L07M95
127b00O55M03J79j65n33n79n11j66J9M31N10M77L81lk35n74o01l55r6K93M42N96
149C68M53J53j26n99n06m63j92Q6L63N35N03L46K9l42n14n85m20q9K94N35N61
170C90M99P5j93m62n49m68j82O3L57N47N26L47j8k57n83n99l40j21K50N74N47
191D03M75P0j77m49n68m57k52R0L10O27N30L07M0l72m81n81m09n7K60N52N21L85
$$ plain form
213 767 947 793 292 -184 -669 -904 -847 -526 39 535 928 935 625 56 -531 -880 -968 -724 -141 373 765 914
235 914 801 327 -164 -722 -931 -870 -473 61 525 885 881 631 41 -520 -921 -954 -700 -164 404 780 903 767
257 767 329 -144 -688 -931 -856 -469 115 584 951 981 612 36 -465 -854 -954 -600 -147 362 759 947 739
278 739 345 -213 -706 -932 -886 -470 39 646 893 935 613 45 -514 -855 -846 -630 -182 380 783 900 726 346
300 346 -144 -609 -915 -828 -506 55 621 898 884 514 44 -493 -840 -870 -649 -177 321 754 953 754 349
321 349 -172 -653 -952 -826 -447 67 625 909 895 539 31 -480 -830 -888 -662 -172 285 739 881 714 363
342 363 -205 -656 -919 -880 -469 104 571 886 935 532 90 -412 -806 -817 -626 -175 317 704 899 786 386
363 386 -148 -658 -944 -854 -460 63 624 856 822 495 28 -460 -803 -870 -637 -206 307 728 902 816 354 -149
$$ packed form
213G67J80j54n01m76m85k35N7L21N65M96L93Pl10n69n87l49q8K44N83N14L92J49
235I14j13m74m91n58k09O1L97N34M64L60mk50n90n61m01l3K54N36N68L76J23j36
257G67m38m73n44k43P5L87N84M69L67L0l69n76n01l89j00L54M53N09L97J88k08
278G39l94n58m93k26M6M16N09O07K47M2l22n68n59l41RK16M48N62M03J17j74l80
300C46m90m65l06Q7L22N61N66K77j4l70m70n37l47l0K21M72M98M33J99j99m05
321C49n21m81k99J26L79N14N58K84j4l56n08n11l50n8K26M90M57M54J42j67l51
342C63n68m51k63L9M11N73M67L15M9m03m42n02l94j1J91M51M92L87J95j13m00
363C86n34n10k86R0L94N23N61K32l4l27m67m88l43o7K33M31N13M21J74q6m62n03
$$ plain form
385 -149 -654 -877 -791 -434 123 581 825 823 494 42 -475 -769 -878 -677 -227 275 743 915 742 339 -209
406 -209 -690 -922 -830 -411 40 607 912 828 535 105 -406 -780 -862 -683 -204 314 709 960 714 359 -226
427 -226 -694 -863 -802 -412 74 557 852 799 558 125 -406 -777 -828 -644 -208 280 732 931 781 383 -231
448 -231 -684 -830 -784 -372 100 506 787 779 498 81 -387 -735 -857 -671 -202 347 689 932 767 358 -205
469 -205 -613 -853 -776 -420 19 508 849 828 548 69 -414 -705 -936 -679 -206 272 659 906 803 323 -228
490 -228 -617 -823 -751 -371 90 509 811 797 523 72 -384 -750 -874 -614 -220 358 716 884 732 325 -198
511 -198 -644 -865 -784 -382 55 505 798 786 567 89 -413 -755 -848 -666 -136 322 724 917 706 288 -198
532 -198 -637 -857 -767 -337 51 516 818 822 558 79 -416 -805 -851 -633 -178 293 746 885 694 297 -140 -580
$$ packed form
385a49n05k23Q6L57N57M58K44kl29m52n17k94j09K01M50N02M68J72j73m03n48
406b09m81k32R2M19M51N67L05q4k93m30n11l74q2J79M79N18L95K51k46l55n85
427b26m68j69O1L90M86M83K95n3k41m33n31l71n1J84M36M88M52J99j50l98o14
448b31m53j46M6M12M72M06K81qk81m17m68l48j22J86M69N49L42K43j65m09n63
469b05m08k40P7L56M39M89L41k1k80m79m83k91k31K57M73M78L87K47j03m80n51
490b28l89k06P2L80M61M19L02j4k74m51m56l66j24K60L94N78L58J68j52m07n23
511a98m46k21Q1M02M37M50K93j2k19m78n02l42r3J82N30M58M02J93k11m18m86
532a98m39k20R0M30L88M65L02Mk64m79m95l89m6K18M55M71M53J39j91l97m37m40
$$ plain form
554 -580 -778 -707 -406 33 538 819 799 551 113 -422 -780 -894 -671 -144 318 725 828 710 318 -169 -640
575 -640 -828 -709 -401 78 503 817 848 570 129 -423 -740 -842 -624 -201 350 738 790 708 281 -196 -628
596 -628 -765 -754 -472 68 476 761 843 584 121 -415 -740 -827 -659 -191 369 741 858 646 219 -183 -537
617 -537 -771 -739 -465 21 529 790 796 493 40 -451 -791 -858 -596 -173 312 656 806 702 300 -216 -578 -807
639 -807 -722 -406 6 539 805 798 561 75 -377 -755 -901 -643 -161 282 646 839 681 312 -140 -560 -762
660 -762 -783 -424 -1 485 849 830 555 69 -449 -796 -741 -611 -124 319 704 791 611 333 -149 -541 -776 -756
682 -756 -440 18 514 792 826 493 57 -410 -734 -787 -590 -170 323 682 825 676 337 -102 -495 -799 -720
703 -720 -453 58 514 805 806 495 42 -441 -696 -806 -540 -192 270 629 748 661 311 -140 -520 -773 -754 -391
$$ packed form
554e80j98P1L01M39N05K81k0k48m38n35l58j14K23N27M62M07J03j18l92m87m71
575f40j88J19L08M79M25L14L1k78m41n52l17j02K18M23N51L88N2q2m27m77m32
596f28j37J1K82N40M08K85Q2k59m63n36l25q7J68M68N60L72J17k12m27m02l54
617e37k34L2K74M86N08K61Ol03m53m91l40o7K62M23M85L44J50j04m02n16l62k29
639h07Q5L16M12N33K66pk37m86m52l78j46K58M82M43L64J93j58l69m52m20k02
660g62k1L59M23M86L64j9k75m86n18l47N5J30M87M43L85Q7j80k78m82l92k35K0
682g56L16M58M96K78L4l33m36m67l24n3J97M20M93L59J43j49l39m39l93l04P9
703g20K67N11M56K91Jl11m53m83k55j10K66L48M62L59J19q7l50m51l80k53J9L63
$$ plain form
725 -391 54 545 810 773 500 78 -376 -722 -737 -576 -210 255 639 826 682 295 -214 -579 -801 -774 -446
746 -446 96 516 803 764 527 22 -387 -709 -747 -556 -176 318 639 779 660 341 -145 -584 -792 -743 -382
767 -382 69 457 766 742 464 30 -412 -669 -692 -601 -196 234 597 814 730 327 -156 -557 -782 -717 -396 62
789 62 548 836 763 458 77 -401 -668 -726 -548 -199 240 627 786 636 326 -128 -540 -776 -714 -352 48 475
811 475 710 750 492 64 -342 -626 -721 -527 -197 253 609 775 651 331 -138 -578 -776 -723 -420 109 496
832 496 766 720 474 37 -352 -646 -725 -549 -160 220 655 807 646 303 -72 -583 -759 -708 -404 69 457
853 457 695 702 467 86 -330 -638 -743 -586 -292 268 584 758 635 322 -113 -572 -759 -664 -401 77 426
874 426 736 679 463 106 -352 -641 -766 -541 -224 238 593 775 691 283 -176 -535 -708 -658 -340 103 425
$$ packed form
725c91M45M91K65l7k73m22m54l46j5J61L66M65L84J87j44l87n09l65k22K7L28
746d46N42M20K87l9k37n05m09l22l8J91L80M94L21J40j19l19m86m39k08M9L61
767c82M51L88L09k4k78m34m42k57k3R1M05M30L63K17q4m03m83m01k25O5L21M58
789F2M86K88p3l05l81m78k67n8J78L49M39L87J59j50l10m54m12k36O2L62M00M27
811D75K35M0k58m28m06k84r5J94L30M50L56J66j24l20m69m40j98N3L03N29L87
832D96K70m6k46m37l89k94p9J76L89L80M35J52j61l43l75n11j76N1L04M73L88
853D57K38Pk35l81m16l08j05J57K94N60L16J74j23l13m35m59j87R5K63M78L49
874D26L10n7k16l57m58k89j25K25L17M62L55J82q4m08m59l59j73N0L18M43L22
$$ plain form
895 425 698 687 499 129 -288 -610 -742 -575 -201 208 629 732 688 277 -181 -590 -711 -653 -359 28 396
916 396 706 704 461 62 -305 -630 -690 -547 -201 240 607 751 687 294 -131 -515 -697 -645 -348 73 421 676
938 676 672 478 149 -282 -692 -702 -591 -196 222 591 787 678 258 -180 -538 -687 -583 -314 68 396 686
959 686 768 472 146 -323 -639 -700 -619 -215 256 622 732 578 294 -135 -494 -670 -576 -360 57 366 656 735
981 735 517 133 -287 -625 -682 -529 -197 271 619 692 582 278 -151 -504 -646 -600 -375 -4 379 626 663 501
1003 501 121 -275 -609 -729 -565 -190 266 546 680 568 278 -127 -451 -631 -566 -319 -24 387 629 671 494
1024 494 102 -276 -627 -731 -523 -193 250 561 678 579 272 -147 -448 -614 -572 -372 11 423 643 700 511
1045 511 128 -287 -604 -691 -523 -123 225 560 669 566 296 -113 -452 -636 -642 -390 -27 352 638 712 498
$$ packed form
895D25K73j1j88l70m17l22j32J67L74M09M21J03m4m11m58m09j21N8K94L87L68
916C96L10kk43l99l67l25o0J43L46M41L67J44o4l93m25l84j82N2K97M21L48K55
938F76mj94l29m31m10j0J11L95M18L69J96j09m20m38l58j49J04K69L82L28K90
959F86Q2k96l26m69l16o1Q1M04M71L66J10j54k84m29l59j76R4K16M17L09K90P9
981G35k18l84m20l38n7J53L32M68L48P3j10l04m29l53j42M6K25L71L83K47L7j62
1003E01l80l96l34j20J64L75M56K80J34j12k90m05l24j80O5K47K95M11K42M2j77
1024D94l92l78l51j04K08L30M43L11J17r9l07m19l01j66M2K00L83M12K20N7j89
1045E11l83m15l17q7J68M00L48L35J09j03k70m09l39j84oK52L63L79K86P4k14
$$ plain form
1066 498 87 -277 -612 -669 -541 -171 149 534 693 556 252 -82 -424 -624 -590 -374 -31 369 630 683 473
1087 473 84 -280 -592 -638 -457 -117 228 503 658 596 305 -62 -413 -556 -601 -377 16 359 681 661 493
1108 493 53 -295 -554 -636 -462 -189 236 508 606 545 272 -91 -459 -587 -629 -383 -15 369 646 666 482 127
1130 127 -273 -602 -663 -467 -224 231 496 565 549 263 -68 -414 -591 -658 -388 -60 370 633 664 431 71 -286
1152 -286 -563 -614 -478 -169 177 453 617 616 301 -96 -437 -616 -615 -371 -27 332 608 607 395 99 -305 -575
1174 -575 -627 -497 -190 141 462 617 556 334 -43 -407 -591 -575 -344 36 382 636 677 440 108 -242 -534
1195 -534 -576 -462 -190 183 468 627 564 298 -94 -430 -650 -590 -366 -18 367 643 643 455 83 -291 -484 -583
1217 -583 -421 -170 177 474 623 558 304 -55 -401 -605 -571 -361 59 369 627 614 424 127 -280 -489 -571
$$ packed form
1066D98m11l64l35n7J28L70L20L85J59j37l04l34l42k00L4K16L43M00K61N3k10
1087D73l89l64l12m6J81L40L45K75J55o2k91l67l51j43m5K24L93L43L22k0j68
1108D93m40l48k59q2J74K73M25K72R8o1k73l63l68j28m2K46L68L84K77K0j84l55
1130A27m00l29o1J96K43M55K65O9j6k86l31l46j77o7K70L28M30K63L1k33l60l57
1152b86k77n1J36L09L46K76J64jl15l97l41j79JK44L44L59K76jk12k96m04k70
1174e75n2J30L07L31L21J55o1k22l77l64j84J6K31L80L46K54M1k37l32l50k92
1195e34m2J14K72L73K85J59o3k66l92l36k20O0K24L48L85K76%j88l72l74j93r9
1217e83J62K51L47K97J49o5k54l59l46k04L4K10M20L10K58j3j90k97m07k09q2
$$ plain form
1238 -571 -401 -187 210 523 643 573 337 -30 -392 -633 -633 -340 38 365 573 641 419 54 -230 -487 -659
1259 -659 -533 -192 195 478 662 577 280 -83 -400 -589 -544 -365 26 353 593 588 409 162 -227 -501 -592 -498
1281 -498 -172 139 486 638 522 279 -84 -424 -630 -563 -365 -25 336 533 638 447 110 -214 -503 -569 -483
1302 -483 -223 124 510 632 531 314 -109 -390 -580 -505 -367 16 282 579 553 393 125 -225 -481 -579 -510
1323 -510 -187 150 480 621 606 307 -56 -400 -600 -563 -311 18 314 558 584 429 139 -220 -484 -587 -495
1344 -495 -161 146 471 615 560 285 -124 -392 -580 -528 -318 -27 290 529 590 397 159 -197 -481 -591 -462
1365 -462 -178 149 505 636 497 301 -101 -360 -579 -561 -321 -13 337 549 548 444 108 -222 -487 -601 -493
1386 -493 -183 162 463 633 477 282 -73 -358 -537 -508 -345 -10 282 534 517 462 139 -178 -520 -613 -531 -203
$$ packed form
1238e71J70K14L97L13J20p0k36l67l62k41%K93L78L27K08O8k22l65k84k57j72
1259f59J26L41L87K83J84q5k97l63l17j89M5J79L91L27K40nj79k47l89k74r1R4
1281d98L26L11L47J52j16k43l63l40k06O7J98L40L61J97J05j91l37l24k89o6Q6
1302d83K60L47L86J22j01k17m23k81j90P5J38L83K66K97k6j60k68l50k56r8O9
1323e10L23L37L30J41j5k99l63l44k00L7K52L29K96K44K6j55k90l59k64j03R2
1344d95L34L07L25J44n5k75m09k68j88N2K10K91L17K39O1j93k38l56k84j10J29
1365d62K84L27L56J31j39j96m02k59k19J8K40L08L50K12jj04l36l30k65j14J08
1386d93L10L45L01J70j56j95l55k85j79K9J63L35K92K52j7n5l23l17l42r3Q2L28
$$ plain form
1408 -203 173 451 577 450 267 -71 -289 -556 -547 -363 -66 310 549 605 430 134 -181 -507 -585 -502 -173 142
1430 142 416 591 530 286 -37 -323 -533 -510 -269 -64 272 517 584 389 135 -211 -488 -626 -469 -170 119
1451 119 403 561 521 246 -27 -344 -511 -508 -339 -79 227 526 553 466 168 -210 -482 -556 -443 -224 181 434
1473 434 503 473 248 -30 -308 -492 -521 -396 -42 231 492 550 467 105 -252 -452 -566 -441 -164 85 410 546
1495 546 467 286 -19 -312 -478 -534 -378 -77 251 543 592 455 175 -230 -458 -498 -431 -211 141 403 543 465
1517 465 235 -48 -327 -466 -533 -313 -81 249 472 571 406 130 -134 -421 -576 -429 -167 122 390 540 537
1538 537 273 -11 -296 -523 -523 -348 -79 258 513 532 377 142 -220 -433 -547 -397 -197 55 375 490 456
1559 456 273 -10 -287 -460 -513 -396 -27 255 469 540 410 119 -226 -401 -539 -412 -146 66 323 482 460
$$ packed form
1408b03L76K78J26j27j83l38k18k67RJ84K97L76K39N6j75k96l15l26p8Q3L29L15
1430A42K74J75o1k44l23k86k10K3K41K05L36K45O7j95k54l46k77j38J57K99K89
1451A19K84J58m0k75k73l17j67LJ69K60L06K99K7q7k98l78k72p4J13K19M05K53
1473D34O9l0k25k78k78j84k9J25L54K73K61N8q3l62l57k00j14J25K77K49L25J36
1495E46p9j81l05k93j66n6J56L01L28K92M9j37k80m05k28m0O7K20L52K62J40p8
1517D65k30k83k79j39o7K20K32L30K23R9j65k76k64k87j55J47K62K89K68J50l
1538E37k64k84k85k27%J75K69L37K55J9j55k35l62k13j14J50K00K52L20J15l4
1559D56j83k83k77j73n3J17L69K82K14P1j30k91l45j75j38J27K66K12K57J59k2
$$ plain form
1580 460 323 18 -302 -450 -534 -376 -40 206 459 514 406 119 -178 -427 -534 -400 -206 66 335 459 447
1601 447 241 32 -291 -477 -497 -307 -83 247 507 533 415 149 -173 -390 -444 -406 -207 104 356 546 428
1622 428 306 32 -317 -490 -501 -350 -94 222 476 479 425 147 -154 -386 -466 -434 -204 14 345 467 432 327
1644 327 -13 -278 -464 -497 -301 -22 239 447 494 392 115 -156 -404 -457 -447 -215 90 382 479 441 313 9
1666 9 -236 -494 -509 -339 -80 257 446 489 381 113 -163 -397 -484 -393 -222 49 338 476 472 305 -4 -267 -476
1689 -476 -473 -354 -40 249 392 482 392 127 -130 -355 -450 -446 -218 88 349 522 499 285 23 -264 -508 -449 -358
1712 -358 -67 249 437 469 363 145 -157 -405 -484 -420 -205 62 345 487 464 301 10 -230 -416 -438 -283 -39
1734 -39 230 401 456 383 107 -71 -344 -413 -444 -206 30 334 455 478 287 -16 -291 -458 -485 -308 -68 200
$$ packed form
1580D60j37l05l20j48q4J58L36K46K53N5j08k87k97k49j07J34J94K72K69J24j2
1601D47k06k09l23j86k0J90K24L30K60K6j18k66l22k17n4L8J99L11K52J90j18
1622D28j22k74l49j73j1J51K56L16K54Ln4k78l01k32q0L2K30K18L31J22l5j05
1644C27l40k65j86l3J96K79K61K08M7j02k77k71k48n3J0K32L05K92R7l8j28l04
1666Ik45k58j5J70K59L37J89M3j08k68k76k34q7R1J71K71K89J38mj67l09k63k09
1689d76LJ19L14K89J43R0r0k65k57k25r5MK28L06K61J73k3k14k62k87k44N9R1
1712c58K91L16J88L2j06k18l02k48p9O4K15K67K83J42k3j63k91k40j86k2J55K44
1734c9K69J71N5p3k76j78k73o9l1K38K36L04J21K3j91l03k75j67k7J77K40K68
$$ plain form
1756 200 450 482 393 190 -114 -345 -436 -406 -234 18 337 474 436 274 -45 -255 -397 -465 -289 -121 146 337
1778 337 452 384 159 -112 -349 -409 -424 -234 80 321 537 498 324 30 -215 -429 -451 -346 -93 189 357 444
1800 444 391 117 -106 -326 -462 -478 -237 54 307 460 427 283 49 -249 -456 -441 -309 -126 208 377 478
1821 478 400 202 -117 -336 -472 -420 -249 84 315 447 444 241 40 -253 -449 -440 -326 -64 184 394 420 422 166
1844 166 -86 -322 -430 -366 -227 105 271 444 415 279 -40 -249 -410 -501 -285 -150 125 363 427 385 197 -125
1866 -125 -337 -466 -385 -191 84 333 450 422 269 37 -224 -378 -417 -322 -113 115 407 451 377 215 -119 -330
1888 -330 -487 -394 -193 69 268 442 405 289 13 -197 -396 -437 -359 -123 178 397 441 377 170 -59 -329 -454
1910 -454 -467 -197 35 246 431 383 265 12 -193 -405 -438 -342 -99 120 392 448 390 139 -84 -267 -462 -358
$$ packed form
1756B00K50L2q9k03l04k31r1L0J72K52L19J37l8j62l19k10j42o8J76J68K67J91
1778C37J15o8k25k71k37o0j5J90L14K41K16l9j74k94k45k14k2J05K53K82J68Q7
1800D44n3k74k23k20j36j6K41K91K53J53l3j44k34k98k07J5J32J83L34J69J01
1821D78p8j98l19k19j36N2J71L33K31J32lk03k01k93j96RJ14K62K48K10K6Kk56
1844A66k52k36j08O4J39L32J66J73k9j36l19k09j61r1K16J35K75K38O4m2j88l22
1866a25k12j29Q1J94K75K49J17k8j53k32k61j54l9R5K09K28K92M4p4j62l34k11
1888c30j57R3K01K62J99J74l7j16k76k10j99m1P8K36L01K19M4o4k07k29k70j25
1910d54j3K70K32K11J85m8j18k53k05k12l3R6K43K19K72N6n8k51k23j83j95J04
$$ plain form
1932 -358 -155 76 289 444 400 254 44 -186 -409 -410 -314 -145 163 351 456 427 169 -113 -293 -476 -330 -205
1954 -205 25 271 406 399 264 40 -182 -329 -386 -380 -79 112 385 453 362 188 -93 -362 -450 -421 -213 54 302
1977 302 429 431 274 78 -217 -428 -392 -396 -147 161 380 451 390 138 -95 -316 -425 -343 -155 71 273 428 434
2000 434 268 63 -189 -406 -471 -338 -92 160 355 440 387 160 -99 -339 -412 -367 -196 44 251 410 409 313 76
2023 76 -238 -354 -374 -318 -127 100 396 470 366 146 -55 -304 -457 -424 -182 41 277 390 412 314 73 -152
2045 -152 -352 -399 -339 -47 227 430 448 370 178 -80 -274 -391 -388 -209 35 263 378 409 354 90 -163 -381 -434
2068 -434 -346 -139 168 351 469 354 186 -35 -301 -347 -398 -222 23 258 418 459 320 119 -201 -398 -473 -386
2090 -386 -119 192 280 420 368 177 -68 -316 -411 -373 -209 22 198 413 432 328 98 -220 -350 -436 -298 -106
$$ packed form
1932c58K03K31K13J55m4j46k10k30k23jR6J69L08J88J05k9k58k82j80j83J46J25
1954b05K30K46J35pj35k24k22j47n7OL01J91K73O8r1j74k81k69q8K9K08K67K48
1977C02J27Kj57j96k95k11L6mK49L08K19P1o1k52k33k21j09Q2J88K26K02J55O
2000D34j66k05k52k17o5J33K46K52J95Q5n3k27k59k40p3M5J71K40K07J59jr6k37
2023G6l14j16k0N6J91K27K96P4j04k20k01k49j53L3K42K23K36J13K2r8k41k25
2045a52k00m7O0K92K74K03J8p8j92k58j94j17LJ79K44K28J15L1n5k64k53k18n3
2068d34Q8K07L07J83J18j15j68k21k66m6n1J76K45K35J60M1j39k01l20j97p5Q7
2090c86K67L11Q8J40n2j91k45k48r5L8J64K31J76K15J9j04k30l18j30q6J38J92
$$ plain form
2112 -106 190 334 394 333 164 -43 -272 -396 -400 -228 -12 221 405 405 341 60 -155 -375 -405 -329 -130 158 363
2135 363 378 367 214 -52 -265 -394 -391 -209 -55 203 425 432 304 90 -205 -408 -493 -346 -89 126 315 413 320
2158 320 155 -53 -242 -364 -344 -233 -80 143 401 406 354 118 -177 -318 -428 -314 -147 99 253 404 362 182
2180 182 -39 -261 -394 -400 -224 -37 177 441 393 280 88 -190 -347 -399 -298 -148 132 293 414 382 202 -52
2202 -52 -199 -380 -411 -259 -24 151 356 423 253 57 -186 -347 -440 -307 -131 76 306 379 393 186 -34 -269
2224 -269 -420 -363 -261 3 198 387 407 288 64 -190 -334 -408 -340 -129 91 287 399 395 209 -11 -258 -401
2246 -401 -412 -262 -35 216 392 434 318 79 -146 -385 -405 -315 -170 67 275 376 381 200 -43 -258 -369 -391
2268 -391 -241 -19 231 357 425 312 58 -212 -359 -400 -298 -130 34 278 435 429 208 -6 -239 -392 -386 -263
$$ packed form
2112a06K96J44O0o1j69k07k29j24mJ72K16K33J84%o4k81k15k20l0P6J99K88K05
2135C63J5j1j53k66k13j29LJ82J54K58K22Pj28k14k95k03q5J47K57K15J89R8r3
2158C20j65k08j89j22K0J11J53K23K58Nn2k36k95j41j10J14J67K46J54J51m2j80
2180A82k21k22j33oJ76J87K14K64m8j13j92k78j57n2J01J50K80J61J21l2j80k54
2202e2j47j81l1J52K35J75K05O7j70j96k43j61r3J33J76K07K30P3J4k07k20k35
2224b69j51N7J02K64J95J89K0j19k24k54j44p4O8K11K20J96J12mj86k20k47j43
2246d01j1J50K27K51J76M2j16k39k25k39k0R0J45K37K08J01Nj81k43k15j11k2
2268c91J50K22K50J26O8j13k54k70j47m1J02J68J64K44J57ok21k14k33j53OJ23
$$ plain form
2290 -263 -25 221 346 380 291 75 -139 -291 -385 -328 -172 44 289 408 344 200 -36 -238 -389 -325 -270 -56
2312 -56 194 361 389 271 96 -127 -304 -363 -313 -119 60 300 429 365 216 -32 -247 -400 -381 -246 -57 196
2334 196 405 363 303 167 -109 -316 -375 -322 -195 39 250 413 404 217 -50 -227 -391 -421 -270 -11 220 348
2356 348 332 288 129 -136 -282 -391 -368 -189 67 304 396 340 258 1 -251 -364 -381 -259 -50 156 299 342 292
2379 292 54 -115 -309 -381 -362 -184 97 260 411 366 218 -30 -206 -316 -360 -189 -22 148 344 397 291 96
2401 96 -111 -320 -413 -327 -210 86 210 349 319 162 -3 -270 -387 -359 -211 -88 208 314 363 322 144 -85
2423 -85 -313 -362 -293 -136 69 286 410 399 231 -21 -293 -392 -349 -247 -79 190 322 377 290 87 -69 -325 -390
2446 -390 -350 -140 76 234 405 393 229 9 -225 -312 -379 -235 -61 118 300 321 290 118 -119 -290 -368 -403 -201
$$ packed form
2290b63K38K46J25L4q9k16k14j52r4N7J56K16K45J19o4j44k36k02j51O4N5K14
2312e6K50J67K8j18j75k23j77n9N0J94J79K40J29o4j49k48k15j53J9J35J89K53
2334A96K09m2o0j36k76k07n9N3J27K34K11J63rj87k67j77j64l0J51K59K31J28
2356C48j6m4j59k65j46j09K3J79K56K37R2n6q2k57k52j13j7J22K09K06J43M3n0
2379B92k38j69j94p2J9J78K81J63J51m5j48k48j76j10m4J71J67J70J96N3j06j95
2401I6k07k09r3Q6J17K96J24J39l0j57j65k67j17K8J48J23K96J06M9m1j78k29
2423h5k28m9O9J57K05K17J24j1j68k52k72r9M3J02J68K69J32N5q7k03j56k56o5
2446c90M0K10K16J58J71j2j64k20k34q7o7J44J74J79J82K1l1j72k37j71p8l5K02
$$ plain form
2469 -201 97 293 375 377 247 -1 -189 -345 -371 -277 -26 175 354 369 348 107 -100 -265 -408 -304 -180 55
2491 55 279 395 319 170 48 -188 -322 -345 -228 -95 175 355 377 360 150 -77 -304 -362 -317 -167 66 283
2513 283 370 318 191 2 -232 -336 -358 -288 -62 149 305 397 297 126 -100 -305 -378 -311 -163 72 222 372
2535 372 332 178 3 -144 -336 -362 -283 -53 147 287 392 322 157 -127 -276 -417 -356 -139 77 255 383 380
2557 380 218 -20 -201 -303 -356 -244 -95 152 367 404 266 164 -98 -246 -393 -292 -176 29 251 357 377
2578 377 231 22 -192 -338 -377 -295 -93 175 315 389 300 144 -94 -304 -402 -313 -155 51 246 364 385 238
2600 238 42 -183 -319 -392 -309 -70 121 269 398 279 126 -70 -271 -373 -306 -177 51 215 317 360 219
2621 219 56 -160 -340 -356 -320 -107 175 328 383 315 101 -49 -272 -361 -308 -147 33 206 367 337 204 56
$$ packed form
2469b01K98J96Q2Kj30k48j88j56k6R4K51K01J79J5k1k41k07j65j43J04J24K35
2491E5K24J16p6j49j22k36j34k3J17J33K70J80K2j7k10k27k27n8M5J50K33K17
2513B83Q7n2j27j89k34j04k2P0K26K11J56R2j00j71k26k05p3O7J48K35J50J50
2535C72m0j54j75j47j92k6P9K30K00J40J05p0j65k84j49j41O1K17K16J78J28l
2557C80j62k38j81j02n3J12J49K47K15L7j38j02k62j48j47J01J16K05K22J06K0
2578C77j46k09k14j46l9Q2K02K68J40P4q9j56k38k10r8Q9J58K06J95J18K1j47
2600B38j96k25j36p3Q3K39J91J48J29j19j53j96k01j02O7J29K28J64J02M3j41
2621B19j63k16j80j6L6K13K82J53N5o8k14j50k23q9N3J61J80J73J61l0j33j48
$$ plain form
2643 56 -178 -348 -400 -282 -65 143 313 345 352 105 -58 -304 -352 -294 -175 6 243 343 357 279 27 -170 -324
2666 -324 -385 -277 -55 133 326 404 290 109 -91 -267 -356 -360 -125 67 202 363 362 271 58 -98 -341 -359 -240
2689 -240 -76 151 314 371 274 151 -69 -265 -353 -315 -144 18 209 359 347 218 46 -171 -322 -329 -263 -97 95
2712 95 291 402 278 130 -92 -222 -350 -329 -146 0 151 351 371 256 40 -184 -346 -367 -269 -75 165 302
2734 302 389 232 134 -67 -243 -338 -283 -146 64 241 327 316 232 -31 -133 -326 -386 -258 -103 137 241 350 325
2757 325 111 -50 -261 -309 -358 -192 8 217 378 374 266 36 -225 -319 -358 -252 -72 184 308 308 312 124 -79
2780 -79 -234 -338 -322 -198 4 236 394 360 284 44 -177 -317 -338 -289 -63 149 254 354 326 161 -23 -260
2802 -260 -340 -305 -200 -3 236 371 367 187 -8 -142 -305 -357 -271 -68 89 305 383 287 151 -40 -220 -352 -325
$$ packed form
2643E6k34j70n2J18K17K08J70L2Pk47j63k46m8N8J19J81K37J00J4p8k52j97j54
2666c24o1J08K22J88J93P8j14j81k00j76q9mK35J92J35J61jr1k13j56k43j8J19
2689b40J64K27J63N7r7j23k20j96q8L8J71J62J91J50j2j29j72k17j51pO6J66J92
2712I5J96J11j24j48k22j30j28K1J83J46J51K00K0j15k16k24j62k1R8J94K40J37
2734C02Q7j57r8k01j76r5N5J37K10J77Q6j1q4k63j02j93o0J28J55K40J04J09k5
2757C25k14j61k11m8m9J66K00K09J61mj08k30k61r4l9J06J80K56J24%Mj88k03
2780g9j55j04J6J24K02K32J58l4p6k40k21j40k1M9K26K12J05J00k8j65j84k37
2802b60q0L5J05J97K39J35mj80j95j34j63n2Q6K03J57K16P8r6j36j91j80j32K7
$$ plain form
2825 -325 -189 3 235 327 303 237 23 -173 -326 -342 -323 -72 113 266 346 296 127 -33 -225 -386 -344 -236 8
2848 8 227 311 406 214 43 -138 -321 -331 -288 -66 128 281 350 316 160 -39 -217 -393 -314 -189 36 204 340
2871 340 365 218 72 -187 -335 -327 -266 -64 92 313 391 330 171 -16 -235 -331 -343 -177 18 199 326 363 245
2894 245 34 -129 -330 -340 -285 -109 103 242 357 343 154 -115 -266 -369 -348 -201 48 213 337 397 253 59
2916 59 -123 -296 -316 -234 -73 84 251 351 323 177 -49 -260 -325 -316 -197 35 230 346 375 229 22 -145 -321
2939 -321 -365 -255 -114 77 313 385 328 220 -66 -226 -338 -330 -167 16 193 342 357 223 49 -135 -291 -313
2961 -313 -305 -105 105 249 360 338 165 -63 -227 -424 -375 -156 1 222 306 319 207 96 -129 -318 -360 -276 -108
2984 -108 80 322 380 293 160 -77 -242 -333 -323 -195 37 228 336 338 223 79 -161 -280 -342 -263 -141 108 261
$$ packed form
2825c25J36J92K32R2k4o6k14j96j53j6J9K51J85J53Q0n0j69j60j92j61M2J08K44
2848HK19Q4R5j92j71j81j83j0M3K22J94J53O9l4j56j99j78j76P9J25K25J68J36
2871C40K5j47j46k59j48QO1K02J56K21P8o1j59j87k19r6j2J66J95J81J27L7j18
2894B45k11j63k01j0N5J76K12J39J15j4j89k69j51j03K1J47K49J65J24O0j44j94
2916E9j82j73k0Q2J61J57J67J00k8j46k26k11o5RJ19K32J95J16K9j46k07j67j76
2939c21m4J10J41J91K36P2n7j08k86j60j12QJ63J83J77J49J5j34j74j84j56k2
2961c13QK00K10J44J11k2j73k28j64j97M9K19J57K21Q4J3j12j11k25j89m2Q4J68
2984a08J88K42N8q7j33k37j65r1J0J28K32J91J08Kj15j44k40j19o2P9J22K49J53
$$ plain form
3007 261 361 332 121 -78 -268 -381 -356 -176 -35 207 329 329 295 41 -146 -290 -362 -274 -153 77 292 323 322
3030 322 133 -73 -249 -279 -307 -165 8 186 342 311 229 45 -112 -320 -338 -286 -141 92 231 388 328 152
3052 152 -70 -253 -296 -320 -168 17 221 291 349 262 35 -140 -286 -356 -258 -84 101 273 397 317 189 -54 -238
3075 -238 -337 -335 -215 -7 225 302 332 249 95 -133 -281 -388 -321 -93 54 318 375 345 150 -4 -246 -338 -302 -141
3099 -141 19 168 315 302 292 54 -101 -260 -378 -258 -103 127 292 342 343 119 -48 -222 -354 -324 -205 24
3121 24 184 362 312 290 67 -105 -254 -345 -219 -127 121 288 369 337 109 -30 -255 -403 -314 -194 32 147 311
3144 311 321 272 18 -144 -296 -382 -278 -116 112 320 342 326 150 -44 -241 -359 -330 -162 2 199 369 313
3166 313 276 57 -138 -259 -363 -289 -148 114 272 362 331 189 -36 -214 -315 -335 -216 -4 183 292 364 256
$$ packed form
3007B61J00k9k11j99j90j13K5J80J41K42J22%l4k54j87j44p2Q8J21K30K15L1j
3030C22j89k06j76l0k8J42J73J78J56l1q2j84j57k08j8N2J45K33J39J57o0j76
3052A52k22j83m3k4J52J85K04P0N8q7k27j75j46p0R8J74J85J72J24q0j28k43j84
3075b38r9KJ20K08K32P7L0q3j54k28j48j07O7K28J47K64N7l0j95j54k42r2L6J61
3099a41J60J49J47j3j0k38j55j59j18J20J55K30J65N0Jk24j67j74j32L0J19K29
3121B4J60J78n0k2k23j72j49r1J26R2K48J67Q1l2k28j39k25j48Q9J20K26J15J64
3144C11J0m9k54j62j52q6J04J62K28K08K2j6j76j94j97j18K9J68J64J97J70n6
3166C13l7k19j95j21j04P4J41K62J58R0l1j42k25j78j01k0J19K12J87J09P2j08
$$ plain form
3188 256 65 -113 -310 -357 -297 -114 94 242 367 298 119 -63 -217 -344 -315 -196 -20 179 338 381 287 39
3210 39 -155 -292 -306 -228 -60 148 235 382 312 224 -63 -203 -296 -300 -166 -19 145 302 304 202 80 -122 -266 -315
3234 -315 -245 -84 67 295 359 308 179 -30 -157 -283 -274 -242 -52 205 320 328 216 78 -158 -275 -357 -274 -67
3257 -67 68 266 288 311 197 -19 -202 -270 -305 -246 -12 175 352 351 278 55 -104 -281 -318 -283 -102 124 248 341
3281 341 277 181 6 -219 -322 -312 -208 -9 206 332 346 275 91 -131 -279 -307 -260 -107 68 244 345 334 182
3304 182 11 -139 -266 -314 -250 -3 190 339 365 256 51 -122 -306 -321 -229 -149 57 230 318 314 194 -36 -185
3327 -185 -322 -344 -218 -56 230 300 346 198 37 -107 -293 -325 -268 -47 88 249 349 308 162 -35 -208 -277
3349 -277 -327 -207 2 205 361 302 263 14 -123 -250 -348 -281 -159 43 217 359 354 206 -37 -255 -320 -344 -205
$$ packed form
3188B56j91j78j97m7O0J83K08J48J25o9j79j82j54j27K9J19J76J99J59M3r4k48
3210C9j94j37j4P8J68K08Q7J47p0q8k87j40r3mJ34J47J64J57Kj02j22k02j44m9
3234c15P0J61J51K28O4n1j29k09j27j26RL2J90K57J15Qj12j38k36j17q2Q3K07
3257f7J35J98K2K3j14k16j83o8l5N9K34J87J77jp3k23j59j77l7L5J81K26J24R3
3281C41o4r6j75k25j03J0J04J99K15J26J4p1j84k22j48k8M7J53J75J76J01j1j52
3304A82j71j50j27m8O4K47J93J49K6j09k05j73j84j5R2Q0K06J73Q8mj20k30j49
3327a85j37k2J26J62K86P0M6j48j61j44j86l2N7K21J35J61J00m1j46j97j73o9
3349b77n0J20K09K03J56n9l9k49j37j27r8O7J22K02J74J42nj48k43k18o5k4J39
$$ plain form
3372 -205 -27 166 328 375 222 44 -81 -253 -313 -258 -130 26 253 303 302 189 -56 -208 -357 -348 -219 -27 185
3395 185 317 344 244 47 -134 -258 -305 -327 -152 102 236 368 290 179 60 -205 -313 -314 -186 -5 169 340
3417 340 250 265 49 -146 -262 -295 -289 -148 54 225 323 323 207 40 -198 -324 -323 -192 7 161 318 290 285 53
3441 53 -141 -316 -337 -315 -158 98 273 329 306 201 -58 -193 -348 -334 -219 -10 156 314 305 207 108 -102 -258
3464 -258 -331 -260 -129 58 242 297 314 156 -59 -177 -327 -340 -204 -14 186 297 330 269 95 -98 -256 -357
3486 -357 -279 -127 90 256 346 347 178 -41 -172 -314 -335 -221 -24 151 306 333 294 124 -118 -239 -304 -247 -123
3509 -123 52 238 372 303 201 -19 -224 -289 -276 -179 -4 179 267 331 213 99 -100 -265 -372 -257 -149 36
3531 36 262 377 314 163 -59 -197 -269 -321 -180 -33 186 251 293 266 108 -135 -261 -370 -332 -110 105 254 304
$$ packed form
3372b05J78J93J62M7j53j78j25j72o0N5J28J56K27N0jj13k45j52j49RJ29J92K12
3395A85J32K7j00j97j81j24m7k2J75K54J34J32p8j11j19k65j08jJ28J81J74J71
3417C40r0J5k16j95j16l3OJ41K02J71R8%j16j67k38j26JJ31J99J54J57k8nk32
3441E3j94j75k1K2J57K56J75N6k3j05k59j35j55J4J15K09J66J58rr8r9k10j56
3464b58p3P1J31J87J84N5J7j58k15j18j50j3J36J90K00J11L3o1j74j93j58j01
3486c57P8J52K17J66R0Jj69k19j31j42k1J14J97J75J55K7l9j70k42j21o5N7J24
3509a23J75J86J34o9j02k20k05o5J3R7J75J83Q8O4j18j14j99j65j07J15J08J85
3531C6K26J15o3j51k22j38p2n2J41J47K19O5M2k7j58k43j26j09L8K22K15J49N0
$$ plain form
3554 304 330 205 -32 -170 -305 -312 -233 -17 205 273 348 277 133 -71 -252 -328 -293 -130 73 249 360 294 173
3577 173 -67 -173 -327 -275 -170 1 185 303 341 262 90 -94 -282 -332 -278 -149 58 239 343 249 170 -23
3599 -23 -193 -305 -254 -155 -56 179 263 343 253 83 -118 -255 -318 -250 -123 78 302 355 326 163 -34 -159 -290 -284
3623 -284 -187 -49 161 309 347 254 72 -68 -237 -313 -309 -117 70 206 326 256 143 -16 -210 -269 -328 -249 -50
3646 -50 159 326 329 299 76 -84 -255 -339 -249 -139 91 236 333 260 141 31 -163 -239 -337 -210 -28 148 299
3669 299 330 251 23 -112 -303 -327 -250 -95 89 185 320 265 175 -12 -165 -313 -348 -243 -86 137 298 330 260
3692 260 37 -148 -242 -346 -242 -142 74 195 336 263 166 -38 -201 -264 -294 -198 -43 127 300 343 239 76
3714 76 -105 -259 -320 -296 -97 65 186 324 305 186 -29 -169 -281 -332 -182 -29 166 304 343 268 57 -144
$$ packed form
3554C04K6j25k37j38j35pP9K16K22O8P5p1j44k04j81p6L5J63K03J76J11o6j21
3577A73k40j06j54N2J05J71J84J18L8p9j72j84j88n0N4J29K07J81J04r4p9j93
3599b3j70j12N1R9R9K35Q4Q0r0j70k01j37o3O8J27K01K24N3k9j63j97j25j31O
3623b84R7J38K10J48L8r3j82j40j69p6MJ92J87J36J20p0j13j59j94n9n9P9J99
3646e0K09J67Ll0k23j60j71q4R0J10K30J45R7p3j19j10j94p6r8J27J82J76J51
3669B99L1p9k28j35j91k4P7J55J84R6J35n5r0j87j53j48l5J05J57K23J61L2p0
3692B60k23j85r4j04J04J00K16J21J41p3r7k04j63o3l0R6J55J70J73M3j04j63
3714G6j81j54o1K4J99J62J21J38j9j19k15j40j12n1J50J53J95J38L9p5k11k01
$$ plain form
3736 -144 -258 -305 -283 -141 59 210 326 266 160 -37 -186 -314 -306 -178 -30 155 305 306 167 108 -107 -254 -285
3759 -285 -259 -134 77 243 294 264 166 -4 -111 -295 -286 -216 -24 189 311 313 230 66 -98 -266 -309 -202 -165 94
3783 94 170 314 299 124 0 -213 -288 -307 -161 4 182 250 284 215 65 -81 -223 -305 -249 -133 33 199 307
3806 307 268 184 -25 -186 -247 -260 -194 -5 169 296 300 239 55 -109 -235 -317 -259 -111 63 188 266 295 195 -2
3830 -2 -156 -334 -306 -184 -47 213 279 248 228 75 -73 -239 -257 -249 -137 25 166 307 291 149 31 -183 -317
3853 -317 -296 -179 4 133 240 307 211 71 -110 -216 -311 -248 -120 15 237 302 273 174 -39 -201 -275 -286 -172
3876 -172 35 148 248 276 220 78 -122 -256 -343 -201 -104 80 223 281 286 192 -2 -176 -312 -282 -179 -37 131
3899 131 262 305 227 104 -100 -225 -262 -234 -115 84 233 295 319 184 -33 -167 -277 -277 -190 23 158 245 296 175
$$ packed form
3736a44j14m7K2J42K00J51J16o0j06j97j49j28QJ28J48J85J50Jj39n9k15j47l1
3759b85K6J25K11J66N1l0r8j70j07j84RP0J92K13J22Kq3j64j64j68m3J07L7K59
3783I4P6J44j5j75j24k13p5j9J46J65J78O8L4o9j50j46j42q2N6J16J66J66J08
3806C07l9q4k09j61o1j3O6J89J74J27Mo1j84j64j26q2N8J48J74J25P8K9j00j97
3830bj54j78K8J22J37K60O6l1k0j53j48j66j8QJ12J62J41J41j6j42j18k14j34
3853c17K1J17J83J29J07O7r6j40j81j06r5O3J28J35K22O5k9r9k13j62p4j1J14
3876a72K07J13J00K8n6j42k00j34q7J42R7J84J43N8Nr4j94j74j36L0J03J42J68
3899A31J31M3p8j23k04j25l7K8J19J99J49O2K4j35k17j34j10%Q7K13J35Q7N1j21
$$ plain form
3923 175 97 -82 -162 -256 -262 -92 77 151 301 239 155 -16 -156 -277 -264 -111 -32 114 236 314 189 84 -88 -230
3947 -230 -317 -290 -166 76 219 270 302 139 -30 -172 -295 -269 -145 -34 132 210 295 155 107 -67 -232 -274 -246
3970 -246 -75 20 217 268 258 177 31 -178 -323 -256 -224 -26 127 210 287 265 96 -99 -214 -305 -274 -87 67 234
3994 234 307 230 151 -48 -165 -285 -295 -171 -42 138 281 243 282 22 -28 -229 -336 -207 -64 41 182 333
4016 333 206 144 -53 -165 -248 -252 -146 -14 140 208 253 235 99 -49 -241 -336 -289 -111 52 232 264 248 158 -9
4040 -9 -188 -227 -259 -151 -68 84 240 248 263 60 -81 -207 -267 -245 -114 49 241 274 294 175 -12 -167 -232 -271 -159
4065 -159 -53 109 256 306 266 101 -124 -255 -316 -277 -123 64 188 258 248 144 -18 -158 -232 -300 -207 -19 126
4088 126 233 309 219 77 -91 -251 -314 -254 -86 56 217 291 288 150 -29 -196 -240 -264 -189 -20 104 252 283 202
$$ packed form
3923A75p8j79q0r4oJ70J69P4J50o2q4j71j40j21J3J53P9J46J22P8j25j05j72j42
3947b30q7K7J24K42J43N1L2j63j69j42j23K6J24J11J66P8Q5j40m8j74j65m2K8
3970b46J71R5J97N1j0q1j46k09j45O7L2J98J53Q3P7k2j69j95j15r1L1J87J54J67
3994B34P3p7p9j99j17j20j0J24J29J80J43l8L9k60n0k01j07J29J43J05J41J51
4016C33j27o2j97j12q3mJ06J32J54O8M5j8j36j48j92r5M7J78J63J80L2j6r0j67
4040ij79l9l2J08Q3J52J56QJ5k03j41j26o0K2J31J63J92L3K0j19j87j55o5l9J12
4065a59J06J62J47N0m0j65k25j31o1L9J54J87J24P0j0j04j62j40p4o8R3J88J45
4088A26J07P6r0j42j68j60o3O0J68J42J61P4lj38j79j67m4k4P5J69J24J48L1q1
$$ plain form
4112 202 98 -141 -215 -289 -266 -127 56 151 278 268 135 10 -172 -281 -272 -203 -32 128 212 283 187 92 -138 -219
4136 -219 -313 -181 -97 53 216 271 275 116 22 -151 -240 -266 -212 0 144 287 296 218 46 -100 -248 -300 -214 -122 46
4161 46 212 290 248 152 52 -160 -270 -282 -254 -96 115 278 246 232 101 -89 -217 -254 -212 -91 39 159 297
4184 297 274 186 32 -151 -272 -276 -204 -25 113 296 301 250 77 -86 -210 -246 -265 -80 36 218 263 261 176 -24 -144
4209 -144 -253 -230 -209 -23 168 282 282 176 71 -55 -219 -239 -244 -64 -24 217 280 307 207 22 -135 -247 -292 -197
4233 -197 -56 187 281 301 183 65 -120 -167 -287 -264 -153 -11 178 274 269 144 6 -171 -275 -287 -169 -1 179
4256 179 284 270 222 82 -140 -222 -268 -223 -106 44 166 259 295 123 -3 -174 -258 -305 -186 -29 201 219 280 221
4280 221 68 -57 -216 -271 -307 -115 29 238 281 260 192 8 -169 -283 -257 -178 -47 169 227 260 229 130 -117 -198
$$ packed form
4112B02j04k39p4p4K3J39J83R5J27j0j33j25j82j09RO9J71J60Q4P1r6r5k30q1
4136b19r4J32Q4J50J63N5Mj59r4j73q9k6N4K12J44J43Rp8j72j46j48n2Q6R2J68
4161D6J66P8m2r6j00k12j10j2K8J58K11J63l2j4j31j90j28l7M2J21J30J20J38
4184B97k3q8j54j83j21mP2J79J38J83Nn1j73j63j24l6j9J85J16J82M5kq5k00j20
4209a44j09K3K1J86J91J14%j06j05j26j64k0nJ80M0K41O3K7j00j85j57j12m5R5
4233a97J41K43R4K0j18j18j85m7j20K3J11J42J89R6nj25j38j77j04j2J18J68J80
4256A79J05j4m8j40k22q2m6M5J17J50J22R3L6j72j26j71q4m7J19J57K30J8O1n9
4280B21j53j25j59n5l6J92J44K09M3k1o8j84j77j14K6P9J31K16N8L3l1r9k47q1
$$ plain form
4304 -198 -257 -244 -94 6 144 282 235 150 -2 -133 -252 -262 -153 34 158 217 293 177 56 -46 -228 -261 -208
4327 -208 -107 77 204 264 243 174 -36 -161 -218 -275 -179 7 131 236 240 205 80 -39 -224 -254 -233 -134 9 178
4351 178 293 256 175 -20 -108 -216 -246 -175 -33 163 209 280 229 88 -44 -183 -277 -186 -110 49 200 299 283 132
4375 132 -21 -163 -267 -213 -144 -36 144 195 231 193 57 -78 -195 -298 -184 -144 21 178 243 231 148 9 -196
4398 -196 -216 -256 -147 -27 129 260 228 213 84 4 -214 -244 -240 -182 60 194 290 262 153 12 -147 -201 -237 -168 -56
4423 -56 120 181 243 175 152 -90 -178 -274 -196 -103 95 176 256 230 151 -16 -120 -191 -234 -162 -39 61 260 277 246 107
4449 107 -63 -140 -249 -252 -106 29 189 270 228 138 -34 -105 -220 -218 -206 -55 124 230 226 225 74 -105 -153 -258 -209
4474 -209 -118 52 171 236 207 95 16 -138 -242 -213 -196 -41 120 213 272 211 91 -61 -134 -237 -160 -106 50 195
$$ packed form
4304a98n9J3J50J00J38J38m7q5j52j31j19j0J09J87J24N9P6j16j21j02j82l3N3
4327b08J01J84J27O0k1o9k10j25n7n7R6J86J24J05Ml5j25j19j85l0K1R9J43J69
4351A78J15l7q1j95q8j08l0P1J42J96M6P1n1j41j32j39r4R1P6J59J51R9j6j51
4375A32j53j42j04N4O9J08J80N1L6l8j36j35j17j03J14M0J65J57O5j2q3j39k05
4398a96k0m0J09J20J56J31l2j5j29q0k18l0MN8K42J34R6k8j09j41j59n4l6O9J12
4423e6J76O1O2o8k3k42q8r6P8R3J98Q1Q0k6p9j67j04p1m3P2J23J00J99J7l1j39
4449A07j70p7j09lJ46J35J60Q1m2r0j72p1j15KJ2J51J79J06mjj51j79m8j05M9
4474b09R1J70J19O5k9j12p9j54j04K9J7J55J61R3N9o1j20j52p3j03P7N4J56J45
$$ plain form
4498 195 253 199 115 -10 -133 -213 -211 -181 -64 35 215 254 200 78 -81 -200 -239 -214 -48 74 183 230 224 136 -16
4523 -16 -141 -213 -216 -222 -19 143 232 236 227 69 -63 -205 -239 -242 -58 24 160 185 216 150 -18 -123 -233 -186 -182 -2 81
4550 81 199 241 198 87 -85 -219 -246 -181 -84 36 217 176 222 149 -10 -91 -235 -236 -144 -28 121 218 273 183 98 -93
4576 -93 -208 -216 -189 -124 9 179 195 230 173 1 -129 -236 -204 -204 -63 101 253 238 184 117 -134 -182 -232 -140 -79 44
4602 44 150 222 205 137 -20 -135 -198 -222 -183 -18 50 213 221 167 90 -83 -149 -229 -172 -105 -7 107 202 228 110 -8
4628 -8 -137 -239 -246 -188 -56 103 197 258 167 55 -48 -173 -146 -176 -41 60 90 231 184 174 -9 -91 -230 -242 -153
4653 -153 -57 84 243 199 195 45 -87 -188 -243 -181 -111 5 97 215 220 153 -16 -105 -244 -236 -163 -31 127 217 196 128
4679 128 60 -102 -197 -207 -219 -124 11 151 270 212 118 -1 -94 -220 -216 -139 -36 126 174 235 145 22 -61 -159 -179 -173
$$ packed form
4498A95N8n4q4j25j23q0KL0J17R9J80L9n4j22j59j19l9K5J66J22J09M7oq8j52
4523a6j25p2loK03J62Q9Mrj58j32j42l4lJ84Q2J36K5L1o6j68j05j10M7MJ80Q3
4550H1J18M2m3j11j72j34k7O5R7J20J81m1M6p3j59q1j44jR2J16J49R7N5r0q5j91
4576i3j15qK7O5J33J70J6L5n7j72j30j07L2%J41J64J52j5n4o7k51m8n0R2O1J23
4602D4J06P2j7o8j57j15o3k4L9J65O8J63Qn4p7j73o6q0N7O7R8J14R5K6j18j18
4628hj29j02pN8J32J59R4O1r1j12j03j25K7l0J35J01L0J41m7j0j83q2j39j2Q9
4653a53R6J41J59m4mj50j32j01n5O2P0J16R2J18No7j69q9j39QP3J32J58R0k1o8
4679A28o8j62r5j0j2R5J35J40J19n8r4j19r3j26MP7J03J62M8O1r0j23q3r8k0O
$$ plain form
4705 -173 -84 45 148 252 238 135 36 -132 -214 -216 -136 -36 100 217 193 188 90 -82 -153 -172 -211 -116 49 182 212
4730 212 254 138 -3 -125 -215 -197 -126 7 105 163 193 151 39 -40 -144 -155 -213 -73 -6 173 247 227 133 39 -144
4755 -144 -185 -211 -147 -28 94 191 196 189 67 -21 -131 -206 -166 -112 16 174 199 223 113 -50 -151 -245 -217 -110 -15 109
4781 109 177 206 171 66 -12 -213 -214 -202 -120 10 171 233 172 150 -51 -174 -170 -200 -155 -29 107 174 198 190 81 -71
4807 -71 -179 -209 -196 -66 21 156 250 220 120 1 -122 -241 -164 -136 -25 93 182 206 177 52 -29 -181 -218 -209 -98
4832 -98 43 131 186 249 119 8 -146 -181 -172 -100 -32 57 186 206 190 89 -66 -165 -236 -184 -122 45 170 162 172 48
4858 48 -46 -142 -202 -159 -119 -29 44 154 273 212 72 -38 -144 -211 -204 -95 6 126 235 187 105 -6 -128 -161 -215
4883 -215 -152 -25 83 176 208 210 56 -46 -185 -234 -172 -69 -5 141 174 187 90 20 -112 -192 -172 -161 -46 44 166
$$ packed form
4705a73Q9J29J03J04j4j03r9j68q2kQ0J00J36J17k4nr8j72p1j9l9R5J65J33L0
4730B12M2j16j41j22r0J8P1J33R8N8L0m2j12p9j04j1n8J40O7J79P4k0r4r4j83
4755a44m1k6O4J19J22R7Npj22q8j10p5M0N4J28J58K5K4j10j63j01r4K8J07R5J24
4781A09O8K9l5j05p8k01jJ2Q2J30J61O2o1k2k01j23Ml0M5J26J36O7K4qj09j52
4807g1j08l0J3J30Q7J35R4l0j00j19j23j19P7K8J11J18Q9K4k9j25q1j52l7RJ11
4832i8J41Q8N5O3j30j11j54l5RP2O8Q9J29K0j6j01j55r9p1N2O2J67J25qJ0j24
4858D8r4r6o0M3M0R0P3J10J19o1j40j10j06o7PJ09J01J20J09m8q2j11j22l3n4
4883b15O3J27J08R3L2Kj54j02j39m9O2J03O4J46L3J3r7p0j32q0K0J1J15R0J22
$$ plain form
4908 166 262 163 78 -55 -176 -237 -215 -67 26 130 216 165 114 41 -116 -132 -165 -191 -66 82 137 230 185 32 -101
4933 -101 -215 -225 -160 -96 34 101 106 187 106 -4 -76 -171 -163 -162 -92 50 149 211 170 118 -86 -193 -182 -191 -61 24 188 172
4961 172 230 97 -16 -81 -181 -132 -135 -71 85 161 226 138 93 -51 -154 -196 -168 -40 66 124 112 173 119 -1 -101
4986 -101 -185 -188 -187 1 58 200 206 166 66 -65 -148 -238 -169 -137 38 99 176 185 127 58 -111 -158 -203 -164 1 107 195 192
5014 192 168 42 -32 -183 -208 -155 -65 63 95 186 150 126 -25 -93 -124 -189 -160 -28 61 188 195 175 13 -51 -195 -191 -184
5041 -184 -64 76 73 153 200 120 51 -78 -170 -190 -134 -23 121 164 167 125 61 -73 -142 -130 -151 -70 21 96 190 138 142 20
5069 20 -101 -167 -235 -130 -28 108 194 155 161 57 -45 -105 -198 -140 -81 49 103 223 160 125 25 -88 -153 -196 -146 -25
5095 -25 114 154 226 150 96 -29 -117 -135 -81 -88 66 126 199 165 125 20 -68 -112 -203 -103 -54 76 187 165 184 79 -14
$$ packed form
4908A66R6r9q5j33j21o1K2J48R3J04Q6n1n1p3j57j6l3k6J25J48N5R3m5j53j33
4933a01j14j0O5O4J30O7NQ1q1j10p2r5QJP0J42R9O2m1n2k04j07J1rJ30Q5J64j6
4961A72N8j33j13o5j00M9lO4J56P6O5q8m5j44j03m2K8J28J06N8j2O1n4j20j00
4986a01q4lJJ88N7J42Om0j00j31q3r0O9L2J75O1P7Rn8o9j69m7m5L9J65J06Q8l
5014A92k4j26p4j51k5N3R0J28L2R1l6k4j51o8l1o5K9J32Q9J27Pk0j62o4j44MP
5041a84J20J40lQ0M7q0o9j29r2k0N6J11J44M3Lm2o4j34o9J2k1Q1R1P5R4n2Mj22
5069B0j21o6o8J05J02J36Q6l9Oj04j02o0r3N8N9J30N4J20o3l5j00j13o5m3N0J21
5095b5J39M0P2p6n4j25q8j8N4pJ54O0P3l4m0j05q8m4r1J00M9J30J11k2J9j05r3
$$ plain form
5122 -14 -129 -146 -173 -72 18 74 204 133 88 30 -92 -172 -225 -129 -22 72 208 163 112 68 -72 -92 -137 -141 -100 -4 125
5149 125 184 153 81 24 -114 -194 -166 -114 -43 88 133 193 90 76 -30 -122 -160 -141 -108 -30 119 206 227 144 22 -133
5175 -133 -194 -175 -105 41 107 123 165 136 52 -28 -125 -159 -136 -86 15 117 176 184 123 11 -120 -168 -188 -131 -15 120 159
5202 159 219 148 90 -84 -85 -191 -126 -117 8 158 190 189 74 -40 -114 -144 -133 -121 -11 62 170 201 129 52 15 -77 -156
5229 -156 -149 -113 18 78 195 153 135 21 -146 -127 -111 -126 -30 6 115 159 156 109 -17 -110 -178 -171 -81 33 122 214 180 87
5257 87 -28 -98 -143 -143 -80 -30 72 91 148 139 50 -59 -117 -204 -130 -34 41 80 196 117 47 -41 -78 -111 -151 -126 -52 53 87
5286 87 138 123 70 -27 -87 -188 -176 -77 -6 138 170 156 102 -23 -77 -196 -175 -156 -19 109 133 211 159 71 -57 -143 -206
5313 -206 -148 -23 -25 129 183 142 98 3 -41 -157 -160 -149 -66 34 82 133 182 57 -47 -113 -194 -133 -65 20 152 174 124
$$ packed form
5122a4j15j7k7J01R0N6J30p1m5n8j22q0n3R6J07R4J36m5n1m4j40k0m5mM1R6J29
5149A25N9l1p2n7j38q0K8N2P1J31M5O0j03j4j06r2l8J9L3P8J49Q7K1q3j22j55
5175a33o1J9P0J46O6J6M2k9q4q0r7l4K3N0J01J02N9Qo1j12j31m8k0N7J16J35L9
5202A59O0p1n8j74jj06O5RJ25J50L2jj15j14p4l0J1J2J10P3J08L1p2p7l7r2p9
5229a56PL6J31O0J17m2j8j14j67J9J6j5R6L6J09M4lm7j26r3o8PR0J14Q9R2l4r3
5257H7j15p0m5%O3N0J02J9N7rq9j09n8q7P4R6P5L9J16p9p0q8l7l3m0K5P4J05L4
5286H7N1j5n3r7o0j01J2R9P1J44L2j4n4j25n4j19K1J9J37J28K4P8n2q8j28q6o3
5313b06N8J25kJ54N4m1m4r5m4j16lJ1Q3J00M8N1M9j25j04o6q1O1O8Q5J32K2n0
$$ plain form
5340 124 69 -19 -126 -151 -144 -130 -24 62 88 238 117 92 -78 -137 -174 -162 -77 -36 109 144 142 80 58 -122 -138 -152 -128
5367 -128 -38 82 86 174 151 79 -17 -116 -175 -145 -60 45 71 111 154 109 22 -56 -103 -130 -96 -9 50 85 144 159 9 -62 -155
5396 -155 -178 -135 -93 10 106 149 132 112 -8 -86 -80 -141 -108 -67 66 146 236 100 19 -17 -115 -119 -124 -82 -2 85 190 120 110
5425 110 28 -42 -124 -162 -66 -44 102 113 146 139 41 -75 -153 -166 -111 -79 4 113 139 170 70 21 -55 -149 -164 -74 -32 92
5453 92 197 171 128 84 -25 -146 -160 -169 -64 19 61 127 165 103 17 -50 -115 -155 -122 -2 96 119 109 168 82 -53 -109 -183
5481 -183 -115 -35 45 103 144 148 110 54 -72 -102 -190 -122 -4 7 141 110 92 14 -53 -110 -136 -111 -109 6 59 120 109 139 26
5510 26 -107 -175 -214 -170 -19 38 131 152 118 73 -42 -120 -131 -122 -87 -26 63 105 185 93 45 -79 -143 -151 -139 -12 56 96 151
5539 151 123 74 -24 -93 -123 -173 -101 -30 43 159 162 111 -9 -70 -165 -160 -124 -68 58 130 164 106 68 -19 -118 -122 -106 -69 0 97
$$ packed form
5340A24n5q8j07k5PJ4J06Q6K6J50j21k5j70n9l7J2Q5M1J45L5ko2k2j80j6j4K4
5367a28R0J20MQ8k3p2r6r9n9L0Q5J05K6M0M3m5q7p8m7k7L4Q7N9L5N9J5j50p1r3
5396a55k3M3M2J03R6M3j7k0j20p8Oo1L3M1J33Q0R0j36q1l6r8mnM2Q0Q7J05p0j0
5425A10q2p0q2l8R6K2J46J1L3pr8j16p8j3N5L2Q3J09K6L1j00m9p6r4j5R0M2J24
5453I2J05k6m3m4j09j21j4rJ05Q3M2O6L8o2q6o7o5m0L3J20R8K3j0N9q6j35n6p4
5481a83O8Q0Q0N8M1Ml8n6j26l0q8O8J18J1J34l1j8p8o7n7k6K5KJ15N3O1j1L0j13
5510B6j33o8l9M4J51N7R3K1l4m5j15p8j1RL5O1Q9M2Q0r2m8j24o4qJ2J27O8M0N5
5539A51k8m9r8o9l0n0P2P1P3J16Ln1j20o1r5NL6N6J26P2L4n8l8q7r9mJ6L7O9R7
$$ plain form
5569 97 106 163 81 29 -78 -131 -133 -148 -20 47 99 133 78 98 -46 -79 -182 -189 -109 -33 41 76 154 111 -14 -84 -157 -181 -164
5598 -164 -24 51 104 143 67 101 -32 -99 -145 -127 -91 42 75 114 130 57 2 -59 -115 -169 -87 -64 45 81 147 73 74 -13
5626 -13 -77 -108 -121 -85 -19 72 135 139 16 19 -71 -94 -193 -120 -67 12 88 140 103 40 -25 -74 -165 -203 -79 -40 58 135 152 119
5656 119 16 -65 -170 -156 -78 -44 15 117 146 139 61 -22 -49 -126 -146 -118 -39 70 115 180 84 39 -70 -124 -160 -131 -34 38
5684 38 87 166 84 74 22 -154 -99 -168 -83 3 64 151 167 120 4 -59 -109 -146 -45 -53 34 82 76 86 58 6 -89 -148 -167 -68
5714 -68 -5 64 145 141 109 20 -17 -84 -174 -128 -86 11 63 123 140 96 -21 -105 -116 -119 -49 -54 108 114 135 93 11 -58 -88 -92 -112 -57
5746 -57 48 101 106 134 76 33 -110 -126 -134 -93 48 34 98 135 93 54 -46 -92 -103 -115 -54 26 78 106 147 90 23 -71 -172
5775 -172 -134 -49 13 105 155 100 98 8 -44 -68 -100 -116 -81 16 77 83 112 80 10 -73 -124 -115 -67 30 108 89 145 58 66 -35 -97
$$ packed form
5569I7RN7q2n2j07n3kj5J28O7N2L4n5K0j44l3j03pQ0P6P4L5P8m3j25p0p3k4J7
5598a64J40P5N3L9p6L4j33o7m6J8L6J33L3L9J6p3n5o1n6n4Q2K3J09L6O6p4Jq7
5626a3o4l1j3L6O6R1O3Mj23Lr0k3r9P3N3P9P6N2l7o3o5m9r1l8J24L9R8P7J7l3
5656A19j03q1j05J4P8L4N9J02K9pp8q3k7p7k0K8P9J09M5O5r6m5j09n4l6K9R7P2
5684C8M9P9q2j0n2j76N5o9Q5Q6O1Q7J6m7j16o3n0l7J01qQ7M8oJ0k8n2r5n9j9R9
5714f8O3O9Q1ml2q9l7o7r0M6M2R7N2O0J7m4j17q4j1lP0nJ62OK1m2q2o9l0mk0N5
5746e7J05N3NK8n8m3j43j6qM1J41j4O4L7m2l9j00m6j1j2O1Q0N2K8M1n7o7r4j01
5775a72L8Q5O2R2N0n5kr0n2k4l2j6L5R7O1OK9l2p0q3n1RM8R7P8j9N6q7Qj01o2
$$ plain form
5806 -97 -98 -153 -72 19 107 139 125 77 -14 -45 -129 -126 -60 4 21 91 143 60 14 -55 -104 -131 -87 -28 22 96 173 135 55 -26 -38
5837 -38 -159 -78 -69 -8 72 104 122 77 83 -17 -82 -137 -85 -86 25 68 115 122 39 -27 -69 -140 -107 -122 8 96 73 77 84 44 -35
5868 -35 -96 -139 -96 -19 29 101 101 147 54 -39 -112 -141 -79 -81 -34 43 55 132 103 35 -32 -132 -96 -114 0 41 94 125 104 2
5898 2 -1 -107 -113 -98 -94 22 35 94 113 65 50 -39 -117 -153 -109 -41 35 105 132 90 66 14 -71 -146 -115 -39 -37 66 69 62 71 22 -51
5931 -51 -135 -126 -115 -91 10 55 149 108 121 -29 -57 -103 -115 -49 -23 102 86 141 64 12 28 -78 -139 -88 -68 22 81 112 75
5960 75 34 -52 -55 -75 -109 -101 -80 32 88 108 71 21 -36 -108 -133 -89 -32 29 87 143 64 63 5 -43 -141 -124 -121 -38 63 106 111 100
5992 100 8 -47 -105 -137 -112 -36 -12 36 80 81 52 -61 -84 -90 -150 -139 -31 8 43 129 110 -6 -48 -79 -179 -95 -98 0 49
6021 49 45 126 29 17 -78 -77 -141 -92 -20 59 133 103 108 -6 -42 -170 -99 -74 -75 33 65 91 94 70 0 -48 -117 -121 -62 -54 0 100
$$ packed form
5806i7jn5Q1R1Q8L2j4m8r1l1q4LO6O4J7P0N2q3m6o9m9k7M4N9N0P4P7l8q0q1j2
5837c8j21Q1RO1Q0L2J8m5Oj00o5n5N2jJ11M3M7Pq3o6m2p1L3j5J30Q8k3MPm0p9
5868c5o1m3M3P7M8P2%M6r3r3p3k9O2kM7P7J2P7k9o8o7j00L6j8J14M1N3L1k1j02
5898Blj06oJ5MJ16J3N9J9m8j5q9p8l6M4O8P6P0K7m2k4n2q5p5L1P6KJ03LpRm9p3
5931e1q4RJ1K4J01M5R4m1J3j50k8m6j2O6K6J25j6N5p7n2J6j06o1N1K0R0N9L1l7
5960G5m1q6lk0l4QK1J12N6K0l7n0n7p2k5M4N7O1N8N6p9jn8m8r8J7LQ3J01M3Nj1
5992A00r2n5n8l2K5P6K4M8M4Jk9j13k3oo0J1J08L9L5Q6j9j16m2l1j00Q4lR8M9
6021D9mQ1r7j2r5Jo4M9P2P9P4l0Nj14l6j28P1K5jJ08L2K6Lk4p0m8o9mN9QN4J00
$$ plain form
6053 100 138 121 27 -34 -102 -105 -98 -93 36 104 105 61 66 -5 -52 -116 -126 -89 -3 39 113 123 87 31 -27 -99 -64 -88 -69 -7 47 112
6085 112 84 85 26 -53 -135 -144 -108 -61 52 144 63 79 1 -26 -90 -130 -62 -70 -9 62 92 74 63 -2 -46 -104 -128 -93 -16 33 96
6116 96 112 40 31 -85 -81 -132 -140 -85 1 78 60 127 49 -26 -72 -97 -131 -100 -3 19 114 79 41 18 -31 -79 -128 -138 -97 -54 57
6147 57 117 97 28 -27 -66 -116 -101 -77 -7 90 93 93 68 46 -19 -59 -91 -55 -20 -17 40 89 125 66 -33 -101 -135 -105 -62 -5 49 39
6179 39 68 75 58 -12 -49 -97 -103 -11 8 46 96 127 72 -12 -35 -134 -109 -72 -41 35 65 120 96 35 -51 -104 -97 -89 -70 -39 59 80
6211 80 147 55 46 -75 -128 -98 -48 -21 3 62 134 100 70 -21 -63 -106 -96 -62 -15 85 92 124 84 37 -54 -101 -98 -113 2 25
6241 25 62 130 88 34 -23 -49 -133 -116 -41 63 34 134 71 72 16 -70 -93 -109 -48 -13 102 81 109 70 74 41 -48 -69 -65 -48
6271 -48 3 88 133 110 112 23 -67 -70 -93 -41 32 42 81 82 81 64 2 -87 -144 -102 -49 2 81 150 122 53 -16 -17 -49 -95 -37 -40 45
$$ packed form
6053A00L8j7r4o1o8lPNJ29O8Jm4Np1m7o4j0L7Q6M2P4J0l6n6n8p2L5k4J9O2N4O5
6085A12k8Jn9p9q2rL6M7J13R2q1J6p8k7o4m0O8qO1P1L0j8j1o5m4n8k4L5P7M9O3
6116I6J6p2rj16Mn1qN5Q6P7j8O7p8p5m6k5l4L1R7K2R5l5l8k3m9m8m9j0M1M3J11
6147E7O0k0o9n5l9n0J5K4P0R7L%k5k2o5m0l2L6L5LN7M9L6n9r9o8l4L0M3N7N4j0
6179C9K9Pj7p0l7m8oR2J9L8N0L1n5q4k3r9K5L7L1P6L0N5k4o1q6n3PQJ9L1R8K1
6211H0O7r2rj21n3L0N0K7K4N9P2l4l0r1m2m3J0L4M7J00PL2m0m7r1m7Lj5J15K3
6241B5L7O8m2n4n7k6q4J7P5J04k9J00o3Jn6q6k3j6O1L5J15k1K8l9Ml3q9k1MJ7
6271d8N1Q5M5k3Kq9r0lk3N2P3J0L9Jjj7o2q9n7M2N3N1P9O9k8o9o9jl2m6N8lQ5
$$ plain form
6304 45 98 108 97 42 11 -41 -93 -150 -66 -7 66 102 141 84 -23 -22 -90 -104 -54 -6 68 77 123 68 55 49 -57 -79 -109 -58 -2
6335 -2 88 36 105 102 1 -40 -95 -44 -75 -6 38 69 97 111 94 22 -47 -125 -143 -44 -37 51 71 92 30 18 -46 -71 -96 -86 -28
6366 -28 17 60 50 124 69 0 -95 -146 -68 -6 24 76 93 82 47 39 -70 -98 -73 -78 -48 9 66 65 111 45 -49 -93 -103 -75 -54
6397 -54 45 24 64 93 18 14 -54 -47 -66 -76 25 50 81 101 136 59 18 -90 -107 -91 -43 4 47 94 100 103 7 -76 -41 -85 -62
6428 -62 -27 60 94 113 130 38 12 -63 -77 -73 -91 1 38 95 96 95 23 -35 -85 -79 -102 -43 25 118 174 95 82 22 -103 -130 -142 -32
6460 -32 10 42 78 80 54 49 -39 -82 -106 -74 -24 53 65 67 106 64 -17 -73 -88 -100 -58 34 79 112 140 66 44 -51 -68 -109 -70 -13
6492 -13 -14 126 51 123 82 -37 -8 -93 -69 -45 -12 61 72 112 20 56 -25 -53 -98 -124 -36 8 88 134 96 9 52 -52 -120
6521 -120 -103 -9 10 58 78 119 60 50 -68 -113 -60 -74 -8 1 96 58 62 25 -18 -81 -73 -53 -16 0 34 75 61 150 85 -13 -59
$$ packed form
6304D5N3J0j1n5l1n2n2n7Q4N9P3L6L9n7j07Jo8j4N0M8P4RM6n5j3oj06k2l0N1N6
6335bR0n2O9lj01m1n5N1l1O9M4L1K8J4j7p2o9p8j8R9PQ8K0K1o2j2o4k5k5J0N8
6366b8M5M3j0P4n5o9r5n1P8O2L0N2J7j1l5qj09k8K5nL0N7N7jM6o6r4m4j0K8K1
6397e4R9k1M0K9p5mo8Pj9j0J01K5L1K0L5p7m1j08j7J6M8M7M3M7OLr6q3L5m4K3
6428f2L5Q7L4J9J7r2k6p5j4Mj8R2L7N7Jjp2n8n0Ok3N9O8R3N6p9j3o0j25k7j2J10
6460c2M2L2L6Kk6nq8m3k4L2N0P7J2KL9m2q1n6j5j2M2R2M5L3K8p4k2r5j7m1L9N7
6492a3jJ40p5P2m1j19K9q5K4K4L3P3J1M0r2L6q1k8m5k6Q8M4Q0M6l8q7M3j04o8
6521a20J7R4J9M8K0M1n9j0j18m5N3j4O6RR5l8Ml7m3o3QK0L7J6L4M1j4Q9o5r8m6
$$ plain form
6552 -59 -107 -73 -17 -2 64 114 77 41 37 -73 -66 -97 -13 -26 66 127 57 93 65 -49 -126 -65 -109 -10 66 66 142 24 42 -37
6582 -37 -62 -61 -96 -42 -43 32 87 92 99 73 -46 -97 -77 -87 -28 55 80 125 62 37 5 -25 -99 -104 -54 -61 28 85 116 50 16 -21 -96
6615 -96 -90 -30 14 27 61 56 82 47 15 -30 -114 -60 -82 -46 18 76 102 37 58 11 -51 -84 -93 -43 29 91 76 53 101 21 -80
6646 -80 -102 -79 -50 27 65 74 102 64 29 -72 -75 -54 -61 -23 35 95 94 73 18 -1 -81 -32 -41 -115 22 23 92 121 118 18 3 -54
6678 -54 -102 -63 -20 -5 61 107 93 28 9 -53 -58 -82 -44 -6 56 39 75 55 13 -53 -31 -55 -47 -25 17 70 70 79 7 16 -72 -75 -97
6711 -97 -45 -23 44 55 135 61 -1 -60 -68 -68 -53 -15 -6 30 107 110 18 -5 -96 -96 -113 -74 -31 17 51 105 51 41 -49 -70 -61 -114 -30
6744 -30 12 53 38 28 68 19 -66 -86 -79 -59 -35 40 55 94 25 -8 -75 -38 -83 -89 -98 -16 48 89 71 53 26 -86 -52 -60 -64 12
6776 12 45 5 97 84 -21 -51 -90 -89 -64 -69 -17 65 60 68 46 -2 -66 -112 -73 -60 -15 9 88 92 53 1 -61 -90 -113 -58 -55 -28 76
$$ packed form
6552e9m8L4N6J5O6N0l7l6mj10Pl1Q4j3R2O1p0L6k8j14p7O1m4R9P6%P6j18J8p9
6582c7k5Jl5N4jP5N5NPk6j19n1K0j0N9Q3K5M5o3k5l2l0p4nN0pQ9N7L1o6l4l7p5
6615i6OO0M4J3L4nK6l5l2m5q4N4k2L6O4N8K6o5K1m7o2l3rN0P2O2j5k3M8q0j01
6646h0k2K3K9P7L8RK8l8l5j01lK1pL8N8O0jk1n5j9q0M9rp4J37JO9K9lj00j5n7
6678e4m8L9M3J5O6M6j4o5j9o2nk4L8L8O2j7L6k0m2o6K2k4QK2M2N3%Rp2Rq8lk2
6711i7N2K2O7J1Q0p4o2n9q%J5L8RL6P7Lr2k3r1%j7L9M3M8L4N4n4j0r0k1Rn3Q4
6744c0M2M1j5j0M0m9q5k0PK0K4P5J5L9o9l3o7L7m5orQ2O4M1j8j8k7j12L4qmP6
6776A2L3m0R2j3j05l0l9JK5nN2Q2nQk2m8o4m6L9J3M5K4P9Ml9n2o2k9k3N5LK7J04
$$ plain form
6809 76 61 88 71 -29 -65 -72 -98 -98 -5 99 101 93 54 46 -32 -119 -146 -97 -100 27 74 52 68 21 -3 -53 -77 -89 -39 -17 15 61
6841 61 102 39 26 -4 -67 -71 -71 -64 8 104 88 116 32 -16 -70 -114 -112 -100 -84 48 34 118 70 17 15 -77 -106 -111 -52 -24 54 92 113
6874 113 52 -21 -91 -70 -76 -80 6 47 57 114 52 29 -12 -114 -44 -62 -27 8 44 72 84 106 -27 -51 -98 -91 -63 -18 51 100
6904 100 87 61 61 -79 -13 -112 -100 -35 23 37 117 96 58 -21 -58 -63 -63 -13 -47 63 124 54 51 51 49 -42 -98 -79 -57 25 41 81
6936 81 66 49 -31 -25 -61 -76 -20 -45 45 63 100 121 41 -11 -41 -108 -70 -27 25 76 87 44 63 3 -36 -82 -91 -42 -30 66 61 64
6968 64 82 42 7 -91 -71 -94 -29 26 20 62 59 87 -4 -38 -87 -81 -43 5 16 93 104 75 46 -12 -96 -97 -53 -40 82 93 109 124
7000 124 -9 4 -12 -69 -32 -37 -33 3 97 66 77 59 -2 -55 -87 -31 -49 -26 108 64 86 37 44 -33 -42 -80 -63 -17 25 103 94
7031 94 92 51 12 -75 -97 -89 -18 4 79 85 129 26 35 -24 -26 -97 -43 -22 4 70 77 123 59 -11 -66 -73 -62 -58 16 36 87 79 27 41
$$ packed form
6809G6j5K7j7j00l6pk6%R3J04Kql9qp8q7k7M9lJ27M7k2J6m7k4n0k4j2N0K2L2M6
6841F1M1o3j3l0o3m%PP2R6j6K8q4m8n4m4KJ2J6J32j4Q4m8n3kr2k9nN9K8P8L8K1
6874A13o1p3p0K1omQ6M1J0N7o2k3m1j02P0j8L5L5L6K8J2K2j33k4m7PK8M5O9M9
6904A00j3k6%j40O6r9J2O5N8J4Q0k1l8p9l7n%N0l4J10O1p0l%kr1n6J9K2Q2J6M0
6936H1j5j7q0Ol6j5N6k5R0J8L7K1q0n2l0o7L8M3N2N1J1m3J9o0l9m6rM9J2R6nL
6968F4J8m0l5r8K0k3O5N5oM2lK8r1l4m9OL8M8J1P7J1k9k9n8q4jM4J3J22J1J6J5
7000A24j33J3j6n7L7nML6R4l1J1j8o1n3l2N6j8K3J34m4K2m9Pp7rl8J7M6M2P8r
7031I4km1l9q7k2QP1K2P5OM4j03Rn9kp1N4K1K6O6PM6o4p0n5pJ1MP4K0N1qn2J4
$$ plain form
7065 41 -42 -28 -78 -84 -25 14 79 64 83 29 -18 -77 -79 -57 -61 7 56 112 77 55 21 1 -112 -82 -55 -7 4 71 109 88 6
7096 6 -52 -79 -94 -77 -70 18 57 86 41 68 -29 -19 -106 -102 -105 -62 47 84 74 52 46 -54 -42 -96 -63 -11 15 62 63 94 32 -6
7128 -6 16 -80 -76 -104 -41 50 40 60 28 65 16 -80 -115 -80 -2 28 70 84 47 59 33 -50 -40 -124 -79 8 -8 93 88 60 34
7159 34 -37 -83 -87 -76 -33 19 102 39 63 6 54 -52 -99 -72 -17 -12 20 70 104 92 3 1 -48 -85 -50 -71 0 60 53 57 75 28
7191 28 -31 -69 -125 -42 -46 -1 86 111 72 -3 -5 -88 -52 -64 -62 55 39 39 53 69 9 -51 -133 -105 -109 -41 8 40 118 72 17 -60
7223 -60 -86 -68 -80 -65 -30 61 74 54 73 2 -39 -71 -64 -43 -62 20 28 117 95 71 6 -17 -103 -81 -49 -20 4 57 69 26 3
7254 3 -69 -120 -78 -63 -36 54 21 46 103 20 2 -28 -46 -69 -66 -39 55 87 109 70 -10 0 -42 -69 -67 -50 -5 85 74 81 -18 -1
7286 -1 -71 -90 -83 -45 -2 2 98 74 63 -8 -4 -96 -68 -69 -64 49 26 56 62 39 -16 -29 -91 -47 -55 -8 88 74 87 23 -22 -50 -46 -38 -78
$$ packed form
7065D1q3J4n0oN9L9O5j5J9n4m7n9kK2mO8M9N6l5k2l4k0j13L0K7M8J1O7L8k1q2
7096Fn8k7j5J7PQ8L9K9m5K7r7J0q7MlM3J09L7j0k2oj00J2n4L3N2K6M7JL1o2l8
7128fK2r6Mk8O3R1j0K0l2L7m9r6l5L5P8L0M2J4l7J2k6q3J0q4M5Q7j6J01nk8k6
7159C4p1m6mJ1M3N2Q3o3K4n7M8j06m7K7N5NL2N0L4j2q9km9l7L5k1P1O0pMJ8m7
7191B8n9l8n6Q3mM5Q7K5l9p5kq3L6j2KJ17j6%J4J6o0o0q2K8mO8M9L2P8m6n5p7
7223f0k6J8j2J5L5R1J3k0J9p1m1l2PK1j9Q2QQ9k2k4o5k3q6K2L2K9K4N3J2m3k3
7254Cp2n1M2J5K7R0l3K5N7q3j8l0j8k3LK7R4L2K2l9q0J0m2k7KJ7M5R0j1Pr9J7
7286ap0j9PL8M3MR6k4j1p1Mr2K8jNJ13k3L0Ok3n5j3o2M4qM7R6j4J3o4m5k8MQm0
$$ plain form
7321 -78 -32 0 93 108 97 14 -12 -79 -93 -105 -69 18 25 105 121 53 12 -59 -50 -91 -36 -25 -15 53 75 56 59 -23 -71 -75 -58 -47
7353 -47 -28 76 51 93 13 7 -56 -76 -52 -37 -8 -19 57 65 68 52 -26 -85 -130 -60 -35 10 65 67 102 57 19 -2 -68 -69 -49 -44 8
7386 8 41 65 97 54 5 -77 -83 -90 -72 -18 50 49 70 64 -6 -65 -44 -97 -93 -51 13 73 47 115 43 5 -42 -103 -36 -98 3 39 120
7419 120 83 31 -44 -65 -73 -88 -38 -67 9 41 47 79 52 37 -35 -60 -83 -53 -26 35 73 102 49 3 -42 -76 -152 -37 9 23
7449 23 46 88 116 17 -6 -39 -83 -111 -66 16 107 77 97 32 29 -45 -62 -96 -2 -28 -5 31 55 89 11 6 -104 -51 -86 -11 -11
7480 -11 34 30 71 67 -12 -12 -94 -19 -57 6 21 85 80 52 47 -2 -34 -98 -77 -20 -7 -3 43 14 10 14 -5 -92 -69 -106 -22 24 36 59
7514 59 69 41 -80 -87 -126 -55 -47 -22 50 -17 61 61 -16 -12 -78 -62 -39 -40 10 56 86 82 28 -20 -2 -75 -46 -22 -47 32 37 45 33 -63
7548 -63 -55 -44 -101 -83 -8 36 33 69 79 41 31 -90 -21 -87 -34 0 36 35 79 70 -11 -34 -72 -82 -74 -45 22 41 78 61 34 -3
$$ packed form
7321g8M6L2R3J5j1q3k6o7j4j2L6Q7PQ0J6o8m1p1Rm1N5J1J0O8K2j9Lq2m8mJ7J1
7353d7J9J04k5M2q0oo3k0K4J5K9j1P6QLj6p8n9m5P0K5M5N5KL5m5l8k1o6jK0NN2
7386HL3K4L2m3m9q2opJ8N4O8jK1op0n9K1n3MM2O4O0k6O8p2l8m7o1O7o2J01L6Q1
7419A20l7n2p5k1qj5N0k9P6L2OL2k7j5p2k5k3L0K7O1L8K9n3m6m5l4p6J15M6J4
7449B3K3M2K8r9k3l3m4k8M5Q2R1l0K0o5lp4j7l4R4k6K3L6K4L4p8nj10N3l5P5%
7480a1M5mM1mp9%q2P5l8O3J5O4nk8nm9l2o4K1N7J3MM6k9mMj9q7K3l7Q4M6J2K3
7514E9J0k8j21pl9P1QK5P2o7P8%p7Mo6J6K3jN0M6L0mn4m8J8p3K9K4k5P9NQj2r6
7548f3QJ1n7J8P5M4lL6J0l8j0j21O9o6N3L4L6jM4rq1k3l8j0QK9O7J9L7j7k7l7
$$ plain form
7580 -3 -62 6 -62 -82 -60 6 37 64 67 8 0 -92 -97 -62 -26 16 46 96 45 -43 -67 -45 -94 -73 -19 -25 30 61 64 104 42 -36 -67
7613 -67 -71 -78 -2 12 104 82 64 14 -2 -40 -38 -51 -85 -63 50 57 35 50 37 -28 -82 -67 -76 -71 6 34 53 51 56 -11 -50 -70 -75 -65
7647 -65 12 -1 53 42 68 11 -38 -69 -107 -79 -47 -8 82 61 32 49 16 -71 -26 -95 -107 6 23 82 73 56 30 -46 -63 -51
7677 -51 -34 -44 31 115 46 61 7 23 -55 -51 -70 -75 -31 17 86 77 53 36 -34 -28 -106 -33 -41 -7 14 104 81 25 16 -86 -43 -72 -74
7710 -74 -18 19 91 94 61 9 -15 -72 -124 -58 -57 18 17 57 82 36 40 -17 -41 -38 -42 -2 -1 39 88 59 25 -65 -55 -63 -31 -12 41 66
7744 66 80 59 44 14 -49 -33 -78 -47 -1 73 74 38 12 8 -56 -108 -48 -37 -4 72 74 50 100 -14 -37 6 -102 -86 -19 -57 -14
7775 -14 97 60 44 25 -61 -53 -78 -12 -25 29 83 104 70 -3 -28 -15 -78 -77 -66 -13 29 79 84 29 -32 -38 -83 -84 -47 -54 39 36 31 54
7809 54 -2 7 -37 -67 -99 -78 -32 38 70 71 83 -13 24 -66 -83 -50 -56 37 36 94 14 123 22 -62 -70 -66 -21 10 39 107 60 34
$$ packed form
7580cn9O8o8k0K2O6L1K7Ln9qr2nL5L6M2L0N0n1q8k4K2m9K1N4oN5L1LM0o2p8l1
7613f7mpP6J4R2k2j8n0j6l8Kj3l4K2J13Pk2J5j3o5n4J5rNP7K8J9kNo7l9k0nJ0
7647f5P7j3N4j1K6n7m9l1l8K8L2L9R0k1k9J7l3q7M5o9j2J13J7N9rj7k6p6j7J2
7677e1J7j0P5Q4o9J5n4J6p8Mj9nM4M8O9rk4j7p0Op8P3qL4K1R0k3n6rj02M3k9k
7710g4N6L7P2Ll3n2k4n7n2O6JP5jM0K5m6Mn7k4LmM0JM0M9k9l4r0J0qL2J9N3K5
7744F6J4k1j5l0o3J6m5L1M6P4Jl6k6mo4n2O0J1L3P6Kk4N0j14k3M3j08J6O7l8M3
7775a4J11l7j6j9q6Qk5O6j3N4N4K1l4p3k5J3o3JJ1N3M2N0Nn5o1om5jL7pR3lnK3
7809E4n6Rm4l0l2K1M6P0L2JJ2r6L7r0j7L3oR3jN8q0J09j01q4qMM5L1K9O8m7k6
$$ plain form
7841 34 38 -35 -84 -75 -90 -42 -52 35 87 25 15 -7 -57 -24 -29 -54 21 53 77 124 48 40 -32 -32 -59 -41 -14 11 33 66 68 48 -44
7874 -44 -26 -84 -71 -90 -10 54 23 34 13 20 -18 -73 -77 -55 -35 6 56 129 48 12 4 -17 -46 -36 7 43 32 46 58 58 -17 24
7906 24 -38 -107 -100 -20 1 46 77 88 5 -45 -60 -44 -76 -16 32 27 68 47 40 34 6 -61 -89 -62 -4 44 51 62 21 18 -3 -19 -91
7939 -91 -75 -65 4 15 60 42 96 -21 26 -67 -75 -44 -87 66 37 55 41 55 4 -95 -78 -46 -1 -41 37 80 72 83 -14 -15 -55
7970 -55 -81 -46 -35 11 26 109 59 13 13 -51 -51 -48 6 9 30 123 91 53 -4 -23 -43 -94 -103 -4 -3 -22 97 63 4 -17 -73 -59 -72
8003 -72 -20 -2 20 69 91 61 2 -31 -56 -111 -3 -9 36 53 77 45 21 3 -42 -62 -42 -14 -10 39 59 10 -5 65 -42 -72
8033 -72 -91 -76 -46 -24 71 78 52 57 13 -48 -58 -37 -69 -22 30 19 48 62 12 -28 -89 -92 -58 -27 50 81 102 9 23 -1 -7 -64
8065 -64 -61 -78 -14 8 48 39 18 28 17 -52 -48 -85 -4 -17 72 50 16 7 -36 -50 -60 -92 -68 -38 41 47 54 24 -63 -31 -13 -21 -42 -12
$$ packed form
7841C4Mp3m9Rj5M8j0Q7N2o2j0k2n0L3nk5P5L2K4M7p6qp2%k7J8K7K5K2L3Kk0r2
7874d4J8n8J3j9Q0O4l1J1k1Pl8n5mK2K0M1N0P3q1l6qk1k9J0M3L6j1J4J2%p5M1
7906B4o2o9PQ0K1M5L1J1q3n0j5J6l2O0M8nM1k1pok8o7k8K7N8M8PJ1m1lk1j6p2
7939i1J6J0O9J1M5j8N4j17M7r3qL1m3J53k9J8j4J4n1r9J7L2M5m0P8M3qJ1r7jm0
7970e5k6L5J1M6J5Q3n0m6%o4%LN4LK1R3l2l8n7j9k0n1rR9Jj9J19l4n9k1n6J4j3
8003g2N2J8K2M9K2l0n9l3k5n5J08oM5J7K4l2k4j8m5k0K0K8MM9K0m9j5P0j07l0
8033g2j9J5L0K2R5Pk6Nm4o1j0K1l2M7N2j1K9J4n0m0o1lL4L1P7L1K1r3J4k4on7
8065f4Lj7O4K2M0rk1J0j1o9Ml7Q1j3Q9k2l4rm3j4j0l2K4L0P9OPl0q7L2J8qk1L0
$$ plain form
8099 -12 28 49 64 66 7 30 -17 -70 -43 -43 -36 -20 14 85 2 60 8 -17 -106 -95 23 15 81 59 26 16 -16 -35 -91 -46 -54 24
8131 24 25 68 70 1 21 -72 -30 -36 -42 -13 7 40 37 44 -10 26 -52 -37 -24 -40 6 9 40 77 43 17 -57 -47 -80 -29 1 26 52 81
8165 81 35 37 22 -25 -80 -42 16 -37 -6 33 105 73 16 -24 -21 -17 -80 -35 46 48 46 48 72 -60 -19 -27 -94 -30 -2 52 61 48 84 22
8199 22 -25 -29 3 -53 -50 -42 28 82 45 57 -39 -8 -40 -90 -48 -13 48 3 18 87 -8 17 -70 -89 -48 -3 -8 21 68 13 35 -28
8231 -28 6 -35 -45 -24 -30 10 30 91 51 -28 -46 -39 -40 -40 -61 -35 10 101 36 85 4 -12 6 -124 -32 -1 52 62 77 16 17 3
8263 3 -73 -28 -32 -17 8 22 70 92 5 8 -16 -54 -65 -56 -25 9 73 94 51 34 -40 -56 -48 -82 -22 23 53 86 108 19 -13 -27 -57
8296 -57 -40 -46 -17 25 95 -6 19 23 -58 -45 -25 -13 -69 29 37 41 43 52 36 -52 -24 -57 -58 19 21 39 45 64 65 -22 -45 -62 -64 -20 41
8331 41 0 44 36 14 -13 -84 -25 -63 -13 -20 14 7 67 29 33 2 -67 -62 -57 -40 14 28 57 38 12 -2 -40 -41 -51 -98 -13 65 35 37
$$ packed form
8099a2M0K1J5Kn9K3m7n3K7%PJ6L4P1q3N8n2k5q9J1J18qO6k2l3j0l2j9n6M5qP8
8131B4JM3Ko9K0r3M2ooK9K0L3lPn4L6p8J5J3j6M6LL1L7l4k6p4J0l3N1L0K5K6K9
8165H1m6Kj5m7n5L8N8n3L1L9P2l2n7m0LMo3M5Q1KkKK4j32M1qo7O4K8N4Rj3L6o2
8199B2m7mL2n6LQP0N4l7J2r6L1l2n0M2L5O1m5J5O9r5K5q7j9M1M5nK9M7n5K2o3
8231b8L4m1j0K1oM0K0O1m0p9j8Pj%k1K6M5R1o5M9q1j6J8j30R2L1N3J0J5o1Jj4
8263Cp6M5mJ5K5J4M8K2q7Lk4l8j1RL1L4O4K1m3j7p4j6Ql4O0M5L0L3K2q9l2j4l0
8296e7J7oK9M2P0j01K5Mq1J3K0J2n6R8QMKRj6q8K8l3jP7KJ8OJ9Jq7k3j7kM4O1
8331D1m1M4qk2k7p1N9l8N0pL4pO0l8Ml1o9NNJ7N4J4K9j9k6j4l8jj0m7Q5P8l0K
$$ plain form
8365 37 48 29 -20 -48 -32 -57 15 65 54 60 74 2 0 -33 -90 -42 -71 70 7 43 20 50 48 -39 -53 -39 -56 -18 20 28 77 48
8397 48 -24 2 -35 -56 -82 -67 5 0 41 33 19 17 -41 13 -54 -34 -60 -3 57 43 50 30 -13 -48 -78 -18 -56 -18 2 24 59 57 -21
8430 -21 -32 -40 -45 -45 -17 37 75 62 65 11 -10 -20 -81 -36 -23 -20 46 41 39 84 47 -3 -34 -68 -8 -20 31 61 82 64 76 -13 -15 -60
8464 -60 -61 -36 39 -19 50 120 24 28 -22 -23 -35 -88 -45 -16 80 42 86 29 -80 -50 -30 -24 -30 -2 4 23 66 62 34 -22 -16 -17 -49 -31
8498 -31 4 48 43 59 -15 -23 -1 -72 -37 -25 -55 -8 41 44 68 73 -24 -41 -82 -83 21 23 72 77 95 25 4 -31 -6 -9 -8 13 35 52
8532 52 80 46 40 -4 -40 -33 -53 -4 29 35 6 79 -17 55 -25 -12 -33 -36 2 26 46 -2 52 24 -15 -70 -54 -42 15 13 71 62 28
8565 28 28 -16 -51 -5 -90 -66 29 25 30 59 63 25 -15 -23 -114 -10 -34 12 -12 40 7 22 50 -45 -59 -68 -56 -32 8 10 44 -13 -4 24
8599 24 -65 -34 -52 28 -18 -28 92 39 43 29 -7 -33 -31 -64 -10 31 19 79 15 50 -3 -51 -17 -59 -45 33 6 82 41 29 -47
$$ packed form
8365C7J1j9m9k8J6k5P2N0j1OJ4p2kl3n7M8k9J41o3L6k3L0kq7j4J4j7L8L8QM9k9
8397D8p2K6l7k1k6J5P2nM1qj4kn8N4o7K0k6N7O0j4Pk0m3l5l0O0l8L8K0K2L5kp8
8430b1j1qn%K8N4L8j3Ln4k1j0o1M5J3LO6nkM5l7n0l1l4O0j2N1L0K1j8J2q9km5
8464f0jK5P5n8O9P0r6Mn0jj2n3M3K9R6l8M4n7j09L0K0OoK8OJ9M3mk8n6Ojl2J8
8498c1L5M4nJ6p4qK2p1L5J2l0M7M9LK4Nr7j7m1jJ04KM9NJ8p0k1l5K5lJK1K2J7
8532E2K8l4om4l6Pk0M9L3Ok9P3r6P2q0J3k1lL8K4K0m8N4k8l9n5J6J2N7kN8rl4
8565B8%m4l5M6q5K4R5mNK9Ml8m0qr1J04k4M6k4N2l3J5K8r5j4rJ2K4M0KL4n7RK8
8599B4q9L1j8Q0m6j0J20n3Mj4l6k6Kl3N4M1j2O0o4L5n3m8L4m2J4P8k7P6m1j2p6
$$ plain form
8630 -47 -29 -60 -63 -20 2 22 60 35 29 48 -1 -49 -81 -27 -44 -27 57 24 16 -9 31 -30 -72 -44 -42 -30 14 45 22 7 29 -47
8662 -47 -36 -58 -53 -33 40 56 25 42 14 0 -33 -8 -51 -47 -11 32 15 -2 24 35 -11 -38 -28 -29 -58 45 65 45 -10 21 -17
8693 -17 -65 -78 -97 -42 -69 35 25 67 14 -7 20 -5 -89 -31 -43 -33 40 6 56 18 -7 -36 -40 -42 -23 -22 51 72 30 28 -13 -24
8725 -24 -56 1 -22 -24 -11 32 17 44 1 -14 -18 -20 -44 -61 -13 -1 62 43 46 11 -36 -65 -38 -49 -4 -16 33 38 18 50 9 -55 -49
8758 -49 -38 -69 17 52 37 29 1 11 -33 -32 -19 -9 -13 -11 66 19 84 38 -15 -58 -59 -54 -4 40 16 13 5 50 29 13 10 -10 -44 -56 4
8793 4 66 87 75 43 -17 -91 -57 -27 -84 -3 16 42 2 36 -22 -1 -17 -22 -52 -14 12 50 42 61 35 7 -3 -59 -32 -13 30 -3
8825 -3 41 21 25 25 -33 13 2 -70 -18 13 40 53 83 93 -30 2 -55 -8 -22 10 65 52 57 45 -9 14 -54 -51 -63 -35 -22 69
8857 69 79 16 40 -17 -40 -93 -50 18 24 29 41 48 54 75 -3 -5 -17 -38 -9 -27 17 28 33 22 -14 -43 -69 10 -23 -11 -52 66 25
$$ packed form
8630d7J8l1lM3K2K0L8k5oJ9m9m8l2N4j7J7Q4l3qk5M0o1m2K8KJ2M4L1k3j5K2p6
8662d7J1k2NK0P3J6l1J7k8j4l3K5m3ML6M3j7j7K6J1m6k7J0jk9J03K0k0n5L1l8
8693a7m8j3j9N5k7J04j0M2n3k1K7k5q4N8j2J0P3l4N0l8k5k9mkJ9JP3K1m2km1j1
8725b4l2N7k3kJ3M3j5K7m3j5mkk4j7M8J2O3j9Ll5m7k9K7j1M5j2M9Nk0L2m1o4O
8758d9J1l1Q6L5j5qk8J0m4JJ3J0mKP7m7O5m6n3m3jNN0M4k4lqM5k1j6lk0l4j2O0
8793DO2K1j2l2o0p4L4L0n7Q1J9K6m0L4n8K1j6nl0L8K6L8qJ9k6k8j0n6K7J9M3l3
8825cM4k0M%n8M6j1p2N2L1K7J3L0J0j23L2n7M7j4L2N5j3Nj2n4K3o8Lj2K8J3R1
8857F9J0o3K4n7k3n3M3O8ONJ2POK1p8kj2k1K9j8M4J1Nj1l6k9k6P9l3J2m1J18m1
$$ plain form
8890 25 72 12 13 5 -48 -54 15 36 3 55 39 80 19 7 -6 -49 -12 6 4 42 24 49 -25 -23 -64 7 -59 -17 -6 42 85 40 -5
8923 -5 -26 -34 -41 -35 -33 -6 30 57 59 45 49 -1 -61 -39 -71 -7 34 41 49 8 -1 7 -17 -28 -58 -30 22 4 35 61 50 25 -7 -65 -29 -42
8959 -42 -40 31 38 31 -6 13 -43 -43 -63 -41 -50 -39 42 31 18 74 38 -42 -16 -29 -47 -14 1 34 42 27 -13 34 -32 -9 -26 -16 23
8992 23 32 11 41 27 42 7 -66 -8 -38 -29 29 24 44 35 19 -23 -44 16 -58 -64 -19 -1 88 39 77 34 -46 -31 -2 -7 2 -17 41 60
9026 60 -14 -37 23 -32 -9 12 -21 -20 -40 38 24 5 14 -17 -11 -4 -55 -30 -1 18 53 -16 37 35 -41 -59 -34 -44 4 -5 19 73 51
9059 51 19 -23 -28 -16 -13 -35 5 48 26 10 6 4 -3 -65 -16 -87 -23 14 44 30 16 -26 -11 -59 -62 -24 18 -9 36 53 49 2 -18 9
9093 9 -58 8 -32 -15 12 3 42 -20 0 25 -49 -36 -68 -17 12 52 21 -7 -2 -23 11 -60 -4 -57 7 52 15 -14 18 -16 -8 -48
9125 -48 -55 -56 -53 -12 6 29 68 12 32 -88 -42 -36 -14 19 -5 39 21 57 40 -23 -16 -48 -39 -22 15 -4 65 43 41 -4 4 -73 -6 -20
$$ packed form
8890B5M7o0Jqn3oO9K1l3N2j6M1o1j2j3m3L7J8kL8j8K5p4Km1P1o6M2J1M8M3m5m5
8923ek1qpOKK7L6K7Kj4Mn0o0K2l2O4M1PQm1rQk4j1l0K8N2j8L1K6j1k5l2n8L6j3
8959d2KP1Ppl7J9n6%k0K2rJ1Q1j1j3N6l6q0K6j3j8L3J5L3Qj5m0M7o6K3j7J0L9
8992B3Rk1L0j4J5l5p3N8l0RN8nK0rj6m2k1O0p4oM5J8Q9m9L8m3q0J5K9nRj9N8J9
9026F0p4k3O0n5K3K1l3Jk0P8j4j9Rl1OPn1K5K9J9L5o9N3kp6j8K5j0M8rK4N4k2
9059E1l2m2nJ2Lk2M0M3k2j6mkpo2M9p1O4L7L0j4j4m2J5m8lL8M2k7M5J7mm7k0K7
9093Io7O6m0J7K7rL9o2K0K5p4J3l2N1K9M0l1k8Nk1L4p1N6n3O4M5l7k9L2l4Qm0
9125d8pjLM1J8K3L9n6K0j20M6OK2L3k4M4j8L6j7o3Pl2RJ7L7j9O9k2km5Qp7O7j4
$$ plain form
9159 -20 27 28 42 55 -7 3 -18 14 -12 -23 -7 11 30 63 17 42 5 5 -36 -16 -4 -3 34 33 59 60 48 4 -11 -21 -27 -37 9
9192 9 42 51 53 45 2 0 -45 -47 -26 -6 60 18 64 47 22 10 -43 -37 -13 -23 20 46 54 19 33 -4 -39 -35 -42 -7 -44 -4 44 72 13
9227 13 -40 12 -12 14 -76 4 -64 36 6 32 22 -8 1 -47 -29 -23 -34 29 29 24 24 55 -17 2 -27 -62 0 9 57 31 14 -5 -17
9260 -17 -18 -17 -19 2 -2 29 38 -31 32 42 -12 -5 -11 -33 -39 -4 11 35 0 15 60 -4 -35 -60 -4 -36 18 51 -16 -5 37 41 7 8 -53
9295 -53 -26 13 17 54 0 50 0 -62 -33 -38 -22 -14 11 -26 23 27 -27 38 -13 -14 11 -15 2 25 31 30 -2 -4 10 15 -36 31 -51 -7 3
9330 3 48 80 59 -13 -23 -41 -35 -31 -8 5 21 13 -3 -16 -23 -58 -63 -34 -9 23 14 36 4 -1 -59 -7 -62 -57 -33 9 35 5 5 -9 20
9365 20 -46 -35 14 -73 -15 43 3 17 56 49 -8 2 -42 -1 14 10 39 18 -26 23 16 -27 10 10 -40 -15 -28 -24 38 23 48 -49 -30
9398 -30 -70 -15 -36 1 14 17 44 -19 -13 -20 8 -62 8 -70 -37 16 21 33 26 -31 -32 -8 -33 -9 5 25 24 40 -17 30 -26 -31 -40 -5 -21
$$ packed form
9159b0M7JJ4J3o2J0k1L2k6j1J6J8J9L3m6K5l7%m1K0J2JL7jK6Jj2m4j5j0oj0M6
9192IL3RKqm3km5kK1K0O6m2M6j7k5j2n3OK4j0M3K6Ql5J4l7l5MpL5l7M0M8K8n9
9227A3n3N2k4K6r0Q0o8J00l0K6j0l0Rm8J8Oj1O3%n%L1p2J9k9l5O2RM8k6j7j9j2
9260a7jJkK1mL1Ro9O3J0n4Pok2oL5J5K4l5J5M5o4l1k5N6l2N4L3o7J1M2Ml4Jo1
9295e3K7L9ML7n4N0n0o2K9nJ6QK5l7M9Mn4O5n1jK5k6J7K3Ojl2kJ4Nn1O7q2M4J0
9330CM5L2k1p2j0j8OMK3J3J6qj6j3pl5nK9K5L2rK2l2nn8N2n5NK4M2K6l0%j4K9
9365B0o6J1M9q7N8N8m0J4L9pn7J0m4M1J5mK9k1m4M9pm3L7%n0K5j3MO2j5K5r7J9
9398c0m0N5k1L7J3LK7o3OpK8p0P0p8L3N3NJ2pn7jK4k5K4J4K0jJ6n7M7n6nrL5j6
$$ plain form
9433 -21 -4 39 53 10 -16 -18 -40 -48 -12 26 -10 6 0 27 -22 32 -33 -53 -27 -45 -39 -9 51 -17 35 34 -7 -38 -48 -26 -20 -3 4 -2
9467 -2 31 39 -56 -40 -23 10 -40 15 20 26 61 39 56 -13 -24 -73 -22 -37 -16 14 -2 52 6 38 -19 -26 -17 -24 6 7 22 25 77 15 -4
9502 -4 19 -33 -22 2 -14 28 -21 37 27 16 -16 -23 10 -46 5 31 6 34 37 7 -22 -68 -70 -33 -30 -11 42 29 37 42 24 1 -2 -25
9536 -25 -42 7 4 -9 66 -14 11 3 -23 -15 -45 31 3 -8 12 -14 36 11 -1 -8 -18 -15 27 29 26 67 19 23 -5 -23 -4 -25 15 31
9570 31 5 19 -28 32 3 17 6 -17 -24 26 24 -2 53 -12 -6 -19 -31 -10 -24 -12 -3 -15 4 16 -10 5 45 -26 -24 -9 2 74 103
9603 103 32 30 57 -25 -2 4 -34 20 -28 -16 11 51 36 19 7 -53 -14 -11 -17 25 20 37 -49 27 5 4 -19 -37 -1 -20 1 31 12
9636 12 51 18 16 -37 -51 -52 30 -18 40 58 30 6 8 -11 -14 -29 -22 3 22 70 17 17 7 -18 -12 32 3 -9 9 4 -12 -7 8 22 -22
9671 -22 21 -56 -47 13 7 64 32 9 -10 -9 -1 -42 -41 13 3 18 -1 36 -17 16 -3 7 -25 11 -21 -18 67 41 18 52 -28 -20 -13 36
$$ packed form
9433b1J7M3J4m3k6kk2qL6L8l6J6oK7m9N4o5k0K6j8OL0O0o8N2jm1l1j0K2OJ7Po
9467bL3Qr5J6J7L3n0N5NOL5k2J7o9j1m9N1j5K1L0j6N4m6L2n7pRpL0JJ5LN2o2j9
9502dK3n2J1K4j6M2m9N8j0j1l2pL3n6N1K6k5K8Ll0k9m6kL7LJ9N3j3QNj8k3lk3
9536b5j7M9lj3P5q0K5qk6Ql0P6k8j1K0k6N0k5j2pj0LM2KlM1m8Mk8j8J9k1M0J6
9570C1k6J4m7O0k9J4j1k3pN0kk6N5o5Oj3j2K1j4J2Rj2J9J2k6J5M0p1KJ5J1P2K9
9603A03p1kK7q2K3Ol8N4m8J2K7M0j5j7j2o0L9LoM2nJ7q6P6k2jk3j8L6j9K1L0j9
9636A2L9l3kn3j4jQ2m8N8J8k8k4Kj9lj5PK5J9M8n3%j0k5OM4k9j2J8nj6NJ5J4m4
9671b2M3p7RO0oN7l2k3j9JQm1JN4j0J5j9L7n3L3j9J0l2L6l2LQ5k6k3L4q0QPM9
$$ plain form
9705 36 -17 -11 24 46 35 16 -14 -12 -8 -9 12 20 6 6 31 27 3 -8 -20 2 -31 -18 2 11 26 22 0 33 -20 1 1 -21 -37 43 -5
9740 -5 48 34 40 -8 4 -23 -21 35 5 42 -12 73 -18 2 -1 -22 32 -20 14 66 33 17 22 -1 -2 -34 -24 -43 36 17 28 49 15
9773 15 39 -30 13 -36 -68 -48 31 44 -10 17 15 24 -48 -5 -28 -23 -10 0 61 12 38 20 36 0 -16 -29 -30 -22 -21 6 26 1 -6 4
9807 4 -1 -6 -34 -21 -52 22 44 11 -8 -15 -18 -16 -63 -15 3 14 -7 46 30 13 -5 -56 -14 15 -61 -28 -23 41 -22 0 18 -42 -33 -21
9841 -21 22 -16 -3 2 31 57 18 15 -31 2 -56 -58 25 27 24 -8 -13 27 0 -45 -57 -20 23 22 36 12 -6 1 -2 -31 -60 -13 -56 11 8
9876 8 -7 43 2 -36 -35 43 -67 -18 24 -19 -8 61 2 15 1 -5 -39 -11 -11 -23 35 21 51 -28 29 -9 5 -2 -35 5 49 46 7
9909 7 11 69 4 -11 -27 -59 -9 21 -12 26 67 16 32 35 6 -42 1 18 2 73 1 26 -25 29 -24 -40 -13 -47 25 21 21 8 13
9942 13 -7 -23 18 -22 -20 24 5 32 -2 -21 32 9 -4 -34 17 -39 28 25 32 27 -3 -11 31 9 -29 14 1 12 0 8 52 24 3
$$ packed form
9705C6n3OL5K2j1j9l0KMjK1Qj4%K5mk4j1j2K2l3J3K0RJ5mk2L3n3K1%k2j6Q0m8
9740eN3j4Om8J2k7KN6l0L7n4Q5r1K0lk1N4n2L4N2l3j6Nk3jl2J0j9P9j9J1K1l4
9773A5K4o9M3m9l2K0P9J3n4K7kRp2M3k3NJ3J0O1m9K6j8J6l6j6j3jQJK7K0k5pJ0
9807Dnnk8J3l1P4K2l3j9plKm7M8J8J1k1N3j6j7j8n1M2K9p6L3NO4o3K2J8o0RJ2
9841b1M3l8J3NK9K6l9lm6L3n8kQ3Kll2nM0k7m5j2L7M3jJ4k4j8Plk9k9M7m3O7l
9876Hj5N0m1l8JP8j10M9M2m3J1O9n9J3j4ol4K8%j2N8j4L0p9N7l8J4pl3M0M4ll9
9909GMN8o5j5j6l2N0L0l3L8M1n1J6Lk9m8M3J7j6P1p2K5n1N4n3j6K7l4P2m%j3N
9942A3k0j6M1m0KM4j9K7l4j9N3k3j3l0N1n6O7lPnl0qM2k2l8M3j3J1j2QM4k8k1
$$ plain form
9975 3 19 2 -27 7 -3 21 34 18 39 -49 11 -41 -3 -29 41 -44 -36 23 40 -12 40 -15 -48 -6 4 40 -36 25 26 57 12 24
10007 24 -23 -31 -48 4 11 -7 44 16 35 -25 -51 -40 -27 14 -31 -54 -2 42 36 24 -22 -40 -19 7 17 3 23 34 -9 12 30
10038 30 11 -24 -60 -8 5 16 -4 23 -41 15 3 -18 -41 -45 25 -10 41 55 49 15 -16 -14 -68 28 -5 18 -1 15 -38 18 -5
10069 -5 -23 -14 27 -52 8 49 52 38 57 -12 -22 2 23 -62 -17 53 -23 27 31 19 27 -22 -16 9 -28 -17 9 26 27 48 61 -10 -70
10102 -70 -12 -21 -40 38 -7 -28 40 -5 4 -8 -49 -18 -63 -32 42 32 31 7 2 -4 -17 -43 -14 6 0 19 21 21 14 7 36 -55 -30 -50 -27
10137 -27 27 45 56 2 34 -20 -66 -57 -30 -10 -20 24 36 -27 19 14 -7 -47 -5 1 -19 -1 -18 56 35 -40 -45 4 -14 -29 8 -3
10169 -3 -49 35 -4 -21 -6 16 -25 -25 -17 -5 -8 21 14 12 2 -15 -49 -30 -12 -40 -11 -11 16 32 27 36 -11 -29 -49 -18 -23 10 22 36 -3
10204 -3 2 -29 4 -40 -32 -18 -9 44 32 26 29 38 8 -56 -16 -22 -17 16 28 32 41 -32 -33 -24 -14 14 11 -12 -33 -18 15 12 -29 -8 2 -47 5
$$ packed form
9975CJ6j7k9L4j0K4J3j6K1q8O0n2L8k6P0q5QN9J7n2N2n5l3M2J0L6p6O1JL1m5J2
10007B4m7qj7N2Pj8N1k8J9o0k6J1J3M1m5k3N2M4oj2m6j8K1K6J0j4K0J1m3K1J8
10038C0j9l5l6N2J3J1k0K7o4N6j2k1k3mP0l5N1J4ol4l1Kn4R6l3K3j9J6n3N6k3
10069ej8RM1p9O0M1Lj4J9o9j0K4K1q5M5P0p6N0Mj2Qm9OK5l7J1K6J7JK1J3p1o0
10102g0N8rj9P8m5k1O8m5Rj2m1L1m5L1P4j0jk4noj3k6K9K0oJ9K%ppK9r1K5k0K3
10137b7N4J8J1n4L2n4m6RK7K0j0M4J2o3M6nk1m0M2Ok0J8j7P4k1p5nM9j8j5L7j1
10169cm6Q4l9j7J5K2m1%QJ2lK9pkj0j7l4J9J8k8K9%K7J6nRm7j8k0L1nL3J2J4l9
10204cNl1L3m4QJ4RN3j2oLRl0o4M0oNL3J2MRp3jRJ0K8lk3k1J5L3lm1K1J0m9N2
$$ plain form
10241 5 11 6 -9 -17 -28 3 0 -23 -29 -72 33 15 13 5 23 36 28 -21 -12 -17 -22 -7 -6 25 0 -6 9 19 -22 -14 -36 -15 23 3 36 67 1
10278 1 30 -48 10 24 -30 -4 -49 34 1 28 37 -10 -47 -17 -25 18 -2 25 28 43 17 22 9 -2 -42 -7 10 32 15 -5 -33 9
10310 9 -26 38 -19 1 36 12 26 50 48 24 1 -63 -40 13 3 -16 -33 18 4 19 8 28 57 1 -11 -48 24 40 56 -35 38
10341 38 -8 10 -34 -29 3 -9 1 55 24 7 16 -19 -26 -58 8 -15 -15 -8 29 26 33 -14 13 -32 -48 -6 -29 23 31 31 13 50 28 -21
10375 -21 5 -31 -31 8 3 14 -3 14 -27 12 -29 -13 -22 7 -48 28 37 55 35 45 23 -47 -32 -25 -19 26 32 33 23 27 23 -8 12 18 22 -16
10411 -16 -5 -3 55 72 -5 27 -32 -7 -14 18 39 4 -4 -14 -17 18 -14 14 26 -28 -21 57 28 35 -10 28 -19 -23 -16 9 -5 21 18 15 38
10446 38 -5 6 -33 6 -21 0 -32 9 39 -10 31 -13 -41 17 12 1 -24 28 28 15 9 52 -25 -5 -35 -35 23 -9 7 8 -31 7
10478 7 33 -40 -19 -57 -37 -8 21 31 -25 41 34 4 -10 -7 23 -35 2 -6 3 1 30 21 -40 -40 -28 4 24 21 -33 7 3 9 -9 -32 -9
$$ packed form
10241EOnj5qj1L1lk3om3J05j8kqJ8J3qm9RnnJ5JL1k5oJ5J0m1Qk2K1L8k0L3L1o6
10278AK9p8N8J4n4K6m5Q3l3K7Rm7l7L0qM3k0K7LJ5k6Nj3j1m0L5J7K2j7k0k8M2
10310Il5O4n7K0L5k4J4K4kk4k3o4K3N3j0j9j7N1j4J5j1K0K9n6j2l7P2J6J6r1P3
10341C8m6J8m4NL2j2J0N4l1j7Rl5pl2O6k3%PL7lPm7K7m5j6M2k3N2Q%j8L7k2m9
10375b1K6l6%L9nJ1j7J7m1L9m1J6rK9n5P6RJ8k0J0k2p0J5POM5OJj0Mml1K0OMl8
10411a6J1KN8J7p7L2n9K5pL2K1l5qj0lL5l2K8J2n4PP8k9Pm5L8m7mPK5j4K6llK3
10446C8m3J1l9L9k7K1l2M1L0m9M1m4k8N8nj1k5N2%j3oM3p7K0l0%N8l2J6Jl9L8
10478GK6p3K1l8K0K9K9J0n6O6pl0j4LL0n8L7qRkK9ro1%J2L2K0ln4M0mOj8k3K3
$$ plain form
10513 -9 -4 25 64 28 5 -37 -22 -36 -22 6 4 -18 9 -29 -47 19 -21 40 -25 -40 -38 -30 20 32 -20 60 -10 -46 37 -3 -24 -37
10545 -37 7 -9 -11 -10 66 17 22 -25 -30 -40 -21 7 18 2 62 27 -52 -41 -41 -15 -49 -18 -1 -7 -13 15 8 27 1 -14 -48 -20 2 -47
10579 -47 34 -23 21 18 6 40 -1 -4 24 23 3 69 63 54 18 9 22 -17 -13 0 13 43 39 -23 -21 24 -50 25 -45 -63 2 -46 47 13
10613 13 26 26 -29 -34 -54 -23 0 -21 12 63 -27 -6 38 -43 15 -36 -11 -26 23 15 65 26 56 35 -9 -8 -2 3 -1 21 8 2 -5 -18
10647 -18 -2 -22 4 -20 -2 10 29 39 25 17 -34 0 -29 -20 -8 12 -1 36 5 24 -26 -2 -37 -11 -65 4 -59 -1 52 -33 -2
10678 -2 -38 -40 -35 -18 9 19 6 1 22 -6 -4 17 -9 -47 -8 -14 10 -25 -9 25 -5 25 14 -23 21 24 36 -7 14 5 15 0 20 -15
10712 -15 -62 -3 33 -17 32 21 15 10 1 -31 -5 -24 43 28 9 -3 22 18 19 -16 10 -18 -11 -15 46 0 9 47 -15 -29 7 0 -32 -12
10746 -12 13 22 1 10 -22 -15 -4 -10 31 -1 -32 -21 8 -6 -19 -4 -4 -13 -5 -25 35 27 -23 9 32 32 -18 69 -27 -15 -11 -34 23 56 52
$$ packed form
10513iNK9L9l6k3m2J5j4J4K8kk2K7l8j8O6m0O1o5j5KQN0J2n2Q0p0l6Q3m0k1j3
10545c7M4j6kJP6m9Nm7nj0J9K8J1j6O0l5p9J1%K6l4L1J7ooK8pJ9k6j5l4K8K2m9
10579d7Q1n7M4lj2L4m1lK8jk0O6orl6rJ3l9MJ3J3L0mo2KM5p4P5p0j8O5m8R3l4
10613A3J3%n5nk0L1K3k1L3N1r0K1M4q1N8n1K5j5M9qN0l9L0k1m4JONmK2j3opj3
10647a8J6k0K6k4J8J2J9J0j4qn1L4k9RJ2K0j3L7l1J9n0K4l5K6n4O9o3N8N3q5L1
10678bl6kNJ7K7J0j3nK1k8KK1k6l8L9oK4l5J6L4l0L0j1l7M4LJ2m3K1rJ0j5K0l5
10712a5m7N9L6n0M9j1onrl2K6j9O7j5j9j2K5mJl5K6k8PmO1m6RL8o2j4L6pl2K0
10746a2K5Rk1Rl2PJ1oM1l2l1J1K9j4j3J5%rQk0O0qn0L2K3%n0Q7r6J2Mk3N7L3m
$$ plain form
10781 52 53 13 -26 -31 -5 34 8 -28 41 1 34 25 16 -31 -29 32 11 -31 27 5 -10 -26 17 40 -15 -10 -19 -8 18 -5 1 9 12 -5 -19
10816 -19 -30 -10 7 33 10 25 15 31 -31 28 6 3 31 -11 24 2 74 47 -12 17 23 -4 -10 10 17 23 20 30 15 30 33 -21 -19 -6
10850 -6 -17 62 -35 33 42 34 -10 -2 45 -38 14 3 21 33 -16 82 -26 -1 -18 -47 -10 -7 -24 50 15 -29 -19 4 11 -5 -33 8
10882 8 43 9 42 11 41 39 -3 26 -4 -30 -17 -9 -18 -33 -37 -14 -8 -13 40 -9 -62 -7 -3 -7 44 7 30 10 -52 -17 -57 -1 -16 29
10916 29 4 38 -7 10 2 20 16 -3 18 -21 6 6 -1 -7 23 8 -8 -65 -1 -40 9 -15 41 -19 -2 -14 -27 -26 -11 5 -20 18 19
10949 19 13 1 -7 26 -27 8 -19 7 26 11 42 25 6 -37 -15 -12 2 -18 -6 29 5 16 8 8 -26 -28 -9 -5 17 4 31 52 38
10982 38 15 3 -73 -14 -6 -15 12 47 32 10 62 -15 -31 -10 11 -11 50 23 16 -37 -27 -2 -47 1 -1 16 -6 -14 -52 12 10 19 -16
11015 -16 -11 -4 31 12 -24 -12 -19 20 -8 -4 36 -39 29 -29 -17 43 -9 32 17 -6 -47 22 -4 -26 -6 16 20 57 -6 30 -47 -26
$$ packed form
10781E2Jm0l9nK6L9k6l6O9m0L3rrm7KO1k1m2N8k2j5j6M3K3n5NrJ1K6k3OQLj7j4
10816a9j1K0J7K6k3J5j0J6o2N9k2lK8m2L5k2P2k7n9K9Ok7oK0POlJ0j5J5Ln4KJ3
10850fj1P9r7O8Rqm4QM7q3N2j1J8J2m9R8j08K5j7k9L7Lj7P4l5m4J0K3Pj6k8M1
10882HL5l4L3l1L0km2K9l0k6J3Qrj5mK3OnN3m9n3N5MmN1l7K3k0o2L5m0N6j5M5
10916B9k5L4m5J7qJ8mj9K1l9K7%poL0j5j6n7O4l9M9k4N6o0J7j2j3JJ5J6k5L8J
10949A9oj2qL3n3L5k7K6J9j5L1j7j9m3K2LJ4k0J2L5k4J1q%l4kJ9MK2j3K7K1j4
10982C8k3j2p6N9QrK7L5j5k2N2p7j6K1K1k2O1k7pn3J0K5m5M8kJ7k2ql8O4kRl5
11015a6NPL5j9l6J2pL9k8MM0p5O8n8J2O0n2M1j5k3m1O9k6k2K0K2ML7o3L6p7K1
$$ plain form
11047 -26 -25 38 -61 37 -38 -37 24 -1 1 15 16 -59 -14 -13 20 -8 -86 31 36 40 26 -15 2 -19 13 -15 -13 19 42 -30 27 -27 -2
11080 -2 -29 1 16 33 11 49 13 -18 17 -5 -2 -2 23 -15 28 0 10 51 1 -58 9 33 -13 9 -45 17 2 2 48 -16 19 20
11112 20 -32 -31 15 14 6 9 44 24 -24 -38 -32 -11 -6 13 32 -19 18 37 14 -35 8 -20 -61 13 24 85 33 54 3 -12 -26 -16 38
11145 38 25 20 3 9 -6 21 11 -35 -4 -24 0 23 -27 24 22 -3 22 -13 -43 15 11 -24 4 20 37 2 37 4 9 -58 -6 16
11177 16 -52 -9 63 7 -15 29 -46 5 30 -24 15 20 48 13 -8 10 -26 6 -29 -12 -13 -1 24 10 3 3 -8 -25 9 2 8 28 36
11210 36 44 2 25 41 -17 2 -8 5 -16 68 23 53 1 15 -8 11 -9 1 -7 -23 -3 4 -14 -12 49 -6 -57 -28 -5 5 19 -39
11242 -39 17 54 -16 19 -33 -9 4 -40 -7 31 13 -27 -11 2 -21 -16 -27 -37 20 -40 -33 -9 -13 -10 -36 -34 -42 -27 -5 25 32 40 37 13
11276 13 -21 -30 2 -16 -66 12 61 -12 -3 1 55 -31 28 -21 -33 -17 8 15 -27 38 -2 -39 -23 -33 -13 8 24 11 -2 -54 50
$$ packed form
11047b6JO3r9R8p5JO1k5KJ4Jp5M5JL3k8p8J17NMj4m1J7k1L2k8KL2K3p2N7n4K5
11080bk7L0J5J7k2L8l6l1L5k2L%K5l8M3k8J0M1n0n9O7K4m6K2n4O2j5%M6o4L5J
11112B0n2JM6jqLL5k0m8j4OK1NJ9J9n1L7J9k3m9M3k8m1P4J1O1n2K1n1j5j4J0N4
11145C8j3nj7Oj5K7j0m6L1k0K4K3n0N1kk5K5l5l0N8ml5K8J6J7l5L5l3No7N2K2
11177A6o8M3P2n6k2M4p5N1K5n4L9NK8l5k1J8l6L2l5J7jJ2K5j4p%j1j7L4pOK0Q
11210C6Qm2K3J6n8J9j0J3k1Q4m5L0n2J4k3J9k0J0qj6K0Pj8KO1n5n1K9K3J0J4n8
11242c9N6L7p0L5n2K4J3m4L3L8j8m0J6J3k3Nj1j0N7o0PK4mLk6KqJ5K2L0PQlk4
11276A3l4rL2j8n0P8M9p3RMN4q6N9m9j2J6K5Pm2O5m0l7J6j0K0K1J6j3j3n2J04
$$ plain form
11307 50 7 24 -14 -31 -41 -37 -33 -14 -19 -13 -2 -5 44 13 -34 -50 24 -2 30 -21 18 27 -6 22 58 17 -44 -8 11 61 6 9 32
11340 32 2 -8 -3 -4 -37 29 -27 18 15 -7 -11 20 -22 -1 -12 -44 -4 20 1 -26 19 -27 4 -19 13 -8 -6 24 41 46 36 39 15
11373 15 30 -39 25 -23 43 -4 1 -11 0 29 16 -15 -25 -33 -9 4 55 25 -30 17 -10 58 -25 1 -12 12 -5 17 4 -22 43
11404 43 -7 -7 4 0 -9 43 8 2 41 1 -42 0 -9 -6 -26 14 -32 48 -3 -4 -16 -8 -18 -29 13 -40 -37 14 34 41 25 24 -21 -12 9 37
11440 37 70 47 11 -15 -33 23 -24 -40 18 8 -1 21 35 50 -1 35 25 0 0 -11 30 1 34 -16 30 13 9 40 10 28 0
11471 0 41 15 28 14 -12 18 -6 -22 -4 12 43 13 51 44 -2 28 37 -18 -25 24 3 -43 40 -21 36 23 19 -18 10 -14 -36 6
11503 6 39 50 14 97 15 9 -3 -21 22 39 55 -3 8 34 23 24 15 6 16 -17 27 28 -5 13 -7 14 18 -22 -18 -23 -37 3 -11 -15 39
11538 39 48 -19 0 -16 4 0 27 -6 -9 54 -38 11 6 2 -27 -10 -33 -32 26 44 -20 4 10 1 4 5 -77 36 -24 38 -9 -18 43 3 0
$$ packed form
11307E0m3J7l8j7j0MMJ9nOJ1lM9l1m7j6P4k6L2n1L9Rl3K8L6m1o1L6J9N0n5LK3
11340C2l0j0Njl3O6n6M5lk2mL1m2K1j1l2M0K4j9k7M5m6L1k3L2k1KL0J7Nj0Lk4
11373A5J5o9O4m8O6m7Nj2J1K9j3l1j0qK4J3N1l0n5M7k7O8q3K6j3K4j7K2j3k6O5
11404D3n0%J1mrN2l5oL9m0m3M2rLk0M0m6Q0n1jj2Qj0j1M2n3LN1K0Pj6jm5RK1K8
11440C7L3k3l6k6j8N6m7j6N8j0rK2J4J5n1L6j0k5%j1M1k9L3n0M6j7mL1l0J8k8
11471@M1k6J3j4k6L0k4j6J8J6L1l0L8pm6L0Rn5pM9k1m6Q3o1N7j3ml7K8k4k2M2
11503FL3J1l6Q3q2oj2j8M3J7J6n8J1K6j1JrrJ0l3M4Jl3J8k0K1Mm0Mnj4M0j4mN4
11538C9Ro7J9j6K0mK7l3lO3r2M9nmk9J7k3JN8J8o4K4OrLJq2J13o0O2m7rO1m0l
$$ plain form
11573 0 12 -21 -3 15 33 6 26 -25 22 25 -47 10 -14 -22 10 33 25 8 10 23 6 -22 22 -27 30 21 -8 61 47 -16 26 -11 -19
11606 -19 3 -7 6 19 10 18 30 0 -3 -54 0 4 -1 -4 33 18 -1 5 -13 -11 -15 10 -34 -33 -6 12 -6 -24 3 9 14 -43 5 -21 28 20
11642 20 -10 -27 10 34 -38 -45 32 -43 6 -3 11 22 44 -24 -34 22 -37 5 -29 6 57 17 19 33 32 34 -12 5 -20 -12 -41 50 -5
11675 -5 26 -11 -39 12 -34 -26 -4 9 9 -7 21 -30 -11 0 32 3 4 30 -14 14 46 -5 -3 6 -26 -6 14 24 23 15 21 28 30 4 -1 -9
11711 -9 -20 -26 -20 21 7 2 38 27 -44 -18 5 -42 -9 19 13 12 -34 25 25 -26 -22 14 -15 62 36 -4 20 35 4 -62 -22 -25 -17 -36 15
11746 15 6 16 5 -7 -19 29 -79 50 -6 -4 0 11 -4 39 46 -31 -5 -19 8 13 -14 38 22 7 30 -31 -45 -18 -6 -52 -19
11777 -19 -2 -13 7 -8 -20 43 51 9 -21 22 -8 40 -20 14 -22 19 -14 -21 45 -6 -10 0 44 25 -4 24 33 8 6 10 -2 -11 41
11810 41 35 -16 51 -31 41 1 -35 1 39 24 12 -22 -37 -17 43 -20 -3 -15 -26 -24 -16 23 39 34 19 -19 -50 8 -26 -14 -16 53
$$ packed form
11573@J2l3J8J8J8k7K0n1M7Lp2N7k4qL2K3qj7KJ3j7k8M4m9N7rk9O9j4o3M2l7q
11606a9K2j0J3J3rQJ2l0ln1N4MnlL7j5j9Oj8KmK5m4JK7J8j8j8K7ONn7M8k6M9q
11642B0l0j7L7K4p2pP7p5M9rJ4J1K2o8j0N6n9M2l4L5N1m0KJ4jKm6J7k5Qk9R1n5
11675eL1l7k8N1m6QK2J3%j6K8n1J9J1L2k9JK6m4K8L2n1KRl2K0K0J0jqOPKk6nq
11711ij1oOM1j4nL6j1p1K6K3m7L3K8ojm6N9%n1ML6k9P7k6m0K4J5l1o6M0lQj9N1
11746A5rJ0j1j2j2M8j08J29n6KMJ1j5M3Pp7K6j4K7Nk7N2j6j5K3o1j4K7J2m6L3
11777a9J7j1K0j5j2O3Qm2l0M3l0M8o0L4l6M1l3pO6n1mJ0M4j9k9K8Rk5kMj2rN2
11810D1on1O7q2P2m0l6L6L8j5j2l4j5K0O0o3J7j2j1KQL9J6nj5l8l1N8l4J2kO9
$$ plain form
11842 53 57 -11 16 5 -25 -12 -37 44 -25 -7 -5 21 8 -16 23 -47 23 69 2 2 19 30 -5 -44 8 -4 28 30 -9 -25 28 44
11874 44 33 40 1 16 -42 -2 -20 -49 -13 -2 34 -41 -19 5 7 15 4 1 53 -29 5 1 -6 -30 -75 20 52 -31 -16 15 -14 -8 30
11907 30 -2 5 26 3 -9 -34 -11 29 -23 66 -13 -44 56 28 -58 -5 27 40 24 36 43 -24 2 12 15 27 -26 -1 -32 54 19
11938 19 -9 10 -22 49 -21 38 12 -5 -17 16 22 -1 4 16 19 -2 -22 -23 13 18 -38 -41 5 -25 -14 -23 21 10 41 -1 6 -5 24 -27
11972 -27 -6 -29 -5 -50 8 -12 -9 3 -32 39 21 -71 -2 25 -39 48 15 62 24 16 -15 -19 -8 11 22 29 0 -25 56 -42 20 15
12004 15 -17 62 -8 -16 2 -21 35 -23 4 -21 7 8 -55 -30 14 14 -1 -3 -2 -5 -20 24 -13 13 30 -41 10 49 35 17 -3 15 24
12037 24 -12 -31 -2 3 8 21 14 23 -13 -38 15 17 28 38 8 7 11 -12 8 -38 -16 9 26 9 9 10 37 6 56 -24 -2 9 0 -30 -29
12072 -29 -30 19 -4 -21 -36 -18 30 -8 4 51 -18 11 27 -6 -5 -31 -28 11 24 -33 -3 25 -9 22 20 -7 13 -46 11 3 2 -1 8 1
$$ packed form
11842E3Mo8K7j1l0J3k5Q1o9J8KK6j3k4L9p0P0M6o7%J7J1l5l9N2j2L2Kl9j6N3J6
11874D4j1Pl9J5n8M0j8k9L6J1L6p5K2K4KQj1lN2q2L4mpk4m5R5L2q3J5L1k9OL8
11907C0l2PK1k3j2k5K3M0n2Q9p9l1J00k8q6N3L2J3j6J2Po7K6J0LJ2n3K5l1Q6l5
11938A9k8J9l2P1p0N9k6j7j2L3Ok3NJ2Lk1k0jL6Nn6lM6l0J1rM4j1L1m2Pj1K9n1
11972b7K1k3K4m5N8k0LJ2l5P1j8r2O9K7o4Q7l3M7l8ql1mJ1J9J1Pk9k5Q1r8O2n
12004A5l2P9p0qJ8k3N6n8K7k5K8Jo3K5M4%j5kJlj5M4l7K6J7p1N1L9j4j8k0J8R
12037B4l6j9K9NNJ3pRl6k5N3KJ1J0l0jMk3K0m6K2K5J7j7%JK7l1N0q0K2J1rl0J
12072b9jM9k3j7j5J8M8l8J2M7o9K9J6l3Jk6LL9J3n7L0K8l4L1kk7K0n9N7qjlRp
$$ plain form
12106 1 76 -39 1 -4 21 -5 17 8 -48 22 -16 22 -37 13 -1 -25 9 -13 -25 -12 25 -23 15 23 -34 -1 -30 79 9 23 16
12137 16 48 26 -13 -16 -3 -15 55 11 58 22 49 -4 30 -18 -5 -33 -47 -11 40 -18 -60 57 -39 -33 -14 13 23 -19 10 26
12167 26 -1 10 -19 -17 -44 39 -58 -33 -50 45 2 -11 44 -29 0 -44 -12 -54 -20 -50 -32 15 -10 -8 -13 30 -10 1 22 30 -2 40
12199 40 -14 33 -6 -3 -4 -13 -8 -3 27 20 15 -20 -13 21 36 -9 3 13 -30 -43 1 8 52 21 13 -43 5 -8 10 17 -32 -15 19 35 8
12234 8 -2 -7 -19 18 -15 24 17 52 -12 8 26 12 -3 49 4 8 15 19 -7 18 39 8 -52 4 10 1 19 14 30 32 23 -28 13 -38 28
12269 28 19 6 -52 -29 11 -6 11 27 65 -17 6 23 3 -4 -38 3 35 8 24 35 0 15 23 -7 43 20 -54 -18 -17 9 -7 -32
12301 -32 25 4 -46 1 11 -28 -8 11 9 36 51 25 -16 58 -8 -26 20 46 16 -18 -12 5 -27 -17 44 -8 29 -14 -8 -19 21
12332 21 -36 -32 13 47 7 -17 15 2 -6 15 19 -6 57 -13 16 27 20 14 12 -1 19 2 -2 34 6 10 -12 4 7 -17 11 -51 18 51
$$ packed form
12106AP5j15M0nK5k6K2rn6P0l8L8n9N0j4k4L4k2j2J3L7m8L8Qn7L3k9J09p0J4p
12137A6L2k2l9lJ3j2P0m4M7l6K7n3L4m8J3k8j4L6N1n8m2J17r6OJ9K7J0m2K9J6
12167B6k7J1k9Kk7Q3r7K5j7R5m3j3N5p3K9m4L2m2L4l0J8M7k5KnM3m0J1K1Ql2M2
12199D0n4M7l9LjrNNL0pnl5PL4J5m5J2J0m3j3M4PM4l1qn6M8j3J8Pm9J7L4J6k7
12234Hj0nj2L7l3L9pL5o4K0J8j4j5N2m5MPMk6K5K1l1o0N6OrJ8nJ6Krn1M1n1O6
12269B8rj3n8K3M0j7J7J6L8q2K3J7k0pl4M1L2k7J6J1l5J5Ql0N0k3p4L6JK6j6k5
12301c2N7k1n0M7J0l9K0J9kK7J5k6m1P4o6j8M6K6l0l4OJ7l2J0O1n2L7m3Oj1M0
12332B1n7MM5L4m0k4L2j3qK1Mk5O3p0K9J1pokj3K0j7mL6k8Mk2J6Lk4K8o2O9L3
$$ plain form
12366 51 48 -13 2 27 -47 -11 -17 -15 17 28 26 18 47 42 21 -51 29 4 -33 -4 -29 43 -27 -7 23 3 -9 41 13 -23 -3 -34 5
12399 5 24 4 -13 -10 -18 23 -3 2 12 34 1 24 23 21 11 -19 -1 12 49 -14 -21 15 -7 -2 9 7 3 18 -10 31 -22 61 -15 -4 -2
12434 -2 -3 35 -49 -12 -36 -6 -16 -29 35 -46 -12 8 -70 2 -17 -16 -2 22 27 -10 -3 -4 -13 -53 0 0 8 -20 -4 -16 -9 -7 -12 39 -10 33
12470 33 39 -67 0 26 -25 -12 0 -11 25 -6 23 30 4 -39 3 -9 8 -20 9 2 -13 16 22 19 -14 74 4 -57 -30 -17 7 -37
12502 -37 23 -12 -29 16 -23 15 17 0 -35 -7 -33 42 43 -15 20 -3 2 -16 -32 14 -16 -7 -26 -68 25 -22 -5 -30 -22 13 16 -6 22
12535 22 27 9 -28 53 -8 -9 -45 5 -7 9 -36 -22 -32 -7 -10 -26 -58 14 -14 -3 46 -12 4 -26 0 -49 -20 -36 17 44 -22
12566 -22 40 -28 47 -35 -32 10 -56 5 23 6 -39 41 -16 46 -17 -8 24 -15 19 2 -32 7 -4 -22 -35 -5 -27 -5 -7 -13 40 51
12598 51 21 25 30 -5 -1 12 -41 -21 5 -25 18 -37 22 12 -22 -1 0 -22 36 -5 -2 -40 32 -12 6 -9 9 21 -22 -29 17 61 -33
$$ packed form
12366E1lo1J5K5p4L6oKL2J1kqK9nk1p2Q0k5l7K9k5P2p0K0L0k0j2N0k8l6K0l1L9
12399EJ9k0j7LqM1k6NJ0K2l3K3jkj0l0J8J3L7o3pL6k2NJ1kmJ5k8M1n3Q3p6J1K
12434bjL8q4L7k4L0j0j3O4q1L4K0p8P2j9JJ4K4Nl7Pjrm0N3%Qk8J6j2PKnN1m9M3
12470C3Oj06O7K6n1J3J2j1L6l1K9Pk6m3M2j2J7k8K9pj5K9Oll3Q8p0o1K7J3K4m4
12502c7O0l5j7M5l9L8Kj7l5K8k6P5Jn8L5k3Nj8j6M6l0Rj9m2R3m7J7k5QL5Lk2K8
12535B2Nj8l7Q1o1jl6N0j2J6m5J4j0K5lj6l2P2k8J1M9n8J6l0K6m9K9j6N3K7o6
12566b2O2o8P5q2LM2o6O1J8j7m5Q0n7O2o3RL2l9L4j7l4L9j1j8j3L0k2K2koN3J1
12598E1l0MNl5MJ3n3K0K6l0M3n5N9j0l4K1Jk2N8m1Ll8P2m4J8j5J8J2m3pM6M4r4
$$ plain form
12631 -33 0 -16 10 -14 27 -8 -17 -4 56 9 -8 -3 9 1 25 -1 9 -5 20 4 5 15 16 24 -7 -46 -53 -15 15 47 0 -16 22
12664 22 15 -9 7 5 -7 40 -8 17 64 34 4 -21 17 -37 5 -9 17 34 -21 -29 -34 19 8 -6 1 15 35 30 40 24 8 -16 -6
12697 -6 -6 -4 -5 -8 -14 54 3 -1 -37 -9 7 20 4 34 28 -42 23 5 -32 -18 -16 -1 14 19 -13 41 51 -35 -51 36 28 -15 -19 -11 -4 -11 70
12734 70 29 -13 -2 25 -41 0 -65 -10 -30 23 58 7 -15 33 2 19 23 5 19 -9 0 11 28 -32 -22 -11 -75 3 -17 36 33
12765 33 -5 22 -6 -9 18 17 0 13 30 25 -31 32 40 -27 0 -28 -18 -30 19 55 -17 -24 -13 7 7 12 -25 30 -31 27 42 -1 30
12798 30 -20 10 -42 -10 26 -19 -23 -9 27 50 -4 54 26 0 19 11 -32 28 11 -1 -1 26 72 12 -3 -29 0 9 -25 -12 6 21
12830 21 1 -18 12 8 8 -45 16 -13 -4 -18 -17 34 -32 26 -9 -37 42 -20 -11 -22 50 -1 -2 -10 -20 -17 12 22 -26 15 -9 -5 30 -15
12864 -15 -12 -2 2 -37 -2 1 21 74 -23 16 4 -19 34 50 27 -33 3 5 -7 -3 -18 -23 10 -21 16 -18 -13 22 5 33 16 3 -32
$$ packed form
12631c3L3j6K6k4M1l5rJ3O0m7j7NJ2qK4k6J0j4K5j6JJ0JQl1l9pL8L0L2m7j6L8
12664B2pk4J6kj2M7m8K5M7l0l0k5L8n4M2j4K6J7n5qnN3j1j4PJ4K0nJ0j6j6k4J0
12697f%KjloO8n1ml6K8J6J3j6L0op0O5j8l7J4KJ5J5Nl2N4J0q6j6Q7qm3mQPpQ1
12734G0m1m2J1K7o6M1o5N5k0N3L5n1k2M8l1J7Mj8J4k8RJ1J7o0J0J1o4P8k0N3l
12765C3l8K7k8lK7jj7J3J7nn6O3Qo7K7k8J0j2M9L6p2pJ1K0%Nl7N5o1N8J5m3L1
12798C0n0L0n2L2L6m5mJ4L6K3n4N8k8k6J9qm3O0j7j2%K7M6o0j5k6K9Rl4J3J8J5
12830B1k0j9L0m%n3O1k9Rj4JN1o6N8l5k8P9o2Rj1P2n1jqj0LK9J0m8M1k4ML5m5
12864a5LJ0Ml9L5LK0N3r7L9j2k3N3J6k3o0L6Kj2Mj5nL3l1L7l4NL5j7K8j7j3l5
$$ plain form
12897 -32 21 -33 -24 -2 6 -1 14 56 -11 -26 18 7 19 -16 6 -31 3 -12 -20 23 -34 -12 10 33 54 26 -15 14 39 24 -2 26
12929 26 4 -18 -27 11 3 31 -1 1 -23 -25 -44 3 -6 -19 26 -29 12 -37 31 7 -19 -1 18 -69 12 11 -22 24 -31 2 0 -13 -4 1
12963 1 -25 -21 7 52 -15 -17 -15 -19 4 -24 1 10 15 5 35 -6 38 -8 -6 50 17 15 16 31 20 -24 11 -9 19 6 -2 54 7 46 -1
12998 -1 -43 33 -34 -8 -19 29 -6 -1 32 -21 11 -56 32 25 11 -4 -11 -2 9 28 -3 26 2 29 -18 35 3 -3 6 26 2 -15 -15 17
13032 17 -23 45 -19 32 15 -17 11 -33 29 -2 18 -20 -33 -1 -10 11 -30 -9 26 -12 -28 -12 -14 -25 22 -8 11 46 30 -11 29
13063 29 -33 36 -22 -42 26 15 19 3 -28 13 9 -10 23 27 -16 23 0 9 22 6 9 23 17 -12 8 -5 -26 8 14 6 6 -1 -22 5 5
13098 5 36 27 1 -2 -1 -17 21 2 -28 -17 9 -5 -34 44 19 77 8 -31 12 -38 3 -9 20 56 31 0 7 -7 -15 6 -45 7 -3
13131 -3 32 -18 24 -2 -34 8 -11 -16 9 -27 10 35 39 27 28 38 -27 -3 2 -20 19 -12 13 5 8 -26 31 -20 -8 6 -1 18 27 -14
$$ packed form
12897c2N3n4RK2QpJ5M2o7j5M4j1J2l5K2l7L4j5qM3n7K2K2K3K1k8m1K9K5j5k6K8
12929B6k2k2rL8qK8l2Kk4kj9M7rj3M5n5M1m9O8k4k6J8J9q7Q1jl3M6n5L3kj3RN
12963Ak6MK8M5o7kKmK3k8K5RNj0L0m1M4m6KN6l3kJJ5j1m4L5k0K8j3qN6m7L9m7
12998am2P6o7K6j1M8l5NL3n3L2o7Q8pj4j5pRJ1J9l1K9k4K7m7N3l2oRK0k4j7%L2
13032A7m0O8o4N1j7l2K8m4O2l1K0l8j3L2rK1m1K1L5l8j6J6kj1M7l0J9L5j6m1M0
13063B9o2O9n8k0O8j1Mj6l1M1mj9L3Mm3L9k3RJ3j6LJ4ok9K0j3k1L4Oq%pk1K7%
13098EL1rk6lJj6L8j9l0J1K6j4k9P8k5N8o9l9M3n0M1j2K9L6k5l1Pj4qK1n1N2j0
13131cL5n0M2k6l2M2j9nK5l6L7K5Mj2JJ0o5K4Nk2L9l1K5qLl4N7n1J2J4pJ9Rm1
$$ plain form
13165 -14 44 -13 -23 20 25 -25 -5 38 2 25 -21 15 -14 1 -33 -49 -5 16 -21 13 25 44 44 21 42 12 -53 -38 25 -36 -25
13196 -25 35 14 -9 -4 5 -43 -2 22 4 11 -59 1 22 -22 -26 15 0 3 18 -15 1 50 -13 -29 -44 -6 -31 -32 32 5 21 -33 -35
13229 -35 -26 -13 -11 37 33 -78 17 1 -32 -7 37 -52 34 -14 -35 -35 4 -48 -11 19 20 -18 1 -44 -41 3 8 -54 -22 -7 -14 -27 -12
13262 -12 -45 -41 9 7 -2 3 -11 -28 -38 -4 -20 -24 -15 -21 -22 14 -4 3 -2 -18 6 -27 19 24 -41 5 -3 -32 2 7 44 -21 -23 -36 22 -16 9
13299 9 -19 -6 1 -10 12 -18 3 15 -43 -13 20 67 2 12 27 8 10 3 7 -9 29 31 -15 9 -19 -10 2 -30 7 -51 19 7 37
13332 37 -24 4 -13 39 -1 14 -37 -14 15 -29 -17 -1 -17 35 -18 22 -34 -14 32 22 13 -10 -1 18 -5 24 -4 2 -43 -21 33
13363 33 13 -10 -10 -43 15 -21 1 -2 -10 40 14 30 -20 30 -1 14 8 -10 2 -27 -19 18 -12 31 -15 9 -19 5 11 -33 1 -35 -11
13396 -11 -23 4 -9 18 -12 -48 51 -21 0 38 13 24 10 -6 20 12 32 14 2 -18 19 -24 -31 -22 47 -8 -37 23 -9 24 -19
$$ packed form
13165a4N8n7j0M3Nn0K0M3l6K3m6L6k9J5l4j6M4K1l7L4J2J9%k3K1l0o5J5O3o1J1
13196b5O0k1k3NRm8M1K4j8Pp0O0K1m4mM1j5LJ5l3J6M9o3j6j5L8k5jO4k7J6n4k
13229c5RJ3KM8mj11R5j6l3K5M4q9Q6m8k1%L9n2L7L0Jl8J9m5LM4No2L2J5pj3J5
13262a2l3MN0krNj4j7j0L4j6mRojL6j8Pnj6K4l3M6No5M6qk9L4NL7o5kj3N8l8K5
13299Ik8J3Pj1K2l0K1J2n8L0L3M7o5J0J5j9KpMj6L8Km6K4k8RJ2l2L7n8P0j2L0
13332C7o1K8j7N2m0J5n1K3K9m4J2J6j6N2n3M0n6K0M6j0rk3RJ9k3K9k8Om5K2N4
13363C3k0k3%l3N8l6K2lqN0k6J6n0N0l1J5oj8J2k9QL7l0M3m6K4k8K4Om4L4l6K4
13396a1j2K7j3K7l0l6R9p2K1L8k5J1j4j6K6qK0j8j2k0L7m3pRO9n5k9O0l2L3m3
$$ plain form
13427 -19 -24 -9 -2 4 -27 16 -29 -10 22 2 19 -8 18 12 20 -75 -33 9 -9 -15 9 29 28 -3 -29 -15 18 15 17 26 25 -24 15 -11 27
13462 27 -25 17 -51 16 11 20 19 -39 0 30 28 -16 -28 -16 28 -1 -10 -48 45 -23 20 -24 31 -16 33 -26 18 -22 5 24 -44 48
13494 48 50 -30 -13 15 41 28 58 7 -39 31 8 9 -38 -20 0 -13 20 -50 26 -11 37 -5 -29 -21 -32 -16 -1 13 22 -9 -5 15
13526 15 -22 17 25 18 6 -8 29 26 32 33 6 6 -43 39 -1 6 10 34 -23 -7 17 -64 -3 -14 -30 -26 16 26 44 27 14 49 40 20 -26
13561 -26 -9 41 -25 40 2 8 -10 20 7 14 -1 -19 42 -32 21 -14 -3 -19 -4 -15 15 -14 26 -9 -3 0 -2 -38 -50 6 -24 -1
13593 -1 -7 40 17 47 41 -3 -32 0 1 -14 -13 8 21 6 32 -23 8 -30 11 -28 -52 2 -19 -36 -6 -8 -6 -65 10 11 22 9 -50 3
13627 3 12 26 5 -23 -22 11 -11 6 1 -16 -14 -39 -5 -18 -14 17 -22 -21 -38 -42 -22 -37 6 4 10 -1 24 -4 -46 -18 -75 -40 -17 1 9
13662 9 1 -23 -52 -14 51 -34 29 -36 -43 -3 -15 -8 -11 -33 7 6 -12 4 3 26 -16 -24 0 -28 25 -27 2 17 13 -60 -16 -31 17 -2
$$ packed form
13427a9nJ5POl1M3m5J9L2k0J7k7K6oQr5M2M2j8oK4K0jl1k6J4L3lKRjm9L9k6L8
13462B7n2M2o8O7nRjn8L9L0km4j2J2M4k9rl8R3o8M3m4N5m7M9n9M4m0K7J9o8R2
13494D8Kq0J7K8K6j3L0n1m6P0k3Jm7J8K0j3L3p0P6l7M8m2k4Qj1J6J5J4Rl1MK0
13526A5l7L9Qpj2j4L7lOJk7%m9Q2m0PMK4n7J6K4q1O1j1j6MM2J0J8j7j3L5rk0m6
13561b6J7N0o6O5l8Oj8L0j3Pj5j8O1p4N3l5J1j6J5j1L0k9M0l5OLkl6j2N6l0K3
13593aoM7k3L0om4k9L2Jj5JK1J3j5K6n5L1l8M1l9k4N4k1j7L0kKn9P5JJ1j3n9N3
13627CRJ4k1k8JL3k2J7nj7Kk5L4j3ML1l9Jj7mK0j5M3kOj1K5k8m2K8n7L5K3J8Q
13662Iqk4k9L8O5q5O3o5pM0j2Plk2M0jj8J6jK3m2qK4k8N3n2K9J5mp3M4j5M8j9
$$ plain form
13696 -2 4 22 17 3 -4 22 4 -15 -37 -28 11 -16 -20 17 -33 7 -13 -9 3 23 -44 -30 3 15 14 -23 -18 -47 -2 25 -8 -5 -15 25 -18
13731 -18 -56 -20 5 -13 -29 -7 -70 3 -28 -22 4 9 11 31 2 -12 -12 7 -30 -14 -26 15 8 -16 2 4 56 -25 40 -21 -23 0 -11
13764 -11 31 -18 18 40 -15 8 -39 -18 -12 12 -17 1 2 11 -7 15 -6 -25 -24 16 16 -14 -16 10 10 -33 -11 -10 -35 -24 8 -7 -4 11
13798 11 8 26 30 -27 5 -4 -59 48 3 -5 -7 -16 18 12 3 7 -1 26 30 24 5 17 -1 4 -1 -11 11 52 -10 45 17 36 7 -19 3 -60
13834 -60 10 52 8 -8 -29 22 -62 -13 -20 -34 -4 17 1 -27 35 -25 -12 -6 1 54 -20 4 -22 -6 11 -14 17 15 -33 -33 -25 4 -25
13867 -25 -13 12 16 -16 -53 6 46 37 -1 5 0 3 49 -7 -10 9 25 21 8 29 -23 27 -3 10 -25 -20 -26 -10 -29 -24 28 47 6 -22 11
13902 11 -50 0 -35 27 6 -8 -21 -11 -11 -16 20 -11 9 -13 -45 4 -22 -2 -14 16 23 -32 -4 -4 6 14 31 -6 -11 -16 38 -1 -1 -12
13936 -12 -10 13 6 -27 4 -5 -21 -7 -1 -22 -45 -20 -3 -9 -11 37 -67 -19 15 5 10 -4 60 22 3 2 14 41 30 -3 -4 29 -26 -25
$$ packed form
13696bOJ8nj4pK6j8j9k2RL9k7mL7n0M0k0MJ2K0o7J4L3J2jl7Nk9M5K7l3Lj0M0m3
13731a8l8L6K5j8j6K2o3P3l1OK6NKK0k9j4%J9l7J6j2M1pk4J8KN2q1O5o1kK3j1
13764a1M2m9L6K2n5K3m7K1OK4k9J8JRj8K2k1j9JM0%l0kK6%m3K2Jk5J1L2j5LJ5
13798A1lJ8Mn7L2rn5J07m5qkrL4orMqK7Moj9J2j8Nnj0K2M1o2N5k8J9k9k6K2o3
13834f0P0M2m4j6k1N1q4M9pj4L0K1j6k8O2o0J3OPN3p4K4k6J6J7k5L1km8%QK9k9
13867b5J2K5Ml2l7N9M0rl8OnLM6n6lJ9J6mj3K1n2N0l0J3l5NoJ6j9NN2J9m1k8L3
13902A1o1N0l5O2k1j4j3J0%nL6l1K0k2l2M9k6K0j2L0Pn5K8%J0QJ7l7nnN4l9%j1
13936a2KK3pl3L1rj6J4Ok1k3K5J7okM8j04M8L4j0Nj4O4l8j9jJ2K7j1l3jL3n5J
$$ plain form
13970 -25 22 -12 -10 0 -4 12 15 -36 -22 -56 -19 13 15 33 29 -9 42 22 -31 -16 -39 26 23 -7 36 14 15 10 -43 2 -18 59 -21 38
14004 38 13 -28 -10 -11 -41 22 28 -18 18 28 24 -10 35 3 -10 -24 27 -28 -3 -21 -16 37 -40 -22 -34 23 14 -36 -12 -20 -20 -45 -18
14037 -18 14 16 -19 -21 -14 11 85 22 -11 10 -21 48 5 -21 -32 -13 -33 -24 20 -21 63 42 -10 3 13 -19 11 13 -33 -16 -1 -11
14069 -11 -5 1 10 17 35 -36 6 41 26 43 25 -31 8 -22 -23 -46 -23 9 7 -27 9 -34 31 -16 15 -1 -14 22 -1 -22 10 -19 -51
14102 -51 12 13 19 31 -6 38 -22 -14 -6 -43 30 -27 23 10 -2 18 -15 2 -29 14 -2 3 1 3 -17 -6 28 3 -3 -3 -37 -9 28 34 47
14137 47 -15 24 9 3 41 64 30 10 11 23 29 -45 69 7 24 27 26 21 25 26 -53 -32 -50 -30 -13 32 5 -23 -20 -8 -39 6 1 -19
14171 -19 -1 11 41 -1 17 -23 -11 -2 12 -8 12 63 16 19 16 -25 25 -13 16 6 29 45 -1 15 0 37 -5 -15 4 -51 23
14202 23 30 42 18 -18 4 -4 -12 -3 -4 4 -2 -3 54 6 16 2 3 9 -13 45 -36 -52 -28 -4 -17 20 -3 4 21 34 8 -2 39 -7 29
$$ packed form
13970b5M7l4KJ0mJ6Ln1J4l4L7L2KJ8ml8N1k0n3J5k3O5ll0M3k2Jnn3M5k0P7q0N9
14004C8k5m1J8jl0O3Om6L6J0ml4M5l2j3j4N1n5K5j8NN3p7J8j2N7rn0K4q%k5K7
14037a8L2Kl5kPK5P4o3l3K1l1O9m3k6j1J9k0RM4m1Q4k1n2J3J0l2L0Km6J7J5j0
14069a1OORPJ8p1M2L5j5J7j8n6L9l0jk3K3L2kl4L6m3O5m7L1j6j3L6k3k1L2k9l2
14102e1O3JOJ2l7M4o0QQl7P3n7N0j3j2K0l3J7l1M3j6NkKk0J1L4k5o%l4K8L7OJ3
14137D7o2L9j5oL8K3l4k0JJ2Op4J14o2J7LjnMJp9K1j8K0J7M5k7k8LJ2l1M5nk0
14171a9J8J2L0m2J8m0J2RJ4k0K0N1m7Llm1N0l8K9j0K3J6m6J6j5L7m2j0J9n5P4
14202B3PJ2k4l6K2qqRjQojN7m8J0j4JOk2N8q1j6K4K4j3L7k3PJ7J3k6j0M1m6L6
$$ plain form
14237 29 3 -6 14 -14 20 -21 -33 -16 59 17 -54 -19 22 16 12 19 27 -6 -26 0 7 6 22 11 -30 18 20 45 3 30 -7 -18 -1 15
14271 15 -1 -12 8 48 -4 9 16 19 5 36 76 -22 34 -18 -14 22 -4 29 33 43 24 -19 3 -32 2 -47 -16 -58 -11 25 -30 37
14303 37 -37 26 7 15 -8 -6 16 6 -6 6 -36 9 -1 -28 13 1 -8 15 14 20 13 -19 29 -25 23 36 24 2 -15 -5 -29 21 -9
14336 -9 -26 -9 -58 -68 61 32 -34 64 34 7 0 12 0 14 -18 4 -4 26 -25 -21 18 -6 11 -43 -35 -16 -35 4 -15 14 8 -21
14368 -21 39 -8 -9 -1 -4 44 8 38 -15 11 -17 -9 -45 32 -7 3 20 -39 -32 2 -14 20 -8 -7 -27 -47 1 0 11 3 -14 14 -6 12
14402 12 45 -22 37 11 -19 -2 33 14 -53 -11 0 7 7 22 -31 29 10 56 -79 39 42 -2 -1 -19 -12 10 -7 19 -22 34 10
14433 10 -33 2 -32 14 -8 35 -31 -23 6 -18 -7 -33 16 -1 45 4 7 -55 -7 -14 1 -15 3 -21 -4 13 2 -6 -16 -10 -22 -67
14465 -67 7 10 12 -10 -10 -24 2 -17 -4 -67 -4 39 -94 11 -3 15 -2 -54 -54 33 2 -15 -47 28 -18 -25 -20 32 -9 23 -19 29
$$ packed form
14237B9k6rK0k8L4m1j2J7P5m2p1L5M1omPQl3k0K6PjJ6j1m1M8KK5m2K7l7j1J7J6
14271A5j6j1K0M0n2J3PLj4L1M0r8N6n2ML6k6L3MJ0j9m3K2l5L4m9L1m2M7L6n5O7
14303C7p4O3j9Qk3KK2j0j2J2m2M5j0k7M1j2rK3jOpl2M8n4M8J3j2k2j7J0k4N0l0
14336ij7J7m9j0J29k9o6R8l0k7pJ2j2J4l2K2qL0n1ML9k4J7n4QJ9j9L9j9K9ok9
14368b1O0m7jQlM8l6L0n3K6k8Ql6P7l9J0J7n9PL4j6L4k8Jk0k0M8jJ1qj7K8k0J8
14402A2L3o7N9k6l0J7L5j9o7M2J1P%J5n3O0j9M6j35J18Lm4Jj8PK2j7K6m1N6k4
14433A0m3L5l4M6k2M3o6QK9k4J1k6M9j7M6m1Lo2M8pJ5j6J8k4J7J7j1qj0Oj2m5
14465f7P4LKk2%j4K6j9J3o3O3M3j33J05j4J8j7n2%Q7l1j7l2P5m6pNN2m1L2m2M8
$$ plain form
14497 29 -31 -15 13 1 -13 2 3 5 -25 -6 -32 15 -61 -22 13 -15 -33 9 10 -35 12 -13 25 0 -54 -47 5 67 25 -9 8 15
14529 15 27 -19 2 30 29 22 -14 0 -26 16 -12 25 13 26 18 20 -9 41 29 -4 40 4 26 -4 19 -9 -17 47 25 55 -12 -50
14561 -50 -17 -14 -31 -8 25 -32 14 -21 6 18 -45 61 -19 7 9 -39 11 -11 -17 -44 28 -4 -17 31 50 10 -2 0 33 -63 -4
14592 -4 -32 24 -13 0 33 -12 -5 2 -20 -9 -36 30 -10 -56 20 15 -25 36 -28 -29 -9 1 -1 29 7 -16 -16 19 24 4 -8 -8 -10 -15 -13 -53
14628 -53 -15 2 18 -35 -17 -12 -15 27 41 55 12 -28 -1 -6 9 -1 -17 -4 -5 5 -28 31 14 -8 30 -34 5 -53 -44 4 13 2 39
14661 39 -5 -28 25 10 -35 30 9 15 -5 -28 -13 12 55 -16 37 -48 -27 8 20 -21 -31 -18 9 25 -9 -6 42 27 -9 2 1
14692 1 -16 2 -41 -13 -6 -7 23 -12 10 -41 -41 4 -39 19 8 -46 -9 6 17 26 -31 26 5 20 -24 -27 -10 -7 16 -8 -7 -26 -53 31
14726 31 -28 14 1 -28 -39 -5 108 18 2 -23 26 7 -15 -6 -6 -12 -48 15 29 -36 43 -37 -1 -6 -58 -28 -44 6 -3 18 -35 -59
$$ packed form
14497B9o0J6K8j2j4J5JKl0J9k6M7p6L9L5k8j8M2Jm5M7k5L8k5n4PN2O2m2l4J7P
14529A5J2m6K1K8jpl6J4k6M2k8L7j2J3qKk9N0j2l3M4l6K2l0K3k8qO4k2L0o7l8
14561e0L3Lj7K3L3n7M6l5K7J2o3J06q0K6Km8N0k2ok7P2l2j3M8J9m0j2KL3r6N9
14592dk8N6l7J3L3m5PPk2J1k7O6m0m6P6nm0O1o4jK0J0kL0k2k3%L5Nk0j2%knKm0
14628e3L8J7J6n3J8NlM2J4J4m3m0K7nJ5j0j6J3jJ0l3N9j7k2L8o4L9n8RM8Rj1L7
14661C9m4k3N3j5m5O5k1Ok0k3J5K5M3p1N3q5K1L5J2m1j0J3K7J6l4LM8j5l6J1j
14692Aj7J8m3K8PjL0l5K2n1%M5m3N8j1n4L7J5J1Rn7N7k1J5m4lJ7LK3k4Jj9k7Q4
14726C1n9M2j3k9j1L4J13r0j6k5M9j9k2R%ol6O3J4o5P9q0L6nn2L0j6N0rK1n3k4
$$ [...]
16383b2
##END NTUPLES=NMR FID
##END=
