##TITLE=31P_DE-80H_X3
 64 sc D2O
 26.2.2025
##JCAMPDX= 6.0         $$ Bruker NMR JCAMP-DX V2.0
##DATA TYPE= NMR SPECTRUM
##DATA CLASS= NTUPLES
##ORIGIN= UXNMR, Bruker Analytische Messtechnik GmbH
##OWNER= root
$$ XWIN-NMR		Version 3.5
$$ Wed Jul 23 15:06:33 2025 Russian Standard Time (UT+4h)  Yarkov@DPX200
##.OBSERVE FREQUENCY= 81.013821
##.OBSERVE NUCLEUS= ^31P
##.ACQUISITION MODE= SIMULTANEOUS
##.ACQUISITION SCHEME= undefined
##.AVERAGES= 64
##.DIGITISER RES= 17
##SPECTROMETER/DATA SYSTEM= spect
##.PULSE SEQUENCE= zgpg30
##.SOLVENT NAME= MeOD
##.SHIFT REFERENCE= (INTERNAL, MeOD, 0, 198.062)
##AUDIT TRAIL= $$ (NUMBER, WHEN, WHO, WHERE, WHAT)
$$ ##TITLE= Audit trail, XWIN-NMR		Version 3.5
$$ ##JCAMPDX= 5.01
$$ ##ORIGIN= Bruker BioSpin GmbH
$$ ##OWNER= Yarkov
$$ C:/Bruker/XWIN-NMR/data/yarkov2/nmr/P31/2/pdata/1/auditp.txt
$$ ##AUDIT TRAIL=  $$ (NUMBER, WHEN, WHO, WHERE, WHAT)
(   1,<2025-07-23 15:05:26.23 +0400>,<Yarkov>,<DPX200>,
      <created by zg, POWCHK disabled, PULCHK disabled
       configuration hash MD5:
       00 E9 B6 7A A2 85 ED C7 34 08 36 98 17 FE 4E 26
       data hash MD5: 32K
       F2 63 0D 2F E1 F7 41 2C CF 56 1B 3D 41 1C CA 33>)
(   2,<2025-07-23 15:06:06.59 +0400>,<Yarkov>,<DPX200>,
      <Start of raw data processing
       efp BC_mod = 2 LB = 1.5 FT_mod = 6 PKNL = 1 PHC0 = 1662.243 PHC1 = 49.15953 SI = 64K 
       data hash MD5: 64K
       27 62 B1 AB 8F 06 83 D2 B2 F2 DE 21 45 32 11 CA>)
$$ ##END=
$$ 
$$ hash MD5
$$ 61 44 A8 4B A2 36 F2 D8 1C 57 02 11 FA D7 F8 9E
##$RELAX= 
##$RELAX= 
##$RELAX= 
##$RELAX= 
##$RELAX= 
##$RELAX= 
##$RELAX= 
##$RELAX= 
$$ Bruker specific parameters
$$ --------------------------
##$DU= <C:/Bruker/XWIN-NMR>
##$EXPNO= 2
##$NAME= <P31>
##$PROCNO= 1
##$TYPE= <nmr>
##$USER= <yarkov2>
##$AMP= (0..31)
100 100 100 100 100 100 100 100 100 100 100 100 100 100 100 100 100 100 
100 100 100 100 100 100 100 100 100 100 100 100 100 100 
##$AQSEQ= 0
##$AQ_mod= 1
##$AUNM= <au_zg>
##$AUTOPOS= <>
##$BF1= 81.014009
##$BF2= 200.13
##$BF3= 200.13
##$BF4= 200.13
##$BF5= 200.13
##$BF6= 200.13
##$BF7= 200.13
##$BF8= 200.13
##$BYTORDA= 1
##$CFDGTYP= 0
##$CFRGTYP= 5
##$CHEMSTR= <none>
##$CNST= (0..31)
1 1 145 1 1 1 1 1 1 1 1 1 1 1 1 1 1 1 1 1 1 1 1 1 1 1 1 1 1 1 1 1 
##$CPDPRG= <waltz16>
##$CPDPRG1= <>
##$CPDPRG2= <waltz16>
##$CPDPRG3= <>
##$CPDPRG4= <mlev>
##$CPDPRG5= <mlev>
##$CPDPRG6= <mlev>
##$CPDPRG7= <mlev>
##$CPDPRG8= <mlev>
##$CPDPRGB= <>
##$CPDPRGT= <>
##$D= (0..31)
0 1 0 0 0 0 0 0 0 0.06 0 0.03 2e-05 3e-06 0 0 0.0002 0 0 0 0 0 0 0 0 0 
0 0 0 0 0 0 
##$DATE= 1753268725
##$DBL= (0..7)
120 120 120 11 120 120 24 19 
##$DBP= (0..7)
150 150 150 150 150 150 150 150 
##$DBP07= 0
##$DBPNAM0= <>
##$DBPNAM1= <>
##$DBPNAM2= <>
##$DBPNAM3= <>
##$DBPNAM4= <>
##$DBPNAM5= <>
##$DBPNAM6= <>
##$DBPNAM7= <>
##$DBPOAL= (0..7)
0.5 0.5 0.5 0.5 0.5 0.5 0.5 0.5 
##$DBPOFFS= (0..7)
0 0 0 0 0 0 0 0 
##$DE= 6
##$DECBNUC= <off>
##$DECIM= 4
##$DECNUC= <off>
##$DECSTAT= 4
##$DIGMOD= 1
##$DIGTYP= 9
##$DL= (0..7)
0 0 52 120 120 21 21 25 
$$ [...]
##$SUBNAM2= <"">
##$SUBNAM3= <"">
##$SUBNAM4= <"">
##$SUBNAM5= <"">
##$SUBNAM6= <"">
##$SUBNAM7= <"">
##$SUBNAM8= <"">
##$SUBNAM9= <"">
##$SW= 400.765351723535
##$SWIBOX= (0..15)
0 1 3 0 0 0 0 0 0 0 0 0 0 0 0 0 
##$SW_h= 32467.5324675325
##$TD= 32768
##$TD0= 1
##$TE= 0
##$TE2= 300
##$TE3= 300
##$TEG= 300
##$TL= (0..7)
0 120 53 12 22 120 120 120 
##$TP= (0..7)
150 150 150 150 150 150 150 150 
##$TP07= 0
##$TPNAME0= <>
##$TPNAME1= <>
##$TPNAME2= <>
##$TPNAME3= <>
##$TPNAME4= <>
##$TPNAME5= <>
##$TPNAME6= <>
##$TPNAME7= <>
##$TPOAL= (0..7)
0.5 0.5 0.5 0.5 0.5 0.5 0.5 0.5 
##$TPOFFS= (0..7)
0 0 0 0 0 0 0 0 
##$TUNHIN= 0
##$TUNHOUT= 0
##$TUNXOUT= 0
##$USERA1= <user>
##$USERA2= <user>
##$USERA3= <user>
##$USERA4= <user>
##$USERA5= <user>
##$V9= 5
##$VALIST= <valist>
##$VCLIST= <CCCCCCCCCCCCCCC>
##$VD= 0
##$VDLIST= <DDDDDDDDDDDDDDD>
##$VPLIST= <PPPPPPPPPPPPPPP>
##$VTLIST= <TTTTTTTTTTTTTTT>
##$WBST= 1024
##$WBSW= 4
##$XGAIN= (0..3)
0 0 0 0 
##$XL= 0
##$YL= 0
##$YMAX_a= 1080
##$YMIN_a= -773
##$ZGOPTNS= <>
##$ZL1= 120
##$ZL2= 120
##$ZL3= 120
##$ZL4= 120
##$ABSF1= 0
##$ABSF2= 0
##$ABSG= 0
##$ABSL= 0
##$ALPHA= 0
##$AQORDER= 0
##$ASSFAC= 0
##$ASSFACI= 0
##$ASSFACX= 0
##$ASSWID= 0
##$AUNMP= <proc_1d>
##$AZFE= 0.1
##$AZFW= 0.5
##$BCFW= 0
##$BC_mod= 2
##$BYTORDP= 0
##$COROFFS= 0
##$CY= -3
##$DATMOD= 1
##$DC= 0
##$DFILT= <>
##$DTYPP= 0
##$F1P= 0
##$F2P= 0
##$FCOR= 1
##$FTSIZE= 65536
##$FT_mod= 6
##$GAMMA= 0
##$GB= 0
##$INTBC= 1
##$INTSCL= 9.790993e-09
##$ISEN= 30
##$LB= 1.5
##$LEV0= 0
##$LPBIN= 0
##$MAXI= 10000
##$MC2= 0
##$MEAN= 0
##$ME_mod= 0
##$MI= 50
##$NCOEF= 0
##$NC_proc= -14
##$NLEV= 6
##$NOISF1= 182.463
##$NOISF2= 159.3651
##$NSP= 0
##$NTH_PI= 0
##$NZP= 0
##$OFFSET= 198.0616
##$PC= 4
##$PHC0= 1662.243
##$PHC1= 49.15953
##$PH_mod= 1
##$PKNL= yes
##$PPARMOD= 0
##$PSCAL= 0
##$PSIGN= 0
##$REVERSE= no
##$SF= 81.0140089999434
##$SI= 65536
##$SIGF1= 159.3651
##$SIGF2= -187.1042
##$SINO= 113.3802
##$SIOLD= 16384
##$SREGLST= <1H.CDCl3>
##$SSB= 0
##$STSI= 65536
##$STSR= 0
##$SW_p= 32467.5324675325
##$SYMM= 0
##$S_DEV= 0
##$TDeff= 32768
##$TDoff= 0
##$TI= <>
##$TILT= no
##$TM1= 0
##$TM2= 0
##$TOPLEV= 0
##$USERP1= <user>
##$USERP2= <user>
##$USERP3= <user>
##$USERP4= <user>
##$USERP5= <user>
##$WDW= 1
##$XDIM= 65536
##$YMAX_p= 354479262
##$YMIN_p= -456883979
$$ End of Bruker specific parameters
$$ ---------------------------------
##NTUPLES= NMR SPECTRUM
##VAR_NAME=  FREQUENCY,     SPECTRUM/REAL,   SPECTRUM/IMAG
##SYMBOL=    X,             R,               I
##VAR_TYPE=  INDEPENDENT,   DEPENDENT,       DEPENDENT
##VAR_FORM=  AFFN,          ASDF,            ASDF
##VAR_DIM=   65536,         65536,           65536
##UNITS=     HZ,            ARBITRARY UNITS, ARBITRARY UNITS
##FACTOR=    0.49542278885378, 1,            1
##FIRST=     16045.7642231865, 0,            0
##LAST=      -16421.768244346, 0,            0
##MIN=       -16421.768244346, -456883979,   0
##MAX=       16045.7642231865, 354479262,    0
$$ Real data points
##PAGE= N=1
##DATA TABLE= (X++(R..R)), XYDATA
$$ [...]
7278c2254433P329790K923481l990954m861123J245737N054445O95154m505411
7270b8363314r26528P726368R360569J914183l903336j395649L161733K479234
7262i946740l60440N77726K653532j30562n009012l668160L647573O951949J112082
7253d172052o489542o404640Q51713P432768Q434864N140061R30458j723522j642065
7244B358043K57646J180577l06286k183008j858918J91038J462838O87729j723610
7235F6049m931485p366524o781693k998621N86299O12659k018254l628939k452856
7226b8913365L20905L062015M789260M625490K700907R62078P15484K13683k632078
7217a4155621n977903n751018j408132L361529N997918P722103R750209J0011214
$$ y = [-32254433, -24924643, -22001162, -25992116, -30853239, -29607502, -24553057, -23857903, -28363314, -29289842, -21563474, -12202905, -10288722, -14192058, -15587707, -12425974, -9946740, -10307180, -9729454, -7075922, -7206484, -12215496, -15883656, -12236083, -5284134, -4172052, -10661594, -17066234, -16214521, -8781753, -346889, 4793172, 5723630, 4000108, 2358043, 2615689, 3796266, 3489980, 1306972, -551946, -360908, 1101930, 1789659, 66049, -4865436, -12231960, -19013653, -22012274, -21425975, -20813316, -22831570, -26460509, -28913365, -28592460, -25530445, -20741185, -16115695, -13414788, -12452710, -11737226, -11523543, -14155621, -20133524, -25884542, -27292674, -23931145, -17933227, -10211124, -460915, 9550299]
7209I550299N843445j635340p772831q654085m521799O19976K748930J532518
7201b288887k21937q41438j436777k340533j153392K840205N500613L407822j21176
7192C344500j87467Q24573k997209r291150q513970J121260Q928933O586188m68279
7183f52621k922389j708176l653319q123406q078984k465208K112620K273271
7175b3218212J836027L543666M580955K782230N48303l82175k019063m696919
7167a7025188m389342L61281M006165J638805k980289k876953J364426K570026
7159a7331069k103081p076414o201298l61863M629846N146291K954862K280377
7151a8062349M522861O180250L245251k223849l119922K875886Q007130L731171
$$ y = [9550299, 15393744, 13758404, 5985573, -2668512, -7190311, -6570335, -3821405, -2288887, -2510824, -3352262, -4789039, -7129572, -8282964, -5442759, 57854, 3465676, 3344500, 3157033, 3981606, 984397, -8306753, -16820723, -15699463, -6770530, -184342, -652621, -3575010, -5283186, -8936505, -17059911, -25138895, -27604103, -25491483, -23218212, -21382185, -17838519, -13257564, -10475334, -9927031, -10309206, -12328269, -17025188, -21414530, -21053249, -17047084, -15408279, -18388568, -21265521, -19901095, -17331069, -19434150, -26510564, -32711862, -33073725, -28443879, -23297588, -20342726, -18062349, -13539488, -7359238, -4113987, -6337836, -9457758, -6581872, 1425258, 5156429]
7143E156429o848525j2133312p592733j284514j399206m913256l918821J448210
7135c1485728L699584J59421k901865O2019N797868P360619L834935Q66805K670745
7126i935597O931977Q108154L866080k637149o319062n483128l103716k486846
7118a1059287k830285j056119K603578M163596J873769r19079j147319r17160
7110i288306l414576o505205n208901N83707N836998P591277P385684O126392
7102C107070K383156k385962l035909J104914K758963l191415j0412175q833699
7094a8505057O89558O988283L682699l571365o511435m282779p96381K337412
7086a9969065N424286O715556M016651r34175l740724k762725m05703P74193Q15947
$$ y = [5156429, -1692096, -13825408, -21418141, -22702655, -24101861, -29015117, -32933938, -31485728, -27786144, -27626723, -30528588, -30466569, -24668701, -17308082, -13473147, -12606342, -9935597, -3003620, 5104534, 8970614, 6333465, 14403, -5468725, -8572441, -11059287, -13889572, -14945691, -12342113, -8178517, -6304748, -7223827, -8371146, -9288306, -12702882, -19208087, -24416988, -23833281, -17996283, -10405006, -3019322, 3107070, 5490226, 3104264, 68355, 1173269, 3932232, 740817, -9671358, -18505057, -17815499, -10827216, -7144517, -10715882, -17227317, -21510096, -22306477, -19969065, -14544779, -7829223, -3812572, -4746747, -8487471, -11250196, -11655899, -10881706, -10065759]
7077a0065759J066747J905138K134339J07879m081483p483081o933775l160090
7069b6510085R4444J702719M493312R120275J0722557N620363j942208m876114
7061a574737k846384j074651j241145o14070J16107l415806r385909q268518L398015
7052b4907098J4712879J3414893K546594m358118k204069P98757k618844q684024
7044a1299030r925801n759456j174442P34955O29065K57450J438114N218078R124887
7035a0756180P999873P97141o121658o209059r91961K920651L057341K441803
7027f862049K835516K212513k52131j691964l01410J043578j202322n633675o922795
7018a6774739j907349O712755J2477959J0735804K954015m521382o880838n335851
$$ y = [-10065759, -8999012, -7093874, -4959535, -4851656, -8933139, -16416220, -23349995, -26510085, -26415641, -24712922, -20219610, -11099335, -376778, 5243585, 3301377, -1574737, -4421121, -5495772, -6736917, -7350987, -7234880, -10650686, -20036595, -28305113, -24907098, -10194219, 3220674, 5767268, 1409150, -794919, 3838, -2615006, -11299030, -21224831, -26984287, -28158729, -27423774, -26794709, -26537259, -25099145, -19881067, -10756180, -2756307, -1959166, -8080824, -14289883, -15281844, -12361193, -9303852, -6862049, -4026533, -1814020, -2066151, -3758115, -4059525, -3015947, -4218269, -9851944, -16774739, -18682088, -11969333, 508626, 11244430, 14198445, 9677063, 2796225, -2539626]
7010b539626l889289l322453j594129Q05357N76183k554574m431688k995556j752800
7001b1698575l441144m290948M98734Q107272J0623519N700209n59991k091478
6993g152402M19784K978831M286445N356689N899479M597189J957772j7728q07183
6984A7518876j665684k824173k682820p43655N74974j010867l663755k995850
6976B507046J750130N366305K618585m596826q810510o004982m56854R63284k587379
6967i251201n430533k968603K612508N174482J965112l301719m958674j965144
6959a8123772J461855J805606N82493J012370K473148J740509j114351k415750
6951a2577892r99919m1668j050656p99819K648219N357461L422766l98512j524192
$$ y = [-2539626, -6428915, -9751368, -11345497, -10540140, -9963957, -12518531, -16950219, -19945775, -21698575, -25139719, -29430667, -28931933, -20824661, -10201142, -4500933, -5060924, -7152402, -6732618, -3753787, 532658, 5889347, 11788826, 16386015, 18343787, 18326059, 17518876, 15853192, 13029019, 10346199, 9602544, 10177518, 9166651, 5502896, 2507046, 4257176, 9623481, 12242066, 7645240, -1165270, -7170252, -7627106, -6663822, -9251201, -14681734, -17650337, -15037829, -9863347, -7898235, -11199954, -16158628, -18123772, -16661917, -14856311, -14273818, -13261448, -10788300, -9047791, -10162142, -12577892, -13577811, -13619479, -14670135, -15469954, -12821735, -7464274, -4041508, -4440020, -5964212]
6942e964212j804644n928135j1387748j0302507j836222N325790N367184K687863
6934b3842631L037655M457079K794297L37110J590306M334358K857380j876238
6926f310684l283657r990K092639p5831k419928j733000j239637l850727n766714
6917b2597529k441726L214047M805761K115962N26392K015927L060339J609792
6909g691035R94m46234j898183m511757l953804J457947N614247K225253n074456
6900a4277028o530476L87519P582721P551265K529907n43802K4222K36950k075268
6891e113990l977935k203199J959205M134570J869603l130949p237220q224352
6883b1924267o235157k573418J099703K638780O26381l140340m291938j021547
$$ y = [-5964212, -7768856, -13696991, -25084739, -35387246, -37223468, -31897678, -26530494, -23842631, -20804976, -16347897, -13553600, -13216490, -11626184, -7291826, -4434446, -6310684, -9594341, -9604331, -7511692, -7587523, -10007451, -11740451, -12980088, -16830815, -22597529, -25039255, -21825208, -17019447, -14903485, -14377093, -12361166, -9300827, -7691035, -7690041, -8136275, -10034458, -14546215, -18500019, -17042072, -11427825, -9202572, -14277028, -20807504, -20419985, -12837264, -5285999, -2756092, -3299894, -3275672, -3038722, -5113990, -9091925, -11295124, -9335919, -5201349, -3331746, -6462695, -13699915, -21924267, -28159424, -30732842, -29633139, -26994359, -26367978, -29508318, -33800256, -34821803]
6875c4821803L052576L732334K205350K402073L776868K089244k475154m152473
6867b4190985n87317L155327L095059K811311O054258Q366116L703051m092284
6859a685464n370111P44343M837828J492125l456205l208137o8411o4330k997420
6850i775782l976743j773217J74452o4875m25812J405453M760362O663111M293036
6841A279985k247028q439024q632821k661477L029009L204101M65095R11636N209002
6832g881522Q155172O470121K707569N84152m3412j592783m282565n614479m041608
6823e539355j610608k000979n885374r196305p363721j119945L771150L257827
6815b5687310l11340j532488J416087N135555N346879J468816l134646m947896
$$ y = [-34821803, -31769227, -28036893, -25831543, -23429470, -19652602, -17563358, -20038512, -24190985, -24778302, -21622975, -18527916, -15716605, -9662347, -1296231, 2406820, -1685464, -7055575, -6311232, -1473404, 18721, -3437484, -6645621, -6714032, -6778362, -9775782, -13752525, -15525742, -15351290, -15416165, -15841977, -14436524, -9676162, -3013051, 1279985, -967043, -9406067, -18038888, -20700365, -17671356, -14467255, -14002160, -13090524, -7881522, 273650, 6743771, 9451340, 10035492, 9992080, 8399297, 4116732, -1497747, -5539355, -7149963, -9150942, -15036316, -24232621, -31596342, -32716287, -28945137, -25687310, -25998650, -27531138, -26115051, -20979496, -15632617, -14163801, -17298447, -22246343]
6807b2246343m180703m048651n526665m845969J002913Q034983R360896N266945
6799a7182594L243753O311300P846119K110455n984621p918018m189495k385058
6791a8148159m688923n364986j072249L680694L855542J120890M83614L246804
6783a6886773O272588O097729J829491m343629q393539p864867m501844j679695
6775b9470539K87432L273149O201964N224407J93172l455072j888070J540187
6767a8093370J183330k892995n473830l531105N56771L111522L506855L340332
6759a8292490L181343K038119j63966j296212M95965L723139M827071K640350
6751b846681n27437k725207m456690n599480l636315K144440P501309P912451
$$ y = [-22246343, -26427046, -30475697, -36002362, -40848331, -39845418, -31810435, -22449539, -17182594, -13938841, -7627541, 218578, 2329033, -3655588, -11573606, -15763101, -18148159, -22837082, -28202068, -29274317, -25593623, -21738081, -20617191, -20133577, -16886773, -10614185, -4516456, -2686965, -7030594, -15424133, -23289000, -27790844, -29470539, -29183107, -25909958, -19707994, -14483587, -14290415, -17745487, -19633557, -18093370, -16910040, -19803035, -25276865, -28807970, -28251199, -25139677, -21632822, -18292490, -15111147, -13073028, -13236994, -14533206, -14037241, -10314102, -5487031, -2846681, -3374118, -6099325, -10556015, -16155495, -19791810, -17647370, -10146061, -2233610]
6743b233610M259610L88772k367490m103006l001763J170527L144517r49989m856278
6734h548710N67575J1746333J4410949L597273q558892r701514k729091J899385
6726B683308J213426p01631j834136k604549j671359R59543Q32554l650131n694153
6717a0467128k70300N343126J756902n863484m276112O084757J0217633J817056
6709D342450o701920l708885M380681M842783j463225l546969J300586M496370
6701C941871R71498l361279j828922K593831J953805m968717j0352729o912385
6693a7963027K956361R656865P675849J738653j86549K468211L411417l49466
6685I408314m520902n025783m017563n085746o695008m839113J55770L692365
$$ y = [-2233610, 2026000, 2414772, 47282, -4055724, -7057487, -5886960, -2742443, -3692432, -8548710, -7981135, 3765198, 18176147, 21773420, 13214528, 3513014, 783923, 2683308, 3896734, 3195103, 1360967, -1243582, -2914941, -1955398, -1122844, -4772975, -10467128, -10737428, -5394302, -3637400, -9500884, -13776996, -7692239, 2525394, 4342450, -2359470, -6068355, -1687674, 3155109, 1691884, -1855085, -554499, 3941871, 4913369, 1552090, -276832, 2316999, 4270804, -697913, -11050642, -17963027, -15006666, -5349801, 2326048, 4064701, 3878152, 6346363, 9757780, 9408314, 4887412, -138371, -4155934, -9241680, -15936688, -20775801, -20620031, -16927666]
6677a6927666K829816q03898l334139k038557K348573N507897L810338k18025
6669h825661l6529N490797R087943M899943k807767n727574l074994j049265k475219
6660d518326l487215q26599L083219L855124L01024n041072p898511n146643J326414
6651a8352585M768043J330105l824031l081313K388361M421858N60436k733670
6643a4522796j254814M87856j989106m876344k348462L884155P519178O703565
6635f396768M174894J169701k554594m470463j588343L417061M380079M40516
6627a427917k621623q17563L136447M854028L875087K109125K30058j888682l574029
6618C874931m327615m677379m634275l086171L3778K779754L623504L205754K611926
$$ y = [-16927666, -14097850, -14901748, -18235887, -20274444, -17925871, -12417974, -8607636, -8825661, -8862190, -3371393, 5716550, 10616493, 7808726, 2081152, -993842, -2043107, -4518326, -8005541, -8832140, -5748921, -1893797, -1592773, -6633845, -14532356, -19678999, -18352585, -13584542, -12254437, -16078468, -19159781, -16771420, -12349562, -11789126, -14522796, -15777610, -15289754, -17278860, -22155204, -24503666, -20619511, -13100333, -6396768, -2221874, -1052173, -3606767, -8077230, -9665573, -6248512, -1868433, -1427917, -4049540, -4867103, -1730656, 3123372, 6998459, 9107584, 9337642, 7448960, 3874931, -452684, -5130063, -9764338, -12850509, -12816731, -10036977, -6413473, -3207719, -595793]
6609e95793J660012J22534r66550o38965M70629J005894M91577n37515j190963
6600a79140q95803l53544j242684l394578l408716J024651O205775N850399l30014
6591C276346n931422o808350n758978o016282n390853j136306L692284M318939
6583a9754622J993239J836891M340542M744660O96809m610679p331807o493078
6575b4578045k340665M109043R016294P956172J948176k717275k413888j55743
6567i175931J74043m93359O83308L176086M041525K130139j255043m180170m710197
6558i609599j975643J537534J492284k274652m297800r76681L645543L543041
6550h915973n59952l029196k186444j780376l820371n407842m001466j303363
$$ y = [-595793, 1064219, 1186753, 220203, -418762, 51867, 1057761, 1549338, 1011823, -179140, -1074943, -1428487, -2671171, -6065749, -9474465, -8449814, -2244039, 3606360, 3276346, -2655076, -9463426, -15222404, -21238686, -26629539, -27765845, -24073561, -19754622, -17761383, -15924492, -11583950, -6839290, -6142481, -10753160, -18084967, -24578045, -26918710, -22809667, -13793373, -5837201, -3889025, -6606300, -9020188, -9175931, -9001888, -9495247, -8811939, -5635853, -1594328, 535811, -719232, -4899402, -9609599, -11585242, -10047708, -8555424, -10830076, -15127876, -16104557, -12459014, -8915973, -9475925, -12505121, -14691565, -16471941, -20292312, -25700154, -29701620, -31004983]
6542c1004983J88587R75296K447464L550081K219100j157068l817503l683326
6534c0282352j198160J436903K285288J360837L98823O27207J518868K459270
6526b1393316M007051N748418M961035N97847l134965j700676K135039J271616
6518g507951m573120p207540k162289L876160K837711k654589l675871J637925
6510a9429564O438369N726326J433759l188196p128524q083478k603104O676628
6502b0157784J0223876L306374o070110o960381j2566M686862K749488N94999
6494a1639242L984288Q674052P073305j87552m983740k642887K696884M312344
6486G287452R61434l106305m322392l592053l707299m645335l448520P63284L898708
$$ y = [-31004983, -30816396, -29841100, -27393636, -23843555, -21624455, -22781523, -26599026, -30282352, -31480512, -30043609, -27758321, -26397484, -25998661, -25371454, -23852586, -21393316, -17386265, -11637847, -6676812, -6078965, -9213930, -10914606, -8779567, -7507951, -12081071, -19288611, -21450900, -17574740, -14737029, -17391618, -21067489, -19429564, -12991195, -7264869, -5831110, -9019306, -16147830, -24231308, -26834412, -20157784, -9933908, -6627534, -12697644, -19658025, -19670591, -14983729, -12234241, -11639242, -7654954, 1019098, 8092403, 7904851, 2921111, 278224, 2975108, 7287452, 8248886, 5142581, 820189, -2771864, -6479163, -11124498, -14573018, -13809734, -9911026]
6477i911026J737026l200389l649765K292800P220181L975820l952828o699628
6469a2187809j488926L957597K566966k857650m586964k79575N631193Q621665
6461f23503Q053208N339061J856809j047461k623353l664286n043936n614870
6453c368331l810979j032869n92225k861344m337748k658056P4761O85319n78295
6444a8479767j213126m98535L50174J202725L138930N384559N223437K405504
6436b486099R55123L757151O924381L625024n989370j2933992j0216697k170229
6428a8534708J591255m23481n87814M758718Q397479K848779p469085j1567074
6420b0985931o934304j845526k536715n253711l668506J524459M641394L201680
$$ y = [-9911026, -8174000, -11374389, -15024154, -12731354, -5511173, -1535353, -5488181, -12187809, -13676735, -9719138, -7152172, -10009822, -14596786, -14876361, -9245168, -623503, 7429705, 12768766, 14625575, 13578114, 10954761, 7290475, 2246539, -3368331, -7179310, -8212179, -8804404, -11665748, -16003496, -18661552, -18586791, -17901472, -18479767, -19692893, -20191428, -19841254, -18638529, -15499599, -10115040, -4891603, -2486099, -1530976, 2226175, 9150556, 12775580, 6786210, -6147782, -16364479, -18534708, -16943453, -17366934, -17954748, -13196030, -4798551, -1949772, -9418857, -20985931, -27920235, -29765761, -32302476, -37556187, -41224693, -39700234, -35058840, -31857160]
6412c1857160l4748j416878L77841M118306O558398M701419k52911l036867p97896
6403b1640496K652516K164398j145698j615998K693712P757606R497972P801183
6395H165195M154969n37566m478765n239296l553046l407081n884183o308696
6387a7088469j009475N915230P244791K560123j677739j874443j432661l245902
6379a0608545l687192J269164P649490P586836R31610l772187j440563K456842
6371C85455P10025m658884o158866k825991j216562m219144o074654j728304M501090
6362b1285835M787806r01923n169338l791831k82386J114519J890286N544076
6354a8094626J0425115J0614189L834311m800980q424329n981511k159306o84879
$$ y = [-31857160, -31891908, -33308786, -32930945, -28812639, -22254241, -17552822, -17805733, -20842600, -21640496, -18987980, -16823582, -17969280, -19585278, -16891566, -9133960, 364012, 8165195, 12320164, 11782598, 7303833, 2064537, -1488509, -4895590, -10779773, -17088469, -18097944, -12182714, -4937923, -2377800, -4055539, -5929982, -7362643, -10608545, -14295737, -13026573, -5377083, 2209753, 3141363, -630824, -2071387, 385455, 1095480, -3563404, -9722270, -12548261, -13764823, -17983967, -24058621, -25786925, -21285835, -16498029, -17399952, -22569290, -26361121, -26643507, -25528988, -23638702, -18094626, -7669511, 2944678, 6778989, 1978009, -6446320, -12427831, -14587137, -15272016]
6346a5272016o00652L9912l6290k736934n561299l521670L511315R490019R883664
6337d803951P082804N588685N056282J891513m108516q720391q478017m008363
6329a0499954J285337L444008J9545o972355j1012344p405709O95919N800111
6321b4645442N038001J932633k57909k072803l763224k631416K759814R042634
6313a4597712J1616191R628964N198441j78405n938451j0571733j1759855q300631
6305b4903191j492911M636261N439170O13192l639806j361059M366919M619870
6297a1721555k249277p105342l118734L870264L950541k555270o692647m213951
6289b9835971L56257K357964K347728J843351K89935j511956l83722L905362O483960
$$ y = [-15272016, -15872668, -15832756, -15869046, -18605980, -24167279, -27688949, -24177634, -14687615, -4803951, 2278853, 7867538, 12923820, 14815333, 10706817, 1986426, -6491591, -10499954, -9214617, -5770609, -5751064, -12723419, -23735763, -31141472, -30445553, -24645442, -19607441, -17674808, -17932717, -20005520, -23768744, -26400160, -23640346, -14597712, -2981521, 6647443, 11845884, 11667479, 5729028, -4842705, -16602560, -24903191, -26396102, -21759841, -16320671, -15707479, -19347285, -20708344, -16341425, -11721555, -13970832, -21076174, -24194908, -20324644, -16374103, -18929373, -25622020, -29835971, -29479714, -27121750, -24774022, -22930671, -22640736, -24152692, -24536414, -20631052, -14147092]
6280a4147092L646691j821427m445893k802625J36199J533016J094998J868p34076
6271a7538341j209117k417736m256105m153140K09824O786371J0275512P973388
6263d329344K457726j873279k800693q91232J277003N33045l451769o515101n050944
6254b0644588j744836j651019l531770j745640K989278L204159k188221l576441
6246b8889078M610199J3214773J1028286J622122k935209o88113j32443l840638
6238f010101m759032m16611J689624k445958n425782q50534N345651M423998j050694
6229i499439k132637J776780L013697j209916n083397m241597j600624j036820
6221b0013953j490195k66421K244322L920968L917057K375207k49438k314564
$$ y = [-14147092, -10500401, -12321828, -16767721, -19570346, -19434147, -17901131, -16806133, -16804265, -17538341, -18747458, -21165194, -25421299, -29574439, -29364615, -22578244, -12302732, -4329344, -1871618, -3744897, -6545590, -7436822, -6159819, -5626774, -9078543, -15593644, -20644588, -22389424, -24040443, -27572213, -29317853, -26328575, -23124416, -25312637, -28889078, -24278879, -11064106, -35820, 1586302, -1348907, -2037020, -2169463, -6010101, -10769133, -11185744, -9496120, -11942078, -17367860, -18218394, -12872743, -8448745, -9499439, -11632076, -9855296, -6841599, -8051515, -13134912, -17376509, -18977133, -20013953, -21504148, -21770569, -19526247, -15605279, -11688222, -9313015, -9562453, -11877017]
6213a1877017k116649p83713j040552k352072j101746K939870M610290O36381
6205a1085208m819801n682126k181833P42995J195794J539842K720047K515421
6197a5054869R8671k181577k994531l999097n676914m983082j3662O058536R046980
6188a9699545R189361Q758864O709596R28667n346166n736518m83224K226660
6180c452305k096101o743895l241793N476669Q161452N70812q960297j0684077
6172b0969535m749784J402565K930418J290812L23565K028340N440793P457048
6164d845778N381101K06502l458240k090575K925762P072397O991175K223289
6156A4405633n188159j1117926j1406757n894298Q39631M637615N930043O717298
$$ y = [-11877017, -13993666, -14777379, -15817931, -18170003, -19271749, -16331879, -11721589, -11085208, -15905009, -21587135, -23768968, -23025973, -21830179, -20290337, -17570290, -15054869, -14956198, -17137775, -20132306, -24131403, -29808317, -34791399, -34805061, -28746525, -19699545, -10510184, -1751320, 4958276, 5886943, 540777, -5195741, -5678965, -3452305, -5548406, -12292301, -15534094, -10057425, -1895973, -1325161, -10285458, -20969535, -25719319, -24316754, -21386336, -20095524, -19771959, -17743619, -12302826, -4845778, 535323, 741825, -2716415, -4806990, -1881228, 5191169, 12182344, 14405633, 9217474, -1900452, -13307209, -19201507, -18361876, -13724261, -7794218, -1076920]
6148a076920O121372K714351q68803q22688J024264r37196o590194q454058k446065
6139a1335937M936951M882555j715358n927738k935330K892531N137081K638992
6131a426253j772854n755281p978846o886953k201066L283283O046789N795560
6123a0895621N040850M948834L982583J210441j508372k304026k379403l866899
6115e771613n706074m716760p20021K673872L294542L171795M320143N096729
6107A642613L680066K092869K524964K089423l077707r596192r621570k892894
6099a3158428J230934k820809q158669n917058J056532K860510k246016o237773
6091c3390777m353669n73585J641627M895538R732137R431671L68098q584155
$$ y = [-1076920, 5044452, 7758803, 6890000, 6067312, 7091576, 6154380, -435814, -8889872, -11335937, -6398986, -1516431, -3231789, -9159527, -12094857, -9202326, -4065245, -1426253, -3199107, -8954388, -16933234, -23820187, -26021253, -22737970, -16691181, -10895621, -5854771, -905937, 3076646, 4287087, 2778715, 474689, -1904714, -5771613, -11477687, -16194447, -16914468, -14240596, -10946054, -7774259, -3454116, 1642613, 5322679, 7415548, 9940512, 12029935, 8952228, -643964, -10265534, -13158428, -11927494, -14748303, -22906972, -28824030, -27767498, -24906988, -27153004, -33390777, -37744446, -38318031, -36676404, -31780866, -22048729, -12617058, -12248960, -20833115]
6083b0833115o335466M071583R464381N851704K749071O176295Q706163K758396
6075A2609012n677444o240318q89800p2547n154079o933980k262174J97497m823247
6066a9247080r194902m268354M597068O148893N77318k021756J734229M369074
6058a7305510R26865l444997k871363J80067K94814j994332k257019L18045K560773
6049b3592657K625089J551831O44985M76135J589850L595750M417513K701099
6041e990405K44595J33744K965641O152689O369779K280286l829310p042008m587736
6032c302725K91928K095543N51915J17854J597122L25584m739919o796009j310629
6023a1169336N241595L953546k978105n419696j27213N938552O912742M438754
$$ y = [-20833115, -27168581, -23096998, -13632617, -7780913, -5031842, 1144453, 9850616, 12609012, 6931568, 691250, -198550, -271097, -5425176, -12359156, -14621330, -14423833, -19247080, -28441982, -32710336, -28113268, -21964375, -21387057, -23408813, -21674584, -17305510, -16378645, -19823642, -22695005, -22514938, -22220124, -24214456, -26471475, -26153430, -23592657, -20967568, -19415737, -18770752, -18294617, -16704767, -13109017, -8691504, -5990405, -5745810, -5612066, -2646425, 3506264, 9876043, 12156329, 8327019, 1285011, -3302725, -3010797, -915254, -363339, -245485, 1351637, 1677221, -3062698, -9858707, -11169336, -5927741, -1974195, -4952300, -10371996, -10499209, -4560657, 2352085, 6790839]
6015F790839J461819k561379p214686q439598m402526O25945J950526K31707j448264
6006a3005617k413715l037034k182011M64011K498310K426580K233347L419065
5998i597064L952237K574144K265512M898707O065128J091032o279964p879645
5990b909913k856635J323974J15466k457765j495452J165370O36911l554814p408077
5981a7440935p606301l950640J409814M820580L244455j959842n249541l447347
5973c0179757j59177n90080l711792l631853J844235Q259004J0614980Q508393
5965i046047M026130j404517n698776n381792n4665M664409K982928l251951o769072
5956a9933353m579279r83659k45641r97604r6019K104919L612895M762379O445827
$$ y = [6790839, 8252658, 5691279, -1523407, -9963005, -14365531, -13739586, -11789060, -11557353, -13005617, -15419332, -18456366, -20638377, -20174366, -17676056, -15249476, -13016129, -9597064, -5644827, -3070683, -805171, 4093536, 10158664, 11249696, 4969732, -2909913, -5766548, -4442574, -4327108, -6784873, -8280325, -7114955, -6478044, -10032858, -17440935, -25047236, -28997876, -27588062, -22767482, -19523027, -21482869, -26732410, -30179757, -30338934, -30929014, -34640806, -38272659, -36428424, -28169420, -17554440, -9046047, -5019917, -6424434, -12123210, -17505002, -17559667, -12895258, -9912330, -13164281, -19933353, -24512632, -25496291, -25741932, -26739536, -26835555, -24730636, -21117741, -16355362, -9909535]
5947i909535O569578K483815m097486q429307q427555n653236j495034L573244
5939b5385516P297058O840237L439647J537881K049566R52132l395806o167890
5931a2832691k891260L218671N244562J777854k429097l942861m032650m266734
5923b0154206l230110K81980L805318L887394J151090L3615L099099P489659Q407368
5914D771207N216586K004543J736314K252029K3744l926129n140171k388945K98715
5905D847893p73136m300058o490150n906233l967447k395527j982170k666550
5897b3633378l429904l108832j992772j165225q7511K636344N625436N421874
5889a9733968K321601J428305N015595P854561M563229j619952l176887K82037
$$ y = [-9909535, -3339957, -856142, -4953628, -13382935, -21810490, -27463726, -28958760, -25385516, -18088458, -11248221, -7808574, -6270693, -4221127, -3268995, -6664801, -12832691, -15723951, -12505280, -7260718, -5482864, -7911961, -11854822, -15887472, -20154206, -23384316, -23102336, -19297018, -15409624, -14258534, -14224919, -11125820, -3636161, 4771207, 9987793, 11992336, 13728650, 15980679, 16004423, 12078294, 6938123, 4549178, 4847893, 4074757, -225301, -6715451, -12621684, -16589131, -18984658, -20966828, -23633378, -27063282, -30172114, -32164886, -33330111, -33417622, -30781278, -25155842, -19733968, -17412367, -15984062, -10968467, -3113906, 1449323, -170629, -3347516, -3065479]
5881c065479J527376k921286p281257n048547J755623N878452M597286J870720
5873b687112J562820K555467J792883o40589k144829k279571l422341n722514
5865a0985786m905519J454307P922486O840424n40194m881803k161593O43280
5857f614398k928060q285301p154779m25042M287262M698754M791020N267671
5849f362873K520080k297489k584765K533923M874602n47198p199133o614055
5841a5676908n17025L017491J441443q23363m81600J103403J526824j26048l533563
5832a4069346o286254m330825K875107R359595R093171L985232Q03029J417357
5824B847066J608927p40301k370792r78062P13587l203j098999L23092K642584
$$ y = [-3065479, -1538103, -4459389, -11740646, -16789193, -15033570, -9155118, -4557832, -2687112, -1124292, 1431175, 3224058, 2583469, 438640, -1840931, -5263272, -10985786, -15891305, -14436998, -6514512, 325912, -214282, -5096085, -7257678, -6614398, -9542458, -17827759, -24982538, -25407580, -21120318, -16421564, -11630544, -6362873, -3842793, -6140282, -8725047, -6191124, -1316522, -1863720, -9062853, -15676908, -16193933, -13176442, -11734999, -12558362, -13039962, -11936559, -10409735, -10535783, -14069346, -20355600, -24686425, -21811318, -12451723, -3358552, 626680, 1429709, 2847066, 4455993, 3715692, 1344900, 366838, 1080425, 1077222, -21777, 301315, 2943899]
5815B943899K152105j060602l533474l765965l372301k991187q38989L340609
5807g125905N960323L713429j640805n265646n266806l973674l303470k075138
5799a8977692Q11312L516274M011123L412784L517797K853274q39531n185410
5791f880069n065919m15104K729068P89144k135198m94548M833500Q342508O945925
5782H649307J891166m039861p795945o707211j727954J648777m06626m472997
5774a2961344m529586n26135K564527K939278L194150L451435Q2194o651298r982568
5765b2419347n604747J407166L214689m06068k893422j09571N601939R550149
5757a1659212R192199M972243l26019l283584k991989j788407j394101m58916
$$ y = [2943899, 5096004, 4035402, 501928, -3264037, -6636338, -9627525, -10466514, -7125905, -1165582, 2547847, 907042, -4358604, -9625410, -13599084, -16902554, -18977692, -18166380, -14650106, -10638983, -7226199, -3708402, -855128, -1694659, -6880069, -11945988, -12361092, -9632024, -8842880, -10978078, -11472626, -6639126, 1703382, 8649307, 10540473, 6500612, -1295333, -8002544, -9730498, -8081721, -8488347, -12961344, -17490930, -18017065, -15452538, -12513260, -9319110, -5867675, -5785481, -12436779, -22419347, -28024094, -26616928, -23402239, -23808307, -26701729, -26811300, -21209361, -11659212, -2467013, 2505230, 2179211, -1104373, -4096362, -5884769, -7278870, -7737786]
5749g737786J665679J634883l135391q520168p952431j953636K391751J924680
5741b1682419J207162L840183O062848L070031k766431m911252j328913M158782
5733a2350009P282977O327127J659753l775055n218180j487893J948382k22420
5725e835318m797245m001131K774022P453591M714865r67157k448469O07425K889607
5716C90190R55898l613889o659736n035685L33723M031812J533315m392953o518105
5707a8975430l150442p7573p44248r74573K539849N030740J354448m188384l631842
5698b2817455K158650N003152J934218j897270k597190j948272j564637j5859
5690b1744663K306130J985204j377277l630100k868767k251956l574554l499580
$$ y = [-7737786, -6072107, -4437224, -7572615, -16092783, -24045214, -25998850, -23607099, -21682419, -20475257, -16635074, -10572226, -7502195, -10268626, -15179878, -16508791, -12350009, -5067032, 1260095, 2919848, -855207, -6073387, -7561280, -5612898, -5835318, -10632563, -14633694, -11859672, -4406081, 308784, -658373, -3106842, -2499417, 390190, 1346088, -2267801, -8927537, -13963222, -13629499, -9597687, -8064372, -12457325, -18975430, -22125872, -22203445, -22947693, -23922266, -21382417, -16351677, -14997229, -19185613, -22817455, -20658805, -15655653, -13721435, -15618705, -18215895, -20164167, -21728804, -21744663, -19438533, -17453329, -18830606, -22460706, -25329473, -27581429, -31155983, -34655563]
5682c4655563P36646O651357J0529902J1680402J0137945N159681r15059k647439
5674F677872N71476J544656m838861j2988825j3546769n916277J831219L726143
5666b2939366J329836p09904j24958J833201K018495j139441m453191k816206
5658b7001534L199675O642143L832916n5065P18355L538308K737374l28941J51914
5649f564855M307827O578266M698417J517690j567545n795963r491822q453146
5641a4771131l000962J702869L457815M811133N945489K918639m473812r833996
5633a3243956q828554n040754l356230k884954q89435J135901N87518p03269O67518
5624c2556215L936585O057526O741253O784345M097588k703325q645769p203561
$$ y = [-34655563, -33918917, -27267560, -16737658, -5057256, 5080689, 10240370, 9325311, 6677872, 7249348, 8794004, 3955143, -9033682, -22580451, -28496728, -26665509, -22939366, -21609530, -22319434, -22444392, -20611191, -18592696, -19732137, -24185328, -27001534, -23801859, -17159716, -13326800, -13381865, -12663510, -9125202, -6387828, -6716769, -6564855, -2257028, 4321238, 9019655, 10537345, 8969800, 3173837, -6317985, -14771131, -17772093, -16069224, -12611409, -7800276, -1854787, 1063852, -3409960, -13243956, -22072510, -27113264, -30469494, -33354448, -34243883, -33107982, -32520464, -33223733, -32556215, -28619630, -22562104, -15820851, -9036506, -4938918, -7642243, -16288012, -23491573]
5616b3491573m87614K465905j041530l091077K210847Q489202O068529l001602
5608a1878913p193738j936346M635136M504460N27721o18808J77157k201225o095780
5599b0080336m535821K706344P285764M386342j151724l807825m945090o993883
5591b7136229p222449l406309K41144k08580p45232L838587R836633R883069N087394
5582i831972K540872K806189Q5397n644756p254774k591797K014822K784310L301991
5573a1789718N049721L164274l213741n855620J89235P075144N264682k086360
5565b202383m782683j068705J995469J125528L52344K083052K888091M5352l827698
5556c391633n152226m291892l798691m328380m185034j869533J816483M212926
$$ y = [-23491573, -23979187, -21513282, -22554812, -25645889, -23435042, -14945840, -8877311, -11878913, -19072651, -21008997, -16373861, -11869401, -11341680, -11960488, -11783331, -13984556, -20080336, -24616157, -21909813, -14624049, -10237707, -11389431, -15197256, -20142346, -27136229, -34358678, -37764987, -37523843, -37732423, -38477655, -34639068, -24802435, -14919366, -9831972, -7291100, -4484911, -4399514, -10044270, -17299044, -19890841, -17876019, -15091709, -11789718, -6739997, -3575723, -6789464, -12645084, -12455849, -5380705, -116023, -2202383, -6985066, -8053771, -6058302, -4932774, -4580430, -2497378, 390713, 436065, -3391633, -8543859, -12835751, -16634442, -20962822, -25147856, -27017389, -25200906, -20987980]
5548b0987980L795882K253316J825129J356334j552963m819111l443156K141860
5540a9430689N225428K782509P078J128037K289204q43599m509857l135091P40614
5531a5746366J027883j107511J41506M223511N050448J680965j013477k098104
5523g841145n402458r556059p173346K684364J0172894P787359O70274j742348
5515a0400465J440894M126707L322606J379252M91090L52412L45296K68363l30104
5506I96051j055573m14961J190757M84775l935268q020948o762547r30014L839995
5497a4607733M050117J710756Q32618K657428M744642L898243k1895l303983k428416
5488b468223J323972L226856J162295k117828l266901k091883o3807J954257K955605
$$ y = [-20987980, -17192098, -14938782, -13113653, -11757319, -13310282, -18129393, -21572549, -19430689, -14205261, -11422752, -11415674, -10287637, -7998433, -8842032, -13351889, -16486980, -15746366, -14718483, -15825994, -15684488, -11460977, -6410529, -4729564, -5743041, -7841145, -13243603, -22799662, -29973008, -27288644, -17115750, -9328391, -8658117, -10400465, -8959571, -4832864, -1510258, -131006, 360084, 712496, 1057792, 1326155, 996051, -59522, -474483, 716274, 1201049, -2734219, -10755167, -17517714, -18447728, -14607733, -10557616, -8846860, -8014242, -5356814, -612172, 3286071, 3264176, -39807, -2468223, -1144251, 2082605, 3244900, 1127072, -2139829, -4231712, -4295519, -2341262, 614343]
5479F14343J594306j305847k495980m73141K416529L670000L557389K537933n37617
5470I577915m638429m861847Q65655O401478M379509l108101o982086l860100
5462b226006K85751K13359j520297o87010J187947M45042j641825j274578L47522
5453d870095j961981q581164j2653426q510663J128896Q822251J0706434Q585676
5445g334072N599907K918660M33075j692925k823589k274652O80K509700K839977
5436A76761M54955j893105j214060J776560L678199L058167J772648J399637R04989
5427A0114751r51186k989211l256032k120402j835781l330137m880217m255653
5419a3503868j450372J230307J846583J007887L34439q78682m794594r628738
$$ y = [614343, 2208649, 902802, -1593178, -2066319, 350210, 4020210, 7577599, 10115532, 9577915, 4939486, 77639, 943294, 7344772, 11724281, 8616180, 1634094, -2226006, -1940255, -1726896, -3247193, -3934203, -2746256, -2301214, -3943039, -5217617, -4870095, -6832076, -15413240, -28066666, -36577329, -35448433, -26626182, -15919748, -7334072, -1734165, 1184495, 1617570, -75355, -2898944, -5173596, -5172916, -2663216, 176761, 631716, -1261389, -2475449, -698889, 2979310, 6037477, 7810125, 9209762, 10114751, 9163565, 6174354, 2918322, 797920, -1037861, -4367998, -9248215, -13503868, -14954240, -13723933, -11877350, -10869463, -10535024, -11413706, -16208300, -25837038]
5411b5837038q716916J017345J2028691J3283796M145260m715704n197349l92754
5403a4384669K901712L721097M396978L941279L23621l764727l778120n14591
5395g157420J072879n73084k306471k050478j027779j81912J114500K263369J378560
5386g467836j105186k073014J14522L644287N827259N373872K184194k612849
5378C885249o211322n784720j013988N615753J0053894Q338907L62928p115347
5370H131354o200298R14191K615197n673358j2757378p139705N118453Q875447
5362f116097K207291k695957O9544K682868q99476n115250l907105n12899N94309
5353a3692772J938871N692606O672643J271134l766311q08324N960305O853962
$$ y = [-25837038, -34553954, -33536609, -21507918, -8224122, -4078862, -8794566, -13991915, -14384669, -11482957, -7761860, -3364882, 576397, 900018, -2864709, -6642829, -7157420, -6084541, -6657625, -8964096, -11014574, -12042353, -12224265, -11109765, -8846396, -7467836, -8573022, -10646036, -10531514, -6887227, -1059968, 4313904, 6498098, 3885249, -2326073, -8110793, -9124781, -3509028, 6544866, 14883773, 15246701, 8131354, 1931056, 2845247, 5460444, -212914, -12970292, -20109997, -14991544, -6116097, -3908806, -6604763, -6535219, -3852351, -4751827, -9867077, -13774182, -14287081, -13692772, -11753901, -6061295, 611348, 1882482, -1883829, -2692153, 3268152, 10122114]
5345A0122114J533583k156894j383098n17581j298165l71083K522568K337468
5337A0788912k882480p802790o903772j474078K803756K302423j857586n342228
5329a0367843m467844l16349J927388j60765k194073O96373N653619N302608j489045
5320e415931p305436n585923J739032P422438O761261J002000m932354o862630
5312a3177543m483853o43132K237516L640901K970667o92654n429777o642374
5304b2220249k935483J428201K771089L051659N160798P103236N575824K018424
5296A953499q2308j053443k912262m300140l254660k092204l240347l315661J307177
5287a6990349O035831M006060j659899j716030L812720N320749j17656l949340
$$ y = [10122114, 11655697, 9498803, 8115705, 7598124, 6299959, 5928876, 8451444, 10788912, 7906432, 103642, -6800130, -8274208, -5470452, -3168029, -5025615, -10367843, -14835687, -15152036, -13224648, -13385413, -15579486, -14883113, -9229494, -3926886, -5415931, -12721367, -18307290, -16568258, -9145820, -2384559, -1382559, -6314913, -13177543, -17661396, -18304528, -16067012, -12426111, -9455444, -10148098, -15577875, -22220249, -25155732, -23727531, -20956442, -17904783, -12743985, -5640749, -64925, 1953499, 1871191, 817748, -2094514, -6394654, -9649314, -11741518, -14981865, -18297526, -16990349, -10954518, -6948458, -8608357, -10324387, -6511667, -1190918, -1308574, -5257914]
5279e257914r99693K496507J216106m7904K851219L764942k552578q216857l568946
5270a0315118N176542L730199p182246j1308641j433517R254445O558080m631019
5262a0151275q681382j231060P055642O596725q2727m625060l554503M22356L855094
5253a0396190N417005M713542J586192k732944n477231m504485m20402L697328
5245h117185M591184J231014m195997p632670o494016k176246J467077K424856
5237a8901983K215748K841826L728208L057576P25595j927956m219527n681868
5229a8162381m457277P68523P032694Q408218K551075n940041j0152187p707843
5221b7659219k035269K056240K934152K777416M368547P353250Q267686M854341
$$ y = [-5257914, -6257607, -3761100, -2544994, -2592898, 258321, 4023263, 1470685, -6746172, -10315118, -5138576, -1408377, -8590623, -19899264, -21332781, -12078336, -5520256, -10151275, -18832657, -20063717, -13008075, -6411350, -6494077, -11119137, -14673640, -14251284, -10396190, -4979185, -265643, 1320549, -1412395, -6889626, -11394111, -11814513, -8117185, -3526001, -2294987, -6490984, -14123654, -20617670, -22793916, -21326839, -18901983, -16686235, -13844409, -10116201, -7058625, -6333030, -8260986, -12480513, -18162381, -22619658, -21851135, -14818441, -6410223, -3859148, -9799189, -19951376, -27659219, -29694488, -27638248, -24704096, -21926680, -17558133, -10204883, -1937197, 2917144]
5213B917144p92604m790469n890698n171945k745015J664927N321122M098425
5205e389113j370224n228101l954587n55479J132365J977104L536295K754598
5197g097142l167540r099809o851478K127331O805490J963577m031008k051731
5189b1402310L762725K947738m330016p379391j713931M613922M379175J525821
5181a7596267K531640N291100M278364R04755o7714j49195l443844o304954j692851
5172a6248966O980709Q188116Q9878n762496k296562L002690J832021j967274
5164f181884j463186O62043j518209n269974m320678n46377M7585j299614N18806
5155a9371488L339167J243297l377558k969012J504300K065814j582422j445844
$$ y = [2917144, 2124540, -2665929, -8556627, -13728572, -16473587, -14808660, -9487538, -5389113, -6759337, -11987438, -15942025, -16497504, -15365139, -13388035, -9851740, -7097142, -10264682, -19364491, -26215969, -24088638, -17283148, -15319571, -19350579, -21402310, -17639585, -14691847, -19021863, -26401254, -28115185, -23501263, -19122088, -17596267, -15064627, -9773527, -5495163, -4590408, -4658122, -4807317, -8251161, -14556115, -16248966, -9268257, -1080141, -990263, -6752759, -9049321, -6046631, -4214610, -6181884, -7645070, -6983027, -8501236, -13771210, -18091888, -18638265, -18590680, -19890294, -19371488, -16032321, -14789024, -18166582, -21135594, -19631294, -17565480, -19147902, -20593746]
5147b0593746L763514N870224K068326k00588K615364L546859j497833n319146
5139i747026j887792L188772L226558K108892N530444Q611428L525302o046084
5131H510494r538950n358995j400700j479214j412491J473227M075336M110553
5123a020740L687051M499896M971678L563398P50668k626375n297839m794733
5115C733004j024807R22348l102407q614753p197368J320274P920772O520716
5107D77779O89406l482923m919985m857969k320733K873469O268838L300348l674636
5098e646406p322303m321178Q88472J973891k063853o614266o938147k631437
5090c2675227K898509O331982P428169Q284639R846891R717683M514897n084057
$$ y = [-20593746, -16830232, -10960008, -8891682, -9092270, -6476906, -2930047, -4427880, -9747026, -11634818, -8446046, -5219488, -3110596, 2419848, 11031276, 14556578, 8510494, -1028456, -6387451, -7788151, -9267365, -10679856, -9206629, -5131293, -1020740, 2666311, 7166207, 12137885, 15701283, 16451951, 13825576, 8527737, 3733004, 2708197, 3630545, 528138, -8086615, -15283983, -13963709, -6042937, 477779, 1167185, -2315738, -7235723, -12093692, -14414425, -11540956, -5272118, -1971770, -5646406, -12968709, -17289887, -16401415, -14427524, -16491377, -23105643, -30043790, -32675227, -29776718, -23444736, -16016567, -7731928, 2114963, 11832646, 16347543, 11263486]
5082A1263486j2950593j3076371o325745M53660K255733M14944j162867q78142
5074b0005895J096784M587374P760982O953866J674316l245361m265841m314362
5066i758137o583254p421539k437207L729243K666435m270673p203509k520566
5058c3799207L344740O038445Q713236J2328177J1075455K926609m274978l851595
5050B500882j55525q19939n369989p977952o183476j100125N638165R708898N019409
5041A260348o945030j4568896r697832J506040P868185P632485O230505N332888
5033a381307K916201J77143k85740l34444k733321m700878k258446K121910L352108
5024c126774J914441J174127K35593l041563n616434l639594K69906J642914J946125
$$ y = [11263486, -1687107, -14763478, -21089223, -20635563, -18379830, -17964886, -19127753, -20005895, -18909111, -14321737, -6560755, 393111, 2067427, -1177934, -5443775, -9758137, -16341391, -23762930, -26200137, -22470894, -19804459, -24075132, -31278641, -33799207, -30454467, -24416022, -15702786, -3374609, 7700846, 10627455, 6352477, 2500882, 2345357, 1525418, -3844571, -11822523, -18005999, -19106124, -13467959, -3759061, 1260348, -5684682, -20253578, -29951410, -28445370, -20577185, -12944700, -6714195, -1381307, 1534894, 1712037, 1426297, 1091853, -1641468, -6342346, -8600792, -6478882, -3126774, -1212333, -38206, 197387, -2844176, -8460610, -12100204, -11830298, -10187384, -8241259]
5015h241259L974947M461422K48243l338673m65525L932374K212722j580467J487522
5006B691306Q001533O515104k868802q494619o421518m400707n764624n016676
4998a5759003j761265l077796q101018o258621L468967P577570J78528n453444
4990b9186082J896599J2422923J0674767q16908p476245m897064j155952j245851
4982a9783813k011553q87123Q53552K990320O298733Q420775O676659L705187
4974F262737L906471N704455L678418k503567p138521o295694j912549J775350
4966C477100K289629j40146k772474k275128J255522L399342N29135n500050r315942
4957i053012p390952q90149M946075M524607k045303p087785l354672O609124
$$ y = [-8241259, -4266312, 195110, 443353, -2895320, -3360845, 571529, 2784251, 1203784, 2691306, 10692839, 17207943, 14339141, 5844522, -576996, -4977703, -10742327, -15759003, -17520268, -20598064, -28699082, -34957703, -31488736, -23911166, -23732638, -29186082, -27289483, -14866560, -4191793, -5008701, -12484946, -17382010, -18537962, -19783813, -21795366, -22682489, -21828937, -18838617, -12539884, -4119109, 2557550, 6262737, 10169208, 15873663, 19552081, 17048514, 9909993, 3614299, 1701750, 3477100, 5766729, 5626583, 2854109, 578981, 1834503, 5233845, 5762980, 262930, -9053012, -16443964, -17334113, -12388038, -7863431, -9908734, -16996519, -20351191, -13742067]
4949a3742067J3452314J2436260O435024j151654q896213j2783751q172512J247535
4941a1175064M833170r22734p047536m952133K286496O234228M515382P23189
4933e505002k062757k587086j19614L701402M620104O97697m752154o938628m064147
4924a7010185K069162O977550O223905R68339j715283J356623L898131J047345
4916C815587o11053N517590J1043752L874094r713806j1905266j072308O225047
4908G173637K366543j901828P64792K970598k34164j644920K256057L221220k326621
4899A2645314n583261k368272n92095k754031K34059R059856J0227156L32481
4891B1201207n312907M87796M271802j381926l634248L608054N547632l593186
$$ y = [-13742067, -289753, 12146507, 18581531, 17429877, 8533664, -4250087, -12422599, -11175064, -6341894, -7264628, -14312164, -19264297, -16977801, -10743573, -6228191, -5505002, -7567759, -10154845, -10274459, -6573057, -1952953, -1255256, -6007410, -12946038, -17010185, -14941023, -7963473, -1739568, -771229, -2486512, -1129889, 2768242, 3815587, 3204534, 8722124, 19765876, 23639970, 13926164, 2020898, 948590, 7173637, 9540180, 7638352, 8403144, 11373742, 11139578, 9494658, 11750715, 14971935, 12645314, 7062053, 4693781, 4101686, 1347655, 1581714, 10641570, 20868726, 21201207, 15888300, 16376096, 20647898, 19265972, 15631724, 19239778, 24787410, 21194224]
4883B1194224n723211O354164J1547738R45887j131901J4698711J6632256p535794
4875E6982074j3285687J8747942J4626555r0913201k14962474j99231631k8847557
4868d56883979J28897054J38802310N4221291N203991J7684359K5634545L651813
4861h2788616q594182P082035K0151423J2432440L254223N847835P532020J678281
4853c3404541l12606M050464L042224l193277j931299M359720k08895j3140740
4845d0738950j3868874M59589R222586L669857q06663M928762Q698876K223835
4837b6210982l631303l46933L357765o5879l014331J191380N553565L969932K704868
4828a6491918O356123P223648r2911p008759n267638q97493k435424n846949k975510
$$ y = [21194224, 15471013, 21825177, 33372915, 34318802, 33186901, 47885612, 64517868, 56982074, 43696387, 62444329, 77070884, -13842317, -228804791, -428036422, -456883979, -327986925, -189184615, -134963324, -129759333, -112074974, -86440429, -82788616, -91382798, -84300763, -64149340, -51716900, -48462677, -42614842, -35082822, -33404541, -33717147, -29666683, -26624459, -29817736, -31749035, -27389315, -27598210, -40738950, -54607824, -54148235, -44925649, -41255792, -42062455, -37133693, -28434817, -26210982, -29842285, -30189218, -26831453, -26897332, -29911663, -28720283, -23166718, -19196786, -16491918, -10135795, -2912147, -3005058, -10013817, -15281455, -16178948, -18614372, -24461321, -27436831]
4819b7436831L388986M330007j056660n904139n918104k416574J427903K622359
4811c0963053L42591j705188J39892K143741j916638q190737n586256O527014
4803c9208634J4930963J1355894L467865J091039K257439P68842j833898j083822
4795h254312P56880r87219m471379m780523k345472q99195m52067J403828L964945
4786a6064514M559380L011574J050525l55557n14014Q41789J121109k867190q442214
4777a7659112q487423j803050M105488L683433M65811j02748J419678K156554
4769a6221369K440976K762934P88851l513192n142397j764957J062274j824274
4761b1411154o452466n644144J17485M242906L701800J058837j056911j820524
$$ y = [-27436831, -24047845, -19717838, -20774498, -26678637, -32596741, -35013315, -33585412, -30963053, -30620462, -32325650, -32185758, -30042017, -31958655, -40149392, -45735648, -39208634, -24277671, -12921777, -9453912, -8362873, -6105434, -5336592, -7170490, -8254312, -7497432, -8484651, -12956030, -17736553, -20082025, -20981220, -21433287, -20029459, -16064514, -11505134, -8493560, -7443035, -7798592, -8312606, -7470817, -6349708, -9216898, -17659112, -26146535, -27949585, -23844097, -20160664, -19694853, -19797601, -18377923, -16221369, -13780393, -11017459, -10228608, -13741800, -18884197, -20649154, -19586880, -21411154, -27863620, -33507764, -33390279, -29147373, -25445573, -24386736, -25443647, -27264171]
4753b7264171j6963M707818Q927062P974754J407552o505581j0818958q845566
4745c0434053j461590O182265P729399K204137m217234n085802m59543M595841
4737b0946580N715869J998448m015922p417100m708488J947663O611103O179025
4729a4635982K309915k583208o762255p201616k233181L536733L583999n82709
4721b4568304j388690J860115J437512m393896o015526K283432J1247745R456065
4713a0081547k83405o750835o605570m763166k844998J884370P789597R073286
4705a2582268M914109M35475j648307l203158m338075k018849L724431Q036532
4697f680110P249922K523024k924381o366313n830533k006492O87808q86438l462410
$$ y = [-27264171, -27281134, -22573316, -13646254, -5671500, -4263948, -10769529, -21588487, -30434053, -31895643, -25713378, -17983979, -15779842, -19997076, -25082878, -25542421, -20946580, -15230711, -13232263, -17248185, -24665285, -29373773, -27426110, -20815007, -14635982, -12326067, -14909275, -21671530, -28873146, -31106327, -27569594, -23985595, -24568304, -25956994, -24096879, -22659367, -27053263, -33068789, -30785357, -19537612, -10081547, -10364952, -17115787, -23721357, -28484523, -31329521, -29445151, -21655554, -12582268, -7668159, -7232684, -8880991, -12084149, -16422224, -18441073, -14716642, -6680110, 569812, 3092836, 168455, -6197858, -12028391, -14034883, -13347075, -14233513, -17695923]
4688a7695923j701731L529053O315324M346217J048326o23421j119978q90364
4680f792497N97737J819167K79208k498970k069229J697582L497849N60561k995610
4671e904202k430288Q68356K075807l01265l484965m733691l906410k256357o07863
4662b0680878R22908K091485K087191P21597j34943J762031N105751N335529R07781
4653a881548l223902j656189L664636N618525J265706m846081p021306m657531
4645a2737690j184823N85869O50925P38835K000623L415249K820606l4123k671542
4636f416071k999141j582991M16129L315566O735691P525051L048475m457284
4628E585425r589309r264258m565345J513842N788401N825323K116724j481514
$$ y = [-17695923, -19397654, -15868601, -9553277, -5207060, -4158734, -4782155, -5902133, -6792497, -6194760, -4375593, -4096385, -6595355, -8664584, -6967002, -3469153, -2908592, -5904202, -8334490, -7466134, -5390327, -5691592, -9176557, -13910248, -17816658, -20073015, -20680878, -19757970, -17666485, -15579294, -14857697, -14992640, -13230609, -8124858, -2789329, -1881548, -5105450, -6761639, -3097003, 2521522, 3787228, -1058853, -8080159, -12737690, -13922513, -13336644, -12685719, -11946884, -9946261, -6531012, -3710406, -3744529, -6416071, -9415212, -10998203, -10582074, -7266508, -530817, 6994234, 10042709, 5585425, -4003884, -13268142, -17833487, -16319645, -10531244, -4705921, -2589197, -4070711]
4620d070711j931145o31068n45402j278227j74117K668393L941918J689117k340429
4611b671671n048295m818096k213788N73171J359272N3393j754774l498158n556095
4602b3575041o021726j575290O288054J0248332O155581n54911j973278J705691
4594i302588L866126J624157j345519j508668J912M1201k676191o472541p548194
4585b3320305l338329L179459N432964J981505p53179J861564N176197K960291
4577f819833k140300l227752n09096O06401K65099L271067Q032442O544924k768017
4568C254935j1086457j1058370n282486K8007L063096M747431N007081M258696
4560g068067M000763L404876k01854n774815q453032o507954l175370m90764K714436
$$ y = [-4070711, -6001856, -6632924, -7178326, -8456553, -8630670, -5962277, -2020359, -331242, -2671671, -7719966, -12538062, -14751850, -14178679, -12819407, -12766014, -14520788, -18018946, -23575041, -29596767, -31172057, -24884003, -14635671, -8480090, -9035001, -11008279, -9302588, -5436462, -3812305, -5157824, -6666492, -6664580, -6623379, -9299570, -15772111, -23320305, -26658634, -23479175, -18046211, -16064706, -16817885, -14956321, -9780124, -6819833, -8960133, -12187885, -12696981, -12090580, -11825481, -8554414, -521972, 6022952, 3254935, -7831522, -18889892, -24172378, -24144371, -21081275, -16333844, -11326763, -7068067, -3067304, 337572, 135718, -5639097, -14092129, -20600083, -23775453, -24266217, -21551781]
4551b1551781N610996N112101K416468K293119L859159O47304p138625j0122726
4543a8873985m461266R01721j184389l935683J098339P859537M409515p086423
4535b1272634j2234018m977196N714136J0412463R618066P346436M113869K76350
4527a002528j272099q9729j09812k891220m161968p63633L662806L834589j89296
4518b982890m803526q020112r123257o684115j375003J906857m35899m664972
4510c6182917l914853K471103Q476100R849329P941187M679380m98022o258420
4502a3437113p347316j484654N496424O752385L926478L266054M153235j77118
4494A148375r541842j3429818n333224O735533J0578169N402415k50070k097197
$$ y = [-21551781, -15940785, -10828684, -8412216, -6119097, -2259938, -1612634, -8751259, -18873985, -23335251, -22433530, -23617919, -27553602, -26455263, -18595726, -14186211, -21272634, -33506652, -38483848, -32769712, -22357249, -12739183, -5392747, -1278878, -1002528, -2274627, -2364356, -2474168, -5365388, -9527356, -10290989, -6628183, -2793594, -2982890, -7786416, -15806528, -24929785, -31613900, -32988903, -31082046, -31517945, -36182917, -40097770, -37626667, -29150567, -19301238, -11360051, -6680671, -7178693, -13437113, -20784429, -22269083, -16772659, -10020274, -6093796, -2827742, 1325493, 1148375, -8393467, -21823285, -27156509, -20420976, -9842807, -4440392, -4690462, -6787659]
4486f787659k995571m196402k856028J079995L245582J627407j391323m529019
4478a6803018q264755r260394k446190Q823109J3205023O298667k574754l810263
4470a4832575k68276K62057j437344Q38228O168722O810523P0435q145086j1824915
4461b2358231j0355042n357391J640489P292995P676390L353998n05714k47213
4453a8859719L010324O357429P828709N903055M7681p174873j1404880j0808878
4445b5101152p070758k245465K656416O068752O188315L853776K565597M343731
4437h740788P024162O532910J198582o137401r933210o961632k23977L791597
4429a3449757K592847l53j62827Q83311N23223n63604j225348l446735p862497
$$ y = [-6787659, -9783230, -13979632, -16835660, -15755665, -12510083, -10882676, -12273999, -16803018, -25067773, -34328167, -36774357, -27951248, -14746225, -8447558, -11022312, -14832575, -15100851, -14838794, -16276138, -15437910, -9269188, -2458665, -2388230, -10533316, -22358231, -32713273, -38070664, -36430175, -29137180, -21460790, -18106792, -18612506, -18859719, -15849395, -9491966, -1663257, 4239798, 4287479, -2887394, -14292274, -25101152, -32171910, -34417375, -31760959, -25692207, -19503892, -15650116, -13084519, -8740788, -1716626, 4816284, 6014866, -122535, -10055745, -17017377, -17241354, -13449757, -10856910, -10857263, -11020090, -10136779, -9613556, -10177160, -11402508, -14849243, -22711740]
4420b2711740r053866k173167P670698J0280663M307189j391790j171058O89092
4412a3553979p56584l148544k903151k535635n388314p710103l357264N856112
4404c3497462J1439822R293071L457249j327126m833795p620627p590963l493796
4396c4173627J854839N207192O995699Q591229Q304306M537642Q51001K119116
4388D287397O005035M743245k921112q258999m968797J073728P02047m723369
4380d060825o559894l125434j182522l486657m696521j780935R13294P87839K144534
4371b1047121O723998P719327Q85293n672391k270642O959982R689403L226910
4363F214759l681651n395276n094925n486318m069232l58656R13982k354128n517005
$$ y = [-22711740, -31765606, -33938773, -26268075, -15987412, -11680223, -13072013, -14243071, -13553979, -14310563, -17459107, -20362258, -22897893, -28286207, -35996310, -39353574, -33497462, -22057640, -12764569, -9307320, -10634446, -15468241, -23088868, -30679831, -34173627, -32318788, -27111596, -20115897, -11524668, -3220362, 1317280, 2168281, 4287397, 10292432, 15035677, 12114565, 3855566, -1113231, -39503, 662544, -4060825, -10620719, -13746153, -14928675, -18415332, -23111853, -24892788, -23979494, -23191655, -21047121, -14323123, -6603796, -5718503, -11390894, -13661536, -6701554, 2987849, 6214759, 2533108, -2862168, -7957093, -13443411, -17512643, -17871299, -16957317, -19311445, -24828450]
4354b4828450m687703k359539j708751p77167L184739P708497P908882K868579
4346a2690913l763268p434089n358390J491322P653096P820232L453665R39111
4338g889234K281076K838969J23870j419045J650400M707989J663453n188075
4330a230597q040300m238868J488782M274923L454521K91471l545340m830283
4322a2375691q53878N628824P159669j566j0135353j3605824p825758o4666J844223
4313c0230020p98547n67850M305110O939635L264530L13577O067111J4787818
4305D081364J2521790k349492j4511999j2042393k276875L2653o211227q876427
4297b9632606j306849R096687J1985704O363915q67692l735789j651215K029921
$$ y = [-24828450, -29516153, -31875692, -33584443, -34361610, -31176871, -23468374, -15559492, -12690913, -16454181, -23888270, -29246660, -27755338, -20102242, -12282010, -8828345, -7889234, -5608158, -2769189, -2645319, -4064364, -2413964, 2294025, 3957478, -1230597, -9270897, -13509765, -12020983, -7746060, -4291539, -4000068, -7545408, -12375691, -13229569, -7600745, -441076, -442642, -10577995, -24183819, -32009577, -32074243, -30230020, -31028567, -31596417, -27291307, -20351672, -17087142, -16773565, -10706454, 4081364, 16603154, 14253662, -258337, -12300730, -14577605, -14544952, -20756179, -29632606, -30939455, -21842768, -9857064, -3493149, -4360841, -8096630, -9747845, -7717924]
4289g717924L450513J473961j609725l347581m312928o194409p904935o756809
4281c2919837l147128m70675K22263J874961O121030R541487Q032114K992187
4273g753598j48929P85973J938879j099621p159029j0672387q102262j428991
4265c3639965M513866O515120M732009J734581L54919J075498J343414p95447
4257a4166005k731260k05660N486442P872487M771277J926255L372273M079995
4249A0405804j341658p798203o653758m08422K28429o689817j1496130q549694
4241c2303449l341752m78147L789107J0917686J3001174N172048l917990m134112
4233a1295435R21008J570587j381182j76698M260542L898408j022525k099056
$$ y = [-7717924, -4267411, -2793450, -4403175, -7750756, -12063684, -18258093, -26163028, -32919837, -36066965, -36537640, -36315377, -34440416, -28319386, -18777899, -10745785, -7753598, -7902527, -7116554, -5177675, -6277296, -13436325, -24108712, -32210974, -33639965, -29126099, -22610979, -17878970, -16144389, -15789470, -14713972, -13370558, -14166005, -16897265, -17102925, -11616483, -3743996, 1027281, 2953536, 6325809, 10405804, 9064146, 1265943, -5387815, -5796237, -5567808, -12257625, -23753755, -32303449, -35645201, -36123348, -32334241, -21416555, -8415381, -3243333, -7161323, -11295435, -10374427, -8803840, -10185022, -10361720, -6101178, -2202770, -3225295, -5324351]
4225e324351J221820l08737q543242j2204974m413252N643887O671138J554703
4217a5703008K73156L595688M335314P26043j855496j157366q55935k669731l381340
4208a6692675j155669J578726L349847N948332R122015Q385709J789078n365314
4200F960049p048548m844647m774199p484980p520926k917181N06635k114360
4192b9238157o080838k893848O879303J2637523P194091l599416p987768k160634
4184b5249744O823026J0462376P131484R32702l911357n564418l787970L37259
4176a2826642L822387L274409j257483m923554l020041K503320M481859M480m996909
4167a2938174l968700P52476K122549j74515j0774L591715M025361q87373l303362
$$ y = [-5324351, -4102531, -4411268, -12954510, -25159484, -29572736, -23928849, -17257711, -15703008, -15429852, -11834164, -7498850, -6772807, -8628303, -9785669, -10641604, -13311335, -16692675, -17848344, -16269618, -12919771, -6971439, 2150576, 10536285, 12325363, 6960049, -88499, -4933146, -9707345, -17192325, -24713251, -27630432, -27123797, -29238157, -35318995, -38212843, -31333540, -18696017, -11501926, -15101342, -23089110, -25249744, -18426718, -7964342, -832858, 99844, -3811513, -9375931, -13163901, -12826642, -9004255, -5729846, -6987329, -11910883, -14930924, -12427604, -7945745, -7941265, -12938174, -16906874, -16154398, -14031849, -14206364, -14217138, -10625423, -6600062, -7487435, -10790797]
4158a0790797K310040Q671644N655148m384021j0399606q751404n898082n921610
4150b9508688n128820q59087K834413K136693R218J402656N652608P456657L807849
4141a2196501j968090k349927P403178K2172125K8871069J9782457K546493q476408
4133E5784396r367299q110565r521083q361089q13143O263465M437735l767072
4125B6545345q976699q122507o002477n326579k925760K765251O615803L037917
4117G610294n435852r810325n105697L520825P144859M164602J316987K995545
4109F401238M562170K34110o651708p957978l235818K8324j270927j720039K116595
4100g494033N208452K556252k623465m831454m901413o403107p773978m956744
$$ y = [-10790797, -8480757, 190887, 5846035, 1462014, -8937592, -17688996, -23587078, -29508688, -34637508, -35496595, -32662182, -30525489, -30516271, -29113615, -23461007, -16004350, -12196501, -14164591, -16514518, -9111340, 13060785, 41931854, 61714311, 64260804, 55784396, 46417097, 38306532, 28785449, 20424360, 19611217, 25874682, 30312417, 26545345, 17568646, 9446139, 3443662, -1882917, -4808677, -2043426, 4572377, 7610294, 2174442, -7635883, -12741580, -9220755, -2075896, 2088706, 3405693, 6401238, 10963408, 11197518, 4545810, -3412168, -6647986, -6619662, -7890589, -9610628, -7494033, -2285581, 270671, -2352794, -7184248, -12085661, -18488768, -26262746, -31219490]
4092c1219490P83546M298733M322565L900079M149460L302070J466371Q86714
4084h109952J316954J64800k212573k170339J046944L148778R45025k589951k071429
4075a0531743L010306P015149M280180m190308j0839103r294811j643760M136877
4067a8057213M063227J878474J541805Q44995l246649o889274l676519M628161
4059a8912993Q723543M362438j827436k042529K094161L069273j275020n236639
4051a1045202l800415P71621K905816J528161N41258J992018K544216j158443
4043e720970o333412p066060k583541J694884J901209L15012N55765K173621K902194
4034a2161298L125488M449874N718398M007358j095317o626646r015964o406554
$$ y = [-31219490, -30435944, -26137211, -21814646, -17914567, -13765107, -10463037, -8996666, -8109952, -6792998, -6628198, -8840771, -11011110, -9964166, -6815388, -5870363, -8460314, -10531743, -7521437, -506288, 3773892, -416416, -11255519, -20550330, -22194090, -18057213, -13993986, -12115512, -10573707, -9728712, -12975361, -19864635, -23541154, -18912993, -10189450, -5827012, -7654448, -9696977, -7602816, -4533543, -5808563, -11045202, -14845617, -14073996, -11168180, -9640019, -9098761, -7106743, -4562527, -5720970, -12054382, -19120442, -21703983, -20009099, -18107890, -17792878, -17237113, -15063492, -12161298, -9035810, -4585936, 1132462, 5139820, 4044503, -2582143, -11598107, -18004661]
4026a8004661L7925N664910N584675M29338l631524k747282j43515k57679j802147
4017a4869960r58938J566809K044291M62035J99314J600429J180028k404922o078533
4008a7259447o788039m684140j440788J439761K485541J333897j53464m04644
4000b5471323q18235k932666m387756j727186L717382P030592O335925M147655
3992a4105612K625475J601418P84827j95014l035370p549254q627528k149454
3984c0650512O990787R448070M094641q99156n19046J095144o46504l489024l556388
3975a8131988j738250n73989L43619J930978K855712K477678K279394J846555
3967h710291j328235n402080m091835L002604O970623K106687m732218m242209
$$ y = [-18004661, -17966736, -12301826, -6717151, -6287813, -9919337, -12666619, -12810134, -13067813, -14869960, -15828898, -14262089, -12217798, -11755763, -11556449, -9956020, -8775992, -11180914, -17259447, -24047486, -28731626, -30172414, -28732653, -26247112, -24913215, -25066679, -25471323, -26289558, -29222224, -33609980, -35337166, -31619784, -24589192, -18253267, -14105612, -11480137, -9878719, -9093892, -9288906, -12324276, -19873530, -28501058, -30650512, -23659725, -14211655, -10117014, -11016170, -11535216, -10440072, -11086576, -14575600, -18131988, -19870238, -20444227, -20100608, -18169630, -15313918, -12836240, -10556846, -8710291, -10038526, -15440606, -19532441, -16529837, -9559214, -7452527, -12184745, -16426954]
3959a6426954J749609M942827L764113K594146J541364k627232p113017n266423
3951a6841567J665883M993347K156786J86300L109279N477788K644742j312255
3943B080303j676385j554441n297389r355846p384050m91207N006749P096270
3935a1575996P969304O818723R83205o311601p675763k383392J901488N51901
3927i722131j868100l72613K320866J930126J296648N493924J1370921J0246513
3919B0696154Q33345q016208r162400n421064l152859l141997k044072R41571
3911h467530L466994M014540K780343K35607k199601k063493N51437J723298n57172
3902e15577k274758M32285L864155J663457m661166p276286l794446M0321M95884
$$ y = [-16426954, -14677345, -9734518, -5970405, -3376259, -1834895, -4462127, -11575144, -16841567, -15175684, -10182337, -8025551, -7839251, -4729972, 747816, 3392558, 2080303, 403918, -1150523, -6447912, -15803758, -23187808, -23679015, -18672266, -11575996, -3606692, 3212031, 4195236, -2116365, -9792128, -12175520, -10274032, -9722131, -11590231, -11962844, -9641978, -7711852, -6415204, -921280, 10449641, 20696154, 21529499, 13513291, 4350891, -1070173, -4223032, -7365029, -9409101, -8467530, -5000536, -985996, 1794347, 2029954, -169647, -2233140, -1681703, 41595, -515577, -2790335, -2358050, 1506105, 3169562, -1491604, -8767890, -12562336, -12522015, -12026131]
3893a2026131Q56418L590212N117899K766661K42299P88174R31374k512447m659476
3884d905017J11001O837953N266536m814636j2540248j0899993m362731L69070
3876b4938065L186572O233524P510961M556807L09322n30911J232008Q80682k408695
3867c967795m211624j623161K592705L957169J690700j423982k832548k123709
3859g942245r3693K219698L421724K182111j188496m208625m469825k356373l99852
3850a2835576J67817P28602K488077M006941L117070L61122j379259n56751J298766
3841b603191J700157j67976l261901o071623p557421p213126m993147j645528
3833c1813756R19489M95293l029182o350652n290376Q36135Q304267J2566899
$$ y = [-12026131, -11169713, -7579501, -2461602, 305059, 547358, 1335532, 2266906, -245541, -4905017, -4794016, 2043937, 7310473, 2495837, -10044411, -20944404, -25307135, -24938065, -21751493, -15517969, -8007008, -3450201, -3140879, -3671790, -2439782, -1559100, -3967795, -8179419, -9802580, -7209875, -3252706, -1562006, -2985988, -5818536, -7942245, -8035938, -5816240, -2394516, -212405, -1400901, -5609526, -10079351, -12435724, -12835576, -12667759, -11939157, -9451080, -5444139, -2327069, -1965947, -3345206, -3901957, -2603191, -903034, -1071010, -4332911, -10404534, -17961955, -25175081, -30168228, -31813756, -30894267, -30398974, -33428156, -39778808, -45069184, -44233049, -35928782, -23361883]
3825b3361883J1684425O511158l88768n469846o037688k667709J437249L993623
3817a4299439M978477M577308K637800O48902P98286J895301J24962m316176n845657
3808h800236j791583K601578J909942j098456p32234J654544M96063l228611k737912
3799a1726905K645071M848798q98779q453983r206274k766967M824377Q940141
3791a1794521Q171217K550327m917259p940467l453435L299033M935798J670248
3783g479059k50624J173274J280725k101183l326634K825693J1269941J1022718
3775A4414851m41198j2292822j2423615j496644Q510604Q430666N83660o807856
3767a522354r427431q588720o427371l460695j19089K653623M624463N973173
$$ y = [-23361883, -11677458, -5166300, -5555068, -11024914, -17062602, -19730311, -18293062, -14299439, -9320962, -4743654, -2105854, -1456952, -658666, 1236635, 1361597, -2954579, -8800236, -10591819, -7990241, -6080299, -7178755, -7910989, -6256445, -5760382, -8988993, -11726905, -9081834, -4233036, -5131815, -13585798, -22792072, -25559039, -20734662, -11794521, -3623304, -1072977, -5990236, -13930703, -17384138, -14085105, -9149307, -7479059, -7729683, -6556409, -5275684, -7376867, -10703501, -7877808, 3392133, 14414851, 13973653, 1680831, -10742784, -12239428, -3728824, 4701842, 5285502, -1522354, -10949785, -19538505, -25965876, -29426571, -29545660, -26892037, -22267574, -16294401]
3759a6294401N741540K458207l463450r131773j0974504o979744J270757Q197445
3751b9175923Q545029L788014J204314M203245P302620M481054j477189l680109
3743d808945k019176k099320m754591m607524L51854N126157N317680K026074
3735e467791k337606o679515q144802l611559L244336L804414l000025p406056
3727b9598604k692629M791093N471539J66127l182622j478365K164953N309597
3719a9048911P227367N894864Q53093l230167k310003J10277j571425n152783
3711a7227688l766710K530509O326215M017854p8227j714049j925516k554543
3703a4392155k625446j549643j136528k087698k190107J63307L528544N502153
$$ y = [-16294401, -10552861, -8094654, -11558104, -20689877, -31664381, -38644125, -37373368, -29175923, -20630894, -16842880, -15638566, -11435321, -4132701, 348353, -1128836, -4808945, -6828121, -8927441, -13682032, -18289556, -17937702, -12811545, -7493865, -5467791, -7805397, -14484912, -22629714, -26241273, -22996937, -19192523, -22192548, -29598604, -32291233, -27500140, -22028601, -21862474, -25045096, -26523461, -24358508, -19048911, -11821544, -5926680, -5073587, -8303754, -10613757, -10503480, -12074905, -17227688, -20994398, -18463889, -12137674, -8119820, -8198047, -9912096, -11837612, -14392155, -17017601, -18567244, -19703772, -21791470, -23981577, -23818270, -20289726, -14787573]
3695a4787573M850213J598394k452441m172879k963503k521541n229563p186462
3687c2865355l667837K775221N574025L676588J352778R3843j890462l080868
3679b8032067J78981N727952P042945L429087N98115M50884n23111j576200K685694
3670a0017720J0014626R580479r64006q703794l812094N317484N267176k422141
3662D260010o130142l116438j047799l397177n172045k973037M28501K098869
3654a5049258J764859j149881o096960p953146k589461N146702P054395M072315
3646a4800435M075327P803551P690719K208814k066N216237R072731K937737q040963
3637A6161652j2510846q636547m066826l565078m580848l909206j987954k45488
$$ y = [-14787573, -9937360, -8338966, -10791407, -14964286, -17927789, -20449330, -25678893, -32865355, -36533192, -33757971, -28183946, -24507358, -23154580, -23060737, -24951199, -28032067, -27853086, -22125134, -15082189, -11653102, -11054987, -10604103, -11127214, -12703414, -10017720, -3094, 9577385, 8613379, -90415, -3902509, 1414975, 6682151, 4260010, -1870132, -4986570, -6034369, -9431546, -14603591, -17576628, -17148127, -15049258, -13284399, -14434280, -20531240, -28484386, -31073847, -25927145, -18872750, -14800435, -10725108, -2921557, 4769162, 6977976, 6975910, 12192147, 21264878, 24202615, 16161652, 3650806, -4985741, -9052567, -12617645, -17198493, -21107699, -23095653, -23341141]
3629b3341141R30365J060047o3672q78076N8518J175666J43981j481709K18250
3620b2177771M877159O793775K658005k852486k714668K681583N718535K193364
3612b822504k571310j502308L551969M404727j138375o123412n292130k413459
3604a3906802k681036l828619j243538K521231J363784l486142m586639M3723
3596b5804038M340643M147746K271084J928296K208639K284761L465402M576400
3588e81067J940146l323553m939687j673742m34906m828147q299935m724165J305515
3579b5559541K290985L499J246259N712471P021076L415187p88352k848810l379000
3570a2886226k107431J049499K393972r66432m868146l869518q66723k151180
$$ y = [-23341141, -22410776, -21350729, -21414401, -22292477, -22233959, -21058293, -20914312, -22396021, -22177771, -17300612, -10506837, -7848832, -10701318, -13415986, -10734403, -5015868, -2822504, -5393814, -6896122, -3344153, 1060574, -77801, -6201213, -11493343, -13906802, -16587838, -20416457, -21659995, -19138764, -17774980, -21261122, -25847761, -25804038, -21463395, -17315649, -15044565, -13116269, -10907630, -8622869, -5157467, -581067, 1359079, -1964474, -6904161, -8577903, -9012809, -13840956, -22140891, -26865056, -25559541, -23268556, -23265057, -22018798, -16306327, -9285251, -5870064, -6658416, -9507226, -12886226, -14993657, -13944158, -11550186, -12516618, -17384764, -21254282, -22121005, -24272185]
3562b4272185n012468j021107Q612122J2723515P384860J803202K752808M145088
3554G115835j203589q719723r371244l292936K055799K807708O75933k130985
3546a2063202l684660j655053K514187K821174k350679n465804o68930N853050
3538a4699917M788838j400305k596135K522414N170645J395229k647656k380755
3530i847642j620134l799128n178573k129900J777752J794361k75205j48384J372520
3521a8054333P93353j152891p21559K398675M762413M291906J734345j990535
3513g938626o133136q534932p291396l869145j725335j843719j813301Q33183
3505c8316407N901069J0447447J0379628M047613m125720o263941j49530O748323
$$ y = [-24272185, -29284653, -30305760, -21693638, -8970123, -1585263, 217939, 2970747, 7115835, 5912246, -2807477, -12178721, -15471657, -13415858, -10608150, -9932217, -12063202, -15747862, -17402915, -14888728, -12067554, -14418233, -19884037, -20552967, -14699917, -9911079, -11311384, -13907519, -11385105, -6214460, -4819231, -7466887, -9847642, -11467776, -15266904, -20445477, -22575377, -20797625, -19003264, -19278469, -19426853, -18054333, -17260980, -18413871, -19135430, -16736755, -11974342, -7682436, -5948091, -7938626, -14071762, -22606694, -29898090, -33767235, -35492570, -37336289, -39149590, -38316407, -32415338, -21967891, -11588263, -7540650, -11666370, -17930311, -18079841, -11331518]
3497a1331518O086141o67170n034839l486837p05067p69052j399403N62225L110455
3488a3635065K465270o38858j994394K85956L972321N659230L506841j478013
3480a856712n168941l460565K186348M931165J184273l891765l785897p13829
3472a0575923j861959o739111o485787K117098J0062802Q819738L087009L072786
3464A496653Q120688P760578j274500q939849o264208K043100N190495J105618
3456I238575l342958l955444l529604m796295n739882l954494q65056R66199J366302
3447a4612657R97926q28148m096468o031395l994140P58567M501114N158023L102142
3438a5045036n17656l566986k539648L759086J0220597R184726k24104r600829
$$ y = [-11331518, -5245377, -5912547, -10947386, -14434223, -15139290, -15908342, -17307745, -16745520, -13635065, -11169795, -11808653, -13803047, -13517091, -9544770, -3885540, -378699, -1856712, -7025653, -10486218, -8299870, -3368705, -2184432, -6076197, -9862094, -10575923, -12437882, -19176993, -25662780, -23545682, -13482880, -4663142, -1576133, 1496653, 9617341, 17377919, 16103419, 7163570, 899362, 2942462, 8132957, 9238575, 5895617, 1940173, -1589431, -6385726, -12125608, -16080102, -16945158, -15978959, -14612657, -13614731, -14442879, -18539347, -24570742, -28564882, -27806315, -23305201, -18147178, -15045036, -15562692, -19129678, -21669326, -17910240, -7689643, 1495083, 1270979, -8329850]
3430h329850j0460891l840988J951994J767529j471273k240666L45746K390199
3422a9888200O80444l517911n856338l179069L305599Q542745P886349J715079
3414a0311302m526837n733920k266312J271555J945865J502556L006499O181467
3406h930429P726181N733430K122595J47466L96452K08408k815078p235576q501212
3397a1147763l764107M400391R943778R062829L310492k709731n431574m137677
3389d73362p75810R48975j754860p023940q687400k982688N686377Q666291L152522
3380c243895m357031n945120j349423K809066J466570l577787o638743m478076
3372b5314439J108013N921999P269643N207322J287804k432462l521948o06679
$$ y = [-8329850, -18790741, -22631729, -20679735, -18912206, -20383479, -22624145, -22278399, -19888200, -19207756, -22725667, -28582005, -31761074, -28455475, -19912730, -12026381, -10311302, -14838139, -20572059, -22838371, -21566816, -19620951, -18118395, -15111896, -8930429, -1204248, 4529182, 6651777, 6799243, 7195695, 7404103, 4589025, -2646551, -11147763, -14911870, -10511479, -567701, 8495128, 11805620, 9095889, 3664315, -473362, -1249172, -300197, -2055057, -9078997, -17766397, -20749085, -15062708, -6396417, -3243895, -7600926, -13546046, -14895469, -12086403, -10619833, -14197620, -20836363, -25314439, -24206426, -18284427, -11014784, -5807462, -4519658, -6952120, -10474068, -11080747]
3364a1080747M213609O329715L872568L43610l67921K07757k083484o643067q479856
3355a3687816o181693l922830l556516o21600P387535J3709019R934319j338023
3347A722395q505921n659829J089609L424040J066688r42095o46251l40945j526102
3338a0318411k836941k637095j017620P25810J089230n54558k604830k106504
3330b0260919J408486M204773K665588j503154l004263J16090L819919L328205
3322i225275q08298l461321j186852L549886M996616Q79494m320929m295337R04808
3313a2967208M108755K56134n976889n547012K694563R774139Q070951P38993
3305A152426l635486k681312j809574n179524j0101831j1615449q766484m103916
$$ y = [-11080747, -6867138, -537423, 3335145, 3678755, 3310834, 3518591, 1435107, -5207960, -13687816, -19869509, -23792339, -27348855, -27970455, -20582920, -6873901, 3060418, 1722395, -6783526, -12443355, -11353746, -7929706, -6863018, -7805113, -8451364, -8792309, -10318411, -13155352, -15792447, -16810067, -16084257, -14995027, -15549585, -18154415, -20260919, -18852433, -14647660, -11982072, -13485226, -16489489, -16373399, -12553480, -9225275, -10033573, -13494894, -14681746, -11131860, -6135244, -5255750, -9576679, -13872016, -12967208, -8858453, -8602319, -14579208, -20126220, -17431657, -7657518, 413433, 1152426, -2483060, -5164372, -6973946, -12153470, -22255301, -33870750, -42637234, -46741150]
3297d6741150L93565M188102O514106O578159N117219L842964L308673K524536
3289a4273826N31068k472617n053267m938835p14569N567098Q802488N965432
3281f587028Q9437l083072j908949K31166O07385N43192K073928M051105L847572
3272a35264J497878j40576Q68364L093812L303654J8830m538272o216138l119799
3263e367511K242138N569318M888537J261233l281225o631235o653348l144480
3255a1116573P40116J841787J231718J839748K742458N50047l609117m483292
3247a0263108j464774k98639k954971k937372L832393J0097492P239939o77343
3239B573617k540594K698081N190020M96919m159048k791419K33779p79071l103955
$$ y = [-46741150, -46347585, -42159483, -35645377, -29067218, -23949999, -20107035, -16798362, -14273826, -13742758, -16215375, -21268642, -26207477, -26922046, -21354948, -12552460, -6587028, -6497591, -9580663, -11489612, -11258446, -10651061, -10107869, -8033941, -3982836, -135264, 1362614, 1222038, 2090402, 5184214, 8487868, 8506698, 3968426, -2247712, -5367511, -3125373, 2443945, 7332482, 8593715, 5312490, -1318745, -7972093, -11116573, -10376457, -8534670, -7302952, -5463204, -2720746, -2170699, -5779816, -10263108, -11727882, -12026521, -14981492, -17918864, -14086471, -3988979, 3250960, 2573617, 33023, 2731104, 7921124, 8418043, 4258995, 1467576, 1701355, 922284, -2181671]
3230b181671j788248Q07472m11980l495034k609567J287316J310202l970104p676276
3221a8727890m902727M48309K035757m66513k807058k733585j332931K93544J907190
3212b6285904K203860n29649m914927o196843j488693N844406R404174P370851
3204a4592725M351498M388970M824089M13326p787968j2290797q946754k604030
3196c2244391k06177j480943o77355L924896P085860M188779j908651m236407
3188b5554389m21349M684327N385146K073574m0078J567366L236178N28910n092192
3179a3632507p879841n121241M27586N143107P746720P321135K609689m272895
3171g658247p277409l365483K359392K487853k995186o749552l493640M083352
$$ y = [-2181671, -3969919, -3162447, -3574427, -7069461, -9679028, -8391712, -7081510, -11051614, -18727890, -23630617, -23182308, -21146551, -21613064, -24420122, -27153707, -28486638, -28193094, -26285904, -24082044, -24611693, -29526620, -35723463, -37212156, -31367750, -21963576, -14592725, -10241227, -5852257, -1028168, -614842, -8402810, -20693607, -29640361, -32244391, -32450568, -33931511, -34608866, -30683970, -23598110, -19409331, -21317982, -25554389, -25975738, -21291411, -15906265, -13832691, -13872769, -12305403, -9069225, -8540315, -13632507, -21512348, -26633589, -26206003, -21062896, -13316176, -5995041, -3385352, -7658247, -14935656, -18301139, -15941747, -13453894, -16449080, -23198632, -26692272, -22608920]
3163b2608920R165704P740508J065741o321123r770943p108810K85089Q275549
3155a9277205J1840775P773471j780172q731837o001687L365424Q173389K988707
3147a649135m427096m330166O89911J82698p302578j1040711l776508P454795
3139b4198790J0728046L960902m881794q564964o316161j108527L589351N026584
3131b1765353L215575J662680L118235N282318L873357p25369l569388j991124
3123a0899069J298817K736934K131877R61254m44459j921705k151494o93775O55234
3114h326386R74596K536717O701711R370671N290599l389878q069490m601544
3106D86996J579851L671547K013537N28391p76363l873400o323612l910085J315451
$$ y = [-22608920, -13443216, -5702708, -4636967, -10958090, -20729033, -27837843, -27552754, -19277205, -7436430, 337041, -1443131, -10174968, -16176655, -12811231, -4637842, -1649135, -6076231, -10406397, -9716486, -9533788, -16836366, -27877077, -31653585, -24198790, -13470744, -9509842, -14391636, -22956600, -29272761, -30381288, -26791937, -21765353, -18549778, -16887098, -13768863, -8486545, -4613188, -5338557, -8907945, -10899069, -9600252, -6863318, -4731441, -3770187, -4214646, -6136351, -8287845, -8981620, -8326386, -7351790, -4815073, 1886638, 11257309, 16547908, 13158030, 5088540, 486996, 2066847, 5738394, 7751931, 8280322, 7503959, 3630559, -2693053, -6603138, -5287687]
3097e287687K723030p60357l175326j544302j66452k203669m128083k847755j826022
3088a9216623m438073o802256l981720R93645J728589r11351n35941L968220O999265
3079b2196245N407706K247564Q44815J132747K540660M947220O052292L109353
3071D086112k017570m629396m466990n769631r415805j0808405p017055p04324
3063d0743064M537052P687762Q006085M791791R68147J249658M887082N825727
3055b789760J939371j886098k103809j527311k924605l839953j680959J475548
3047a3337576K880933K822367J348521k723951o422205l469455N057506Q600943
3039e242917J648381o971842o593118K76627L820641J735615j247393l643549
$$ y = [-5287687, -2564657, -3325014, -6500340, -8044642, -8211094, -10414763, -14542846, -17390601, -19216623, -23654696, -30456952, -34438672, -33445027, -31716438, -32627789, -33163730, -29195510, -22196245, -16788539, -14540975, -13696160, -12563413, -10022753, -5075533, 976759, 4086112, 2068542, -2560854, -7027844, -12797475, -22213280, -33021685, -40038740, -40743064, -36206012, -28518250, -20512165, -15720374, -14752227, -13502569, -8615487, -2789760, -850389, -2736487, -4840296, -6367607, -9292212, -13132165, -14813124, -13337576, -10456643, -7634276, -6285755, -9009706, -15431911, -18901366, -13843860, -5242917, -3594536, -10566378, -17159496, -16882869, -13062228, -11326613, -12574006, -16217555]
3031a6217555o709753p280931j728683N166762N577393J172936K2612K453080
3023a7544139J297685l966456n349466m34416L212160J126464j177499J149837
3015b1685830M512842M884036M624149N586143L890180j880840n124305j344722
3007f538347L097451P47769m290804k970457L494631N355818q8685m548170j797364
2998g538158L417360K902026l856804r838978r092623k341308M932294Q131878
2990a3284313O985316L803873l05157n421958r505030q754798k850696L199128
2982b6133635M606413J911093j086744j750595P40047N784590R965556Q651312
2974B688037K044080l504893l489469j295267k382483n690874n871504j878814
$$ y = [-16217555, -22927308, -30208239, -31936922, -26770160, -21192767, -20019831, -19997219, -17544139, -16246454, -20212910, -25562376, -25996792, -22784632, -21658168, -22835667, -21685830, -17172988, -12288952, -7664803, -2078660, 1811520, -69320, -5193625, -6538347, -3440896, -2693127, -6983931, -9954388, -6459757, -1103939, -1192624, -5740794, -7538158, -4120798, -1218772, -5075576, -14914554, -24007177, -26348485, -21416191, -13284313, -6298997, -2495124, -2800281, -8222239, -17727269, -26482067, -29332763, -26133635, -21527222, -19616129, -20702873, -22453468, -21713421, -15928831, -5963275, 2688037, 4732117, 1227224, -2262245, -3557512, -5939995, -11630869, -17502373, -19381187]
2966a9381187K069571L083673K148694N86595j219489j528416J669861O401029
2958f169669P488435K952401l254840o019095m313589r95986O32460m27330k024178
2949a2131391q97341K986474N195353K239974k924297m059401P7298M188436L726935
2940a597960L68468j330598k00484Q68488m78665k806808k841782n2114K020924
2931f050531J23808l963853n407133k815837M27080J801598K480453K905730M65953
2922a0032732m829643o976498j685372N791614O719662P32746m766080n687736
2914b0734039m630307l337192M43020O509345R522535O381432J164548r10049
2906e590707j77887L45632M45191J140005R60758j526152l656554j857644K212247
$$ y = [-19381187, -17311616, -14227943, -12079249, -11492654, -12712143, -14240559, -12570698, -6169669, 1318766, 4271167, 1016327, -5002768, -9316357, -10312343, -9679883, -10107213, -12131391, -13028732, -10042258, -4846905, -2606931, -5531228, -9590629, -9513331, -5324895, -1597960, -1229492, -2560090, -2760574, -1892086, -2370751, -5177559, -8019341, -8071455, -6050531, -5926723, -9890576, -15297709, -18113546, -17686466, -15884868, -13404415, -10498685, -10032732, -14862375, -21838873, -23524245, -17732631, -11012969, -10280223, -15046303, -20734039, -25364346, -28701538, -28258518, -21749173, -12226638, -5845206, -4680658, -5590707, -5768594, -5422962, -4977771, -3837766, -2877008, -4403160, -8059714, -9917358, -7705111]
2897g705111L252821m1587l136448k406864m2726J3706j585478p51552L201417
2888i201822N707079L529774n8566k51572J327902q07717n670416n163229L148942
2879g439625R688515N575888l717635n910482J29044L893557Q6903m553702l560163
2870e807700L0049J396238K306272N281104O228596P13875o925934q699433m626534
2861a0103467j801743l047911l680234O7771N603714Q566149Q239504O415533
2853A0259316M064030J132143k054889m492129n021820l273410o48590O17387
2845E82038J67639k18233R2190n86854k689029l533136j450483Q73389J11214
2836f651265k925337n159754n596753m762565k407112P47900J717700k52652p91267
$$ y = [-7705111, -4452290, -4493877, -7630325, -10037189, -10079915, -10066209, -11651687, -12403239, -9201822, -3494743, 35031, -23535, -275107, 1052795, 245078, -5425338, -10588567, -7439625, 2248890, 7824778, 4107143, -1803339, -1674295, 2219262, 2306165, -2247537, -5807700, -5777651, -4381413, -2075141, 3205963, 9434559, 10148434, 3222500, -5476933, -10103467, -11905210, -14953121, -18633355, -18565584, -12961870, -4395721, 3843783, 10259316, 14323346, 15455489, 13400600, 8908471, 3886651, 613241, -35349, 582038, 749677, 531444, 623634, 36780, -2652249, -6185385, -7635868, -6762479, -6651265, -9576602, -14736356, -20333109, -25095674, -27502786, -26754886, -25037186, -25289838, -26081105]
2827b6081105L165776O928967M153929k706766n188945j376403J793379l97117
2819a9708285m217081m388742q99439L652691P767598R254280N354929j778143
2811d962192m828912o38277M685889M274254j85830k642873k272593k625793l667235
2802a2863562j668175L155943N251349J613385l596906m573459q42175L395251
2794a0128349M621139K684816l95162k482589k860531k924876m813451q407114
2786b4706117j0272040o896173Q56216P622034Q650437M425976p14129l733559
2778b4767355m694322l814627k26424M698540O304965K507836j776638o70645
2770b2438670L643275L485318k729697p471726m594684K406266N803533L320436
$$ y = [-26081105, -22915329, -15986362, -11832433, -14539199, -19728144, -21104547, -19311168, -19708285, -23925366, -28314108, -29213547, -25560856, -17793258, -8538978, -3184049, -4962192, -9791104, -10429381, -5743492, -1469238, -1655068, -4297941, -6570534, -9196327, -12863562, -14531737, -11375794, -6124445, -4511060, -8107966, -12681425, -13523600, -10128349, -5507210, -2822394, -3217556, -5700145, -8560676, -11485552, -16299003, -24706117, -34978157, -41874330, -41018114, -33396080, -24745643, -20319667, -21033796, -24767355, -29461677, -33276304, -33502728, -28804188, -22499223, -19991387, -21768025, -22438670, -18795395, -15310077, -18039774, -25511500, -30106184, -27699918, -21896385, -18575949]
2762a8575949j016966k736427m83527L885413O229615L530751j709660l600508
2754a4477258j156865q213k987466m430245J105677R175546J1142044O265582
2746D628802R70711j624686l647621n176021l527964m12337j427444o263531p174290
2737b3654381o70468O231943N998138R06236j956787j263267q53750j622080l35706
2728a7220122M239578Q908509R878273O073369o80041o276605o539174j695300
2720c311513K625266J735084k127106l229995l69306K274009J658642n89879j530090
2711b864888n30135J309913K838368K977558J072051j887249l567938k537609
2703c189929K92047K411822J592959k124381n673769n462596j641206J602166
$$ y = [-18575949, -19592915, -22329342, -22812869, -18927456, -12697841, -9167090, -10876750, -14477258, -15634123, -15642336, -18629802, -23060047, -21954370, -12778824, -1636780, 4628802, 5599513, 3974827, 327206, -4848815, -8376779, -8789116, -10216560, -16480091, -23654381, -24324849, -18092906, -12094768, -11188532, -13145319, -14408586, -15262336, -16884416, -17220122, -12980544, -4072035, 5806238, 11879607, 11199566, 4922961, -1616213, -3311513, -686247, 1048837, -1078269, -4308264, -4677570, -2403561, -744919, -1334798, -2864888, -3395023, -2085110, 753258, 3730816, 4802867, 2915618, -652320, -3189929, -2897882, -486060, 1106899, -1017482, -6691251, -12153847, -13795053, -12192887]
2695a2192887J294591n27757p5054K869107N152732M483003J262974k577269m644312
2686d954872l581584j462480k424120o505299p886419k884693L579387M640109
2678b1479971J732204J476691M151713L508197j622195m291013o69324L711769
2670a3481929L266548Q50155J441597L386519K573679N92904J260163K282624
2662B172260j541655q258209r997622m798478J67240p01116l740345k526246K491511
2653b6732660N305397L183318O4871R06650N135923P366017M432062m2694j52841
2644e33957L911307N561278R06635n903454q960359q081934o123512k942555K181323
2635a9985228N227449J791598m541599n724499j158078J597468q33752k623577
$$ y = [-12192887, -10898296, -11426053, -11501107, -8632000, -3479268, 1003735, 2266709, -310560, -4954872, -8536456, -9998936, -12423056, -18928355, -26814774, -29699467, -26120080, -21479971, -19747767, -18271076, -14119363, -10611166, -12233361, -16524374, -17193698, -13481929, -10215381, -9365226, -7923629, -4537110, -1963431, -1370527, -110364, 2172260, 630605, -7627604, -17625226, -22423704, -22256464, -22957580, -26697925, -29224171, -26732660, -21427263, -18243945, -18179074, -17272424, -12136501, -4770484, -338422, -381116, -533957, 3377350, 8938628, 9845263, 3941809, -5018550, -13100484, -19223996, -22166551, -19985228, -14757779, -12966181, -17507780, -23232279, -24390357, -22792889, -23626641, -26250218]
2627b6250218R46139N584659N050626K45144l777191n099755m194480j70036O638549
2618b1026563J1465793R959604M208703m07127k060312k187538j387157k34837
2610a669434j203049m613415n547130n31285N425700N160857O54431M06403O231778
2601D314856J0540851P628485M27063n637160q837798r120890o292212k943866
2593i920671l379803o701376o477593l89846N343100M786142J78737l066215l969460
2584b3596985l762366j115953M405341Q041521N450078q8236k257707j171370
2576a4095677j806339m788214n761742l388167j042908r9250J801608M473406
2568b4707283L721360j238658m591269j797884L630089N152413J960306j089785
$$ y = [-26250218, -25304079, -19719420, -14668794, -14423650, -18200841, -23300596, -27495076, -27665112, -21026563, -9560770, 398834, 4607537, 4200410, 2140098, -47440, -1434597, -1669434, -2872483, -7485898, -13033028, -13564313, -8138613, -2977756, -2323325, -1916922, 4314856, 14855707, 22484192, 22911255, 17274095, 8436297, -684593, -6976805, -9920671, -13300474, -20001850, -26479443, -26869289, -21526189, -16740047, -16561310, -19627525, -23596985, -27359351, -28475304, -24069963, -16028442, -10578364, -10666600, -12924307, -14095677, -15902016, -20690230, -26451972, -29840139, -30883047, -30982297, -29180689, -24707283, -20985923, -22224581, -26815850, -28613734, -24983645, -19831232, -17870926, -18960711]
2560a8960711m13473K750703M848567L819650R11757m19320J387253K952620k82468
2551c405422o715790q887962l230764M312039N900948J957653q07345M79868K123756
2542h273019J116758l00514O04391J780435o42470n839721q106067l526770N004918
2533a8182059J0349373Q224946J241439m163127m389253j625392j19225q26806
2525i490104j199306K77738J600026L89556k063417k075797J293724M639876M746578
2516a881126K759841J732514J448542r15466n072193o744382m279860k135168
2508a5087298m277709p392434n541814N70167M831131N146097M849049M485285
2500a2417526K55419o617124p359899J634478J0513923Q464896m55816l554071
$$ y = [-18960711, -19374184, -16623481, -11774914, -7955264, -7043507, -7462827, -6075574, -3122954, -3405422, -10121212, -19009174, -22239938, -17927899, -12026951, -10069298, -10876643, -10396775, -8273019, -7156261, -7456775, -6852384, -5071949, -5714419, -11554140, -19660207, -23186977, -18182059, -7832686, 392260, 1633699, -2529428, -6918681, -8544073, -8663298, -9490104, -10689410, -10411672, -8811646, -8422090, -10485507, -12561304, -11267580, -6627704, -1881126, 878715, 2611229, 4059771, 3144305, -1927888, -8672270, -12952130, -15087298, -19365007, -26757441, -32299255, -31729088, -26897957, -21751860, -16902811, -12417526, -12162107, -18779231, -26139130, -24504652, -13990729, -5525833, -5981649, -9535720]
2492i535720J318945L873673j028221n313155j439967N353427N502167o79245
2484a948096n031397m012058j560654j164951j822186j816953j077611O94801
2476a7739105L802448O023410M434537L70232j435846L70233J808916L1652k076334
2467d409857n62249L149264M163362J343670j059049L31944K971175J747341l789248
2458C886353q333473p724415m455946l801725n946612n898795j519341K730678
2450c1063276K276160j013701k106145R6922K770874M187517M564100L477213
$$ y = [-9535720, -8216775, -4343102, -5371323, -10684478, -12124445, -6771018, -1268851, -1948096, -6979493, -10991551, -12552205, -13717156, -15539342, -17356295, -18433906, -17739105, -13936657, -7913247, -3478710, -3108478, -4544324, -4174091, -2365175, -2333523, -4409857, -4972106, -1822842, 2340520, 3684190, 2625141, 2957085, 5928260, 7675601, 3886353, -4447120, -12171535, -16627481, -20429206, -26375818, -32274613, -33793954, -31063276, -28787116, -29800817, -31906962, -31810040, -29039166, -24851649, -20287549, -16810336]
$$ [...]
##END NTUPLES=NMR SPECTRUM
##END=
