##TITLE=31P_DE-80H_X3
 64 sc D2O
 26.2.2025
##JCAMPDX= 6.0         $$ Bruker NMR JCAMP-DX V2.0
##DATA TYPE= NMR SPECTRUM
##DATA CLASS= NTUPLES
##ORIGIN= UXNMR, Bruker Analytische Messtechnik GmbH
##OWNER= root
$$ XWIN-NMR		Version 3.5
$$ Wed Jul 23 16:00:34 2025 Russian Standard Time (UT+4h)  Yarkov@DPX200
##.OBSERVE FREQUENCY= 81.013821
##.OBSERVE NUCLEUS= ^31P
##.ACQUISITION MODE= SIMULTANEOUS
##.ACQUISITION SCHEME= undefined
##.AVERAGES= 64
##.DIGITISER RES= 17
##SPECTROMETER/DATA SYSTEM= spect
##.PULSE SEQUENCE= zgpg30
##.SOLVENT NAME= MeOD
##.SHIFT REFERENCE= (INTERNAL, MeOD, 0, 198.062)
##AUDIT TRAIL= $$ (NUMBER, WHEN, WHO, WHERE, WHAT)
$$ ##TITLE= Audit trail, XWIN-NMR		Version 3.5
$$ ##JCAMPDX= 5.01
$$ ##ORIGIN= Bruker BioSpin GmbH
$$ ##OWNER= Yarkov
$$ C:/Bruker/XWIN-NMR/data/yarkov2/nmr/P31/2/pdata/1/auditp.txt
$$ ##AUDIT TRAIL=  $$ (NUMBER, WHEN, WHO, WHERE, WHAT)
(   1,<2025-07-23 16:00:04.51 +0400>,<Yarkov>,<DPX200>,
      <created by zg, POWCHK disabled, PULCHK disabled
       configuration hash MD5:
       00 E9 B6 7A A2 85 ED C7 34 08 36 98 17 FE 4E 26
       data hash MD5: 32K
       D8 C2 A2 1C C8 FF 70 22 4D F0 92 3E 8B 58 6B A2>)
(   2,<2025-07-23 16:00:13.64 +0400>,<Yarkov>,<DPX200>,
      <Start of raw data processing
       efp BC_mod = 2 LB = 1.5 FT_mod = 6 PKNL = 1 PHC0 = 1662.243 PHC1 = 49.15953 SI = 64K 
       data hash MD5: 64K
       FC D5 83 21 8F 1F 97 E6 CF 74 6E 6A 7A 57 51 67>)
$$ ##END=
$$ 
$$ hash MD5
$$ 86 14 54 5C DB 2F 1B DE CE 24 0E 95 1D 82 B5 F9
##$RELAX= 
##$RELAX= 
##$RELAX= 
##$RELAX= 
##$RELAX= 
##$RELAX= 
##$RELAX= 
##$RELAX= 
$$ Bruker specific parameters
$$ --------------------------
##$DU= <C:/Bruker/XWIN-NMR>
##$EXPNO= 2
##$NAME= <P31>
##$PROCNO= 1
##$TYPE= <nmr>
##$USER= <yarkov2>
##$AMP= (0..31)
100 100 100 100 100 100 100 100 100 100 100 100 100 100 100 100 100 100 
100 100 100 100 100 100 100 100 100 100 100 100 100 100 
##$AQSEQ= 0
##$AQ_mod= 1
##$AUNM= <au_zg>
##$AUTOPOS= <>
##$BF1= 81.014009
##$BF2= 200.13
##$BF3= 200.13
##$BF4= 200.13
##$BF5= 200.13
##$BF6= 200.13
##$BF7= 200.13
##$BF8= 200.13
##$BYTORDA= 1
##$CFDGTYP= 0
##$CFRGTYP= 5
##$CHEMSTR= <none>
##$CNST= (0..31)
1 1 145 1 1 1 1 1 1 1 1 1 1 1 1 1 1 1 1 1 1 1 1 1 1 1 1 1 1 1 1 1 
##$CPDPRG= <waltz16>
##$CPDPRG1= <>
##$CPDPRG2= <waltz16>
##$CPDPRG3= <>
##$CPDPRG4= <mlev>
##$CPDPRG5= <mlev>
##$CPDPRG6= <mlev>
##$CPDPRG7= <mlev>
##$CPDPRG8= <mlev>
##$CPDPRGB= <>
##$CPDPRGT= <>
##$D= (0..31)
0 1 0 0 0 0 0 0 0 0.06 0 0.03 2e-05 3e-06 0 0 0.0002 0 0 0 0 0 0 0 0 0 
0 0 0 0 0 0 
##$DATE= 1753272004
##$DBL= (0..7)
120 120 120 11 120 120 24 19 
##$DBP= (0..7)
150 150 150 150 150 150 150 150 
##$DBP07= 0
##$DBPNAM0= <>
##$DBPNAM1= <>
##$DBPNAM2= <>
##$DBPNAM3= <>
##$DBPNAM4= <>
##$DBPNAM5= <>
##$DBPNAM6= <>
##$DBPNAM7= <>
##$DBPOAL= (0..7)
0.5 0.5 0.5 0.5 0.5 0.5 0.5 0.5 
##$DBPOFFS= (0..7)
0 0 0 0 0 0 0 0 
##$DE= 6
##$DECBNUC= <off>
##$DECIM= 4
##$DECNUC= <off>
##$DECSTAT= 4
##$DIGMOD= 1
##$DIGTYP= 9
##$DL= (0..7)
0 0 52 120 120 21 21 25 
$$ [...]
##$SUBNAM2= <"">
##$SUBNAM3= <"">
##$SUBNAM4= <"">
##$SUBNAM5= <"">
##$SUBNAM6= <"">
##$SUBNAM7= <"">
##$SUBNAM8= <"">
##$SUBNAM9= <"">
##$SW= 400.765351723535
##$SWIBOX= (0..15)
0 1 3 0 0 0 0 0 0 0 0 0 0 0 0 0 
##$SW_h= 32467.5324675325
##$TD= 32768
##$TD0= 1
##$TE= 0
##$TE2= 300
##$TE3= 300
##$TEG= 300
##$TL= (0..7)
0 120 53 12 22 120 120 120 
##$TP= (0..7)
150 150 150 150 150 150 150 150 
##$TP07= 0
##$TPNAME0= <>
##$TPNAME1= <>
##$TPNAME2= <>
##$TPNAME3= <>
##$TPNAME4= <>
##$TPNAME5= <>
##$TPNAME6= <>
##$TPNAME7= <>
##$TPOAL= (0..7)
0.5 0.5 0.5 0.5 0.5 0.5 0.5 0.5 
##$TPOFFS= (0..7)
0 0 0 0 0 0 0 0 
##$TUNHIN= 0
##$TUNHOUT= 0
##$TUNXOUT= 0
##$USERA1= <user>
##$USERA2= <user>
##$USERA3= <user>
##$USERA4= <user>
##$USERA5= <user>
##$V9= 5
##$VALIST= <valist>
##$VCLIST= <CCCCCCCCCCCCCCC>
##$VD= 0
##$VDLIST= <DDDDDDDDDDDDDDD>
##$VPLIST= <PPPPPPPPPPPPPPP>
##$VTLIST= <TTTTTTTTTTTTTTT>
##$WBST= 1024
##$WBSW= 4
##$XGAIN= (0..3)
0 0 0 0 
##$XL= 0
##$YL= 0
##$YMAX_a= 103
##$YMIN_a= -1221
##$ZGOPTNS= <>
##$ZL1= 120
##$ZL2= 120
##$ZL3= 120
##$ZL4= 120
##$ABSF1= 0
##$ABSF2= 0
##$ABSG= 0
##$ABSL= 0
##$ALPHA= 0
##$AQORDER= 0
##$ASSFAC= 0
##$ASSFACI= 0
##$ASSFACX= 0
##$ASSWID= 0
##$AUNMP= <proc_1d>
##$AZFE= 0.1
##$AZFW= 0.5
##$BCFW= 0
##$BC_mod= 2
##$BYTORDP= 0
##$COROFFS= 0
##$CY= -3
##$DATMOD= 1
##$DC= 0
##$DFILT= <>
##$DTYPP= 0
##$F1P= 0
##$F2P= 0
##$FCOR= 1
##$FTSIZE= 65536
##$FT_mod= 6
##$GAMMA= 0
##$GB= 0
##$INTBC= 1
##$INTSCL= 9.790993e-09
##$ISEN= 30
##$LB= 1.5
##$LEV0= 0
##$LPBIN= 0
##$MAXI= 10000
##$MC2= 0
##$MEAN= 0
##$ME_mod= 0
##$MI= 50
##$NCOEF= 0
##$NC_proc= -13
##$NLEV= 6
##$NOISF1= 182.463
##$NOISF2= 159.3651
##$NSP= 0
##$NTH_PI= 0
##$NZP= 0
##$OFFSET= 198.0616
##$PC= 4
##$PHC0= 1662.243
##$PHC1= 49.15953
##$PH_mod= 1
##$PKNL= yes
##$PPARMOD= 0
##$PSCAL= 0
##$PSIGN= 0
##$REVERSE= no
##$SF= 81.0140089999434
##$SI= 65536
##$SIGF1= 159.3651
##$SIGF2= -187.1042
##$SINO= 113.3802
##$SIOLD= 16384
##$SREGLST= <1H.CDCl3>
##$SSB= 0
##$STSI= 65536
##$STSR= 0
##$SW_p= 32467.5324675325
##$SYMM= 0
##$S_DEV= 0
##$TDeff= 32768
##$TDoff= 0
##$TI= <>
##$TILT= no
##$TM1= 0
##$TM2= 0
##$TOPLEV= 0
##$USERP1= <user>
##$USERP2= <user>
##$USERP3= <user>
##$USERP4= <user>
##$USERP5= <user>
##$WDW= 1
##$XDIM= 65536
##$YMAX_p= 245493577
##$YMIN_p= -220193750
$$ End of Bruker specific parameters
$$ ---------------------------------
##NTUPLES= NMR SPECTRUM
##VAR_NAME=  FREQUENCY,     SPECTRUM/REAL,   SPECTRUM/IMAG
##SYMBOL=    X,             R,               I
##VAR_TYPE=  INDEPENDENT,   DEPENDENT,       DEPENDENT
##VAR_FORM=  AFFN,          ASDF,            ASDF
##VAR_DIM=   65536,         65536,           65536
##UNITS=     HZ,            ARBITRARY UNITS, ARBITRARY UNITS
##FACTOR=    0.49542278885378, 1,            1
##FIRST=     16045.7642231865, 0,            0
##LAST=      -16421.768244346, 0,            0
##MIN=       -16421.768244346, -220193750,   0
##MAX=       16045.7642231865, 245493577,    0
$$ Real data points
##PAGE= N=1
##DATA TABLE= (X++(R..R)), XYDATA
$$ [...]
##PAGE= N=2
##DATA TABLE= (X++(I..I)), XYDATA
7490h06719m69815l47333J411623M173200M935639K607837o06491k570545l196787
$$ -806719 -1276534 -1623867 -212244 3960956 8896595 11504432 10897941 8327396 5130609
7481E130609k536624l7451L126156L995003J717386j059879k073223j963772j606877
$$ 5130609 2593985 2556534 5682690 9677693 11395079 10335200 8261977 6298205 4691328
7472D691328l05942J433409J018421j643280k363796J091446M600434L710182
$$ 4691328 4385386 5818795 6837216 5193936 2830140 3921586 8522020 12232202
7464A2232202N70101l47623k53930l129111o828595m958639K209667O491082L522652
$$ 12232202 12802303 12454680 12200750 9071639 2243044 -2715595 -505928 5985154 9507806
7455I507806j155454j061890K132619K818487J25009k491588l224732k876314
$$ 9507806 8352352 7290462 9423081 12241568 12366577 9874989 6650257 3773943
7447C773943j905024n22557j83426j561896k532104j227846O16296N53709k47336
$$ 3773943 1868919 1346362 1162936 -398960 -2931064 -4158910 -3542614 -2988905 -3236241
7438c236241P66288K646577K464408N95790J0839P98458J75467j749653j238601
$$ -3236241 -2469953 176624 2641032 3236822 3247661 4046119 4221586 2471933 1233332
7429A233332K514117M741599J846719k817905l488588l1944K349184N50993k775437
$$ 1233332 3747449 8489048 10335767 7517862 4029274 3997330 6346514 6897507 4122070
7420D122070l397961q34182J607204R63733k144228m275669k946074O06539K976577
$$ 4122070 724109 -110073 1497131 2460864 316636 -3959033 -6905107 -6298568 -3321991
7411c321991K725709J718891J958762K644987J646802j142503l498434l513533
$$ -3321991 -596282 1122609 3081371 5726358 7373160 6230657 2732223 -781310
7403g81310j278057J777270M002440M229077K640323R89832Q78382J754128J624594
$$ -781310 -2059367 -282097 3720343 7949420 10589743 11579575 12457957 14212085 15836679
7394A5836679k36307k398055l211148k481735r30718Q13793K093566K121201Q25120
$$ 15836679 15600372 13202317 9991169 7509434 6578716 7392509 9486075 11607276 12432396
7385A2432396q22819j897027k289591j943944l06556K498048M664613M149434
$$ 12432396 11609577 9712550 7422959 5479015 5172459 7670507 12335120 16484554
7377A6484554J046080k351115l870052l237909j664235l58174L92792J031304
$$ 16484554 17530634 15179519 11309467 8071558 6407323 6049149 6441941 7473245
7369G473245J741018J758128J74132k465192m164726l559072j271855J253451
$$ 7473245 9214263 10972391 11146523 8681331 4516605 957533 -314322 939129
7361I39129L286078M440777M002508J975557o5658p09690o56846j382853k538135
$$ 939129 4225207 8665984 12668492 14644049 14578391 13868701 13211855 11829002 9290867
7352I290867k581192j547949j017493j410402j560551j131414j104109j427321
$$ 9290867 6709675 5161726 4144233 2733831 1173280 41866 -1062243 -2489564
7344b489564o87573J023569J464582j51903j278626L52459L162383L938109K218980
$$ -2489564 -3177137 -2153568 -688986 -840889 -2119515 -1767056 1395327 5333436 7552416
7335G552416K97657k18453J78018L57414k20083j341917k003808j240716K28036
$$ 7552416 7850073 7631620 7809638 8167052 7946969 6605052 4601244 3360528 3588564
7326C588564N18291l76587q7066K087903L076804N04241k961513l186073r41228
$$ 3588564 4106855 3730268 3643202 5731105 8807909 9312150 6350637 3164564 2223336
7317B223336o13926l139107m543889k086320K070246M573710M921644M156472
$$ 2223336 1609410 -1529697 -6073586 -8159906 -6089660 -1515950 3405694 7562166
7309G562166K443199M2677j416240p43240J034954K167158K201712J433238j17562
$$ 7562166 10005365 10048042 8631802 7888562 8923516 11090674 13292386 14725624 14608062
7300A4608062j847568k120480j84692K436542L703132L327582K281350J021642
$$ 14608062 12760494 10640014 10455322 12891864 16594996 19922578 22203928 23225570
7292B3225570o29563k486272l863769m201324l521418k622077k463668k557764
$$ 23225570 22596007 20109735 16245966 12044642 8523224 5901147 3437479 879715
7284H79715q73255K967070N495358L298987j407977k903835r4774J800932o13201
$$ 879715 6460 2973530 8468888 11767875 10359898 7456063 7361289 9162221 8549020
7275H549020l559737k093185K257759M179427K434461L46277k06961n43877j260082
$$ 8549020 4989283 2896098 5153857 9333284 11767745 12114022 11907061 11363184 10103102
7266A0103102j037517M6048j18210j910495k835157j451047L13351K77665q06720
$$ 10103102 9065585 9111633 8993423 7082928 4247771 2796724 3110075 3387740 2581020
7257B581020p63769R70381L117784M068732K805778k29116k529100j515465J970891
$$ 2581020 1817251 2787632 5905416 9974148 12779926 12550810 10021710 8506245 10477136
7248A0477136L905377J912573j779772l492108k599465j256260r08324j044947
$$ 10477136 14382513 16295086 14515314 11023206 8423741 7167481 6259157 5214210
7240E214210q30785j86663O95091J611779K069439J654166P02710K015k3113N53033
$$ 5214210 4383425 4196762 4891853 6503632 8573071 10227237 10929947 10931962 10908849 11461882
7230A1461882J285354J147600q57725l831995m625734j135400M158966N864448
$$ 11461882 12747236 13894836 13037111 9205116 4579382 3443982 7602948 13467396
7222A3467396J697116m487669o826931l796811Q18236K773972J568047l95332
$$ 13467396 15164512 10676843 3849912 53101 871337 3645309 5213356 4818024
7214D818024j185768p67362p99L55168p5197q08047m71205J509444L307336K352019
$$ 4818024 3632256 2864894 2864095 3219263 3144066 2336019 1864814 3374258 6681594 9033613
7204I033613j094053l666931k954746k63885J648210J938633J302997j11644k156033
$$ 9033613 7939560 4272629 1317883 1053998 2702208 4640841 5943838 5832194 3676161
7195C676161l079305j178801K089525L170082J012654j561789j800385l22105
$$ 3676161 596856 -581945 1507580 4677662 5690316 4128527 2328142 2006037
7187B006037N56372P6361p69611j109194p86594K92369K117356L933002M386342
$$ 2006037 2562409 2638770 1869159 759965 -26629 265740 2383096 6316098 10702440
7178A0702440K558634r80602l938173l827811p82975J767865Q40350k096039k958447
$$ 10702440 13261074 12280472 8342299 4514488 3731513 5499378 6339728 4243689 1285242
7169A285242p83796J151646N92938m76367L57899J879694J768911Q42643J258933
$$ 1285242 501446 1653092 2246030 1769663 2127562 4007256 5776167 6618810 7877743
7160G877743K021520L39587k977001l669036k82789L448986L879691J856936N5074
$$ 7877743 9899263 10238850 7261849 3592813 3310024 6759010 10638701 12495637 12550711
7151A2550711j048534k031299j952804j62914J021985r59779m281195m462318
$$ 12550711 11502177 9470878 7518074 7355160 8377145 7417366 3136171 -1326147
7143a326147q47321K202187J526062p63452j239115k22335o8992n10833N96860
$$ -1326147 -2173468 28719 1554781 791329 -447786 -670121 -739113 -1249946 -653086
7134f53086K565826J855139k269490n347217l214642K165092N035169L086070
$$ -653086 1912740 3767879 1498389 -3848828 -7063470 -4898378 136791 3222861
7126C222861l25772j209351L72387J659567J292814L26423P7155O88745J663608
$$ 3222861 2897089 1687738 2060125 3719692 5012506 5338929 5416084 6104829 7768437
7117G768437K419759K137725K21813k587262m365026l880455j911099k80176L8344
$$ 7768437 10188196 12325921 12547734 9960472 5595446 1714991 -196108 -476284 -437940
7108d37940n07390r62683q55628m29672k14538k66803J80550J819620L838860
$$ -437940 -945330 -1908013 -2763641 -3193313 -3407851 -3674654 -3494104 -1674484 2164376
7099B164376M163850J808236j542492l140346k089059R9961J503966J415839L07295
$$ 2164376 6328226 8136462 6593970 3453624 1364565 1464526 2968492 4384331 4691626
7090D691626o62297k38476J543858K613293J024005j980210k912870o68830J813919
$$ 4691626 4029329 3790853 5334711 7948004 8972009 6991799 4078929 3410099 5224018
7081E224018J710725J26754j18193J160200J843178J135403J68589n30907j454381
$$ 5224018 6934743 7061497 6943304 8103504 9946682 11082085 11250674 10719767 9265386
7072I265386k048088r86312J100445J826308P26621J66852J472029K591437J171868
$$ 9265386 7217298 6230986 7331431 9157739 9884360 10051212 11523241 14114678 15286546
7063A5286546k039690m437709m490061k147886J618264M192270K625988k232691
$$ 15286546 13246856 8809147 4319086 2171200 3789464 7981734 10607722 8375031
7055H375031n167768k835585J463568K411711J58733q35130P93411J850387O20213
$$ 8375031 3207263 371678 1835246 4246957 4405690 3570560 4363971 6214358 6834571
7046F834571m35701O20423J950944J468209J95093k42325n37787j574530k000401
$$ 6834571 6398870 7019293 8970237 10438446 10633539 10391214 9853427 8278897 6278496
7037F278496p71856J63173j122557k754402j793226P03167J264180j80417m00829
$$ 6278496 5506640 5669813 4547256 1792854 -372 702795 1966975 1786558 1385729
7028A385729J104051P65648k830836n483249l004317K477370N209926L336128
$$ 1385729 2489780 3255428 424592 -5058657 -8062974 -5585604 -375678 2960450
7020B960450M85163L16848K340803L590120K400872k44839k024944j534376J02169
$$ 2960450 3445613 3762461 6103264 9693384 12094256 11849417 9824473 8290097 8392266
7011H392266J64484k259803m579217l887148j015325Q24941R17658J482777K898246
$$ 8392266 8556750 6296947 1717730 -2169418 -3184743 -2359802 -1442144 40633 2938879
7002B938879K169970j927748n479721m342019j31381K334036J988420J742209
$$ 2938879 5108849 3181101 -2298620 -6640639 -6772020 -4437984 -2449564 -707355
6994g07355K539181J951895p02693k469386j700892q09890j688985k140817m2352
$$ -707355 1831826 3783721 3081028 611642 -1089250 -1899140 -3588125 -5728942 -5771294
6985e771294K223833J492137n22389J37247K869137L251102K10097k331487j596187
$$ -5771294 -3547461 -2055324 -2577713 -2440466 428671 3679773 3889870 1558383 -37804
6976c7804N83119J616050J485178N87881j928170n310181o008384k313764K348125
$$ -37804 545315 2161365 3646543 4234424 2306254 -3003927 -9012311 -11326075 -8977950
6967h977950L864037L065756L485241N110648M473249O11890l037094l571292
$$ -8977950 -5113913 -2048157 1437084 6547732 11020981 11632871 8595777 5024485
6959E024485k169242j182396l83109J556553L556381L041280K08318j303507P54362
$$ 5024485 2855243 1672847 1289738 2846291 6402672 9443952 9652270 8348763 9103125
6950I103125L562387K608680j877170m679867k726592L16331p55127m697915n071714
$$ 9103125 12665512 15274192 13397022 8717155 5990563 6306894 5551767 853852 -4217862
6941d217862M71445O353054O379133J532731k362747k361034m18641Q53626Q90954
$$ -4217862 -3746417 2606637 8985770 10518501 8155754 5794720 5376079 6229705 7120659
6932G120659J3926j244233j490882J22980J676528M30357k618572l182735K62490
$$ 7120659 7134585 5890352 4399470 4522450 6198978 6629335 4010763 828028 1090518
6923A090518L837480L464789K02392j945184j601965o94911p36103j212357j285556
$$ 1090518 4927998 8392787 8595179 6649995 5048030 4353119 3617016 2404659 1119103
6914A119103o97241R03437L338320M613608K557145j812086m663809l849227j170132
$$ 1119103 421862 1325299 4663619 9277227 11834372 10022286 5358477 1509250 339118
6905C39118N79215Q38487M77203j34510n73308K51486J985706J682524k461357
$$ 339118 918333 1756820 2234023 2099513 1526205 1777691 3763397 5445921 2984564
6896B984564p188159p196709k004773L310113M704719L397168K448315K309701
$$ 2984564 -4203595 -11400304 -13405077 -10094964 -5390245 -1993077 455238 2764939
6888B764939J872341J401799J690817J854635O03274j297553k160200k024866
$$ 2764939 4637280 6039079 7729896 9584531 10187805 8890252 6730052 4705186
6880D705186j890352j312570N87487K471882K088123m2747j178186n96145k28103
$$ 4705186 2814834 1502264 2089751 4561633 6649756 6607009 5428823 4832678 4604575
6871D604575p20119j52689K251389M180666L563923J314496q14428k623604l924071
$$ 4604575 3884456 3731767 5983156 10163822 13727745 15042241 14227813 11604209 7680138
6862G680138l139969Q0825K805159K057387j152248l452212l583013k782291j768210
$$ 7680138 4540169 4620994 7426153 9483540 8331292 4879080 1296067 -1486224 -3254434
6853c254434j67148J451217J656524M62348n30141m33523K55485J182626K414886
$$ -3254434 -3421582 -1970365 -313841 148507 -381634 -815157 -559672 622954 3037840
6844C037840L217412K574250J128057O15454J045083N21597j495813k910471k123490
$$ 3037840 6255252 8829502 9957559 10573013 11618096 12139693 10643880 7733409 5609919
6835E609919n73469n24709j713289k089914j044504J65126R04596J890865K976145
$$ 5609919 5036450 4511741 2798452 708538 -335966 -170840 733756 2624621 5600766
6826E600766K360264n20002k887676j676353J901846L392066J010551k120011
$$ 5600766 7961030 7441028 4553352 2876999 4778845 8170911 9181462 7061451
6818G061451k765307j829771j589288j268658J036471L641033K919181o08077
$$ 7061451 4296144 2466373 877085 -391573 644898 4285931 7205112 6597035
6810F597035k358768n27735J624432J618650J208247J764453J028466k029318
$$ 6597035 4238267 3710532 5334964 6953614 8161861 9926314 10954780 8925462
6802H925462l543989o77743K406128J98732n000354n936341j274437K936856K862917
$$ 8925462 5381473 4703730 7109858 7308590 2308236 -3628105 -4902542 -1965686 897231
6793H97231J450362J821080K122920J6749k417681k038069K13339J035215l80684
$$ 897231 2347593 4168673 6291593 6308342 3890661 1852592 2065931 3101146 2720462
6784B720462k084838k456341j356401M15607J180474m55163l054447k979197P99843
$$ 2720462 635624 -1820717 -3177118 -2761511 -1581037 -2036200 -5090647 -8069844 -7270001
6775g270001M592710M508570J074890k489181m390533m451652k446247R05751
$$ -7270001 -2677291 1831279 2906169 416988 -3973545 -8425197 -10871444 -9965693
6767i965693K930432J889591k96118p72319J77199N50182N85026J790508L007034
$$ -9965693 -7035261 -5145670 -5441788 -6214107 -6036908 -5486726 -4901700 -3111192 -104158
6758a04158J468646k193104l931706k078315M04949Q03887M95120J842674L889197
$$ -104158 1364488 -828616 -4760322 -6838637 -6433688 -5629801 -5134681 -3292007 597190
6749E97190L802498J134490j791647l002345k486856j254152m11779p55861j855461
$$ 597190 4399688 5534178 3742531 740186 -1746670 -3000822 -3412601 -4168462 -6023923
6740f023923j950831o6270K277780K853694J658397L92456m33712j626648k634130
$$ -6023923 -7974754 -8041024 -5763244 -2909550 -1251153 -858697 -1292409 -2919057 -5553187
6731e553187j516758J517396L264307J923043j20725k81823j45823k330722m786845
$$ -5553187 -7069945 -5552549 -2288242 -365199 -485924 -767747 -913570 -3244292 -8031137
6722h031137l075729J923879M008108Q57525k041514J25547L841291K986085j182261
$$ -8031137 -11106866 -9182987 -5174879 -4317354 -6358868 -6233321 -2392030 594055 -588206
6713e88206k007763J939339M719869K278319j927851k831105p35026P51078N89397
$$ -588206 -2595969 -656630 4063239 6341558 4413707 1582602 847576 1598654 2188051
6704B188051O81640K040412L516153L696081K216873k43162k104730j838831K57245
$$ 2188051 2869691 4910103 8426256 12122337 14339210 14096048 11991318 10152487 10409732
6695A0409732K030961J801805j83809k684923m403911m084120j706636L80283
$$ 10409732 12440693 14242498 14058689 11373766 6969855 2885735 1179099 1559382
6687A559382m833j154872M95785M143655M538847j28492m513412l385911J008706
$$ 1559382 1554549 399677 895462 5039117 9577964 9449472 4936060 1550149 2558855
6678B558855K846694J141782m29685l31000o45339k058932k162984K12359K649499
$$ 2558855 5405549 6547331 6117646 5786646 5141307 3082375 919391 1131750 3781249
6669C781249K654712R74013k3544M79717J375838J366071L57039l73473M76531
$$ 3781249 6435961 7409974 7386430 7866147 9241985 10608056 10965095 10591622 11068153
6660A1068153K278646K799076J300378j65487J3267K58099j515946m081407m613176
$$ 11068153 13346799 16145875 17446253 17280766 17294033 17552132 16036186 11954779 7341603
6651G341603l065722j662738p61287J254036M005711M602887J866666j805278
$$ 7341603 4275881 2613143 1851856 3105892 7111603 11714490 13581156 11775878
6643A1775878l715755l616055k461911q09905O38464R65584M16278K04968N08742
$$ 11775878 8060123 4444068 1982157 1172252 1810716 2776300 3192578 3397546 3906288
6634C906288L67689k97572n88390n85485j088163j341282K71356K920719L658250
$$ 3906288 4273977 3976405 3388015 2802530 1714367 373085 644441 3565160 7223410
6625G223410J775272j26893l87858m56235j372622j343804R01336L052444K254789
$$ 7223410 8998682 8871789 8483931 8027696 6655074 5311270 6212606 9265050 11519839
6616A1519839o95960k783267k901968k140240j229913j78561M46048J43646j88058
$$ 11519839 10823879 8040612 5138644 2998404 1768491 1589930 2035978 2179624 1991566
6607A991566N25650J546027J284685l00818j850406k507215k169879o15573J913861
$$ 1991566 2517216 4063243 5347928 5047110 3196704 689489 -1480390 -2095963 -182102
6598a82102L828157L588393J643141l67739j674514k221013j447847P32953K440641
$$ -182102 3646055 7234448 8877589 8509850 6835336 4614323 3166476 3899429 6340070
6589F340070J710676k80698l62399J927363L315341J490544j468025k111975m05000
$$ 6340070 8050746 7770048 7407649 9335012 12650353 14140897 12672872 10560897 10155897
6580A0155897P77259J30051n88783J66002J169933M22201j684795k872126k093363
$$ 10155897 10933156 11063207 10474424 10640426 11810359 12232560 10547765 7675639 5582276
6571E582276n11207N44189R56614Q79023O5610j141517j686858j590997k301416
$$ 5582276 5071069 5615258 6571872 7450895 7516505 6374988 4688130 3097133 795717
6562G95717m057472m640535k531391L25396J260778R96620K110869M329943M778454
$$ 795717 -3261755 -7902290 -10433681 -10108285 -8847507 -7850887 -5740018 -1410075 3368379
6553C368379K745326O73152m8179p73407k135331k383122q07939L49349m91599
$$ 3368379 6113705 6786857 6738678 5965271 3829940 1446818 638879 988228 496629
6544D96629j496025o03585R98535J176419M30931K98749L2017j837427l823080
$$ 496629 -999396 -1602981 -604446 571973 1002904 1301653 1333670 -503757 -4326837
6535d326837k882605P64094L390537K833036J258288J838950M327310N237298
$$ -4326837 -7209442 -6445348 -3054811 -221775 1036513 2875463 7202773 12440071
6527A2440071K091150l151128n482447k357796K726268L935636L50550l034213
$$ 12440071 14531221 11380093 5897646 3539850 6266118 10201754 10552304 7518091
6519G518091k267721P42221K236678K251827L075789M363678L605441L59419l353917
$$ 7518091 5250370 5992591 8229269 10481096 13556885 17920563 21526004 21885423 18531506
6510A8531506o037200p004604m866866N25018N332617N051380O45337k523147
$$ 18531506 12494306 5489702 622836 1147854 6480471 11531851 12177188 9654041
6502I654041k137166j189056k129997l250140k662072j749496j990779j771270
$$ 9654041 7516875 6327819 4197822 947682 -1714390 -3463886 -5454665 -7225935
6494g225935M54111K467108J304058j684843k300078O40026L859475L993432J156616
$$ -7225935 -6771824 -4304716 -3000658 -4685501 -6985579 -6345553 -2486078 1507354 2663970
6485B663970j930066k708723p23406J894287K147420m61065k850589j951057J336163
$$ 2663970 733904 -1974819 -2698225 -803938 1343482 882417 -1968172 -3919229 -2583066
6476b583066L410111K677776J034478O76332J457461K081434K300545K716473
$$ -2583066 827045 3504821 4539299 5215631 6673092 8754526 11055071 13771544
6468A3771544L148512K369490m13292m208076o582712n635597j929355J700172
$$ 13771544 16920056 19289546 18876254 14668178 8085466 2449869 520514 2220686
6460B220686K628032O80939k182486l888472l515945j303059J486856K937333
$$ 2220686 4848718 5529657 3347171 -541301 -4057246 -5360305 -3873449 -936116
6452i36116K006707q390o21931P13712J689892K20768k515334l488193j754275
$$ -936116 1070591 1062201 440270 1153982 2843874 3064642 549308 -2938885 -4693160
6443d693160O96210K023975K544489K942632K447017M25258j585514j566663k5785
$$ -4693160 -3996950 -1972975 571514 3514146 5961163 6386421 4800907 3234244 3208459
6434C208459Q21954M09917j4240l07581j573957k989499j849256J741211L473447
$$ 3208459 4030413 4440330 4426090 4118509 2544552 -444947 -2294203 -552992 2920455
6425B920455O51295l293873l373590j55436J558247J34091j053653N28899K820005
$$ 2920455 3571750 277877 -3095713 -3251149 -1692902 -1558811 -2612464 -2083565 736440
6416G36440K729339N43593j196499j404563j137796j431956j847189j097866J203812
$$ 736440 3465779 4009372 2812873 1408310 270514 -1161442 -3008631 -4106497 -2902685
6407b902685L387988L031227J67156j996948j108756R15191Q70235n60469K5081
$$ -2902685 485303 3516530 3683686 1686738 577982 1493173 2363408 1802939 1828020
6398A828020K867837M278629K336001m96400j690836j838811j736601j18878K975515
$$ 1828020 4695857 8974486 11310487 10814087 9123251 7284440 5547839 5428961 8404476
6389H404476L979141N08179m164081n100175k370972N7052O77094J433168K869838
$$ 8404476 12383617 12891796 8727715 3627540 1256568 1313620 1990714 3423882 6293720
6380F293720K699300O8164k302871j808854O13823K198483J754919J51590j264138
$$ 6293720 8993020 9061184 6758313 4949459 5563282 7761765 9516684 9668274 8404136
6371H404136j608195o76464Q96620J981175J701955j47147k741586l949188j860673
$$ 8404136 6795941 6119477 7016097 8997272 10699227 10552080 7810494 3861306 2000633
6362B000633K263541M225624J970436j163857r02735J655166J706626j932848
$$ 2000633 4264174 8489798 10460234 9296377 8393642 10048808 11755434 9822586
6354I822586n272546n316125l635959k426771r79241J525818L066976J789658
$$ 9822586 4550040 -766085 -4402044 -6828815 -7808056 -6282238 -3215262 -1425604
6346a425604l32010o8271K325874L918338L537955K539037J880333J179420K96230
$$ -1425604 -1757614 -1825885 499989 4418327 7956282 10495319 12375652 13555072 13851302
6337A3851302n47213j845605l725428m330586j920845J677427K558783n9254k780672
$$ 13851302 13304089 11458484 7733056 3402470 1481625 3159052 5717835 5658581 2877909
6328B877909k696962n86353J234184J763252J102084k12677n88665J496246M456752
$$ 2877909 180947 -405406 828778 2592030 3694114 3481437 2892772 4389018 8845770
6319H845770M217216l55303n020718n381660k395207j27747k839m56496q28369
$$ 8845770 13062986 12707683 7686965 2305305 -89902 -217649 -220488 -676984 -1505353
6310a505353j816103k526906q55314K704625M831846L803809J372460o37571k694698
$$ -1505353 -3321456 -5848362 -6703676 -3999051 832795 4636604 6009064 5371493 2676795
6301B676795n093935n840455l225583J178582M172210M464084K925584N25668
$$ 2676795 -2417140 -8257595 -11483178 -10304596 -6132386 -1668302 1257282 1782950
6293A782950k070225l565501k641331L99402L670391N429327N287119M026646
$$ 1782950 -287275 -3852776 -6494107 -6094705 -2424314 3005013 8292132 12318778
6285A2318778K588104R58262j647138m693184n316045j585705L548324M643795
$$ 12318778 14906882 15865144 14218006 9524822 4208777 2623072 6171396 10815191
6277A0815191Q14807k835579k286330L26038J118295N56692J434892L245950L041228
$$ 10815191 11629998 8794419 6508089 6834127 7952422 8509114 9944006 13189956 16231184
6268A6231184P44942o88205j12879O06666J95317p13491j841312l419448m087033
$$ 16231184 16976126 16287921 16175042 16781708 16977025 16263534 14422222 11002774 6915741
6259F915741k211198N90578J062240l18351R9776K476227K336049j907783n166757
$$ 6915741 4704543 5295121 6357361 6039010 6138786 8615013 10951062 9043279 3876522
6250C876522k860373J977482L054329k50329k796797j359687J729047K661701
$$ 3876522 1016149 2993631 6047960 5797631 3000834 1641147 3370194 6031895
6242F031895P58903j694798k356101r14669J007348J952211K367293L154230L067348
$$ 6031895 6790798 5096000 2739899 1825230 2832578 4784789 7152082 10306312 13373660
6233A3373660K22505l616254l923095p7422K655897M20092l518776l865459r75934
$$ 13373660 13596165 9979911 6056816 5979394 8635291 9055383 5536607 1671148 695214
6224F95214Q72562M25025k65042q33514k524020l782063j450109L198236M805157
$$ 695214 1567776 1992801 1727759 894245 -1629775 -5411838 -6861947 -3663711 1141446
6215A141446J557075k203191k675486j479621j486457j791088n0671L046446M920678
$$ 1141446 2698521 495330 -2180156 -3659777 -5146234 -6937322 -6987993 -3941547 979131
6206I79131M776042L341555O67909l003630n496587m669817j501561J057982J699212
$$ 979131 5755173 9096728 9764637 6761007 1264420 -3405397 -4906958 -3848976 -2149764
6197b149764J215669K11873j238653k076735r69304J212962J877412K97312j205374
$$ -2149764 -934095 -722222 -1960875 -4037610 -5006914 -3793952 -1916540 -1619228 -2824602
6188b824602n30613J471711K726144K822014K458741J196991j751693m676606
$$ -2824602 -3355215 -1883504 842640 3664654 6123395 7320386 5568693 892087
6180H92087m155900J15147L693023K743481p60911k040972m01283O73701l7800
$$ 892087 -3263813 -3148666 544357 3287838 2526927 485955 84672 758373 720573
6171G20573L68288L048867M453466K217463j58871J177159L506921J498232l909735
$$ 720573 1088861 4137728 8591194 10808657 10649786 11826945 15333866 16832098 12922363
6162A2922363o541773m295186j370176o52273R8730K609732M223665K667060J47329
$$ 12922363 6380590 2085404 715228 62955 161685 2771417 6995082 9662142 9809471
6153I809471o80329j015519k676603m017469k931883r95526n65311l28833J891161
$$ 9809471 9129142 8113623 5437020 1419551 -1512332 -2507858 -3073169 -3402002 -1510841
6144a510841M071676K579096j504315l506340j991594J88624J355163K671712
$$ -1510841 2560835 5139931 3635616 129276 -1862318 -1673694 -318531 2353181
6136B353181M033757L206548L31862j164790l124O08198j698272m359594l852898
$$ 2353181 6386938 9593486 9925348 8760558 8757434 9365632 7667360 3307766 -545132
6127e45132q38637J556920K267304K225500J723461P16475K27842P25055N13192
$$ -545132 -1383769 173151 2440455 4665955 6389416 7105891 7333733 8058788 8571980
6118H571980j535153l123354j527276J731519K702319Q20622p94448o61902n36003
$$ 8571980 7036827 3913473 2386197 4117716 6820035 7640657 6846209 6184307 5648304
6109E648304j100616k58313K564859M142563K051288j406091k797869k605619
$$ 5648304 4547688 4289375 6854234 10996797 13048085 11641994 8844125 6238506
6101F238506l285432m228826k704905R60050L204006K455997R20381M00422k20554
$$ 6238506 2953074 -1275752 -3980657 -3020607 183399 2639396 3559777 3960199 3739645
6092C739645j924429l044329j847549O25277K336135L004633L146448K222829
$$ 3739645 1815216 -1229113 -3076662 -2451385 -115250 2889383 6035831 8258660
6084H258660M0797j570868j035232K11358j45735j425427j166058M33000O26688
$$ 8258660 8299457 6728589 5693357 5904715 5758980 4333553 3167495 3600495 4227183
6075D227183j205327k326630r25308J331939K249552J929794J183149k72350k050582
$$ 4227183 3021856 695226 -230082 1101857 3351409 5281203 6464352 6192002 4141420
6066D141420j899451J163636M227892L790503N67430j782905j940976j856132
$$ 4141420 2241969 3405605 7633497 11424000 11991430 10208525 8267549 6411417
6058F411417k613624k711761j284068p7781o14281j626609j227022Q3455O40366
$$ 6411417 3797793 1086032 -198036 -275817 -890098 -2516707 -3743729 -3660274 -3019908
6049c019908N28288R50376J532695P95414r49347j774532j449836j845503l159352
$$ -3019908 -2491620 -1541244 -8549 786865 -162482 -1937014 -3386850 -5232353 -8391705
6040h391705k628516J070915M634493M221285J115532p4977J859831L475820K359446
$$ -8391705 -11020221 -9949306 -5314813 -1093528 22004 -52973 1806858 5282678 7642124
6031G642124L52085k12446j84497j298066k668443k248887l23338R03672M18725
$$ 7642124 7994209 7781763 7597266 6299200 3630757 1381870 1058532 1962204 2380929
6022B380929p68154j250964l69156J354958J987904k0750k848955k532899J230240
$$ 2380929 1612775 361811 -7345 1347613 3335517 3314767 465812 -2067087 -836847
6013h36847L592850J526377j085564N84302M255599M038722J03404j744318K00408
$$ -836847 2756003 4282380 3196816 3781118 8036717 12075439 12178843 10434525 10634933
6004A0634933J257728q90343k126371M35035K887273R45671l002125m128300k573495
$$ 10634933 11892661 11002318 8875947 9310982 12198255 13143926 10141801 6013501 3440006
5995C440006j482027p29578J777814M514552L804378K17320j755700o18424K36884
$$ 3440006 1957979 1228401 3006215 7520767 11325145 11542465 9786765 9168341 9405225
5986I405225j587095l829946l369501n88695J855759K613655K413571K341544
$$ 9405225 7818130 3988184 618683 29988 1885747 4499402 6912973 9254517
5978I254517K377069J431198r57025k858255j508802K291154L610020l79205n643766
$$ 9254517 11631586 13062784 12105759 9247504 7738702 10029856 13639876 13260671 7616905
5969G616905o207768k429134j72084k069746m148157k215209K365810N339453
$$ 7616905 1409137 -1019997 -1192081 -3261827 -7409984 -9625193 -7259383 -1919930
5961a919930N094262L190179J234248m73645j960998k850549k536142p64620J500357
$$ -1919930 3174332 6364511 7598759 7125114 5164116 2313567 -222575 -987195 513162
5952E13162K157834J21843k847522l882345k374691j56291J275759J943108K166263
$$ 513162 2670996 2792839 -54683 -3937028 -6311719 -6468010 -5192251 -3249143 -1082880
5943a082880K131799K408877K938342K026473j320783m668337m666073j961909
$$ -1082880 1048919 3457796 6396138 8422611 7101828 2433491 -2232582 -4194491
5935d194491k83683o21647j60271K293294L925071K657107N36866J4475L0672
$$ -4194491 -4478174 -5099821 -5260092 -2966798 958273 3615380 4152246 4166721 4197393
5926D197393j358490l018120k509472j51004J516891J240248j90669j619433k077541
$$ 4197393 2838903 -179217 -2688689 -2839693 -1322802 -82554 -273223 -1892656 -3970197
5917c970197q45137J299795K148402R49030k93711j8000K95942j146697k948413
$$ -3970197 -4815334 -3515539 -1367137 -418107 -711818 -729818 -433876 -1580573 -4528986
5908d528986k407009L20943K616304L189254L025383L016745K805574J803800
$$ -4528986 -6935995 -6615052 -3998748 -809494 2215889 5232634 8038208 9842008
5900I842008r8650k335764l256207j351564J894391K483513q44462m108963l415394
$$ 9842008 9743358 7407594 4151387 2799823 4694214 7177727 6333265 2224302 -1191092
5891a191092m75404N41551m32422k05013J619150K232205J017486O20511K040333
$$ -1191092 -1666496 -1124945 -1557367 -1762380 -143230 2088975 3106461 3726972 5767305
5882E767305K988995K175464J179951P79088n93637l005618l554433j041414J408158
$$ 5767305 8756300 10931764 12111715 12890803 12297166 9291548 5737115 4695701 6103859
5873F103859J089590r4752P14550K303054J646742q09527j973949j044427k064
$$ 6103859 7193449 7098697 7813247 10116301 11763043 10953516 8979567 7935140 7933076
5864G933076J97974M71940P83785k45198k471844l800636l327167k469779k126052
$$ 7933076 8131050 8602990 9386775 9141577 6669733 2869097 -458070 -2927849 -5053901
5855e053901j037611J669072M170384L965831J310348r68978r39422K47879l506
$$ -5053901 -6091512 -4422440 -252056 3713775 5024123 4055145 3115723 3363602 3360096
5846C360096k277835l925725j977883K733125N626789L534868j226548l556303
$$ 3360096 1082261 -2843464 -4821347 -2088222 3538567 7073435 5846887 2290584
5838B290584j744704J087443J756667R13010J064381K460510K843259Q42786j977138
$$ 2290584 545880 1633323 3389990 4303000 5367381 7827891 10671150 11513936 9536798
5829I536798k964586j609693j84225q08195k336319j492300K340293N183459L283478
$$ 9536798 6572212 4962519 4778294 3970099 1633780 141480 2481773 7665232 10948710
5820A0948710j295048k898069m1741K541112Q21268l028421m567943l570777k850468
$$ 10948710 9653662 6755593 6713852 9254964 10076232 7047811 2479868 -1090909 -3941377
5811c941377k507042L2948M443558O526148M133193M35030o91348L44858P25684
$$ -3941377 -6448419 -6415471 -1971913 4554235 8687428 9122458 8431110 8775968 9501652
5802I501652k97715j465566k345038l297562l623301k396152n75305J83631M27183
$$ 9501652 9203937 7738371 5393333 2095771 -1527530 -3923682 -4498987 -4315356 -3888173
5793c888173K077000M767960N632030L262388m16261l021207m305594m788879
$$ -3888173 -1811173 2956787 8588817 11851205 11434944 8413737 4108143 -680736
5785f80736l862461j077411J931641K801686J429197J35000P20956K338955K674949
$$ -680736 -4543197 -5620608 -3688967 -887281 541916 676916 1397872 3736827 6411776
5776F411776Q46936j360636j526088K08117Q98843j450187m811066n346135k287216
$$ 6411776 7258712 5898076 4371988 4580105 5478948 4028761 -782305 -6128440 -8415656
5767h415656J276615K555587J938425J113077M35274m45132q90593P0935K124293
$$ -8415656 -7139041 -4583454 -2645029 -1531952 -1096678 -1541810 -2432403 -2361468 -237175
5758b37175L953687M636375L986122K293220M21150p47041j505406k754406l801227
$$ -237175 3716512 8352887 12339009 14632229 15053379 14306338 12800932 10046526 6245299
5749F245299k664372M03976J975317r5226l303903m013087k537270j744999j993556
$$ 6245299 3580927 3984903 5960220 5864994 2561091 -1451996 -3989266 -5734265 -7727821
5740g727821j051643J483239L356746L395562K690406J706757k72469k118731
$$ -7727821 -8779464 -7296225 -3939479 -543917 2146489 3853246 3580777 1462046
5732A462046j062700K573546M455434K210927r13290j002799Q53839J044392q15104
$$ 1462046 399346 2972892 7428326 9639253 8725963 7723164 8577003 9621395 8806291
5723H806291k229075k244056j852686j162508J92659P43812q73939k319658j16312
$$ 8806291 6577216 4333160 2480474 1317966 1510625 2254437 1380498 -939160 -1055472
5714a055472M241816N314553J657743j807964j007153K050399L584986L453965
$$ -1055472 3186344 8500897 10158640 8350676 7343523 9393922 12978908 16432873
5706A6432873L033079J391175k291693n222668m413184j756317j226102k468449
$$ 16432873 19465952 20857127 18565434 13342766 8929582 7173265 5947163 3478714
5698C478714j999155J66463N22606j165269p85701K924696N371263K962055j360036
$$ 3478714 1479559 1646022 2168628 1003359 217658 3142354 8513617 11475672 10115636
5689A0115636k698562q67193R46458J330130Q97176k89879j885781j678350J484426
$$ 10115636 7417074 6549881 7496339 8826469 9723645 9433766 7547985 5869635 7354061
5680G354061M566013L746033r6946k779140k724989j887458j518924q65678J38954
$$ 7354061 11920074 15666107 15569161 12790021 10065032 8177574 6658650 5792972 5931926
5671E931926N33736O95621J658028K268022O72107j615123j342447P01392L35017
$$ 5931926 6465662 7161283 8819311 11087333 11759440 10144317 8801870 9503262 9838279
5662I838279k798739l831249l19526L706439M030548J967744N64731m97664k220230
$$ 9838279 7039540 3208291 2888765 6595204 10625752 12593496 13158227 12660563 10440333
5653A0440333k510624J15954K265108L30905k991713k411986J405122K850606
$$ 10440333 7929709 8045663 10310771 10641676 7649963 5237977 6643099 9493705
5645I493705K36487k271892j944420j046676j750027k509600j619847k52757L34200
$$ 9493705 9730192 7458300 5513880 4467204 2717177 207577 -1412270 -1665027 -1330827
5636a330827J135844K681551L124071J426993l09939j54310N10999l42585j841678
$$ -1330827 -194983 2486568 5610639 7037632 6727693 6573383 7084382 6741797 4900119
5627D900119k057360j443170j464560j320785P33158L602516M097871J457236
$$ 4900119 2842759 1399589 -64971 -1385756 -652598 2949918 7047789 8505025
5619H505025j590554k662635k312914k119219k153538j474973O4970J591719K263558
$$ 8505025 6914471 4251836 1938922 -180297 -2333835 -3808808 -3743838 -2152119 111439
5610A11439J954424J205032P30353O41765J83439j218047k675904k401012J13944
$$ 111439 2065863 3270895 4001248 4643013 4826452 3608405 932501 -1468511 -1354567
5601a354567L055897M005736K483998L03176n72107Q309P69697Q19065L64721
$$ -1354567 1701330 5707066 8191064 8494240 7922133 7930442 8700139 9519204 9883925
5592I883925j61638p26325j164733r87862l21326j56152q44673j263010o16065
$$ 9883925 9722287 8995962 7831229 6843367 6522041 6365889 5521216 4258206 3642141
5583C642141j19867j156847k422361j256937K073700L971924K356460m06272j122260
$$ 3642141 3522274 2365427 -56934 -1313871 759829 4731753 7088213 6681941 5559681
5574E559681l63640r38510k912896l264776p30315J876526J568841o81030j732353
$$ 5559681 5196041 4257531 1344635 -1920141 -2650456 -773930 794911 113881 -1618472
5565a618472r01056l03510r01719r04385R93989L030186K784333P14494p55215
$$ -1618472 -2519528 -2823038 -3724757 -4629142 -3635153 -604967 2179366 2893860 2138645
5556B138645p57749l85711j16589O54071J462396P44983j404523k801487k351535
$$ 2138645 1380896 995185 878596 1532667 2995063 3740046 2335523 -465964 -2817499
5547b817499j376549q15086L12355K208862K806707J109948m15216O40711K876991
$$ -2817499 -4194048 -5009134 -4696779 -2487917 318790 1428738 1013522 1654233 4531224
5538D531224L664744L394851L817136L951481J594845k160633l910920k916278
$$ 4531224 8195968 11590819 15407955 19359436 20954281 18793648 14882728 11966450
5530A1966450j368754k85048Q76628J060574j294324l994006k908225J262678
$$ 11966450 10597696 10312648 11189276 12249850 10955526 6961520 4053295 5315973
5522E315973L181141J072760p38608M42247J245099j027647k819901m77053K600772
$$ 5315973 8497114 9569874 8831266 9273513 10518612 9490965 6671064 6194011 8794783
5513H794783J103027l039799l412277N25412K731120L43135k343178j283327J489249
$$ 8794783 9897810 6858011 3445734 3971146 6702266 7045401 4702223 3418896 4908145
5504D908145K167263R79036M03639O82479N79501N60887J742651K804335J378135
$$ 4908145 7075408 8054444 8458083 9140562 9720063 10280950 12023601 14827936 16206071
5495A6206071j638879k335875P86704M176480L607665n28640m242617n061309
$$ 16206071 14567192 12231317 13018021 17194501 20802166 20273526 16030909 10969600
5487A0969600l727537j385327J792792M447345L742426n63675m204503l465420
$$ 10969600 7242063 5856736 7649528 12096873 15839299 15275624 11071121 7605701
5479G605701l93033L53833j522482k127227Q5385K367901K646839K024001J254444
$$ 7605701 7212668 7566501 6044019 3916792 4002177 6370078 9016917 11040918 12295362
5470A2295362q36973l586750l450911N61441M105442L249278j18713j790475j254515
$$ 12295362 11458389 7871639 4420728 4982169 9087611 12336889 12218176 10427701 9173186
5461I173186q26876j301643j932168k596279k813900r59249K396275L213243k23901
$$ 9173186 8346310 7044667 5112499 2516220 -297680 -1256929 1139346 4352589 4128688
5452D128688l362322j820719J302371K87113l527357l766020M70667L444456K363399
$$ 4128688 766366 -1054353 248018 535131 -2992226 -6758246 -6287579 -2843123 -479724
5443d79724Q88195J597173J869498n1931j102498R20294K912697J697112n81637
$$ -479724 408471 2005644 3875142 3823211 2720713 3641007 6553704 8250816 7669179
5434G669179m02455J363298J779779R45820N75636l2840k287024m348000l174866
$$ 7669179 7266724 8630022 10409801 11355621 11931257 11898417 9611393 5263393 2088527
5425B088527M57559K805588K473986J482141J310922J084227o9893j465123k230639
$$ 2088527 2546086 5351674 7825660 9307801 10618723 11702950 11633057 10167934 7937295
5416G937295k481228k714504l048850k941584j228349K419600N520713M435168
$$ 7937295 5456067 2741563 -307287 -3248871 -4477220 -2057620 3463093 7898261
5408G898261n10687m009498k358780J221088J198942k177792l661734j077149
$$ 7898261 7387574 3378076 1019296 2240384 3439326 1261534 -2400200 -3477349
5400c477349K066579K537493J500438J078028O91795o68910j554004m70427Q24002
$$ -3477349 -1410770 1126723 2627161 3705189 4396984 3728074 2174070 1703643 2527645
5391B527645l66999l138558l797923r80574K623373L868273K354067k92369k303280
$$ 2527645 2160646 -977912 -4775835 -5756409 -3133036 735237 3089304 2796935 493655
5382D93655k312003N7387L042990L718205J411264j055933r19028Q73785J284967
$$ 493655 -1818348 -1760961 1282029 5000234 6411498 5355565 4436537 5310322 6595289
5373F595289m12982k044699k082274j429507j158108o25027R72130K724220L107230
$$ 6595289 6182307 4137608 2055334 625827 -532281 -1157308 -185178 2539042 5646272
5364E646272K030500O01663n33242j644187l051688m314360m036315q51237M328931
$$ 5646272 7676772 8278435 7745193 6101006 3049318 -1265042 -5301357 -6152594 -1823663
5355a823663P649980O029856J458117j077904k87916J34714k037842l845761k299961
$$ -1823663 5826317 11856173 13314290 12236386 11948470 12083184 10045342 6199581 3899620
5346C899620N90406J528878J366055K479118L518193J882221o38618l69220J430989
$$ 3899620 4490026 6018904 7384959 9864077 13382270 15264491 14625873 14256653 15687642
5337A5687642L71941l006884l574515m67869J230553p17751k077411j15659J352515
$$ 15687642 16059583 13052699 9478184 9010315 10240868 9523117 7445706 7330047 8682562
5328H682562r99053l707754k348877J046054J978310J079635J690009K680266
$$ 8682562 7683509 3975755 1626878 2672932 4651242 5730877 7420886 10101152
5320A0101152J97084m775706o815701l948130J56474K245469L005548L726590
$$ 10101152 10298236 5522530 -1293171 -5241301 -5084827 -2839358 166190 3892780
5312C892780L701850K345250O77704n41514j675941k525478k211167j214029j086144
$$ 3892780 7594630 9939880 10617584 10076070 8400129 5874651 3663484 2449455 1363311
5303A363311j695439j170228R74577L007586L671778L362907K290298J5896k577143
$$ 1363311 -332128 -1502356 -527779 2479807 6151585 9514492 11804790 11820686 9243543
5294I243543l407628k157978p46768L1410J723825M648398N688254K111857l874664
$$ 9243543 5835915 3677937 2931169 2962579 4686404 9334802 15023056 17134913 13260249
5285A3260249p016098n113276j109177J172792J446296J862631K678719J445545
$$ 13260249 6244151 1130875 21698 1194490 2640786 4503417 7182136 8627681
5277H627681k646666n807108l770330J835128M732881K303842j095040j120445
$$ 8627681 5981015 173907 -3596423 -1761295 2971586 5275428 4180388 3059943
5269C059943J12745j601803m725851l867289J533039N960988N861292L817799
$$ 3059943 3172688 1570885 -3154966 -7022255 -5489216 471772 6333064 10150863
5261A0150863L041576K340841n03361l891508m549122k470231m24358K61294N26790
$$ 10150863 13192439 15533280 15029919 11138411 6589289 4119058 3694700 3955994 4482784
5252D482784R53580J025477P97368R80630J249229M38789j225424j859608n81435
$$ 4482784 5436364 6461841 7259209 8239839 9489068 9927857 8702433 6842825 6261390
5243F261390R45108O63110j019973j775594o03182O90011j08316k519796l851151
$$ 6261390 7206498 7869608 6849635 5074041 4470859 5160870 5052554 2532758 -1318393
5234a318393k651534m23088N14825l55210j969277l233001l224579j118776K404677
$$ -1318393 -3969927 -4393015 -3878190 -4233400 -6202677 -9435678 -12660257 -13779033 -11374356
5225a1374356M585887L406349M91266q17815J24366J131181J276453K123004M044866
$$ -11374356 -6788469 -3382120 -2890854 -3708669 -3584303 -2453122 -1176669 946335 4991201
5216D991201M373371J277580k704314l666438j645953j45985p59522j191230O12373
$$ 4991201 9364572 10642152 7937838 4271400 2625447 2479462 1719940 528710 1141083
5207A141083K872389K386202q25250l473388l312147j421121K29519J442877K706330
$$ 1141083 4013472 6399674 5574424 2101036 -1211111 -2632232 -2402713 -959836 1746494
5198A746494L113731J554537p96910j559277n97003m4300o62843p56803N09022
$$ 1746494 4860225 6414762 5617852 4058575 3461572 3417272 2754429 1997626 2506648
5189B506648J398810O54972k39776K20066Q63009K19369m61637N46104J805525
$$ 2506648 3905458 4560430 4320654 4540720 5403729 5623098 5161461 5707565 7513090
5180G513090O33598k238743l272924j154758J786627L189739K900132J529620
$$ 7513090 8146688 5907945 2635021 1480263 3266890 6456629 9356761 10886381
5172A0886381m19899j650698r12656P68759J088791j0633l39262P19093J252804
$$ 10886381 10466482 8815784 7903128 8671887 9760678 9750045 9410783 10129876 11382680
5163A1382680L68550l22359M3739j95585j960500l009593j158065J997775L130103
$$ 11382680 11751230 11428871 11472610 11277025 9316525 6306932 5148867 7146642 10276745
5154A0276745J777403M31718N74442R10529k10148k271336l254950k189278m03612
$$ 10276745 12054148 12485866 13060308 13970837 13760689 11489353 8234403 6045125 5641513
5145E641513n4162j489003k683658j850957M4652N33373r12666k111915j091396
$$ 5641513 5587351 4098348 1414690 -436267 -391615 141758 -770908 -2882823 -3974219
5136c974219J393437K759565J412905j563931l288681j952200R63297K165461
$$ -3974219 -2580782 178783 1591688 27757 -3260924 -5213124 -4249827 -2084366
5128b084366N88603j451166j798601j129137o65722M27760K930926M842872L829960
$$ -2084366 -1495763 -2946929 -4745530 -5874667 -6540389 -6112629 -3181703 1661169 5491129
5119E491129R32272j266409k607382l950418l524074O13910N336767M985482m75645
$$ 5491129 6423401 5156992 2549610 -1400808 -4924882 -4310972 1025795 6011277 5535632
5110E535632m812468l928174j73022K827602M580891N087189K810748j762864
$$ 5535632 723164 -3205010 -3378032 -550430 4030461 9117650 11928398 10165534
5102A0165534m583260l181501j88882Q89895K59335k39594m36802m41154P67333
$$ 10165534 5582274 2400773 2211891 3101786 3361121 3121527 2684725 2243571 3010904
5093C010904K639206K261316r12486k962406j199852J595824K071278J667990
$$ 3010904 5650110 7911426 6998940 4036534 2836682 4432506 6503784 8171774
5085H171774K873948L665777Q73626l513671m848522k876453j028136r5592J852417
$$ 8171774 11045722 14711499 15585125 12071454 7222932 4346479 3318343 3222751 5075168
5076E075168M005209L019696r21233l434268k349869l22095K05335M54163J954772
$$ 5075168 9080377 12100073 11178840 7744572 5394703 5072608 5277943 5732106 7686878
5067G686878L293026K495530K59496j227552j121773j41110P88982J010178J70319
$$ 7686878 10979904 13475434 13734930 12507378 11385605 11244495 12033477 13043655 13213974
5058A3213974j433981k961255l526023k409248L03884K700622K243988p01066
$$ 13213974 11779993 8818738 5292715 2883467 3187351 5887973 8131961 7430895
5050G430895k336391l43462K471146J962143j497070l975159l693976k458044
$$ 7430895 5094504 4751042 7222188 9184331 7687261 3712102 18126 -2439918
5042b439918j846327j234425J89333K071293L814753M803996L913675Q60421k351234
$$ -2439918 -4286245 -5520670 -5331337 -3260044 554709 5358705 9272380 10132801 7781567
5033G781567l404939k537419j448722m34451R28023J495557J19894j426726o01664
$$ 7781567 4376628 1839209 390487 -43964 884059 2379616 2499510 1072784 471120
5024D71120J378973R70232j790844k842445l19634K601305K577592O06378l05556
$$ 471120 1850093 2820325 1029481 -1812964 -2132598 468707 3046299 3652677 3347121
5015C347121M32894J056457N24278l01815r2992J286204K449720J828365l97163
$$ 3347121 3780015 4836472 5360750 5058935 4965943 6252147 8701867 10530232 10133069
5006A0133069k302045k553236j561956K15595L064764N836462N532814J363507
$$ 10133069 7831024 5277788 3715832 3931427 6996191 12832653 18365467 19728974
4998A9728974l059184m264368l401169l155730k785881k92646K605128K492633
$$ 19728974 16669790 12405422 9004253 5848523 3062642 2769996 5375124 7867757
4990G867757J3163j170074k98989L30790L29190J209100J918703j35686l510374
$$ 7867757 7880920 6710846 6411857 6742647 7071837 8280937 10199640 10063954 6553580
4981F553580l762839o85427J079111l43400j534268m49350J67697j534021k787688
$$ 6553580 2790741 2105314 3184425 2841025 1306757 857407 1025104 -508917 -3296605
4972c296605j244875R24744J230923R81476J832025K095891K32394j253209O20444
$$ -3296605 -4541480 -3616736 -2385813 -1404337 427688 2523579 2755973 1502764 2123208
4963B123208M168897N136677K369680j550762l989599m144792k500457m31822
$$ 2123208 6292105 11428782 13798462 12247700 8258101 4113309 1612852 1181030
4955A181030O02680O89264J116373J978182K022251J119330L94811k87687j935990
$$ 1181030 1783710 2472974 3589347 5567529 7589780 8709110 9103921 8816234 6880244
4946F880244l300928j836679J551319K761717O42531j261602n83648N43912o001
$$ 6880244 3579316 1742637 3293956 6055673 6698204 5436602 4852954 5396866 5390865
4937E390865q19250m21367l65490k011228l581013l120779j408738K92127K170891
$$ 5390865 4571615 4150248 3784758 1773530 -1807483 -4928262 -6337000 -6044873 -3873982
4928c873982L513685K011836k189185n197220m494206j986816Q0445K301116M791886
$$ -3873982 -360297 1651539 -537646 -5734866 -10229072 -12215888 -12135443 -9834327 -5042441
4919e042441M957172J760108j447788j602308j61368K70978J94914J027758J785674
$$ -5042441 -85269 1674839 227051 -1375257 -1536625 -1265647 -1070733 -42975 1742699
4910A742699J023144m59759j259314j306011o48059Q63630J818572N96792j255663
$$ 1742699 2765843 2306084 1046770 -259241 -907300 -43670 1774902 2371694 1116031
4901A116031j119850k87203j505071k600880K63901L927898J967349l130188k545420
$$ 1116031 -3819 -291022 -1796093 -4396973 -4133072 -205174 1762175 -1368013 -3913433
4892c913433L127595L476186l572512p204666k297848K061178m80267l037923
$$ -3913433 -785838 2690348 -882164 -8086830 -10384678 -8323500 -8803767 -11841690
4884a1841690m32208P89554k828143l172618J842943O77612q315005p774073N810946
$$ -11841690 -12273898 -11484344 -14312487 -17485105 -15642162 -14964550 -23279555 -31053628 -25242682
4875b5242682O486168j5004090j6484807L9196991J09196355J08432149K5082440
$$ -25242682 -18756514 -33760604 -50245411 -11048420 98147935 206580084 231662524
4868B31662524n6628163o5911920k7344495n476376j3199808j7836130p546507
$$ 231662524 175034361 109122441 81777946 76301570 63101762 45265632 37719125
4861C7719125j891856p857928r389737p36846M318616P5997k248003K220270L866475
$$ 37719125 35827269 27969341 18579604 17842758 22161374 22237371 19989368 22209638 26076113
4852B6076113j214615l868456j82285J553438k225100l571539R01090L004874
$$ 26076113 24861498 20993042 20810757 22364195 20139095 16567556 17468646 20473520
4844B0473520j439718m483000o27605L506048J688414j305573M15774L244179
$$ 20473520 19033802 14550802 13923197 17429245 19117659 17812086 18227860 21472039
4836B1472039J456636k733982l974080k230052k80762J471512K570666O14132
$$ 21472039 22928675 20194693 16220613 13990561 13709799 15181311 17751977 18366109
4828A8366109l663748n091399j910433R13779L6766r10467J424150L776793K145740
$$ 18366109 14702361 9610962 7700529 8614308 8651074 7740607 9164757 12941550 15087290
4819A5087290j451677l053418k800213k344576q17983K134888L577600J807421
$$ 15087290 13635613 10582195 7781982 5437406 4619423 6754311 10331911 12139332
4811A2139332l23981l53913j81596j450841j718223N74460K003747k15851k778752
$$ 12139332 11815351 11461438 11279842 9829001 8110778 8685238 10688985 10473134 7694382
4802G694382j458369K042074L440126K633987K039290J349044q00790k664721
$$ 7694382 6236013 8278087 11718213 14352200 16391490 17740534 16939744 14275023
4794A4275023k120547j202237k751537m733384l236261O45007K420941J441679
$$ 14275023 12154476 10952239 8200702 3467318 231057 876064 3297005 4738684
4786D738684R76644J741879R91118j653928k782050q61825J116502M86234j119174
$$ 4738684 5715328 7457207 8448325 6794397 4012347 3150522 4267024 4753258 3634084
4777C634084p89740J128040J812780J16574j915553j684668O37451K098954O81256
$$ 3634084 2844344 3972384 5785164 5901738 3986185 2301517 2938968 5037922 5719178
4768E719178j774936j942384J69922J384440N80870L62501K141194L145740R24219
$$ 5719178 3944242 2001858 2171780 3556220 4137090 4499591 6640785 9786525 10710744
4759A0710744k197726k439790j21021J459047R79430l00109j430352k101016j397591
$$ 10710744 8513018 6073228 5952207 7411254 8390684 8090575 6660223 4559207 3161616
4750C161616O53791J572241l87671k795444k132740Q37920K350829J319662n1867
$$ 3161616 3815407 5387648 4999977 2204533 71793 909713 3260542 4580204 4528337
4741D528337o86858j624325k685102k144806k21543P12724R0045K159J365059
$$ 4528337 3841479 2217154 -467948 -2612754 -2834297 -2121573 -2031528 -2029369 -664310
4732f64310K445791K126684J578020J625173J348546M65742L50006J407320K010326
$$ -664310 1781481 3908165 5486185 7111358 8459904 8925646 9275652 10682972 12693298
4723A2693298J287485M36130M1502j146164l208489l706906j504271O09985k31039
$$ 12693298 13980783 14416913 14458415 13312251 10103762 6396856 4892585 5502570 5271531
4714E271531k520471k727050o57359P23122J95920j59551J321452L205974L057675
$$ 5271531 2751060 24010 -633349 89773 285693 126142 1447594 4653568 7711243
4705G711243O77813j785602k262561p43885P87860L82080j512104k114579L58823
$$ 7711243 8389056 6603454 4340893 3597008 4384868 4766948 3254844 1140265 1499088
4696A499088L810387M150110L85217l615023l502039L10705L272635K350560o16776
$$ 1499088 5309475 9459585 9844802 6229779 2727740 3038445 6311080 8661640 8044864
4687H044864j860763m61201J353462J800185J305626O40331m60412j880339k276483
$$ 8044864 6184101 5722900 7076362 8876547 10182173 10822504 10362092 8481753 6205270
4678F205270j135717o5220k03119J48465K790798N568050M282927j214644o024624
$$ 6205270 5069553 5004333 4801214 4949679 7740477 13308527 17591454 16376810 10352186
4669A0352186o298590l590628j607182j199513r11746n21839r63965j538608l08861
$$ 10352186 4053596 462968 -1144214 -2343727 -3255473 -3777312 -4741277 -6279885 -6588746
4660f588746K455415L869131K418228L08026M57900K558123L665477J929974j720218
$$ -6588746 -4133331 -264200 2154028 2462054 2919954 5478077 9143554 11073528 9353310
4651I353310n153257o839590o157490l336773L16099K904991L249719J626669
$$ 9353310 4200053 -2639537 -8797027 -12133800 -11817701 -8912710 -5662991 -4036322
4643d036322n40921j279630R20118N264176Q079118O015800L34387l902353l761534
$$ -4036322 -4577243 -5856873 -4936755 327421 8406539 14422339 14756726 10854373 7092839
4634G092839j474775k57734K76539J877742L104596J094219k917508m261601j573444
$$ 7092839 5618064 5360330 5636869 7514611 10619207 11713426 8795918 4534317 2960873
4625B960873J202251Q66053p84083p94638L23902O09574M69833J253323K033172
$$ 2960873 4163124 5029177 4245094 3450456 3774358 4383932 4853765 6107088 8140260
4616H140260J109495o97388j373097j166409j630024k182719r10984J689235K978334
$$ 8140260 9249755 8552367 7179270 6012861 4382837 2200118 1289134 2978369 5956703
4607E956703K132176R66181P41526Q43501P92943J000122J247319P43426j53765
$$ 5956703 8088879 9055060 9796586 10640087 11433030 12433152 13680471 14423897 14270132
4598A4270132m35458m88169j312462k134329j541753m85318q35495j374255O52896
$$ 14270132 13834674 13346505 12034043 9899714 8357961 7872643 7037148 5662893 6315789
4589F315789L809648L146544j986798n691865l731350L70699J010809j367249
$$ 6315789 10125437 13271981 11285183 5593318 1861968 2232667 3243476 1876227
4581A876227k243498n83695M68522n60315j475592m93827J235004J972206J748220
$$ 1876227 -367271 -950966 -482444 -1042759 -2518351 -3012178 -1777174 195032 1943252
4572A943252J553435J794030K087903J737698N87923p6596J347102L898078M163097
$$ 1943252 3496687 5290717 7378620 9116318 9704241 9627645 10974747 14872825 19035922
4563A9035922R14315k417835k325369l29124l21604k373947l169758j917144j408874
$$ 19035922 19950237 17532402 15207033 14877909 14556305 12182358 9012600 7095456 5686582
4554E686582k709614l045608n48108K463771L062829J751588O34173m9436r76965
$$ 5686582 2976968 -68640 -616748 1847023 4909852 6661440 7295613 7246177 6269212
4545F269212j263519R4613J479508N05053j761614j620641J650021M018338K218731
$$ 6269212 5005693 5100306 6579814 7084867 5323253 3702612 5352633 9370971 11589702
4536A1589702j316207j758204J105006K564529N1027k939449k031043J554748
$$ 11589702 10273495 8515291 9620297 12184826 12235853 9296404 7265361 8820109
4528H820109K964764P54662j821976k275572j620365r50912N72650K506398J882721
$$ 8820109 11784873 12539535 10717559 8441987 6821622 5870710 6443360 8949758 10832479
4519A0832479j874951m222994j473239L177253L953633R16428p85256R29171K805392
$$ 10832479 8957528 4734534 3261295 6438548 10392181 11308609 10523353 11452524 14257916
4510A4257916K285008Q67615K92030l44100j865383k861340k128566o07696N31435
$$ 14257916 16542924 17410539 17702569 17358469 15493086 12631746 10503180 9895484 10426919
4501A0426919J257086J214246k28459j603318l83589K402628K380690j485610
$$ 10426919 11684005 12898251 12669792 11066474 10682885 13085513 15466203 13980593
4493A3980593m354234k403755J371903J838759p77301k192935q41856R00063J209303
$$ 13980593 9626359 7222604 8594507 10433266 9655965 7463030 6621174 7521237 8730540
4484H730540O66090J7416o76526q91212l10613j75183j411216k157876k8418L691258
$$ 8730540 9396630 9414046 8737520 7846308 7535695 7360512 5949296 3791420 3763002 7454260
4474G454260N117367K898869n32648k745098l460863k843939p34023J614735J746461
$$ 7454260 12571627 15470496 14937848 12192750 8731887 5887948 5153925 6768660 8515121
4465H515121p36477l037401k489942L41917K764978L016037J493720k07088r05417
$$ 8515121 7778644 4741243 2251301 2593218 5358196 8374233 9867953 9660865 8755448
4456H755448q23999r60716j378091j023290K87659J183934J018140J006472J573024
$$ 8755448 7931449 6970733 5592642 4569352 4857011 6040945 7059085 8065557 9638581
4447I638581P38304k405402m679744k649100J904586M059813K549538O23126M28766
$$ 9638581 10376885 7971483 3291739 642639 2547225 6607038 9156576 9779702 10208468
4438A0208468O36469J41361K26763J787142L449921L675731K397658R7798k324853
$$ 10208468 10844937 10986298 11213061 13000203 16450124 20125855 22523513 22621311 20296458
4429B0296458k906467q68306Q24746j090364m454674m093950j87907J380333j556940
$$ 20296458 17389991 16521685 17346431 16256067 11801393 7707443 7519536 8899869 7342929
4420G342929l775765j343493J877225Q63715k313082k368776N37736J855190K89143
$$ 7342929 3567164 2223671 4100896 4964611 2651529 282753 820489 2675679 2964822
4411B964822j080998l43566J237168K160708J861116j32825k750663k590397J616080
$$ 2964822 1883824 1540258 2777426 4938134 6799250 6666425 3915762 1325365 2941445
4402B941445N503723M493992J012754R39895L965441L821830j463407n996458
$$ 2941445 8445168 12939160 13951914 14891809 18857250 22679080 21215673 15219215
4394A5219215m787361n49645J411943P33962O24840J899843K265369L18919k556832
$$ 15219215 10431854 9882209 11294152 12028114 12652954 14552797 16818166 17137085 14580253
4385A4580253l881393k297874J138402L318063K067505r37678k107200q98819
$$ 14580253 10698860 8400986 9539388 12857451 14924956 13987278 11880078 10981259
4377A0981259k41388j532596k420157r18318J369018K132974J761624J571635
$$ 10981259 10739871 9207275 6787118 5868800 7237818 9370792 11132416 12704051
4369A2704051J062939m40214j423530l42953J272850P08479j896148l971675m247479
$$ 12704051 13766990 13326776 11903246 11560293 12833143 13541622 11645474 7673799 3426320
4360C426320l606766k803959j765560r01732q98486j290230j124582p48772r48446
$$ 3426320 -180446 -2984405 -4749965 -5651697 -6550183 -7840413 -8964995 -9713767 -10662213
4351a0662213p18252J633227N067467O172655L802659J027801J007437K695884
$$ -10662213 -11380465 -9747238 -4679771 1492884 5295543 6323344 7330781 10026665
4343A0026665K516458o84186m254067n106655k942165J98841K467077L509422
$$ 10026665 12543123 11858937 7604870 2498215 -443950 -245109 2221968 5731390
4335E731390L671333K880985R86498j037827j346442M58537J960559M30445l201289
$$ 5731390 9402723 12283708 13270206 12232379 10885937 11344474 13305033 13735478 10534189
4326A0534189m665289j707933K417788K771174p92188l480036k039037J371965
$$ 10534189 5868900 4160967 6578755 9349929 8557741 5077705 3038668 4410633
4318D410633K999420K608225K427540K845282K320607Q44553J67330M35487j92969
$$ 4410633 7410053 10018278 12445818 15291100 17611707 18456260 18623590 19059077 18866108
4309A8866108j843720k018827J84346J926382P81179j529694k109917j436462
$$ 18866108 17022388 15003561 15187907 17114289 17895468 16365774 14255857 12819395
4301A2819395j888855l237770k955550m66770J917894K280803Q91477j142020
$$ 12819395 10930540 7692770 4737220 4270450 6188344 8469147 9360624 8218604
4293H218604k693818k241879Q53351M414096M979375J818893k167577l766019
$$ 8218604 5524786 3282907 4136258 8550354 13529729 15348622 13181045 9415026
4285I415026k295630N99810K420346J449966j364465k665999n93423K366225K590476
$$ 9415026 7119396 7719206 10139552 11589518 10225053 7559054 6965631 9331856 11922332
4276A1922332M13668q15138o5923L65295q49288k264343k764665l209538l939900
$$ 11922332 12336000 11520862 11454939 11820234 10970946 8706603 5941938 2732400 -1207500
4267a207500l539996j352751J145752K513728K722954J787202m52617k499978
$$ -1207500 -4747496 -6100247 -4954495 -2440767 282187 2069389 1616772 -883206
4259h83206j909455J203793L896813M424704L825887K853330O51388k316190l496951
$$ -883206 -2792661 -1588868 2307945 6732649 10558536 13411866 14063254 11747064 8250113
4250H250113k212288j185149k082734k684371q93189J459449J745477R09252J425306
$$ 8250113 6037825 4852676 2769942 85571 -807618 651831 2397308 3306560 4731866
4241D731866K784483K413161L4326j948444k011763j032132l25677O3041R09643
$$ 4731866 7516349 9929510 9963836 8015392 6003629 4971497 4645820 4708861 5618504
4232E618504K399042L188301J357747k608922m821388k499190J256869R71089
$$ 5618504 8017546 11205847 12563594 9954672 5133284 2634094 3890963 4862052
4224D862052k895547l856923R80891O139580N448716K12401l980562n015901m484654
$$ 4862052 1966505 -1890418 -909527 5230053 10678769 10891170 6910608 1894707 -2589947
4215b589947k844698P32682M697707N593860K509544j541373k909743o32110L025713
$$ -2589947 -5434645 -4701963 -4256 5589604 8099148 6557775 3648032 3015922 6041635
4206F041635M521214K564362n1832O0318J827237J269691j866219l355473j370486
$$ 6041635 10562849 13127211 13075379 13135697 14962934 16232625 14366406 11010933 9640447
4197I640447O90653K12515o27273M29089J591032Q26156l87408m28169p25584
$$ 9640447 10331100 10543615 9916342 10345431 11936463 12762619 12375211 11947042 11221458
4188A1221458k406560l605334k984069j846423l60674L279657P426015O810055
$$ 11221458 8814898 5209564 2225495 379072 18398 3298055 10724070 17534125
4180A7534125J056547l224312k530035j287528k348528j316709L717276N889637
$$ 17534125 18590672 15366360 12836325 11548797 9200269 7883560 11600836 17490473
4172A7490473P93251m657505l424871Q5452n35986j444828K765006O460915K263726
$$ 17490473 18283724 13626219 10201348 10286800 9750814 8305986 11070992 17531907 19795633
4163A9795633m343205l819176N93789k28281l793916j589533L440175K365317
$$ 19795633 15452428 11633252 12227041 11998760 8204844 6615311 10055486 12420803
4155A2420803j708474N51274N548942L167686k296900N60968O558600K317383
$$ 12420803 10712329 11263603 16812545 19980231 17683331 18244299 24802899 27120282
4147B7120282n775897r30884R650548M337704r230630l053512J1089964j7286325
$$ 27120282 21344385 20413501 30064049 34401753 25171123 22117611 33207575 15921250
4139A5921250r0716572j29764159p1395447L5677500Q8597626O0614634J6095094
$$ 15921250 -74795322 -204559481 -275954928 -240277428 -151679802 -91065168 -74970074
4132g4970074O715735J5323158J0662634R3135K503688J0058280O824029j063886
$$ -74970074 -68254339 -52931181 -42268547 -42175412 -39671724 -29613444 -22789415 -23853301
4124b3853301R1904O046079N531979J278011J230625K115900j500929l947603
$$ -23853301 -23761397 -17715318 -12183339 -10905328 -9674703 -7558803 -9059732 -13007335
4116a3007335M13366M352774O61204l454184M73488N539558J589692n606853l786778
$$ -13007335 -12593969 -8241195 -7579991 -11034175 -10560687 -5021129 -3431437 -9038290 -12825068
4107a2825068M525253O659049Q03293l267880j521245O11259L90073R08174K473950
$$ -12825068 -8299815 -1640766 -837473 -4105353 -5626598 -5015339 -4625266 -3717092 -1243142
4098a243142J722510p57855r69579R44674J523250P71178P51453p5731l508455
$$ -1243142 479368 -278487 -1248066 -303392 1219858 1991036 2742489 2666758 -841697
4089h41697n713247k861035O25508j602221o253494m906551K067027O229524M643135
$$ -841697 -6554944 -9415979 -8790471 -10392692 -16646186 -21552737 -19485710 -13256186 -8613051
4080h613051K623546L088306L041404J514778J652120L279339K043493k062131
$$ -8613051 -5989505 -2901199 140205 1654983 3307103 6586442 8629935 6567804
4072F567804l431589l76659J818998P0637j669903p1871J865724P70979j204799
$$ 6567804 3136215 2759556 4578554 4649191 2979288 2907417 4773141 5544120 4339321
4063D339321q06814O00857N7075j698527j895843k73504J262483J726037J395757
$$ 4339321 3532507 4133364 4190439 2491912 596069 322565 1585048 3311085 4706842
4054D706842N64769l28102n74984k00390J05585K51971M79537K04156j012723
$$ 4706842 5271611 4943509 4368525 4168135 4273720 4525691 5005228 5209384 4196661
4045D196661k049914j937953j870251k900504l118710n06661K795423L102348
$$ 4196661 2146747 208794 -1661457 -4561961 -7680671 -8187332 -5391909 -2289561
4037b289561R78749J9371P05337M03872q90893k30753K373348L055202M17643
$$ -2289561 -1310812 -1291441 -586104 -182232 -1073125 -1303878 1069470 4124672 4542315
4028D542315k072280j661992N0784P73125P66014O89480n616q13055O9348K085096
$$ 4542315 2470035 808043 858827 1631952 2397966 3087446 3081830 2268775 2338123 4423219
4018D423219K062213p16021k826078j872303K56730J159373J315370J630316J149082
$$ 4423219 6485432 5769411 2943333 1071030 1327760 2487133 3802503 5432819 6581901
4009F581901m28301j216935m57372j72817j252642j302995R19184K355844K68365
$$ 6581901 6153600 4936665 4479293 4306476 3053834 1750839 2670023 5025867 5294232
4000E294232k854221k673808P61973L613715L564201J504547q00326k071096j741179
$$ 5294232 2440011 -233797 528176 4141891 7706092 9210639 8410313 6339217 4598038
3991D598038j012569k156816m770987m931374o83640L969651M024860O04425q63970
$$ 4598038 3585469 1428653 -3342334 -8273708 -8957348 -4987697 -962837 -358412 -1222382
3982a222382J415750L742803L040620Q14134j52141J61732J03414o04066r06796
$$ -1222382 193368 3936171 6976791 7790925 7638784 7800516 7903930 7299864 6393068
3973F393068n57455n31989j377803k219356j917622q26303n20995j438014j873498
$$ 6393068 5835613 5303624 3925821 1706465 -211157 -1037460 -1558455 -2996469 -4869967
3964d869967n68883P27481m53697k844109k307585K080334N927424N282715J834603
$$ -4869967 -5438850 -4711369 -5165066 -8009175 -10316760 -8236426 -2309002 2973713 4808316
3955D808316m9906P21078J897035K165559K132903J722702o430k195207k326740
$$ 4808316 4758410 5479488 7376523 9542082 11674985 13397687 13391257 11196050 8869310
3946H869310O855J809901M98812k614277m139075k930568j063799p28481j491764
$$ 8869310 8876165 10686066 11184878 8570601 4431526 1500958 437159 -291322 -1783086
3937a783086j205621J034232L719690M740203L548743J121432j415628l269177
$$ -1783086 -2988707 -1954475 1765215 6505418 10054161 11175593 9759965 6490788
3929F490788l736386k641515p60680J068051K716807L764670K948023L40152j256305
$$ 6490788 2754402 112887 -647793 420258 3137065 6901735 9849758 10189910 8933605
3920H933605K09580K147951M64638l783685n249385k499614m01582k097400l602261
$$ 8933605 9143185 11291136 11755774 7972089 2722704 223090 -178492 -2275892 -5878153
3911e878153m98486M039515L562600j503702m210389j352666K499947K666190
$$ -5878153 -6376639 -2337124 1225476 -278226 -4488615 -5841281 -3341334 -675144
3903f75144Q92352J269697L353973L345932M14540k073738j682007j70331m19450
$$ -675144 217208 1486905 4840878 8186810 8601350 6527612 4845605 4675274 4255824
3894D255824k084620k311644j82777J668846O46352k126407l268362j566460R01169
$$ 4255824 2171204 -140440 -323217 1345629 1991981 -134426 -3402788 -4969248 -4068079
3885d068079J980980J882757J919312K476080L002508K719229Q03649k666627
$$ -4068079 -2087099 -204342 1714970 4191050 7193558 9912787 10716436 8049809
3877H049809n521361n140688k047550K09845k02830j084311o3414J740641K117583
$$ 8049809 2528448 -2612240 -4659790 -4449945 -4652775 -5737086 -5800500 -4059859 -1942276
3868a942276J496217J443973J356020n178j014127R66738M664475N601928K225226
$$ -1942276 -446059 997914 2353934 2348756 1334629 2301367 6965842 12567770 14792996
3859A4792996j903909k996082j422403m009q9876p85648p46276M03974J756056
$$ 14792996 12889087 9893005 8470602 8466593 8376717 7591069 6844793 7248767 9004823
3850I004823J871903M87121r25510j263384j498207k589082k905056m62411K968472
$$ 9004823 10876726 11363847 10438337 9174953 7676746 5087664 2182608 1720197 4688669
3841D688669L408389M72498j936505j559238o89013j467970j952827K11590L006222
$$ 4688669 8097058 8569556 6633051 5073813 4384800 2916830 964003 1175593 4181815
3832D181815K599087q28041l414821l156353j733515p95509L02059K070570K911153
$$ 4181815 6780902 5952861 2538040 -618313 -2351828 -3147337 -2845278 -774708 2136445
3823B136445J351884j329340k542114j665583l20349K39260M01064P35681Q76721
$$ 2136445 3488329 2158989 -383125 -2048708 -2369057 -2129797 -1728733 -993052 -116331
3814a16331P44786J568470L997542N805546L754940j680029n591312m150349O74956
$$ -116331 628455 2196925 6194467 12000013 15754953 14074924 8483612 4333263 5008219
3805E008219L751011K906671K06488j947883l095627l197224j908102k31351k64477
$$ 5008219 8759230 11665901 11872389 9924506 6828879 3631655 1723553 1492202 1227725
3796A227725j999080k609547l98529K609460L666749K888988J854383N54372j627705
$$ 1227725 -771355 -3380902 -3779431 -1169971 2496778 5385766 7240149 7794521 6166816
3787F166816l277299k328920M29509K051617J549596P00032O37928M02764m89253
$$ 6166816 2889517 560597 990106 3041723 4591319 5291351 5929279 6332043 5842790
3778E842790p12118L58035J031856j53305j964567k239995q27426Q86958K241857
$$ 5842790 5130672 5488707 6520563 6367258 4402691 2162696 1335270 2222228 4464085
3769D464085L287877L375008J742127p78323k343765k293371j392249k47736R04125
$$ 4464085 7751962 11126970 12869097 12090774 9747009 7453638 6061389 5813653 6717778
3760F717778J166237k21160j913963j465271J062595K599260J272199r09551j184247
$$ 6717778 7884015 7662855 5748892 4283621 5346216 7945476 9217675 8308124 7123877
3751G123877l6075J52120q62601j212470m83115l50857j246514j081043J397970
$$ 7123877 7087802 7239922 6377321 5164851 4681736 4330879 3084365 2003322 3401292
3742C401292L994574L576846P2962l631130n063376l989905j438997J415008L289931
$$ 3401292 7395866 10972712 11045674 7414544 2351168 -1638737 -3077734 -1662726 1627205
3733A627205L162538J355933l41268k96243J269624K447191J588694r06308k911881
$$ 1627205 4789743 6145676 5804408 5508165 6777789 9224980 10813674 9907366 6995485
3724F995485k888644j597750r08118j100656n20624J631790L412749K369214q57873
$$ 6995485 4106841 2509091 1600973 500317 -20307 1611483 5024232 7393446 6535573
3715F535573k771660j241350J741551K448006r2095l130451l730104k093896o42903
$$ 6535573 3763913 2522563 4264114 6712120 6620025 3489574 -240530 -2334426 -2977329
3706b977329n43928m81636J004699L191871L963039K318149o16305k739257k689086
$$ -2977329 -3521257 -4002893 -2998194 193677 4156716 6474865 5858560 3119303 430217
3697D30217r03317O23710L04597r61358p54414J238024K207438K60359k209798
$$ 430217 -473100 150610 455207 -506151 -1260565 -22541 2184897 2445256 235458
3688B35458j559490J803876M059441L453594J920747R87468m60312l007282m406082
$$ 235458 -1324032 479844 4539285 7992879 9913626 10901094 10440782 7433500 3027418
3679C027418k646926P40647K631181K109660M84666j145278k388369k624489j486444
$$ 3027418 380492 1121139 3752320 5861980 6346646 5201368 2812999 188510 -1297934
3670a297934J92085J256521J593996J714247J705816J396539P60703k80522j382442
$$ -1297934 -1105849 150672 1744668 3458915 5164731 6561270 7321973 7041451 5659009
3661E659009j080128J503669M059991K948693j420855m105019k162925J375502
$$ 5659009 4578881 6082550 10142541 13091234 11670379 7565360 5402435 6777937
3653F777937K278171P74533m30686r36561j841688k409803j419271k17845o81300
$$ 6777937 9056108 9830641 9399955 8463394 6621706 4211903 2792632 2574787 1893487
3644A893487j545659m85230J558798J972487R75276M59600j59895k313077l882691
$$ 1893487 347828 -137402 1421396 3393883 4369159 4828759 4668864 2355787 -1526904
3635a526904j791974J893925K335072Q5537M21587L948797M934044J002106k492443
$$ -1526904 -3318878 -1424953 910119 995656 1417243 5366040 10300084 11302190 8809747
3626H809747j206434J434692P87422j126694K03619L744840M817613K397953p06455
$$ 8809747 7603313 9038005 9825427 8698733 8902352 12647192 17464805 19862758 19156303
3617A9156303k946020m427765l988509p78266K404648K023231p36503j771653
$$ 19156303 16210283 11782518 7794009 7015743 9420391 11443622 10707119 8935466
3609H935466n86721m52669k359789l571404k740249j948096k307325j518388K059626
$$ 8935466 8348745 7896076 5536287 1964883 -775366 -2723462 -5030787 -6549175 -4489549
3600d489549N829506N848902J716475l136380n016407k894486J132366L555763
$$ -4489549 1339957 7188859 8905334 5768954 752547 -2141939 -1009573 2546190
3592B546190K543031k86697j945511j703116j314500j869221k262866j209843
$$ 2546190 5089221 4802524 2857013 1153897 -160603 -2029824 -4292690 -5502533
3584e502533Q14991K363578K675697J994538R97531K57924k58330j129816k413737
$$ -5502533 -4687542 -2323964 351733 2346271 3343802 3601726 3343396 2213580 -200157
3575b00157l094383k405794j169432p62632j214071j457657j043653l52419N55370
$$ -200157 -3294540 -5700334 -6869766 -7632398 -8846469 -10304126 -11347779 -11700198 -11144828
3566a1144828J963702L449659L962044L079188J526396N60472J137433K966841
$$ -11144828 -9181126 -5731467 -1769423 1309765 2836161 3396633 4534066 7500907
3558G500907L983375J979814k390840n555182n051223k260347N1272J157876J636288
$$ 7500907 11484282 13464096 11073256 5518074 466851 -1793496 -1742224 -584348 1051940
3549A051940J118899o54630j889268p43143J409551J512385p20050k523799k144548
$$ 1051940 2170839 1516209 -373059 -1116202 293349 1805734 1085684 -1438115 -3582663
3540c582663o85339J83335J27840l73691n87320L17033J974882K354234N14591
$$ -3582663 -4268002 -4084667 -3956827 -4330518 -4917838 -4600805 -2625923 -271689 242902
3531B42902j250823n70378R43706J25840k195489k156507Q57102L286055L264837
$$ 242902 -1007921 -1578299 -634593 -508753 -2704242 -4860749 -4003647 -717592 2547245
3522B547245K867602L229357K039699j745061m708555l584877n8808K088147K149378
$$ 2547245 5414847 8644204 10683903 8938842 4230287 645410 586602 2674749 4824127
3513D824127J792209J324686q9039j809054k214365j123875K77174J027274M73271
$$ 4824127 6616336 7941022 7851983 6042929 3828564 2704689 2981863 4009137 4482408
3504D482408j658016l722008k748980J381072M482640L253550j54599j629273
$$ 4482408 2824392 -897616 -3646596 -2265524 2217116 5470666 5316067 3686794
3496C686794j113677j515711l088449l122725r22011Q92386N52975o63348j082292
$$ 3686794 2573117 1057406 -2031043 -5153768 -6075779 -5183393 -4630418 -5293766 -6376058
3487f376058n73830Q06076L226223N162797L839615q99221n269420n642854k406832
$$ -6376058 -6949888 -6143812 -2917589 2245208 6084823 5185602 -83818 -5726672 -8133504
3478h133504J426390L780218M316057L253432J255448k32357j40027Q33502R41470
$$ -8133504 -6707114 -2926896 1389161 4642593 5898041 5665684 5525657 6359159 7300629
3469G300629n33198k446962k980473j485118P20574J593415P06995k27900J72396
$$ 7300629 6767431 4320469 1339996 -145122 575452 2168867 2875862 2647962 2820358
3460B820358R57463O65630J18534J081542K610872J762343j514243l361900j461317
$$ 2820358 3777821 4443451 4561985 5643527 8254399 10016742 8502499 5140599 3679282
3451C679282J396883J559823j59124o10072Q8836p83212k835340k101870K485757
$$ 3679282 5076165 6635988 6476864 5866792 5955628 5172416 2337076 235206 2720963
3442B720963O161129M454202n17694l061194j509733O40558N07478q97168j700669
$$ 2720963 8882092 13336294 12818600 9757406 8247673 8888231 9395709 8498541 6797872
3433F797872k135859k746910k146116Q91863M394048M921641K145624n66797n63308
$$ 6797872 4662013 1915103 -231013 660850 5054898 9976539 12122163 11555366 10992058
3424A0992058R51407J090356p66975k510859k212068k90417J295031J270175J25618
$$ 10992058 11943465 13033821 12266846 9755987 7543919 7253502 8548533 9818708 9944326
3415I944326p42947o17846l2011J38722j75617k18499O24450K030922K840981
$$ 9944326 9201379 8583533 8551522 8690244 8514627 8296128 8920578 10951500 13792481
3406A3792481K018178j13786j706026j242864L32696M88529j423485k987074k090720
$$ 13792481 15810659 15696873 13990847 12747983 13080679 13569208 12145723 9158649 7067929
3397G067929N418P59928K63640N74988J806493J846491J40685j317150j620266
$$ 7067929 7073347 7833275 8096915 8671903 10478396 12324887 12465572 11148422 9528156
3388I528156k481038m504482m907147j615274K571140L188516L05291j815124
$$ 9528156 7047118 2542636 -2364511 -3979785 -1408645 1779871 2085162 270038
3380B70038q55989J026138J237130K77086o8886K01885j51046j252932j937134
$$ 270038 -585951 440187 1677317 1954403 1885517 2087402 1936356 683424 -1253710
3371a253710j458344l07176M95703M08295l5297M85239K511698M439256L811232
$$ -1253710 -2712054 -3019230 -2523527 -2115232 -2150529 -1665290 846408 5285664 9096896
3362I096896M83407k632632k875210r41943M26821O3614q74265j412772k113967
$$ 9096896 9580303 6947671 4072461 3130518 3557339 3620953 2746688 1333916 -780051
3353g80051l350466l827575k147334R18102L065568L179993K329789K098951K941187
$$ -780051 -4130517 -7958092 -10105426 -9187324 -6121756 -2941763 -611974 1486977 4428164
3344D428164M194759M607651K750449j637700o140146p051432l503965R56242
$$ 4428164 8622923 13230574 15981023 14343323 8203177 1151745 -2352220 -1395978
3336a395978K353292Q55495k95656M96409J758351J852337Q34506q30212k982173
$$ -1395978 957314 1812809 1517153 2013562 3771913 5624250 6458756 5628544 2646371
3327B646371m463396l406855m3633K734561K985267K074022J924528J881568N17311
$$ 2646371 -1817025 -5223880 -5267513 -2532952 452315 2526337 4450865 6332433 6849744
3318F849744j041718n04351J499812J728675q95796l386007k673175L53693K252467
$$ 6849744 5808026 5303675 6803487 8532162 7636366 4250359 1577184 1930877 4183344
3309D183344J382206o81463j716957j407115r06952q43728p83768m97255n21513
$$ 4183344 5565550 4884087 3167130 1760015 853063 9335 -774433 -1271688 -1793201
3300a793201q98405n07409J103914K131647O25431k192371k951204p09924J801122
$$ -1793201 -2691606 -3199015 -2095101 36546 661977 -1530394 -4481598 -5191522 -3390400
3291c390400K209171J392897J160393J389199J243712J199830J756305J825212
$$ -3390400 -1181229 211668 1372061 2761260 4004972 5204802 6961107 8786319
3283H786319O16649m01712K40325J281904Q42434j69080J46533N79139j769308
$$ 8786319 9402968 9001256 9241581 10523485 11365919 11196839 11343372 11922511 10153203
3274A0153203o122376p843917m532814O84669L248725K308498M77785J09012J054489
$$ 10153203 4030827 -3813090 -8345904 -7661235 -4412510 -2104012 -1626227 -1517215 -462726
3265d62726J362151k54696k309063j802224J402435L261943R11196k501006j893930
$$ -462726 899425 644729 -1664334 -3466558 -2064123 1197820 2109016 -391990 -2285920
3256b285920K066929L850334J359949j541338j584567k81001P4755q4768l11119
$$ -2285920 -218991 3631343 4991292 3449954 1865387 1584386 1659141 1574373 1263254
3247A263254j845174l859905k504994K763750O203542L536329j138880j373726
$$ 1263254 -581920 -4441825 -6946819 -4183069 2020473 5556802 4417922 3044196
3239C044196J913249K822508L56448q89969P90680J919540P43415j0484Q44048
$$ 3044196 4957445 7779953 8136401 7246432 8037112 9956652 10700067 10689583 11533631
3230A1533631J15975l581749n889268k900118K426571M305263K070732k6808O17145
$$ 11533631 11649606 8067857 2178589 -721529 1705042 6010305 8081037 8054229 8671374
3221H671374K514459L488941L077689J552090o80469k379420k298017j076590
$$ 8671374 11185833 14674774 17752463 19304553 18624084 16244664 13946647 12870057
3213A2870057p07200j862686l067679k712280q78303R05770J056725o20923k337756
$$ 12870057 12162857 10300171 7232492 4520212 3641909 4547679 5604404 4983481 2645725
3204B645725j908219L97931J758385N61388j254278j262662l26679q03824k204764
$$ 2645725 737506 1135437 2893822 3455210 2200932 938270 611591 -192233 -2396997
3195b396997j868842M82451K395092L080164M294911N791672M123526j480272
$$ -2396997 -4265839 -3783388 -1388296 1691868 5986779 11778451 15901977 14421705
3187A4421705n807746m068770J012877K931487N40723j503683q04234j60127j434020
$$ 14421705 8613959 4545189 5558066 8489553 9030276 7526593 6722359 6562232 5128212
3178E128212j958282J62259J737955m71437l716253l035225Q77363K702354P70370
$$ 5128212 3169930 3332189 5070144 4598707 882454 -2152771 -1275408 1426946 2197316
3169B197316q86060M48008J951051L23342k734581l269014q95218J408902K000543
$$ 2197316 1311256 1759264 3710315 4033657 1299076 -1969938 -2865156 -1456254 544289
3160E44289J934692K091073J785845O76469m3134P77092K579223L598532K473668
$$ 544289 2478981 4570054 6355899 7032368 6989234 7766326 10345549 13944081 16417749
3151A6417749o33259l866848m870763l033700l88309O01961p4544l32112R48476
$$ 16417749 15784490 11917642 7046879 4013179 3624870 4226831 4152287 3820175 4768651
3142D768651K472183K359599L26293k327557l961729l461661q65773K196544L412134
$$ 4768651 7240834 9600433 9926726 7599169 3637440 175779 -689994 1506550 4918684
3133D918684J895619r02085k743873k587355q21443J504181K949596K122058q25900
$$ 4918684 6814303 5912218 3168345 580990 -240453 1263728 4213324 6335382 5509482
3124E509482l498783l454525j153005N90285L16358l80145M76197K371024L368385
$$ 5509482 2010699 -1443826 -2596831 -2006546 -1690188 -2070333 -1594136 776888 4145273
3115D145273K876880J701639J80149j699405k700081j228071J818505L352907
$$ 4145273 7022153 8723792 8903941 7204536 4504455 3276384 5094889 8447796
3107H447796K107289K60340p5426J54841p93626k148622j946579m07585N57643
$$ 8447796 10555085 10815425 10739999 10894840 10101214 7952592 6006013 5598428 6156071
3098F156071N04704O61130J345360J538796R50976L87103Q4956m15931j026464
$$ 6156071 6660775 7321905 8667265 10206061 11157037 11544140 11629096 11213165 10186701
3089A0186701j674986l412014o387654p475463l389718L808393Q044284O748372
$$ 10186701 8511715 5099701 -1287953 -8763416 -12153134 -8344741 -300457 6447915
3081F447915L378630J507608N16392r93521j659834k22115J350369Q99036k64153
$$ 6447915 9826545 11334153 11850545 10857024 9197190 8975075 10325444 11224480 10960327
3072A0960327J51111J520851J933250J550079J356206P11121r08139k084525k331554
$$ 10960327 11111438 12632289 14565539 16115618 17471824 18182945 17274806 15190281 12858727
3063A2858727l810517o703093o561740j134933L860462K212278k564930k295229
$$ 12858727 9048210 2345117 -4216623 -5351556 -1491094 721184 -1843746 -4138975
3055d138975K558669L933672L10528n61979M426711P431034K487754m306884m621396
$$ -4138975 -1580306 2353366 2663894 2101915 6528626 13959660 16447414 12140530 7519134
3046G519134o21278M88968j019190J52358K993891J478582l940343n873836j948453
$$ 7519134 6897856 7386824 6367634 6519992 9513883 10992465 7052122 1178286 -770167
3037g70167J533357J35583k321702j340628J003317P94763j026667j471424r53543
$$ -770167 763190 898773 -1422929 -2763557 -1760240 -965477 -1992144 -3463568 -4417111
3028d417111j213649j036126J188986L228613K279839N16597K066924N532402
$$ -4417111 -5630760 -6666886 -5477900 -2249287 30552 547149 2614073 8146475
3020H146475N201872k4055m506636m227939k087203j993529k323036K18888L458879
$$ 8146475 13348347 13324292 8817656 4589717 2502514 508985 -1814051 -1595163 1863716
3011A863716K332329k366243l859816P09400N615755M796588M50154j050302J041325
$$ 1863716 4196045 1829802 -2030014 -1320614 4295141 9091729 9541883 8491581 9532906
3002I532906J655934j377613m158157l298350o57893P77531J506117K858982L192664
$$ 9532906 11188840 9811227 5653070 2354720 1696827 2474358 3980475 6839457 10032121
2993A0032121O39058k668042l194448j402979o27099j542123j790584o68428n1249
$$ 10032121 10671179 8003137 4808689 3405710 2778611 1236488 -554096 -1222524 -1273773
2984a273773m14884J07290J922235K871473J969880Q60382M44223m26725j555895
$$ -1273773 -1688657 -1581367 340868 3212341 5182221 6042603 6486826 6060101 4504206
2975D504206n44897K586674L731981O00787l060456k740150J87269J282387L06896
$$ 4504206 3959309 6545983 10277964 10878751 7818295 5078145 5265414 6547801 6854697
2966F854697P23286K918105L170987J7359k957956k449328m1838P66698l46679
$$ 6854697 7577983 10496088 13667075 13684434 10726478 8277150 8235312 9002010 8655331
2957H655331r39360R5299J254976J046919J61411L59642J719242J932343p74565
$$ 8655331 7715971 7811270 9066246 10113165 10274576 10634218 12353460 14285803 13511238
2948A3511238m406742m804324j202603K101446J471634r97118j136116N25506
$$ 13511238 9104496 4300172 3097569 5199015 6670649 5673531 4537415 5062921
2940E062921m6710l182198m441328j538615K332683L805433L619864L189706J142092
$$ 5062921 5016211 1834013 -2607315 -4145930 -1813247 1992186 5612050 8801756 9943848
2931I943848l131963n957516l863587O62692K441170J102351O07101K055486K108363
$$ 9943848 6811885 854369 -3009218 -2346526 94644 1196995 1804096 3859582 5967945
2922E967945p95255l401168k688208k51870P52683K93255M24923J385430J444291
$$ 5967945 5172690 1771522 -916686 -1168556 -415873 -122618 302305 1687735 3132026
2913C132026o2457j733960k148854j528390j103381j443020j636330k82721K443228
$$ 3132026 3069569 1335609 -813245 -2341635 -3445016 -4888036 -6524366 -6807087 -4363859
2904d363859M298123L516207J336940M86870J404746J917360Q66942j60393L51990
$$ -4363859 -65736 3450471 4787411 5274281 6679027 8596387 9463329 9302936 9654926
2895I654926J330580R44045m57933j011960k68661J21394j364630m078958n528187
$$ 9654926 10985506 11929551 11471618 10459658 10190997 10312391 8947761 4868803 -659384
2886f59384l697314N98007L976682L983077J892851O45902N39690o47551l181688
$$ -659384 -4356698 -3758691 217991 4201068 6093919 6739821 7279511 6631960 3450272
2877C450272m107956j784486J122711J361659l42495r72603J75849J360975J801332
$$ 3450272 -657684 -2442170 -1319459 42200 -300295 -1272898 -1097049 263926 2065258
2868B065258K326605K988998K626661R38229j024024k495926l399807l245436
$$ 2065258 4391863 7380861 10007522 10945751 9921727 7425801 4025994 780558
2860G80558j481759R97073K343668J867178L84290j204393k259331j901159J7933
$$ 780558 -701201 295872 2639540 4506718 4891008 3686615 1427284 -473875 -455942
2851d55942J849102J919632R37876O58154P92351k14472j754135j491509N30169
$$ -455942 1393160 3312792 4250668 4908822 5701173 5486701 3732566 2241057 2771226
2842B771226J431346L2735j231226l60892J107568J015390J47411M41644J394133
$$ 2771226 4202572 4235307 3004081 2643189 3750757 4766147 4913558 5355202 6749335
2833F749335R04954j163343k606797j825594N06554K599795L233490K476217J490584
$$ 6749335 7654289 6490946 3884149 2058555 2565109 5164904 8398394 10874611 12365195
2824A2365195J324797J564769Q77121r47800k606302l120449k680794j535067
$$ 12365195 13689992 15254761 16131882 15184082 12577780 9457331 6776537 5241470
2816E241470J15212R16681m79325k483080j781764J326193K299573p79071l410173
$$ 5241470 5356682 6273363 5794038 3310958 1529194 2855387 5154960 4375889 965716
2807I65716j247715K830190L004197m06292j830941M65828K272943J080898j00550
$$ 965716 -281999 2548191 5552388 5146096 3315155 3780983 6053926 7134824 7034274
2798G034274J212095K325429K31940k864970l001257p27939L00084o28672q42772
$$ 7034274 8246369 10571798 10803738 7938768 4937511 4209572 4509656 3880984 3038212
2789C038212P05475J878001J171003n3552r5775O06032N93235n14198j852163
$$ 3038212 3743687 5621688 6792691 6739139 6643364 7249396 7842631 7328433 5476270
2780E476270k291546j294149L56834Q94803k41455j080274L51114K649481K538627
$$ 5476270 3184724 1890575 2247409 3142212 2900757 1820483 2171597 4821078 7359705
2771G359705j80104j960068p50847Q62289l09120l130611l902763j679037J022565
$$ 7359705 7179601 5219533 4468686 5330975 5021855 1891244 -2011519 -3690556 -2667991
2762b667991K204986K256730J835853O48733r81625j678473j175713r96975j893828
$$ -2667991 -463005 1793725 3629578 4278311 3296686 1618213 442500 -554475 -2448303
2753b448303k413136j284287M64943J286255J453379J863509J895047O30164p45482
$$ -2448303 -4861439 -6145726 -5680783 -4394528 -2941149 -1077640 817407 1447571 702089
2744G02089j78381J954139L041793J824764j71774j022167n01436M61957Q70021
$$ 702089 523708 2477847 5519640 7344404 7172630 6150463 5649027 6110984 6981005
2735F981005k7165j992506l227900k064977O67303K510031K520240J750518Q39776
$$ 6981005 6953840 4961334 1733434 -331543 335760 2845791 5366031 7116549 7956325
2726G956325m55409j278135j72874J740457J247029j934189l742633j453953K157550
$$ 7956325 7500916 6222781 6049907 7790364 9037393 7103204 3360571 1906618 4064168
2717D064168K976254J242405j07567n58668j626626k827720k247759n93794n43658
$$ 4064168 7040422 8282827 8175260 7616592 5989966 3162246 914487 320693 -222965
2708b22965j888029j330446J991688M506126L292877Q2600j710883j412748m98728
$$ -222965 -2110994 -3441440 -1449752 3056374 6349251 6431851 4720968 3308220 2809492
2699B809492L27406J214866J702724J212827J74398p73702j758794k674709k468214
$$ 2809492 3136898 4351764 6054488 7267315 7441713 6668011 4909217 2234508 -233706
2690b33706q34783O06567M21009m78697m51045K18215K36553j21988K88698Q55140
$$ -233706 -1068489 -461922 -40913 -519610 -970655 -752440 -515887 -637875 -349177 505963
2680E05963o6237j861547j914409K60018J878447J110708j31728M87797J912995
$$ 505963 439726 -1421821 -3336230 -3076212 -1197765 -87057 -218785 269012 2182007
2671B182007J866487J163185K397443M876051M686940P31091k724040j605390
$$ 2182007 4048494 5211679 7609122 12485173 17172113 17903204 15179164 13573774
2663A3573774K288663L789723J078448k791735m414626l540969k100926j782577
$$ 13573774 15862437 19652160 20730608 17938873 13524247 9983278 7882352 6099775
2655F099775k797459l557686j742831K783982O587115O088229J972603j934865
$$ 6099775 3302316 -255370 -1998201 785781 7372896 13461125 15433728 13498863
2647A3498863l589094l765322k718132L25125L713537L604907l97998l471171
$$ 13498863 9909769 6144447 3426315 3751440 7464977 11069884 10671886 7200715
2639G200715k030788J188363J597258m95599j342964K3047J126190O70405L2394
$$ 7200715 5169927 6358290 7955548 7459949 6116985 6140032 7266222 7936627 7969021
2630G969021K78170P86282R59310R27715O34813Q4921r4068K3236q84773k728546
$$ 7969021 8247191 9033473 9992783 10920498 11555311 11640232 11546164 11569400 10684627 7956081
2620G956081k902423m89449R39494j504409m453438k799521J945900L618616J008357
$$ 7956081 5053658 4564209 5503703 3999294 -454144 -3253665 -1307765 2310851 3319208
2611C319208q09983Q31304K607339J861868O49098O11841l77579l148031m098757
$$ 3319208 2509225 3340529 5947868 7809736 8458834 9070675 8693096 5545065 1446308
2602A446308j179798J562040p5338l749771m507433k218803k04190R06709K698758
$$ 1446308 266510 1828550 1753212 -1996559 -6503992 -8722795 -8926985 -8020276 -5321518
2593e321518M143534K621418q10894j948184N31225L350077L342006Q75243j688015
$$ -5321518 -1177984 1443434 632540 -1315644 -784419 2565658 5907664 6782907 5094892
2584E094892k526860j341055L16871K00993j590265k129013j4352K002736J443441
$$ 5094892 2568032 1226977 1543848 1744841 154576 -1974437 -1988789 13947 1457388
2575A457388O16574K788161N887960M979247J35871l290967k462451k17773M74541
$$ 1457388 2073962 4862123 10750083 15729330 15865201 12574234 10111783 9894010 10368551
2566A0368551N67694J574192K063422Q9814l406220n786880n596678k994535P71561
$$ 10368551 10936245 12510437 14573859 14663673 11257453 5470573 -126105 -3120640 -2349079
2557b349079L272799K410801p56905k670377j883559r26222k149191l826194k521158
$$ -2349079 923720 3334521 2577616 -92761 -1976320 -2902542 -5051733 -8877927 -11399085
2548a1399085J890053N702043N628953K177404j258625j845409L23081K931659
$$ -11399085 -9509032 -3806989 1821964 3999368 2740743 895334 1218415 4150074
2540D150074M038438L434328J696601o57555k502129k280969j88812J264583L95480
$$ 4150074 8188512 11622840 13319441 12661886 10159757 7878788 7689976 8954559 9350039
2531I350039j400287k137638k120993k200135j290561J349783L269197J955651
$$ 9350039 7949752 5812114 3691121 1490986 200425 1550208 4819405 6775056
2523F775056o17547p02838J046868P50954j867623k891998p90869J442932J692500
$$ 6775056 6157509 5454671 6501539 7252493 5384870 2492872 1702003 3144935 4837435
2514D837435J375621J358949J19591k134501k322457J22660J304707r15997l180046
$$ 4837435 6213056 7572005 7691596 5557095 3234638 3357298 4662005 3746008 565962
2505E65962k278961k34699n4884n27440M95271J405448K90743k32653K859055
$$ 565962 -1712999 -1947698 -2002582 -2530022 -2034751 -629303 -338560 -571213 2287842
2496B287842O539544N328087j04523l826530l506717k522967l004830k616450
$$ 2287842 8827386 14155473 14050950 10224420 6717703 4194736 1189906 -1426544
2488a426544J87744K707926K238573J19219q72912m79817j68430m69193r75841
$$ -1426544 -1238800 1469126 3707699 3826918 2954006 2474189 2305759 1836566 860725
2479H60725j446790j486565m19649J514854L009288L292717K666448J334973o05127
$$ 860725 -586065 -2072630 -2492279 -977425 2031863 5324580 7991028 9326001 8720874
2470H720874j934822j226425N92585R12538n32501p44187K045640N153672M722450
$$ 8720874 6786052 5559627 6152212 7064750 6532249 5788062 7833702 12987374 17709824
2461A7709824P54241l225923m649039l953739k511100o59734J511985K860080
$$ 17709824 18464065 15238142 10589103 6635364 4124264 3464530 4976515 7836595
2453G836595J972729r16835l667925m210198k416936K32047K307037L139888K501548
$$ 7836595 9809324 8892489 5224564 1014366 -1402570 -1170523 1136514 4276402 6777950
2444F777950Q31541l99229q7780O08601m31367k689635k962937r6210K579532
$$ 6777950 7609491 7210262 7122482 7731083 7299716 4610081 1647144 1550934 4130466
2435D130466J612957j629494k970544j103154J496398K597639K353106J599517
$$ 4130466 5743423 4113929 1143385 40231 1536629 4134268 6487374 8086891
2427H086891O26796p9878P9979P27113J018237J036161J167686Q18784m01894
$$ 8086891 8713687 8633809 8713788 9440901 10459138 11495299 12662985 13481769 13079875
2418A3079875j216066o81684m50548k065478l272843j002607K721958K761376
$$ 13079875 11863809 11182125 10731577 8666099 5393256 4390649 7112607 9873983
2410I873983r47612k633768K09189K551443m3903m034376l512452M22547J718111
$$ 9873983 8926371 6292603 6501792 9053235 9009332 4974956 1462504 1885051 3603162
2401C603162j056251l124929j338224J804476L057411K759243K243220O07278
$$ 3603162 2546911 -578018 -1916242 -111766 2945645 5704888 7948108 8555386
2393H555386l066625o519467o312776k239716K366341M413090L659621J851823
$$ 8555386 5488761 -1030706 -7343482 -9583198 -7216857 -2803767 855854 2707677
2385B707677O71603P00564J417140J789821J261970L46305K7891N21204Q62956
$$ 2707677 3379280 4079844 5496984 7286805 8548775 8895080 8922971 9444175 10307131
2376A0307131m2160j960331l130469j894449J298588L796939L089364o32205m405242
$$ 10307131 10264971 8304640 5174171 3279722 4578310 8375249 11464613 10832408 6427166
2367F427166n129137k363676J390366L192700K481201J271451J486071K529648
$$ 6427166 1298029 -1065647 324719 3517419 5998620 7270071 8756142 11285790
2359A1285790K136272n08684l390279l905245j955831k5948j35617j427697j418278
$$ 11285790 13422062 12913378 9523099 5617854 3662023 3636075 3500458 2072761 654483
2350F54483N83845K349755J656638n50619j375094o3780J056728K85535q95939
$$ 654483 1238328 3588083 5244721 4694102 3319008 3255228 4311956 4597491 3701552
2341C701552m24859J000352J391817J022370J750036L313081L309638J197896
$$ 3701552 3276693 4277045 5668862 6691232 8441268 11754349 15063987 16261883
2333A6261883n93504n75415n64144k436964m649186m244325j132614J838595K583787
$$ 16261883 15668379 15092964 14528820 12091856 7442670 3198345 2065731 3904326 6488113
2324F488113J666449N80211j98708r29137j360492o36502J392180L075397K113563
$$ 6488113 8154562 8734773 8536065 7606928 6246436 5609934 7002114 10077511 12191074
2315A2191074j400607l949674k342887J770957L408882P17507k614455k715010
$$ 12191074 10790467 6840793 4497906 6268863 9677745 10395252 7780797 5065787
2307E065787p47675l86150k015357k710482j237936L73146O51979R07350K217639
$$ 5065787 4318112 3931962 1916605 -793877 -2031813 -1658667 -1006688 -99338 2118301
2298B118301K751645L91303l393953m843351k751506K61826J642223J858734K373802
$$ 2118301 4869946 5261249 1867296 -2976055 -5727561 -5465735 -3823512 -1964778 409024
2289D09024K678179J526600o8908M4015J199576K73734l063197m780118k366406
$$ 409024 3087203 4613803 4544895 4588910 5788486 6062220 2999023 -1781095 -4147501
2280d147501P76641L25951j899424o04269M168699O340790K856150j771923k499091
$$ -4147501 -3370860 -3044909 -4944333 -5548602 -1379903 4960887 7817037 6045114 3546023
2271C546023q84780j363645l609164l410134J52527L049401K192277n59595j426081
$$ 3546023 2661243 1297598 -2311566 -5721700 -5569173 -2519772 -327495 -887090 -2313171
2262b313171O29829L519219M807344L734838J286715q17455j387644n31731N64825
$$ -2313171 -1683342 1835877 6643221 10378059 11664774 10847319 9459675 8927944 9492769
2253I492769N59951r09113k496240k143978K00016J641120j74292l312511l772667
$$ 9492769 10052720 9143607 6647367 4503389 4703405 6344525 6170233 2857722 -914945
2244i14945j159246R91685Q34161M66253J445545K036454J044282N19232J689509
$$ -914945 -2074191 -1082506 -248345 217908 1663453 3699907 4744189 5263421 6952930
2235F952930J807482j251842m424238l784481q07953L81097j80757N81366K443322
$$ 6952930 8760412 7508570 3084332 -700149 -1508102 -1127005 -1307762 -726396 1716926
2226A716926K310730L35768k3931J787745K498977R25595k67160L02879P01721
$$ 1716926 4027656 4363424 4339493 6127238 8626215 9551810 9284650 9587529 10289250
$$ [...]
##END NTUPLES=NMR SPECTRUM
##END=
