##TITLE=31P_DE-80H_X3
 64 sc D2O
 26.2.2025
##JCAMPDX= 6.0         $$ Bruker NMR JCAMP-DX V2.0
##DATA TYPE= NMR SPECTRUM
##DATA CLASS= NTUPLES
##ORIGIN= UXNMR, Bruker Analytische Messtechnik GmbH
##OWNER= root
$$ XWIN-NMR		Version 3.5
$$ Mon Jul 21 14:53:06 2025 Russian Standard Time (UT+4h)  Yarkov@DPX200
##.OBSERVE FREQUENCY= 81.013821
##.OBSERVE NUCLEUS= ^31P
##.ACQUISITION MODE= SIMULTANEOUS
##.ACQUISITION SCHEME= undefined
##.AVERAGES= 64
##.DIGITISER RES= 17
##SPECTROMETER/DATA SYSTEM= spect
##.PULSE SEQUENCE= zgpg30
##.SOLVENT NAME= MeOD
##.SHIFT REFERENCE= (INTERNAL, MeOD, 0, 198.062)
##AUDIT TRAIL= $$ (NUMBER, WHEN, WHO, WHERE, WHAT)
$$ ##TITLE= Audit trail, XWIN-NMR		Version 3.5
$$ ##JCAMPDX= 5.01
$$ ##ORIGIN= Bruker BioSpin GmbH
$$ ##OWNER= Yarkov
$$ C:/Bruker/XWIN-NMR/data/yarkov2/nmr/P31/2/pdata/1/auditp.txt
$$ ##AUDIT TRAIL=  $$ (NUMBER, WHEN, WHO, WHERE, WHAT)
(   1,<2025-07-21 14:52:32.51 +0400>,<Yarkov>,<DPX200>,
      <created by zg, POWCHK disabled, PULCHK disabled
       configuration hash MD5:
       00 E9 B6 7A A2 85 ED C7 34 08 36 98 17 FE 4E 26
       data hash MD5: 32K
       89 D6 0A CB 95 9F C5 BC E3 64 8E CD 97 E3 C0 BB>)
(   2,<2025-07-21 14:52:39.82 +0400>,<Yarkov>,<DPX200>,
      <Start of raw data processing
       efp BC_mod = 2 LB = 1.5 FT_mod = 6 PKNL = 1 PHC0 = 1662.243 PHC1 = 49.15953 SI = 64K 
       data hash MD5: 64K
       AC D2 70 73 2E 4A 40 83 FD CD F5 FA 86 C8 A3 D7>)
$$ ##END=
$$ 
$$ hash MD5
$$ B3 4C 9E 8A D0 01 58 8B 7E 83 3F 8A 42 77 9F C8
##$RELAX= 
##$RELAX= 
##$RELAX= 
##$RELAX= 
##$RELAX= 
##$RELAX= 
##$RELAX= 
##$RELAX= 
$$ Bruker specific parameters
$$ --------------------------
##$DU= <C:/Bruker/XWIN-NMR>
##$EXPNO= 2
##$NAME= <P31>
##$PROCNO= 1
##$TYPE= <nmr>
##$USER= <yarkov2>
##$AMP= (0..31)
100 100 100 100 100 100 100 100 100 100 100 100 100 100 100 100 100 100 
100 100 100 100 100 100 100 100 100 100 100 100 100 100 
##$AQSEQ= 0
##$AQ_mod= 1
##$AUNM= <au_zg>
##$AUTOPOS= <>
##$BF1= 81.014009
##$BF2= 200.13
##$BF3= 200.13
##$BF4= 200.13
##$BF5= 200.13
##$BF6= 200.13
##$BF7= 200.13
##$BF8= 200.13
##$BYTORDA= 1
##$CFDGTYP= 0
##$CFRGTYP= 5
##$CHEMSTR= <none>
##$CNST= (0..31)
1 1 145 1 1 1 1 1 1 1 1 1 1 1 1 1 1 1 1 1 1 1 1 1 1 1 1 1 1 1 1 1 
##$CPDPRG= <waltz16>
##$CPDPRG1= <>
##$CPDPRG2= <waltz16>
##$CPDPRG3= <>
##$CPDPRG4= <mlev>
##$CPDPRG5= <mlev>
##$CPDPRG6= <mlev>
##$CPDPRG7= <mlev>
##$CPDPRG8= <mlev>
##$CPDPRGB= <>
##$CPDPRGT= <>
##$D= (0..31)
0 1 0 0 0 0 0 0 0 0.06 0 0.03 2e-05 3e-06 0 0 0.0002 0 0 0 0 0 0 0 0 0 
0 0 0 0 0 0 
##$DATE= 1753095152
##$DBL= (0..7)
120 120 120 11 120 120 24 19 
##$DBP= (0..7)
150 150 150 150 150 150 150 150 
##$DBP07= 0
##$DBPNAM0= <>
##$DBPNAM1= <>
##$DBPNAM2= <>
##$DBPNAM3= <>
##$DBPNAM4= <>
##$DBPNAM5= <>
##$DBPNAM6= <>
##$DBPNAM7= <>
##$DBPOAL= (0..7)
0.5 0.5 0.5 0.5 0.5 0.5 0.5 0.5 
##$DBPOFFS= (0..7)
0 0 0 0 0 0 0 0 
##$DE= 6
##$DECBNUC= <off>
##$DECIM= 4
##$DECNUC= <off>
##$DECSTAT= 4
##$DIGMOD= 1
##$DIGTYP= 9
##$DL= (0..7)
0 0 52 120 120 21 21 25 
$$ [...]
##$SUBNAM2= <"">
##$SUBNAM3= <"">
##$SUBNAM4= <"">
##$SUBNAM5= <"">
##$SUBNAM6= <"">
##$SUBNAM7= <"">
##$SUBNAM8= <"">
##$SUBNAM9= <"">
##$SW= 400.765351723535
##$SWIBOX= (0..15)
0 1 3 0 0 0 0 0 0 0 0 0 0 0 0 0 
##$SW_h= 32467.5324675325
##$TD= 32768
##$TD0= 1
##$TE= 0
##$TE2= 300
##$TE3= 300
##$TEG= 300
##$TL= (0..7)
0 120 53 12 22 120 120 120 
##$TP= (0..7)
150 150 150 150 150 150 150 150 
##$TP07= 0
##$TPNAME0= <>
##$TPNAME1= <>
##$TPNAME2= <>
##$TPNAME3= <>
##$TPNAME4= <>
##$TPNAME5= <>
##$TPNAME6= <>
##$TPNAME7= <>
##$TPOAL= (0..7)
0.5 0.5 0.5 0.5 0.5 0.5 0.5 0.5 
##$TPOFFS= (0..7)
0 0 0 0 0 0 0 0 
##$TUNHIN= 0
##$TUNHOUT= 0
##$TUNXOUT= 0
##$USERA1= <user>
##$USERA2= <user>
##$USERA3= <user>
##$USERA4= <user>
##$USERA5= <user>
##$V9= 5
##$VALIST= <valist>
##$VCLIST= <CCCCCCCCCCCCCCC>
##$VD= 0
##$VDLIST= <DDDDDDDDDDDDDDD>
##$VPLIST= <PPPPPPPPPPPPPPP>
##$VTLIST= <TTTTTTTTTTTTTTT>
##$WBST= 1024
##$WBSW= 4
##$XGAIN= (0..3)
0 0 0 0 
##$XL= 0
##$YL= 0
##$YMAX_a= 109
##$YMIN_a= -1115
##$ZGOPTNS= <>
##$ZL1= 120
##$ZL2= 120
##$ZL3= 120
##$ZL4= 120
##$ABSF1= 0
##$ABSF2= 0
##$ABSG= 0
##$ABSL= 0
##$ALPHA= 0
##$AQORDER= 0
##$ASSFAC= 0
##$ASSFACI= 0
##$ASSFACX= 0
##$ASSWID= 0
##$AUNMP= <proc_1d>
##$AZFE= 0.1
##$AZFW= 0.5
##$BCFW= 0
##$BC_mod= 2
##$BYTORDP= 0
##$COROFFS= 0
##$CY= -3
##$DATMOD= 1
##$DC= 0
##$DFILT= <>
##$DTYPP= 0
##$F1P= 0
##$F2P= 0
##$FCOR= 1
##$FTSIZE= 65536
##$FT_mod= 6
##$GAMMA= 0
##$GB= 0
##$INTBC= 1
##$INTSCL= 9.790993e-09
##$ISEN= 30
##$LB= 1.5
##$LEV0= 0
##$LPBIN= 0
##$MAXI= 10000
##$MC2= 0
##$MEAN= 0
##$ME_mod= 0
##$MI= 50
##$NCOEF= 0
##$NC_proc= -14
##$NLEV= 6
##$NOISF1= 182.463
##$NOISF2= 159.3651
##$NSP= 0
##$NTH_PI= 0
##$NZP= 0
##$OFFSET= 198.0616
##$PC= 4
##$PHC0= 1662.243
##$PHC1= 49.15953
##$PH_mod= 1
##$PKNL= yes
##$PPARMOD= 0
##$PSCAL= 0
##$PSIGN= 0
##$REVERSE= no
##$SF= 81.0140089999434
##$SI= 65536
##$SIGF1= 159.3651
##$SIGF2= -187.1042
##$SINO= 113.3802
##$SIOLD= 16384
##$SREGLST= <1H.CDCl3>
##$SSB= 0
##$STSI= 65536
##$STSR= 0
##$SW_p= 32467.5324675325
##$SYMM= 0
##$S_DEV= 0
##$TDeff= 32768
##$TDoff= 0
##$TI= <>
##$TILT= no
##$TM1= 0
##$TM2= 0
##$TOPLEV= 0
##$USERP1= <user>
##$USERP2= <user>
##$USERP3= <user>
##$USERP4= <user>
##$USERP5= <user>
##$WDW= 1
##$XDIM= 65536
##$YMAX_p= 131590606
##$YMIN_p= -330048354
$$ End of Bruker specific parameters
$$ ---------------------------------
##NTUPLES= NMR SPECTRUM
##VAR_NAME=  FREQUENCY,     SPECTRUM/REAL,   SPECTRUM/IMAG
##SYMBOL=    X,             R,               I
##VAR_TYPE=  INDEPENDENT,   DEPENDENT,       DEPENDENT
##VAR_FORM=  AFFN,          ASDF,            ASDF
##VAR_DIM=   65536,         65536,           65536
##UNITS=     HZ,            ARBITRARY UNITS, ARBITRARY UNITS
##FACTOR=    0.49542278885378, 1,            1
##FIRST=     16045.7642231865, 0,            0
##LAST=      -16421.768244346, 0,            0
##MIN=       -16421.768244346, -330048354,   0
##MAX=       16045.7642231865, 131590606,    0
$$ Real data points
##PAGE= N=1
##DATA TABLE= (X++(R..R)), XYDATA
$$ [...]
##PAGE= N=2
##DATA TABLE= (X++(I..I)), XYDATA
7342H944336R063708o82166n524729j560143K685760J43913n905065r569171r921297
7333a2324854p101511M36276R639875J1650011L249910o820139r503688p338081
7325a8112201p114108o288574K837032J7513282K4225425J6326681L470653j096029
7317C1762161L060185N421818j10094p743379q556470k503229J935829p57310
7309B2509511o134803o565988j823268J845095J892729K413692N609981O830250
7301B6577199K066778m745853p154269n203964l461429k962615j338706Q92697
7293D669838P33604j175580j043748J359066K356225J137552R12177K396251K291965
7284A3637350q1682p90519J562525K572905o95822m464893m255415j705236j271854
$$ plain form
7342 8944336 18008044 17325878 11801149 10241006 12926766 13070679 7165614 -2403557 -12324854
7333 -12324854 -19426365 -18990089 -9350214 2299797 5549707 -1270432 -10774120 -18112201
7325 -18112201 -25226309 -31514883 -28677851 -11164569 13060856 29387537 32858190 31762161
7317 31762161 34822346 40244164 40134070 32390691 23834221 21330992 23266821 22509511
7309 22509511 16374708 9808720 7985452 9830547 11723276 14136968 19746949 26577199
7301 26577199 28643977 23898124 16743855 11539891 8078462 5115847 3777141 4669838
7293 4669838 5403442 4227862 3184114 4543180 6899405 8036957 8949134 11345385 13637350
7284 13637350 13555668 12765149 14327674 16900579 16204757 11739864 7484449 5779213 4507359
7275D507359l767789o673918p262869k785605P354948J6508509J4659948K551480
7267B5092063n538027p33480O298407J116749j0895778j1672458R99538R155065
7259A3822079K169931p768064n942895K829013M321956k564432p058277n035245
7251e225934k776435l767378l800712l44776L065007M065636N154360P530544
7243C900312P811347L687626k239828o357210p280357m144562L023097R702847
7235H103272R288116J645745n522050o351896l238220j163514p20141k43638k17296
7226A580378j185990q99805J969848M084881J796163k994220n497286m592905
7218e738936k529855J25424M402127Q391413P574558Q15147o921788r060811l464872
$$ plain form
7275 4507359 739570 -5934348 -13197217 -15982822 -8627874 7880635 22540583 25092063
7267 25092063 19554036 18820556 25118963 26235712 15339934 3667476 4667014 13822079
7259 13822079 15992010 8223946 2281051 5110064 9432020 6867588 -190689 -5225934
7251 -5225934 -8002369 -11769747 -15570459 -15915235 -12850228 -8784592 -3630232 3900312
7243 3900312 11711659 15399285 13159457 6802247 -478110 -4622672 -1599575 8103272
7235 8103272 17391388 19037133 13515083 7163187 3924967 2761453 2041312 1797674 1580378
7226 1580378 394388 -505417 1464431 5549312 7345475 4351255 -1146031 -5738936
7218 -5738936 -8268791 -8143367 -3741240 4650173 12224731 13039878 6118090 -2942721 -6407593
7209f407593N757600J1425276R410995K971686n99143J057229K449379j482058
7201B4583371p817450j0684998j0534342j1769192j2485295m971079J1015436
7194b2663549K2866128J8948111L879612o552674m568848J843099J579616m991899
7186A0339596q511243m539230J139538J710294j661679l291191j517303J059126
7178e272092L453541O317681O846029R54011p644981p946906M057877J7384442
7170A8149602J8525130P909317k701752o071972m976106l444720j339105R77553
7162B7027947K57362m055565p409569o560997l951827k827747k375268r51640
7154h47304n0676j208287k312859j046129P50903L76852k85743K697116Q397949
$$ plain form
7209 -6407593 -649993 10775283 20186278 23157964 22558821 23616050 26065429 24583371
7201 24583371 16765921 6080923 -4453419 -16222611 -28707906 -33678985 -22663549
7194 -22663549 202579 19150690 23030302 16477628 11908780 13751879 15331495 10339596
7186 10339596 1828353 -2710877 -1571339 138955 -1522724 -4813915 -6331218 -5272092
7178 -5272092 -1818551 4499130 11345159 12299170 4654189 -3292717 765160 18149602
7170 18149602 36674732 44584049 41882297 35810325 30834219 27389499 26050394 27027947
7162 27027947 27285309 23229744 15820175 9259178 5307351 2479604 104336 -847304
7154 -847304 -897980 -2106267 -4419126 -5465255 -4714352 -4337500 -4623243 -1926127 6471822
7145F471822J1205177Q095406K038111k609073n094443p283175r629894r963551
7137f769620o170327P17434O904926R776465J0388837J0401272P913641K41206
7129C3403834r027055j1043978k807701P068730Q342967J992430k338173j0372
7121B5580682L790260L176584p36260l670639m793234n706693n921545l527019
7113H192136P09581L362489K577004k1990k025227l091233m210294n040682l400917
7104b949133J778414P508341Q564280L381994l306549n627700l199666j25538
7096F024443J390699K398865K408932j234449o911748p141328J604151J1263098
7088I802663J0875959J315336n725859l860801K34472j917623q208656j0258877
$$ plain form
7145 6471822 17676999 25772405 27810516 25201443 20107000 12823825 3193931 -6769620
7137 -6769620 -12939947 -12222513 -5317587 4458878 14847715 25248987 33162628 33403834
7129 33403834 24376779 13332801 10525100 17593830 25936797 27929227 25591054 25580682
7121 25580682 29370942 32547526 31811266 28140627 23347393 17640700 11719155 8192136
7113 8192136 8901717 12264206 14841210 14819220 12793993 9702760 5492466 451784 -2949133
7104 -2949133 -1170719 6337622 14901902 18283896 14977347 9349647 6149981 6024443
7096 6024443 7415142 9814007 12222939 10988490 4076742 -3064586 -1460435 9802663
7088 9802663 20678622 21993958 16268099 12407298 12641770 10724147 2515491 -7743386
7080g743386n807599l28705J896795K153453K793317L624220L715325K664295
7072B967715p11009o828004j1580317q800093J416148J1106602J3923608J2101411
7064A3596061J0402716P531102l55168r952565j2225615m772847L458545L259375
7056A0941604l213110o252846j731830M589453N898337K741719J15977n55366
7048A2533938k023977m444815l222018L773191J0642852R674455J537691n368229
7040B3103088n258516J4854O041814J0099206R207381P84982j1112535j6293583
7032A6586691j0464587j882871n6687k480580k62796O646063R444556M818754
7024B2348543m81094j000597L91814R1000L85303L635119O126568L445883k217995
$$ plain form
7080 -7743386 -13550985 -13879690 -11982895 -9829442 -7036125 -3411905 303420 2967715
7072 2967715 2256706 -4571298 -16151615 -24951708 -23535560 -12428958 1494650 13596061
7064 13596061 23998777 31529879 31174711 21222146 8996531 4223684 7682229 10941604
7056 10941604 7728494 1475648 -256182 4333271 10231608 12973327 13089304 12533938
7048 12533938 10509961 6065146 2843128 6616319 17259171 26933626 28471317 23103088
7040 23103088 17844572 17859426 23901240 34000446 43207827 43992809 32880274 16586691
7032 16586691 6122104 4239233 4182546 1701966 1439170 8085233 17529789 22348543
7024 22348543 21867449 20866852 21258666 21349666 21734969 25370088 31496656 34942539 32724544
7015C2724544n251545l958177n44816L016746N009942L086666k164845n537392
7007B6381123l606882k56495j058265m590941m955213j416259O83733j227626
6999I953175l067131p92296L619131N465104L448763k95248m416787r513424j4928324
6990a0527037j6469969r381401N499836J9518649K2437330J2004758l561107j2936734
6982F584325j0597055N66867J2147443J5227880O596056p346592j5275868j1869438
6974c966382k301700N141941P468067O133328K361129k511853n174150l547539
6966C602841l2632K266316M190233P192604Q169802L302613m632655q927334q282495
6957F849293p397324q248585p327236k978016P17156K83964j697153p16820L621703
$$ plain form
7015 32724544 27472999 23514822 22970006 25986752 30996694 34083360 31918515 26381123
7007 26381123 22774241 22517746 21459481 16868540 11913327 10497068 11180801 9953175
6999 9953175 6886044 6093748 9712879 15177983 18626746 18331498 13914711 4401287 -10527037
6990 -10527037 -26997006 -36378407 -30878571 -11359922 11077408 23082166 19521059 6584325
6982 6584325 -4012730 -3445863 8701580 23929460 30525516 23178924 7903056 -3966382
6974 -3966382 -6268082 -1126141 6341926 12475254 14836383 12324530 7150380 3602841
6966 3602841 3570209 5836525 10026758 17219362 25389164 28691777 24059122 15131788 6849293
6957 6849293 -548031 -8796616 -16123852 -19101868 -18384712 -18100748 -19797901 -20514721 -16893018
6948a6893018Q500952J1706765J1850916P754800Q10692m119302l387826Q14308
6940A7038287K951072O69712l009219l662688k57086L945098M619484O89283m468902
6931A8515041o421391l991483J20169K092517j31206m978836p237876k522128
6923d555193O048767Q756222Q69018r246510r224221J177675R529347P123190
6915A0478295n99389k975762J845210O435738M819038r44054m542080k964562
6907A1552434M71080K27200m469304q148901o100361p62995K193265K216223L071923
6898B50564M480107J322574p016112j2830102r313561Q79073R802087J2941513
6890E16143J0339691L397612m592643p879517l615616L591609O802612N171956
$$ plain form
6948 -16893018 -8392066 3314699 15165615 22920415 23731107 19611805 16223979 17038287
6940 17038287 19989359 20659071 17649852 13987164 13730078 17675176 22294660 22983943 18515041
6931 18515041 12093650 8102167 8222336 10314853 10183647 5204811 -2033065 -4555193
6923 -4555193 1493574 10249796 11118814 1872304 -7351917 -6174242 3355105 10478295
6915 10478295 9878906 6903144 8748354 15184092 20003130 19059076 14516996 11552434
6907 11552434 12023514 12250714 7781410 -367491 -6467852 -7230847 -5037582 -2821359 250564
6898 250564 4730671 6053245 -962867 -13792969 -23106530 -22227457 -12425370 516143
6890 516143 10855834 14253446 9660803 1781286 -1834330 1757279 8559891 13731847
6882A3731847L214480K936320J507981k897959p091713o464211o40140N737143
6874A0033748P302337L037775k589927m296263j971016l70272k427862n530604
6866C187916n931037l964711k093502j5312M408101R936986J1479811O227708
6858B3235960j756069n041938r15324N348563O543547K279831r54315P80790L285018
6849C2806063J231594l103177l774131j170755p09389k572558j359649L080711
6841B4428709L669884j968409o511241m523150m71665P21350K371130P242350
6833B4958958Q381579m03418j0971993j0357322o64604L613671k371913p606970
6825D577988l434785M063958N069155j90652n004007o413970n497204k763291
$$ plain form
6882 13731847 16946327 19882647 21390628 18492669 11400956 4936745 4296605 10033748
6874 10033748 17336085 20373860 17783933 13487670 11516654 11146382 8718520 3187916
6866 3187916 -2743121 -6707832 -8801334 -8816646 -4408545 5528441 17008252 23235960
6858 23235960 21479891 16437953 15522629 20871192 27414739 29694570 28740255 29521045 32806063
6849 32806063 34037657 30934480 27160349 25989594 25280205 22707647 21347998 24428709
6841 24428709 28098593 26130184 19618943 15095793 14624128 15345478 17716608 24958958
6833 24958958 33340537 32937119 21965126 11607804 10943200 14556871 12184958 4577988
6825 4577988 1143203 5207161 10276316 10085664 5081657 -1332313 -6829517 -9592808
6817i592808N45835N06723m273815q165119m604147M686430J0930320Q290057
6809a676524k23436o254460l671878O224587J5441664J6410257R469919J795313
6801C7515442j537734k597463n432927r178472r353563m432365J754028L942678
6793A0679624L26335o012371r665244p547920j600190L592578N511946M933124
6785B17882L371569J658029P26459J039417J020280j069511l256905j242862M935204
6776G399562Q893486N227816l093527p601249m141739K452665M156988q52619
6768A2441383n866279l431165N250428J0938411P207092j843121p035357n270671
6760A2390721j837113k364584o113892q039942n091611P90107N123417N758120
$$ plain form
6817 -9592808 -9046973 -8540250 -12814065 -20979184 -25583331 -20896901 -9966581 -1676524
6809 -1676524 -1899960 -8154420 -11826298 -5601711 9839953 26250210 35720129 37515442
6801 37515442 35977708 33380245 27947318 18768846 9415283 4982918 6736946 10679624
6793 10679624 11005959 4993588 -4671656 -12219576 -13819766 -10227188 -4715242 217882
6785 217882 3589451 5247480 5973939 7013356 8033636 6964125 3707220 2464358 7399562
6776 7399562 16293048 21520864 18427337 10826088 6684349 9137014 13294002 12441383
6768 12441383 6575104 3143939 8394367 19332778 26539870 24696749 17661392 12390721
6760 12390721 10553608 8189024 2075132 -5964810 -11056421 -10266314 -5142897 615223
6752F15223M770164M446151K724887l511324j0785596j0710438j731346P153325
6744g028954Q615169O313188N921592L970830m832629j4384760j3275168k417486
6736a7118218N044401J909489n527959r081764p481887k085731N653829J0114263
6728a8573577N479647l272318m118459L909745Q050474J875418m535695j475459
6720a2660224N593037P345609N601214O127764O093355Q46783m600390l392324
6712A0954824L66401q35324l554926j140O050987M484524l268364o397137l072283
6703D727562j641421l778527j862137N034110P659898K899025n95009J741772
6695A4185273K346454l810489q879498n018282K673728N267148L398121K199713
$$ plain form
6752 615223 5385387 9831538 12556425 9045101 -1740495 -12450933 -14182279 -7028954
6744 -7028954 1586215 7899403 13820995 17791825 12959196 -1425564 -14700732 -17118218
6736 -17118218 -12073817 -10164328 -15692287 -24774051 -32255938 -34341669 -28687840 -18573577
6728 -18573577 -13093930 -16366248 -20484707 -16574962 -8524488 -6649070 -11184765 -12660224
6720 -12660224 -7067187 278422 5879636 12007400 18100755 18947538 14347148 10954824
6712 10954824 11321225 10485901 6930975 6929835 12980822 17465346 14196982 7799845 4727562
6703 4727562 3086141 -692386 -2554523 2479587 10139485 13038510 12443501 14185273
6695 14185273 16531727 12721238 3841740 -1176542 1497186 6764334 10162455 12362168
6687A2362168N08898m602892q496378n089314J369412J356112m683183o288642
6679a3563819J154897R378385Q911129J413256l721851j738460K537056K046186
6671F416779k536217k800107O057662J6500485J6026192L033633j0388664j3212684
6663A9097079p246973j114557J657784L328055N031079N424791M370672K980496
6655C3528426J221156p62378q73479J444541K077528k861363j0510327j4145752
6647I118352j1581759o518129k551439k83004J54145j767819m835316o543532
6639b4808501n976272l550315J332363Q817606J5312598J5868375J0502217M678505
6631B2176576K612220K959926J821058k694864r361155j4453371j3094417l410490
$$ plain form
6687 12362168 12871066 8268174 -228204 -5317518 -3948106 -2591994 -7275177 -13563819
6679 -13563819 -12408922 -3030537 5880592 7293848 3571997 1833537 4370593 6416779
6671 6416779 3880562 1080455 7138117 23638602 39664794 42698427 32309763 19097079
6663 19097079 11850106 10735549 12393333 15721388 20752467 26177258 30547930 33528426
6655 33528426 34749582 33987204 33113725 34558266 36635794 33774431 23264104 9118352
6647 9118352 -2463407 -8981536 -11532975 -11815979 -11661834 -13429653 -18264969 -24808501
6639 -24808501 -30784773 -34335088 -33002725 -24185119 -8872521 6995854 17498071 22176576
6631 22176576 24788796 27748722 29569780 26874916 17513761 3060390 -10034027 -13444517
6623a3444517R358873J6036484J2841258N310552J028967Q00208j21234l645139
6615B8165452n841228l363749L80061j122848q171505j2867990q668618M56199
6607a1034226M258476q64027p595765p762930k377133J685552J807135J640656
6599b0242262M195875P777415R486525Q966355P255385M783947K175791Q57143
6591B5256174J035819N96498k131970n409494n701686k124444K111057L073676
6583A6705630J86833l521068m832600l370566j166728L1694K36587K41157J87231
6574D698170l90034j429463j670530M68230M650070P440317N150457j130445n316748
6565A2470024l211545K141545M848908M188764M024831N082273L355359k536983
$$ plain form
6623 -13444517 -4085644 11950840 24792098 30102650 31131617 31931825 31810591 28165452
6615 28165452 22324224 18960475 19340536 18217688 10046183 -2821807 -11490425 -11034226
6607 -11034226 -6775750 -7639777 -15235542 -22998472 -25375605 -23690053 -21882918 -20242262
6599 -20242262 -16046387 -8268972 1217553 10183908 17439293 22223240 24399031 25256174
6591 25256174 26291993 26888491 24756521 19347027 13645341 11520897 13631954 16705630
6583 16705630 16892463 13371395 8538795 5168229 4001501 4033195 4269782 4510939 4698170
6574 4698170 4308136 2878673 1208143 1676373 6326443 13766760 18917217 17786772 12470024
6565 12470024 9258479 11400024 16248932 20437696 24462527 29544800 32900159 30363176
6557C0363176p622309p021679k305905J407160J494950j448812n419861o962953
6549B483767l261240K672224L292199l012805p518025k728022O147167Q556405
6541F631670M071273J592254M459372O246825K898868m45581J047031L349517
6533B9851229M37701n680730q151780n195345q99816J960763M298806O476493
6525B3097321O627160L976695M41266k002907l165940l257999j859834P15399
6517B4571161K626271K372714P25065m01922p78266k147781m956533o280440l367002
6508A2363267J203702J434031l683911p440590m160572K669945N586188L838167
6500A1810227K852806M220756L421417j406304n443790m842112k332578j350360
$$ plain form
6557 30363176 22740867 15719188 13413283 14820443 16315393 14866581 9446720 2483767
6549 2483767 -777473 1894751 5186950 2174145 -5343880 -8071902 -1924735 6631670
6541 6631670 10702943 12295197 16754569 23001394 25900262 25454681 26501712 29851229
6533 29851229 30288930 24608200 16456420 11261075 10361259 12322022 16620828 23097321
6525 23097321 29724481 33701176 34142442 32139535 28973595 25715596 23855762 24571161
6517 24571161 27197432 29570146 30295211 29893289 29115023 26967242 22010709 15730269 12363267
6508 12363267 13566969 15001000 11317089 3876499 -284073 2385872 7972060 11810227
6500 11810227 14663033 18883789 22305206 20898902 15455112 10613000 8280422 6930062
6492F930062l1068L881105O576284K858200n049542r248840n950765J052903N988603
6483G006942O084206J784795l715559n398065r02705N649231P682900M122327
6475B2314072N7576o40370R3297j829728p146008j2452494j3232796p362845K859842
6466a7339454J2107628J6338624J5019049R080140O2738p135427n843077L292894
6458B5583115R370663M367434m356744l789275M515196N575831o025565j6669927
6450A8570728j3244769j519674M230730K064729J420403N547953P053073J230364
6442B5353537o211689p612702k802317K715371M355035J350176l205019m264410
6434I677982j89403L868410J881638m290845o933137l131327J950074K902114
$$ plain form
6492 6930062 6898994 10780099 17356383 20214583 15165041 5916201 -34564 1018339 7006942
6483 7006942 13091148 14875943 11160384 5762319 4859614 10508845 18191745 22314072
6475 22314072 22371648 21731278 21824575 19994847 12848839 396345 -12836451 -20199296 -17339454
6466 -17339454 -5231826 11106798 26125847 35205987 35268725 28133298 22290221 25583115
6458 25583115 34953778 39321212 34964468 31175193 35690389 41266220 35240655 18570728
6450 18570728 5325959 3806285 8037015 10101744 11522147 17070100 24123173 25353537
6442 25353537 19141848 11529146 8726829 11442200 15797235 17147411 13942392 9677982
6434 9677982 9488579 13356989 15238627 10947782 4014645 883318 2833392 5735506
6426E735506j92314m521176p467781n927685J292324R067356J0100849M912905
6418A2999984J026927R29456n85433m388280k842613O202526J1534998M304879
6410B9182444o638769o925723J761838N617681Q15891k907602q08446n67025p183696
6401A2346593j3075447r824272l60972P258190J0463319J0021365M498715n474388
6393A5853103j2745490j1169223m211616K95135O58075N69591J305969J319810
6385h124646J129576K169077K673520P82116l30860K913941O419383K659067o951856
6376C339318j1592232m955672O582146J2487076R887265L940594K90136M16111
6368B0394742K212645K604849N32870j977861k996374m112510p711301j1505234
$$ plain form
6426 5735506 5543192 1022016 -6445765 -12373450 -11081126 -2013770 8087079 12999984
6418 12999984 14026911 14956367 14370934 9982654 7140041 13342567 24877565 29182444
6410 29182444 22543675 15617952 17379790 22997471 23813362 20905760 20097314 19530289 12346593
6401 12346593 -728854 -10553126 -10914098 -3655908 6807411 16828776 21327491 15853103
6393 15853103 3107613 -8061610 -12273226 -11978091 -11320016 -10750425 -9444456 -8124646
6385 -8124646 -6995070 -4825993 -2152473 -1370357 -1701217 1212724 7632107 10291174 3339318
6376 3339318 -8252914 -13208586 -6626440 5860636 15747901 19688495 19978631 20394742
6368 20394742 22607387 25212236 25745106 23767245 20770871 16658361 8947060 -2558174
6360b558174j0233919l528364K571885L862429L381567N639121R218585R268692
6352A7621822N149206J232780O74924J994169K142597J85587k825574n536824
6344B0638687o697337n173380r45892M002786O548277M690059o84244o141919
6336A6237037q125508n678807j271015J166513k46212l221357l301544J023718
6328c417175N724904N380685j66328n329283n408839j448253K567972M878233
6320B781916O217660O773728N586436K491067j226333l927320m515797l133286
6312A1048071j596137j674937k505433k004566j149450k873497n316826j758796
6304g831571Q577838J5108405Q414279n117041r934129k011429O290593M261287
$$ plain form
6360 -2558174 -12792093 -16320457 -13748572 -9886143 -6504576 -865455 8353130 17621822
6352 17621822 22771028 24003808 24678732 26672901 28815498 29001085 26175511 20638687
6344 20638687 13941350 8767970 7822078 11824864 18373141 23063200 22378956 16237037
6336 16237037 8111529 2432722 1161707 2328220 2082008 -1139349 -4440893 -3417175
6328 -3417175 2307729 7688414 7522086 2192803 -3216036 -4664289 -2096317 2781916
6320 2781916 8999576 15773304 21359740 23850807 22624474 18697154 14181357 11048071
6312 11048071 9451934 7776997 5271564 3266998 2117548 -755949 -6072775 -7831571
6304 -7831571 746267 15854672 24268951 19151910 9217781 7206352 13496945 17758232
6296A7758232l027566m011727K471943P181569M400126j933108o344201r202882
6288G292386j2594590j3528257p227138L600603R082319M758275j012241K167777
6280g460866J1447089J3872369M618370o445249q896180m069727J234401M950864
6272I251071O905597L622000m931757r703045m039910M323118M188787q61717
6264H754144J143968Q973936R206388p02735p436767m040964m83253m537098p646750
6255C230869p94354Q364150P365134j270922n338440j552693L486221N851398
6247A9341363O054569K397621n905302j1956234q437047N77390N023744L489538
6239A0585642K338025K979123J262329k027748j670978J287010N70987l200472
$$ plain form
6296 17758232 14730666 10718939 13190882 20372451 24772577 22839469 16495268 7292386
6288 7292386 -5302204 -18830461 -26057599 -22456996 -13374677 -8616402 -9628643 -7460866
6280 -7460866 3986223 17858592 22476962 16031713 7135533 3065806 4300207 9251071
6272 9251071 16156668 19778668 14846911 5143866 1103956 5427074 9615861 8754144
6264 8754144 9898112 18872048 28078436 27375701 19938934 15897970 15414717 10877619 3230869
6255 3230869 2436515 10800665 18165799 16894877 11556437 10003744 13489965 19341363
6247 19341363 25395932 27793553 21888251 9932017 1494970 2072360 7096104 10585642
6239 10585642 12923667 15902790 17165119 15137371 13466393 14753403 15324390 12123918
6231A2123918k654640K900038N567511K776635J777613O195622Q639168K558387
6223C9884252o978180j0652248o816224p51659K797318K067325j983162m969476
6215A2597946k650069K614911M190154J291291N1505K765488M086984Q75420k663817
6206B3159813l722004n947136j0342788r998384j309728P235390O106285j484328
6198C697120n549418l807931j018039J672799O508448J0710431Q241902m43151
6190B0012161q468501j1742981j0919183n882177L225768J0467266Q989091K072977
6182G754421J62052N236382P517958J066258o467929n418129J737994N029100
6174A6618107J456005k474009j089542L581224N752893K992616j688909l552210
$$ plain form
6231 12123918 9469278 12369316 17936827 20713462 22491075 28686697 37325865 39884252
6223 39884252 32906072 22253824 15437600 14685941 17483259 19550584 17567422 12597946
6215 12597946 9947877 12562788 16752942 18044233 18095738 20861226 24948210 25823630 23159813
6206 23159813 19437809 13490673 3147885 -6850499 -8160227 -924837 5181448 3697120
6198 3697120 -1852298 -5660229 -6678268 -5005469 1502979 12213410 20455312 20012161
6190 20012161 11543660 -199321 -11118504 -17000681 -13774913 -3307647 5681444 7754421
6182 7754421 7916473 13152855 20670813 21737071 15269142 9851013 11589007 16618107
6174 16618107 18074112 15600103 14510561 18091785 23844678 26837294 25148385 21596175
6166B1596175j587618J91701j807783n239485n098578j863429j225240m598936
6158C66807n689872J84044Q255092J0365217N371366j160595m772970m730522
6150H188567j326894L821489O210675K800312k669583m031589j811089k055264
6142I126624n961856p533569l445936J445524K000682M05420J243129L709553
6134I89571M203471L096688K961401K469825j627082p413027q760624l786452
6126g866229K544853M946585K865558j319638n014499n683044k251654K773709
6118i004359N375119M277854Q25841l534740n962601j562771R519737J6898749
6110A6832829J0824483k297456n689332M703749J4004196R648102k153590q176455
$$ plain form
6166 21596175 20008557 20200258 18392475 13152990 8054412 6190983 4965743 366807
6158 366807 -5323065 -5139021 3116071 13481288 18852654 17692059 12919089 8188567
6150 8188567 6861673 10683162 16893837 19694149 17024566 12992977 11181888 9126624
6142 9126624 3164768 -4368801 -7814737 -6369213 -4368531 -3963111 -2719982 989571
6134 989571 5193042 8289730 11251131 13720956 12093874 4680847 -4079777 -7866229
6126 -7866229 -5321376 -374791 2490767 1171129 -3843370 -9526414 -11778068 -9004359
6118 -9004359 -3629240 648614 1474455 -2060285 -8022886 -9585657 -65920 16832829
6110 16832829 27657312 25359856 19670524 24374273 38378469 48026571 45872981 37696526
6102C7696526o482875l835379k861616k082099k828429o080589p230936l306443
6094B988160Q069j699970j371356P354357J4268286N099803j3443532j9273800
6086f069983o257294P963307R165459M082695L991867P049090O867839N295434
6078C2088414N575579L680837k549281n421194P5993M822380p22066r035364n905773
6069B2609525O640485J2317706L880846q597379j3329198r804490m577437k762303
6061F377755n532972r704461r227077k249427M663133M825605J103735M40108
6053i303601K069460R1616m351494l589912L800791J0144787R889455N508274
6045A4259376R27484l021945m990235k622445K066803L512329Q10999r58496R68093
$$ plain form
6102 37696526 31213651 27378272 24516656 22434557 19606128 13525539 6294603 2988160
6094 2988160 2996229 1296259 -75097 7279260 21547546 26647349 13203817 -6069983
6086 -6069983 -12327277 -4363970 4801489 8884184 12876051 19925141 26792980 32088414
6078 32088414 37663993 41344830 38795549 33374355 33450348 38272728 37550662 28515298 22609525
6069 22609525 29250010 41567716 45448562 36851183 23521985 13717495 9140058 6377755
6061 6377755 844783 -8859678 -18086755 -20336182 -15673049 -10847444 -9743709 -9303601
6053 -9303601 -7234141 -7142525 -11494019 -15083931 -11283140 -1138353 8751102 14259376
6045 14259376 15186860 12164915 7174680 4552235 6619038 10131367 10942366 9983870 10951963
6036A0951963L543791L717481J408549l745460j1204409j4504539o398273Q546997
6028g683900J5496770P651814m929967r424110n489242q54991J147852K429914
6020a655860L519455L323589K635098K281989M29983l598603n878706l038156
6012a981211J922558L631912J744886P3947P55828L312755O841861Q859492M776534
6003B9938562o245249j6503931j5987460l494369J1531670J7795745J1083507
5996B8118475l118735j3173001j0202894K872705J3111437J1286255J336612o658807
5988B3572047q779292p706738m898424M13686N859919O912253L897685K032286
5980B1303422L294654L687411K89406l912924m662688j969166J470944M117129
$$ plain form
6036 10951963 14495754 18213235 19621784 15876324 4671915 -9832624 -16230897 -7683900
6028 -7683900 7812870 15464684 10534717 1110607 -4378635 -5233626 -4085774 -1655860
6020 -1655860 1863595 5187184 7822282 10104271 10534254 6935651 1056945 -1981211
6012 -1981211 -58653 3573259 5318145 5392092 6147920 9460675 16302536 25162028 29938562
6003 29938562 23693313 7189382 -8798078 -12292447 -760777 17034968 28118475
5996 28118475 24999740 11826739 1623845 4496550 17607987 28894242 30230854 23572047
5988 23572047 14792755 7086017 2187593 2601279 8461198 15373451 19271136 21303422
5980 21303422 24598076 28285487 28574893 24661969 19999281 18030115 19501059 23618188
5972B3618188N325216L948851j05768m556523o837380o118686k453996L453489
5964A6273391Q237435O948450q76814q639744r683068n216564j510664o23713
5956D908709J075101N056974P001172L551365j885856m013469l011436k456325
5948A0226235k349193J89852M302299N554069L241869J594763K128848R43299
5940B5832041l367655n180290j53484O683171P156208J144022m453621n685653
5932B1974739m330878k138271J258915M597146M735772J119716l321236n708871
5924A8187032m506929R62128Q019245J0043831M055318l360195m367281j731418
5916B7301731l823067r445625q592052N15984O801012L074987l143986k170590
$$ plain form
5972 23618188 28943404 32892255 32786487 28229964 21392584 15273898 12819902 16273391
5964 16273391 24510826 31459276 30582462 21942718 12259650 7043086 5532422 4908709
5956 4908709 5983810 11040784 18041956 21593321 19707465 15693996 12682560 10226235
5948 10226235 7877042 8066894 12369193 17923262 21165131 22759894 24888742 25832041
5940 25832041 22464386 17284096 17130612 23813783 30969991 32114013 27660392 21974739
5932 21974739 17643861 15505590 16764505 21361651 26097423 27217139 23895903 18187032
5924 18187032 13680103 14642231 22661476 32705307 36760625 33400430 29033149 27301731
5916 27301731 23478664 14033039 5440987 5956971 12757983 15832970 12688984 10518394
5908A0518394L231816L844840j732207p037057p826464n008171n80020L283491
5900a305378L788175J167790j42849J955959L496071J344139j121983q6183K329014
5891A1424755L274815M840037P819394O141446l725398j3147220j1423740j889348
5883C314741L002772M64034m61404M578406Q317375M220076l935987q621326p254097
5874C624590j263216O681233J1550225Q509139k28723o433451n941684k341413
5866A4156700O08019L319754N108339K415178l797547o135168j353579L523981
5858A7845677J545065l427213l350119J026290J998542k366212n564124l091257
5850D616649J564434L514608L359838L905356L929215P8489o284927q995912n131106
$$ plain form
5908 10518394 13750210 17595050 15862843 8825786 999322 -4008849 -4588869 -1305378
5900 -1305378 2482797 3650587 3507738 5463697 8959768 10303907 9181924 9095741 11424755
5891 11424755 14699570 19539607 27359001 33500447 29775049 16627829 5204089 3314741
5883 3314741 6317513 6781547 6320143 10898549 19215924 23436000 19500013 10878687 3624590
5874 3624590 2361374 9042607 20592832 29101971 28873248 22439797 16498113 14156700
5866 14156700 14764719 18084473 23192812 25607990 21810443 15675275 14321696 17845677
5858 17845677 19390742 15963529 12613410 13639700 15638242 13272030 7707906 4616649
5850 4616649 6181083 9695691 13055529 16960885 20890100 20968589 14683662 5687750 556644
5841E56644O10172K431923J518846L100232P006327P401170K738057r19632K97902
5832B4741641J739381j029950l656548p82915L042321J24569o256182o097178
5824A1825139J17369J405568m532368n667985M616670J4149648Q428343p577639
5816B2764745j5504945p528444O259882J2841740R161752j47174r109951j1999881
5808F737724n596075N897151J2228296P391615l516688j0706209j1162325j0083322
5800h809833j1341408j1104008l870342P959195J5541562J4574281R651074O009872
5792A8610393K670085k220437m735307n43940O600327R155453O272340K405216
5784C8214130k087592r443048j4875098j0019478K327444Q488654K777950m926398
$$ plain form
5841 556644 1166816 3598739 5117585 8217817 15224144 22625314 25363371 24443739 24741641
5832 24741641 26481022 25451072 21794524 21011609 24053930 24178499 17922317 11825139
5824 11825139 11942508 13348076 8815708 3147723 7764393 21914041 30342384 22764745
5816 22764745 7259800 -268644 5991238 18832978 27994730 27847556 18737605 6737724
5808 6737724 1141649 7038800 19267096 26658711 23142023 12435814 1273489 -8809833
5800 -8809833 -20151241 -31255249 -35125591 -27166396 -11624834 2949447 12600521 18610393
5792 18610393 21280478 19060041 14324734 13780794 20381121 29536574 35808914 38214130
5784 38214130 36126538 26683490 11808392 1788914 4116358 12605012 15382962 10456564
5776A0456564n481843k821585k751644j053645O565427J2318454P217495k585126
5768B1864097m156283J934477M055424j54909j237546L537574M395475l587526
5760B6650783j0639787p079701K263141O552337M153094R93250n10542k321876
5752B0060699m092727l525145j726109j621370k158339p2111L304012L128745
5744A3297655n42257j344661M113520J0165253Q896706M92000p054726p775515
5736B0247975l789211r61353j569230l315678l659783k194516O01999L809451
5728I169654M968747J861662l323014m830547o30296L929641K829296k403421
5720A1571722m837850j325083M167522O152165L445496o05671j250144L839267
$$ plain form
5776 10456564 4974721 2153136 -598508 -1652153 4913274 17231728 24449223 21864097
5768 21864097 17707814 19642291 23697715 23542806 22305260 25842834 30238309 26650783
5760 26650783 16010996 8931295 11194436 17746773 21899867 22893117 22382575 20060699
5752 20060699 15967972 12442827 10716718 9095348 6937009 6864898 10168910 13297655
5744 13297655 12755398 11410737 15524257 25689510 34586216 35078216 28023490 20247975
5736 20247975 16458764 15497411 13928181 10612503 6952720 4758204 5360203 9169654
5728 9169654 14138401 16000063 12677049 7846502 7216206 11145847 13975143 11571722
5720 11571722 6733872 5408789 9576311 15728476 19173972 18568301 17318157 21157424
5712B1157424J1244000J3119829N212038o722779j2123569p586345j12561K238130
5704B6426167q05998l781671l012721M58386L420487L531486O84874l085076n447248
5695A8388686n885150n094756k784556J567805N597661M916920j128029p032946
5687H545635o931467j377953L872008M605155J257473l587844p454556p617781
5679h689330k246225N970683R965835N401948l297754p351741l948937J438357
5671b757164L667070M143044N632400N569195K34598o957262q350876l146565
5663a965560J223114L37695j231139J693376O596220Q062157O140419M423981
5655B5280263L062035n64190n946468r310639q520341m317918J952786Q218540
$$ plain form
5712 21157424 32401424 45521253 50733291 44010512 31886943 24300598 24188037 26426167
5704 26426167 25620169 21838498 18825777 19284163 22704650 26236136 26921010 23835934 18388686
5695 18388686 12503536 7408780 4624224 6192029 11789690 16706610 15578581 8545635
5687 8545635 1614168 236215 4108223 8713378 9970851 6383007 -1071549 -8689330
5679 -8689330 -10935555 -4964872 5000963 10402911 7105157 -246584 -4195521 -2757164
5671 -2757164 909906 5052950 10685350 16254545 16489143 9531881 1181005 -1965560
5663 -1965560 -742446 -404751 -1635890 57486 6653706 14715863 20856282 25280263
5655 25280263 28342298 27778108 21831640 12521001 4000660 -317258 1635528 9854068
5647I854068J0986191Q655822M018177J16506l872558q717261j0627410o662465
5639C751070j944635l938217j0283141j0129050J106736J5009093K0420817J5092821
5631B9085494N020691k889905n029326k148863J052067J10703l912897n745079
5623A5542885k761224K492795O329313O748224K901814l654238p753562n964374
5615A3881633k592444m165466q415746o523666K917435J0902418J1270655P884000
5607B5158819M925793j34548p764579j0115014k659679N258520K233684p681178
5599I221818j0546925l078608L930513K747905j725300k208929K71476N00698
5591h87352k317761m509651k826693L079841R712729J0427584J951213q628864
$$ plain form
5647 9854068 20840259 29496081 33514258 33630764 29758206 21040945 10413535 3751070
5639 3751070 1806435 -2131782 -12414923 -22543973 -21437237 -6428144 13992673 29085494
5631 29085494 34106185 31216280 26186954 24038091 25090158 25200861 21287964 15542885
5623 15542885 12781661 15274456 21603769 28351993 31253807 27599569 19846007 13881633
5615 13881633 11289189 7123723 -1292023 -7815689 -4898254 6004164 17274819 25158819
5607 25158819 30084612 29950064 22185485 12070471 9410792 14669312 16902996 9221818
5599 9221818 -1325107 -4403715 -473202 2274703 549403 -1659526 -1388050 -887352
5591 -887352 -3205113 -7714764 -10541457 -7461616 2251113 12678697 14629910 6001046
5583F001046r385044J342594J1449572J0638415L429791O16797K926017J982143
5575B9001331m389016p733382k261679N633237O559313J426401j239925J400674
5567B8396954L359745K41784m226212n071178m007098n654998r067728q486962
5559d515693j599485P529922J3579590J4097545Q817328n72594r136150j1459152
5551A6741311p522655k701813q00588o45567o77260k159221n045625n143167K35546
5542g719039O778422P978459L566890j278322l700617n312881p067785p027231
5534a3782104m341908j345379J78122J640207M330420N978666L655075r85806
5526d672707k564943J216059N961430N673304L52493m078336l644170j034792
$$ plain form
5583 6001046 -3383998 -2041404 9408168 20046583 23476374 24093171 27019188 29001331
5575 29001331 24612315 16878933 14617254 20250491 26809804 28236205 26996280 28396954
5567 28396954 31756699 31998483 27772271 22701093 18693995 13038997 3971269 -4515693
5559 -4515693 -6115178 1414744 14994334 29091879 37909207 37336613 28200463 16741311
5551 16741311 9218656 6516843 5716255 5070688 4393428 2234207 -2811418 -7954585 -7719039
5542 -7719039 -940617 7037842 10604732 9326410 5625793 312912 -6754873 -13782104
5534 -13782104 -18124012 -19469391 -19291269 -17651062 -13320642 -7341976 -3686901 -4672707
5526 -4672707 -7237650 -6021591 -60161 5613143 5965636 1887300 -1756870 -2791662
5518b791662m92961q17163K535141R419860J3710723J0879502L158033m050873
5510C1550600p460899o330561j480770L904632N898207M666085M403727O087297
5502D1238318M548222l302316j1424341j1567982m681962J045911K290451L404370
5494B1550671O313621N395683l156823j2374185j1526602m59353R131628P803131
5486B2677771q37397o078376l625989J055351J878551m55240j945043j828348
5478A0841280j649902n29557L387234P474861O061850j570989r131477j0945915
5470C937385p772781l308507R92397N028284P446629O883357L609613j516454
5462A5299923o731842p420542J52320J0969745J3537946M547377m704846k803788
$$ plain form
5518 -2791662 -3284623 -4101786 -1566645 7853215 21563938 32443440 35601473 31550600
5510 31550600 24089701 17759140 16278370 20183002 26081209 30747294 35151021 41238318
5502 41238318 45786540 42484224 31059883 19491901 14809939 15855850 18146301 21550671
5494 21550671 27864292 33259975 30103152 17728967 6202365 5743012 14874640 22677771
5486 22677771 21840374 15761998 12136009 13191360 15069911 14614671 12669628 10841280
5478 10841280 9191378 8661821 12049055 19523916 25585766 24014777 14883300 3937385
5470 3937385 -3835396 -7143903 -6151506 -1123222 6323407 13206764 16816377 15299923
5462 15299923 8568081 1147539 1299859 12269604 25807550 30354927 25650081 22846293
5454B2846293O031642Q638614J720581n348332n368402j564375L15107q3394o47613
5445B6540121j238341j823079j006515O88985L15203k197402k458363J784331
5437B0604940O289485N792104P49731m482729p488277q511167p519346m106370
5429A328371N89322M578635P097254Q095325O574338J600657n295923j0431407
5421A4136572j0823825o103394J610778Q447323J0067639M511907m890937j0507636
5413F448427o685102L817942J1289075R047838R80522l676843k211088n73796
5405A8436975k977578n166103j775822M463375O763555M636966L463428M590113
5397C2434909K943660l888782j0159315q980907j285423N579472O260843J865524
$$ plain form
5454 22846293 28877935 37516549 39237130 33888798 28520396 26956021 27271128 27187734 26540121
5445 26540121 25301780 23478701 22472186 23161171 23476374 21278972 18820609 20604940
5437 20604940 26894425 32686529 33436260 28953531 21465254 12954087 5434741 1328371
5429 1328371 1917693 6496328 13593582 21688907 28263245 29863902 24567979 14136572
5421 14136572 3312747 -2790647 -1179869 7267454 17335093 21847000 16956063 6448427
5413 6448427 -236675 3581267 14870342 23918180 24898702 21221859 19010771 18436975
5405 18436975 15459397 10293294 8517472 12980847 19744402 24381368 27844796 32434909
5397 32434909 35378569 31489787 21330472 12349565 11064142 16643614 22904457 24769981
5389B4769981k622181l132715O95281N728523Q031348N957212R35855m380640
5381C5982664q302650j0523100j0709468p383374J26951P921140Q792593R81981
5373A6886737o518980l353232P801583J3201199N936119n688090j1001148j0197327
5365G066861q953989p272087k093695L920317N290866K762600J509151K443924
5357D673948K626465J991233K250533J537358k084813m361356o43500M450193
5349A0440061K666710m242892o630415j900641L063133M287707M657347M759775
5341A7100785J102022m469817m584795J365379N005252K208594j495908j881484
5333A4350028j954532l361999k563687L46754r5086l335823j414777N952836P750460
$$ plain form
5389 24769981 22147800 19015085 19710366 25438889 33470237 39427449 40363304 35982664
5381 35982664 27680014 17156914 6447446 -935928 -808977 7112163 15904756 16886737
5373 16886737 10367757 7014525 14816108 28017307 33953426 28265336 17264188 7066861
5365 7066861 -1887128 -9159215 -11252910 -7332593 -2041727 720873 2230024 4673948
5357 4673948 7300413 9291646 11542179 13079537 10994724 6633368 5989868 10440061
5349 10440061 13106771 8863879 2233464 332823 3395956 7683663 12341010 17100785
5341 17100785 18202807 13732990 9148195 10513574 15518826 17727420 16231512 14350028
5333 14350028 12395496 9033497 6469810 6816564 6721478 3385655 1970878 7923714 15674174
5324A5674174M685n558294l69241O400623L591769l344327l026442K293659K629069
5315A8295675j627563k511510r5670n97303k677569J22263N785343O194180J338800
5306B4226646j611932j653696l459913n200999p06803O500098N580751l649020
5298B0025132q739972l531322L657078M612165K094828J306767J312304M62453
5290B1199433Q88289K164641p10109p634870j0333271m885642R07053m94089m518627
5281c417192k632395L605712N625338J652542j278609J498920O145271O519602
5273A7719189J750649m212684p788040q365660o629406k519663L511259Q200573
5265A666217P744410L239873J94018Q07166J105773j509121l310168j334215M33321
$$ plain form
5324 15674174 15678859 10120565 9751324 16151947 19743716 16399389 13372947 15666606 18295675
5315 18295675 16668112 14156602 14060932 13463629 10786060 10908323 16693666 22887846 24226646
5306 24226646 22614714 20961018 17501105 12300106 11593303 18093401 23674152 20025132
5298 20025132 11285160 7753838 11410916 16023081 18117909 19424676 20736980 21199433
5290 21199433 22087722 24252363 23542254 15907384 5574113 688471 1595524 1101435 -3417192
5281 -3417192 -6049587 -2443875 3181463 4834005 3555396 5054316 11199587 17719189
5273 17719189 19469838 15257154 7469114 -896546 -7525952 -10045615 -6534356 1666217
5265 1666217 9410627 12650500 12844518 13651684 14757457 13248336 9938168 8603953 9037274
5256I037274j640912l067489J007886N434098K469403m391349n233144L43492
5248C959259M114614M225915O061626Q581918M304110n143882q059713j258893
5240A6784954M378477K181774n08956K245882L644390k418709q898829p482692
5232I926291k507567j658937k086918K033293O210337L123800k733656j368089
5224A0938554N852910Q545149L834943j615272m233327o328546p185803l083718
5216F724890L180131L490515l147683q542109p475015l675935j808958j157521
5208a2411685M42643K828814N601410Q554702R148028M996641q74292l013900
5200A5272361j631903j479024l111734k608171j56260o71289m282625m563243
$$ plain form
5256 9037274 7396362 4328873 5336759 10770857 13240260 8848911 3615767 3959259
5248 3959259 8073873 12299788 18361414 26943332 31247442 26103560 18043847 16784954
5240 16784954 21163431 23345205 22836249 25082131 28726521 26307812 17408983 9926291
5232 9926291 7418724 5759787 3672869 5706162 11916499 15040299 12306643 10938554
5224 10938554 16791464 25336613 29171556 27556284 23322957 16994411 9808608 6724890
5216 6724890 9905021 13395536 10247853 1705744 -5769271 -9445206 -11254164 -12411685
5208 -12411685 -11969042 -9140228 -3538818 5015884 14163912 19160553 18286261 15272361
5200 15272361 13640458 12161434 9049700 6441529 6285269 5613980 1331355 -3231888
5192c231888P04320M845233K743411q96518P41803N976423P948563N144020K450264
5183B6425631L103339M773943L872637J98207l594218n256498m735948l207365
5175B1579728j104854J798656M177394L218441j345940n409769n370430k873630
5167A4669596j531916j242027j27880J22779l066305o164106k459958O874486
5159G074669J1799614O652204j650336l110460K257778O159650L987842n98916
5151C2572045k402744j105667K74501K43987j7169N99111J241101Q16635M22137
5142C2643937J829040L541922J653661l671502o308463k539450J852108j462726
5134B7538527j0836358j5703301j0591010j547591L356879L733810L595160L711181
$$ plain form
5192 -3231888 -2527568 2317665 5061076 4164558 4906361 10882784 18831347 23975367 26425631
5183 26425631 29528970 34302913 38175550 38373757 34779539 29523041 24787093 21579728
5175 21579728 20474874 22273530 26450924 29669365 28323425 22913656 17543226 14669596
5167 14669596 13137680 11895653 11767773 11890552 8824247 2660141 200183 7074669
5159 7074669 18874283 25526487 23876151 20765691 23023469 29183119 33170961 32572045
5151 32572045 30169301 29063634 29338135 29582122 29564953 30164064 31405165 32221800 32643937
5142 32643937 34472977 38014899 39668560 35997058 29688595 27149145 29001253 27538527
5134 27538527 16702169 998868 -9592142 -11139733 -7782854 -4049044 -453884 3257297
5126C257297K295940J09965k48246J121882J525712l01978l114022n334247n936648
5117f624345m102773l62232K789606L656814L830962N521200P159921M619549
5109A6488702k735691r570913r591747k338961N916327Q228199L864258j225595
5101I034579j272647K712487M653304J257652m263605o900470n618501k756134
5093c153335J4874K358927L168056J056222k702014m192070r06908N430667J0544776
5084A1619195J0935961N584981l428752j0953037j1783038o168403q37931j229143
5076f260167l408849J624543J4272884K2196309J4364223l971297j6314800j3981764
5068H521082m046250K149854J730723j224773l793127n511391n050480j111959
$$ plain form
5126 3257297 5553237 5663202 5414956 6536838 8062550 7760572 4646550 -687697 -6624345
5117 -6624345 -10727118 -11089350 -8299744 -4642930 -811968 4709232 11869153 16488702
5109 16488702 13753011 4182098 -5409649 -7748610 -1832283 6395916 10260174 9034579
5101 9034579 7761932 10474419 15127723 16385375 12121770 5221300 -397201 -3153335
5093 -3153335 -3138461 -779534 2388522 3444744 742730 -3449340 -4356248 1074419 11619195
5084 11619195 22555156 28140137 24711385 13758348 1975310 -4193093 -5031024 -6260167
5076 -6260167 -9669016 -8044473 6228411 28424720 42788943 38817646 22502846 8521082
5068 8521082 4474832 6624686 8355409 7130636 3337509 -2173882 -7224362 -8336321
5060h336321M448839Q150727Q484197N476596p21986p348993q371668j660730
5052A20661N440926M181649k900795m624084K598705Q857110M728044n237167
5044A3165049q881915k607798N221188N978802K42343n269589n909540k318489
5036c79949J735565K456805j363645o541676p259991j111977O801836Q524586
5028B861554K744979l126349k173240L479553O492615M470499J593215P54129
5020A7096955l83967l826067o468816m117697K398711P846329P748392J758775
5012B2052615n815525q288243k903177M292921M413927k074268m986044Q62612
5004G554818P250976M285053n329923j1014280q964072l795764J441592P337871
$$ plain form
5060 -8336321 -3887482 4263245 12747442 18224038 17502052 10153059 1781391 120661
5052 120661 5561587 9743236 6842441 2218357 4817062 13674172 18402216 13165049
5044 13165049 4283134 1675336 6896524 12875326 13117669 7848080 1938540 -379949
5036 -379949 1355616 3812421 2448776 -4092900 -11352891 -12464868 -5663032 2861554
5028 2861554 5606533 2480184 306944 3786497 10279112 14749611 16342826 17096955
5020 17096955 16712988 12886921 6418105 2300408 4699119 12545448 20293840 22052615
5012 22052615 16237090 7948847 5045670 9338591 13752518 11678250 6692206 7554818
5004 7554818 14805794 19090847 13760924 2746644 -6217428 -10013192 -8571600 -1233729
4996a233729J0835912N877055n937949j3372177q803600J879419P219044M336564
4988H00539L01629J006386L507210J123937o099534r638852l114402P867572J1426209
4979G180694M832797k111301j458122K168800N78924m532373n216330n81125K512966
4970C374930Q36901j494457j015792P50290K113454L983760O088842N602775J413698
4961B1654401l868981p025416o543712k521007K600245M723276K998384J741088
4953A3758278L664002M681743N31513n361551p028662n121498l606885j331715
4945A85225M217970Q206981L971880m618992p137155k241803J388527k84524k129658
4936A558451r36101l3786p85545K46368L141571L162856k19200j968280r57105
$$ plain form
4996 -1233729 9602183 15479238 9541289 -3830888 -12634488 -10755069 -3536025 800539
4988 800539 1102168 2108554 5615764 6739701 640167 -8998685 -12113087 -4245515 7180694
4979 7180694 12013491 9902190 8444068 10612868 11191792 6659419 1443089 861964 3374930
4970 3374930 4211831 2717374 1701582 2451872 4565326 8549086 14637928 20240703 21654401
4961 21654401 17785420 10760004 4216292 1695285 4295530 9018806 12017190 13758278
4953 13758278 17422280 22104023 22635536 17273985 10245323 5123825 1516940 185225
4945 185225 4403195 12610176 16582056 11963064 4825909 2584106 3972633 3688109 1558451
4936 1558451 622350 588564 -196981 49387 3190958 6353814 6134614 4166334 3209229
4927C209229j444535l596459k548225J313417J575099k515338m116664r45440
4919i068916J271265j0160l10556J923443K447729P91695J612996M418873L639745
4910F716114N72150K331134P275837N785660k297824o367694l630647k363775
4902H020955l841219M45530R508570J0854140L143389l52695K799794j141239
4894B9437225j3618412j5860408j512498R302377L713326k934056K168653N201517
4886A5897724n604421j4235332n582089N401970Q83100q053278n622149j464726
4878a8379201n629265k954560J1777439Q859986j7815593o527346Q6335435J82389372
4870B38056267J54430235N333252j17697004j12206992l8600705p295018k7393224
$$ plain form
4927 3209229 1764694 -1831765 -4379990 -3066573 -1491474 -4006812 -8123476 -9068916
4919 -9068916 -7797651 -7807811 -8118367 -6194924 -3747195 -2955500 -1342504 3076369 6716114
4910 6716114 7288264 9619398 16895235 22680895 20383071 14015377 10384730 8020955
4902 8020955 4179736 4625266 14133836 24987976 28131365 27778670 30578464 29437225
4894 29437225 15818813 -41595 -1554093 7748284 11461610 8527554 10696207 15897724
4886 15897724 10293303 -3942029 -9524118 -4122148 -3239048 -11292326 -16914475 -18379201
4878 -18379201 -24008466 -26963026 -15185587 -6325601 -24141194 -30668540 55666895 238056267
4870 238056267 392486502 397819754 280122750 167915758 129315053 122020035 94626811
4863I4626811l4170142r341872P017984j877955r929352m376321k305312q816515
4855C0827326p021156M758043O370772o496191j2815669k547740P788361N168807
4847B6032553n10488K273999P547398N445011j236459m435552l343148j666728
4839C0106586l83943J654543M868946Q050322P307076m82622r624064q813695
4831C2683149J854066P452417j33934r482411r344152p091988j2674110j7857429
4823a4594392j0237762L340514P929425N695556Q329450J2317210N457691p321263
4815A0916429r285590o85015J933064n070157p745268j022239L260081r15991
4807h614686m279373j125363J697114N76366J931705P092733P264682O601m719600
$$ plain form
4863 94626811 60456669 51114797 58132781 56254826 46325474 41949153 39643841 30827326
4855 30827326 23806170 28564213 34934985 28438794 15623125 13075385 20863746 26032553
4847 26032553 25522065 27796064 35343462 40788473 39552014 35116462 31773314 30106586
4839 30106586 29722643 31377186 36246132 44296454 51603530 51120908 41496844 32683149
4831 32683149 34537215 41989632 41855698 32373287 23029135 15937147 3263037 -14594392
4823 -14594392 -24832154 -21491640 -13562215 -7866659 462791 12780001 18237692 10916429
4815 10916429 1630839 945824 2878888 -2191269 -9936537 -10958776 -7698695 -8614686
4807 -8614686 -12894059 -14019422 -12322308 -11745942 -9814237 -2721504 4543178 4549779 -169821
4798a69821j030199M492868N709172M394661J416018m830328q354758j26671J3963524
4789A5464466J6733888N309592m618465m488876l404563o892398o139825J866138
4781A3829957L888723o779639j5191972p517298O379400R145561K079284j296444
4773D537572J986586L871548J028522k378040l040617m0495O345982J0617584
4765B2928642N415268m791829n078520P000754J3689463L086161j1439203j2027562
4757A8783174l146808m86900m262012l290287J863387N47126o529244p113194
4749c634758J346570P577595N381695J457071J353391R76952l471055p664041
4741C323420o141041O0578O068111Q234152N303287o58671m334486k355788K480937
$$ plain form
4798 -169821 -1200020 3292848 9002020 13396681 14812699 9982371 1627613 1500942 15464466
4789 15464466 32198354 37507946 32889481 28400605 24996042 18103644 11963819 13829957
4781 13829957 17718680 10939041 -4252931 -11770229 -5390829 3754732 5834016 4537572
4773 4537572 6524158 10395706 11424228 9046188 6005571 5965076 12311058 22928642
4765 22928642 28343910 23552081 18473561 25474315 39163778 42249939 30810736 18783174
4757 18783174 15636366 15149466 10887454 7597167 9460554 10007680 3478436 -3634758
4749 -3634758 -2288188 5289407 10671102 12128173 13481564 14458516 10987461 3323420
4741 3323420 -2817621 -2757043 3311068 11545220 16848507 16189836 11855350 9499562 11980499
4732A1980499N603147O425210N925368K816880k780958o251080m457632m40491
4724A8820943K515677N575555Q103823M516771n624990j2432205r111023k780290
4716I584261k491077m493346m54933P039452R434971O480255L390755k49560o330602
4707B1910176r272596m569160J10436l289987p105218m1460J1030702J0456191
4699A9229084L82806l145176J513464Q6499r606509j1837365p13185Q552604M875502
4690I337724k170212j610325J214793j619989n014384k218666J516636o6496j231942
4681a862861M475729J0249875O946455n36360j386252L269628L699214j986777
4673B2868651o451057m953638P66232O920841Q568027J298903j0594379j4068876
$$ plain form
4732 11980499 17583646 24008856 29934224 32751104 29970146 23719066 19261434 18820943
4724 18820943 21336620 26912175 35015998 39532769 33907779 21475574 12364551 9584261
4716 9584261 7093184 2599838 2144905 9184357 18619328 25099583 28490338 28240778 21910176
4707 21910176 12637580 8068420 8178856 4888869 -2216349 -2257809 8772893 19229084
4699 19229084 19611890 16466714 17980178 18066677 8460168 -3377197 -4090382 4462222 9337724
4690 9337724 7167512 5557187 6771980 5151991 137607 -2081059 -564423 -630919 -1862861
4681 -1862861 2612868 12862743 19809198 19272838 17886586 21156214 24855428 22868651
4673 22868651 16417594 11463956 12230188 19151029 27719056 29017959 18423580 4354704
4665D354704l634077Q977415J0025016J408957o213587r753520j1508637q344330
4657a4688059K668205J2748735J0381727o44426o148931k934716j077417n096676
4649d791558p479578l281373K337393N077869P758855J0590759O648045n844486
4641A1015926j5817937j2246464J015449J0530029R565938L037517j111471j25472
4633E863515K881142K983632j386902o103430n578038K59032N473634M972492
4625I365077m86225n986462o612456o85674P917579J1584147O821685o50446k655696
4616A8611529J030271L946050L082743J387978N97388j352347m658231o004842
4608A6640539m454091l104458l067990j669989J424642K477638N57439o0355K561198
$$ plain form
4665 4354704 720627 9698042 19723058 21132015 14918428 5164908 -6343729 -14688059
4657 -14688059 -12019854 728881 11110608 10466182 4317251 1382535 305118 -4791558
4649 -4791558 -12271136 -15552509 -13215116 -8137247 -378392 10212367 16860412 11015926
4641 11015926 -4802011 -17048475 -16033026 -5502997 4062941 7100458 5988987 5863515
4633 5863515 8744657 11728289 10341387 4237957 -1340081 -1081049 4392585 9365077
4625 9365077 8878852 2892390 -3720066 -4405740 3511839 15095986 21917671 21267225 18611529
4616 18611529 19641800 23587850 26670593 28058571 28655959 27303612 22645381 16640539
4608 16640539 12186448 9081990 6014000 4344011 5768653 8246291 8803730 8743375 11304573
4599A1304573M229955K053092m21484N4811L43749l062488o993166o562735l108851
4590b162544j101854o49111O35722J435465n98551k144031K241317J0332055J3216876
4581B1205344P160728j496662m947217k374028K059027N086337N561591L234041
4573C5489161o14108k970061j824234J410672L156482J057211l691945o919360
4565B5093818n553475k090072k781090r077569j3341076p137389P318831J8362310
4557A0794288J7521392P266140l669657q481553n462285K301544Q437154P832526
4549C6539549J704415l913791n348814m305685l553648l251941k522066j199940
4541A4148079J088204M394877O451488M942858J964365J366969J397601l431741
$$ plain form
4599 11304573 15534528 17587620 17166136 17220947 17564696 14502208 7509042 946307 -2162544
4590 -2162544 -3264398 -3913509 -3277787 -1842322 -2440873 -4584904 -2343587 7988468 21205344
4581 21205344 28366072 26869410 21922193 19548165 21607192 26693529 32255120 35489161
4573 35489161 34875053 31904992 30080758 31491430 34647912 35705123 32013178 25093818
4565 25093818 19540343 17450271 14669181 5591612 -7749464 -14886853 -7568022 10794288
4557 10794288 28315680 35581820 31912163 23430610 17968325 20269869 28707023 36539549
4549 36539549 38243964 34330173 28981359 24675674 21122026 17870085 15348019 14148079
4541 14148079 15236283 19631160 26082648 31025506 32989871 34356840 35754441 32322700
4533C2322700j1500683j2974250l676636P389479J0264981O926463M667032L088469
4525C6507555k613536r867750j1319178p413616n571441o993133n094374J489377
4517a0876096N168435K266724j86379L982295R661709Q146717j66120o897318
4509A1099967o135125O07204P043911P065189M31646n105809k118643N414462
4501A8302802O279393j412119o945379l608542J833151K332633K482447P797919
4493B7062305J1499772M516043p505508j0621663k911158M348150M316812J123735
4485C1828488j140595m045305p748572q633363o195997l631249o11332N419118
4477E241193J0393296O771755k857161o593982o67789N179030L807182N80039
$$ plain form
4533 32322700 20822017 7847767 4171131 11560610 21825591 28752054 33419086 36507555
4525 36507555 33894019 24026269 12707091 5293475 -277966 -7271099 -12365473 -10876096
4517 -10876096 -5707661 -3440937 -3627316 354979 10016688 18163405 17997285 11099967
4509 11099967 4964842 5572046 12615957 19681146 20112792 15006983 12888340 18302802
4501 18302802 24582195 23170076 16224697 12616155 14449306 16781939 19264386 27062305
4493 27062305 38562077 43078120 35572612 24950949 22039791 26387941 30704753 31828488
4485 31828488 30687893 26642588 18894016 10260653 4064656 433407 -177925 5241193
4477 5241193 15634489 22406244 19549083 12955101 12287312 17466342 21273524 21853563
4469B1853563J318224J808518k479722o126667k947439K334510J686964l106304
4461A4341647n007179m318774o126505q623892m857362M968634J2520425J2860113
4453A5757107Q897577L964412k416942r821311j4296864j2915233p201424p49725
4445a8782403M016219O744208Q945090J1851136J3071204Q495225l04567n367753
4437B8668359k952508N51400j069060l440010M01138O571517N515918j922344
4429C2324410n353724j928446n80336o135183j0419600n303589M181373P409579
4421A4194484K992036j595102j615141P55693K054707J339715r75582l449781
4413A3701029l318927J21224K547533o29563o581256o866861J498723J0857786
$$ plain form
4469 21853563 23171787 24980305 22500583 16373916 13426477 15760987 17447951 14341647
4461 14341647 9334468 5015694 -1110811 -9734703 -14592065 -9623431 2896994 15757107
4453 15757107 24654684 28619096 26202154 16380843 2083979 -10831254 -18032678 -18782403
4445 -18782403 -14766184 -8021976 923114 12774250 25845454 34340679 34036112 28668359
4437 28668359 25715851 26267251 25198191 21758181 22159319 28730836 34246754 32324410
4429 32324410 26970686 25042240 24461904 18326721 7907121 2603532 6784905 14194484
4421 14194484 17186520 15591418 13976277 14731970 16786677 18126392 17150810 13701029
4413 13701029 10382102 10503326 13050859 12421296 5840040 -1026821 471902 11329688
4405A1329688J1812018M587645k314837l361065j202598l42161o63075N0858J306796
4396B1203269J748530K770815N472092O464962K414666l168733m343533k539358
4388C0022710l974668p864613o920063q33580J738592j768444k501004L865876
4380A1764806P761762J716596n243852j684211O631641N961865k811381o941735
4372A7155491l676828k296576m822261k200353P085833J1048170L306081n720368
4364A9879189m949856J277153K229174k917243o930008o334456l188154L45493
4356e88708K538157J170405k614142l481447P58884N359239N817851L661623J391579
4347A4013441k220444p051988p910810j861407N391618O316975J313072l186380
$$ plain form
4405 11329688 23141706 27729351 25414514 22053449 20850851 20508690 19845615 19896473 21203269
4396 21203269 22951799 25722614 31194706 37659668 40074334 36905601 32562068 30022710
4388 30022710 26048042 18183429 11263366 10429786 12168378 10399934 7898930 11764806
4380 11764806 19526568 21243164 15999312 14315101 20946742 26908607 24097226 17155491
4372 17155491 13478663 11182087 6359826 4159473 11245306 22293476 25599557 19879189
4364 19879189 14929333 16206486 18435660 15518417 8588409 2253953 -934201 -588708
4356 -588708 1949449 3119854 505712 -2975735 -2216851 3142388 8960239 12621862 14013441
4347 14013441 11792997 4741009 -3169801 -5031208 360410 6677385 7990457 4804077
4339D804077l175705L47218M076877M573777J207152j221105K375821Q316825
4331B1304937P230379j532498p085447k862017L524815K476620l623382o209584
4323A3223823l558527l5077K181299L008589R98544k998191l545573J493357O111411
4314A6879655N414976L277250L876429L119251k841985p900683n059641J048584
4306A7813836J447240k959832n359763n542506o578278m547569M883402J3841808
4298A2998338J0724228j063960p159505l650045j34941j984775m145813l397434
4290B186093k671098j698319L019012P458821L293964o304580q628151j770310
4282e114568K203205j828837l842393K785099R901927R324523M950554K190014
$$ plain form
4339 4804077 1628372 1975590 6052467 10626244 11833396 10612291 12988112 21304937
4331 21304937 28535316 27002818 19917371 17055354 20580169 23056789 19433407 13223823
4323 13223823 9665296 9630219 11811518 14820107 15818651 12820460 9274887 10768244 16879655
4314 16879655 22294631 25571881 29448310 32567561 29725576 21824893 16765252 17813836
4306 17813836 19261076 16301244 10941481 5398975 -1179303 -5726872 -843470 12998338
4298 12998338 23722566 22658606 15499101 11849056 11714115 9729340 5583527 2186093
4290 2186093 -485005 -2183324 835688 8294509 11588473 5283893 -3344258 -5114568
4282 -5114568 -2911363 -4740200 -8582593 -5797494 4104433 13428956 18379510 20569524
4274B0569524j165717n147414k481331O970497J0037830k17291j1197051r347635
4266H021412n11000J883677j395006m83539M786682O706932M683441L887171L271041
4257C0850811j427296o406408m666405Q10397J150560l730022o171458l760096
4249F650083j21109L952226Q821268R369180K244294m302171j073823N515545
4241C1055493K264922q677779j2836658o807873j100627L75576M797859J1761278
4233B0832191R643428l118304j1405784o851027j116185n109179j0692861o601417
4225a4419138Q99614n77347p100024m703306O950235J3666395Q288647r98022
4217B007054n065519m628873l757988k092711K117550P157308R793341Q842144
$$ plain form
4274 20569524 19403807 14256393 11775062 18745559 28783389 28566098 17369047 8021412
4266 8021412 7510412 9394089 7999083 7515544 12302226 19009158 23692599 27579770 30850811
4257 30850811 29423515 23017107 18350702 19161099 20311659 16581637 10410179 6650083
4249 6650083 6528974 10481200 19302468 28671648 30915942 26613771 25539948 31055493
4241 31055493 33320415 24642636 11805978 4998105 3897478 4273054 9070913 20832191
4233 20832191 30475619 27357315 15951531 9100504 7984319 2875140 -7817721 -14419138
4225 -14419138 -13519524 -14096871 -21196895 -25900201 -18949966 -5283571 3005076 2007054
4217 2007054 -3058465 -7687338 -11445326 -13538037 -11420487 -4263179 5530162 14372306
4209A4372306N066636L46576k137170K65913O268767J0603283Q535248M62873
4201D3784432p853476j0202140o069654j049195J27428j130361j329287r46839
4193A5330908j897869k181314O56133L484056K470851J066563L776559M944432
4185B7650319l750314j5771148j4954833m99204R486295M854598k565006l03900
4177D146807N695393N429850L341592P089264R916214J728821j0769624j2733888
4169A3844429m196810K341915K755793L172133M519278J704710l786060n789498
4161A4565890n800687q609342r148112l84017R067414M390083r784625j3526187
4153a9229583k161193P861851N878998q92716n166568q205391p523139O07926
$$ plain form
4209 14372306 19438942 19785518 17648348 17914261 24183028 34786311 43321559 43784432
4201 43784432 35930956 25728816 19659162 18609967 18737395 17607034 16277747 15330908
4193 15330908 13433039 11251725 11907858 15391914 17862765 18929328 22705887 27650319
4185 27650319 23900005 8128857 -6825976 -7325180 2161115 7015713 4450707 4146807
4177 4146807 9842200 15272050 18613642 25702906 35619120 37347941 26578317 13844429
4169 13844429 9647619 11989534 14745327 17917460 22436738 24141448 20355388 14565890
4161 14565890 8765203 155861 -8992251 -9376268 -308854 4081229 -5703396 -19229583
4153 -19229583 -21390776 -13528925 -7649927 -8542643 -13709211 -21914602 -29437741 -28829815
4145b8829815L175750j6083980l7874386j7416111M7798493R4866360P0737217
4138A16373528M043241l4539360k3986948l587410l261187r670429n192056J590552
4130D1769931q22996m807375k359475j882058r354056j2792137k691240Q686143
4122A5746737O055970m111307n192579L198093P821736M291666N47079R92996
4114B9350391J458083m81899j473983L85009K358406K032085J88320j201600n99994
4105C2014818J793294K307148k826162j0155547j0527031j294523Q714216J0393955
4097C0420168M737373j914953o296395o996394j969035O271314R177521K858573
4089C6288172n080871n973466j771543P09076J334364L974915O955336N263015
$$ plain form
4145 -28829815 -25654065 -41738045 -79612431 -97028542 -49230049 45636311 116373528
4138 116373528 120416769 85877409 61890461 58303051 55041864 45371435 40179379 41769931
4130 41769931 40946935 36139560 33780085 31898027 22543971 9751834 7060594 15746737
4122 15746737 21802707 17691400 12498821 15696914 23518650 27810316 28357395 29350391
4114 29350391 30808474 30326575 28852592 29237601 31596007 33628092 33816412 32614812 32014818
4105 32014818 33808112 36115260 33289098 23133551 12606520 11311997 20026213 30420168
4097 30420168 35157541 33242588 26946193 19949799 17980764 24252078 33429599 36288172
4089 36288172 31207301 25233835 23462292 24171368 25505732 29480647 36435983 41698998
4081D1698998m03331m579464m799659k192927K261047N969702L775564m398884
4073C7331046j0058693p785669m368614p258083j0557263m427427O872783J0417749
4065A0165829N081166J586470K996331J048137o044323q093764o86679N738383
4057A1791550K382876m038561l063207L020318M307270j175327o244842n409120
4049A570957L07837P053010J1218372J0673767O610310K336007j256528n546005
4041C2967727q868069o973638m95859M223183M135694K979956L284540K049211
4033C3302745k064719m463578k057304J518467K463688K090944J488979j660877
4025C0618345o274257o053123j46411L126239Q829r42439N980969J0645026J943717
$$ plain form
4081 41698998 41295667 36716203 31916544 29723617 31984664 37954366 41729930 37331046
4073 37331046 27272353 19486684 15118070 7859987 -2697276 -7124703 -251920 10165829
4065 10165829 15246995 16833465 19829796 20877933 14833610 6739846 6053167 11791550
4057 11791550 14174426 10135865 7072658 10092976 14400246 13224919 6980077 1570957
4049 1570957 1878794 8931804 20150176 30823943 37434253 39770260 38513732 32967727
4041 32967727 24099658 17126020 16630161 20853344 24989038 27968994 31253534 33302745
4033 33302745 31238026 26774448 24717144 26235611 28699299 30790243 32279222 30618345
4025 30618345 24344088 18290965 18144554 21270793 21279622 20337183 26318152 36963178 38906895
4016C8906895j2160041j4667341n009721J669996r16432l064561J532006N351961
4008A1642762J784716l268688k651547k76220l006924p847749o739834N08088
4000i855396O690443P999718O995862O146289M874485L122340K767201M369470
3992C3110412N707400M682822J864415o85624k140383l610843n918856p274943
3984B5734400m922048J71292K632375j035475p417987j0291711q007685l508389
3976f645228J031801N139932O901704M038595j711403n459716m506401M76972
3968g33744Q072934J5373765J6625465Q982133j394119n894793n322607p078561
3960B8630473j0919636q140284K441710Q856461K450459r303963j4069599j0876321
$$ plain form
4016 38906895 26746854 12079513 7069792 8739788 7823356 4758795 6290801 11642762
4008 11642762 13427478 10158790 7507243 7231023 4224099 -3623650 -10363484 -9855396
4000 -9855396 -3164953 4834765 11830627 17976916 22851401 25973741 28740942 33110412
3992 33110412 38817812 43500634 45365049 44679425 42539042 38928199 33009343 25734400
3984 25734400 20812352 20983644 23616019 22580544 15162557 4870846 -3136839 -6645228
3976 -6645228 -5613427 -473495 6428209 10466804 8755401 3295685 -1210716 -733744
3968 -733744 7339190 22712955 39338420 48320553 46926434 41031641 35709034 28630473
3960 28630473 17710837 9570553 12012263 20868724 23319183 14015220 -54379 -10930700
3952a0930700o431686j997165N554296J3605484J5250735R412466R75274p271404
3944A8167300j4230392j4559387m058600R215769J0880781p6715q301789l237589
3936f200622O820924Q423960J788805l010137k165626m2279J533779N054962Q750488
3927B0954254O289821k537252q995567o960628p53405K825557M283804P346856
3919B2453440R627161N175064m774564j0853218o924328K660885R090338Q341594
3911C4796372K474638m344956q163226o590495j304505K425498J424976j671253
3903A9047049k651575j547497j231682k196085k477190j514810k56119J541881
3895H713972L986941M064236q49322o619730n592191K148459O719745J053735
$$ plain form
3952 -10930700 -17362386 -19359551 -13805255 -199771 15050964 24463430 25438704 18167300
3944 18167300 3936908 -10622479 -14681079 -5465310 5415471 5338756 -2963033 -6200622
3936 -6200622 620302 9044262 10833067 7822930 5657304 5615025 7148804 12203766 20954254
3927 20954254 27244075 24706823 15711256 8750628 7997223 10822780 15106584 22453440
3919 22453440 32080601 37255665 32481101 21627883 14703555 17364440 26454778 34796372
3911 34796372 37271010 32926054 24762828 18172333 16867828 19293326 20718302 19047049
3903 19047049 16395474 14847977 13616295 11420210 8943020 7428210 7172091 8713972
3895 8713972 12700913 16765149 15915827 9296097 3703906 5852365 12572110 13625845
3887A3625845r406125j4085036j0409965m272602k65657K142518L531548K304885
3879a6834589o60336l52038N943533J3516883J5123921R703623L099496M63107
3871C0003600R38955P07930j275003k772449k293206j054703p74355j624579l023101
3862A8833089m555970n268762m030768j689036n91514o18889J269415N204828
3854H552393N914443M64864m798706j667041O962981R320751J066773q370901
3846A7445557r102871l453593k6687p06172p25995J375116J702497j121299k753359
3837B633194L9151M084458M531976K079089J731046M902250O385847J294643o966547
3828B0715107r545440l485550M001184N232869J847338J75445O44709q58800l121213
$$ plain form
3887 13625845 4219720 -9865316 -20275281 -24547883 -24813540 -22671022 -19139474 -16834589
3879 -16834589 -17494925 -17846963 -11903430 1613453 16737374 26440997 29540493 30003600
3871 30003600 30942555 31650485 30375482 27603033 25309827 24255124 23480769 21856190 18833089
3862 18833089 14277119 9008357 4977589 3288553 2697039 2078150 3347565 8552393
3854 8552393 14466836 14931700 10132994 8465953 15428934 24749685 25816458 17445557
3846 17445557 8342686 4889093 4862406 4156234 3430239 4805355 6507852 5386553 2633194
3837 2633194 2672345 6756803 11288779 13367868 15098914 20001164 26387011 27681654 20715107
3828 20715107 11169667 7684117 11685301 16918170 18765508 18940953 19585662 18726862 15605649
3819A5605649m64867N730170O243183j721736q755939p163636k011744j061742
3811F399338j670533K664589Q692664P527667o74481o978311p330360n722039
3803B908534m081137M40965O626714P709693K053778l199252l086021j853099
3795G520175m440281p643645n479335J379947P145590Q854729P969676O020465
3787B1327321K790935j680811n652666o339050k322176L420385M720413k26996
3779A6037355m748033k414814K409908O92384n660847n116076M145344Q190956
3771A3536177k158360j4986430j2425354M088483J5897172J2073946M86024o767357
3763I744301p945104p580030o401818k245189L026007M204900K89351k860203
$$ plain form
3819 15605649 15140782 20870952 27114135 25392399 16636460 9472824 7461080 6399338
3811 6399338 4728805 7393394 16086058 23613725 22939244 15960933 8630573 2908534
3803 2908534 -1172603 -731638 5895076 13604769 15658547 12459295 9373274 7520175
3795 7520175 3079894 -4563751 -10043086 -8663139 -1517549 7337180 15306856 21327321
3787 21327321 24118256 22437445 16784779 10445729 8123553 11543938 16264351 16037355
3779 16037355 11289322 8874508 11284416 11976800 6315953 1199877 5345221 13536177
3771 13536177 11377817 -3608613 -16033967 -11945484 3951688 16025634 16511658 9744301
3763 9744301 1799197 -5780833 -12182651 -14427840 -11401833 -7196933 -6907582 -9767785
3755i767785Q07505R621725J4955329J0779976J240237l666441P3075O089667
3747C0133288O240153J38604o526555j0061204j1094107j0568915p954495l610422
3739a3303653M69710L052073M622759N534254M972797K264956j798106n097269
3731G17521n422351k390992J650038L965522M576191M838809L311609k700005
3723H546342j0404146j1731704l841206N188474O142190O55356k250521J029962
3715f665253N795221P511615O303019K993603k488138p348758o897934j846035
3707b642660Q69584k107635m851981q17521O521207P562465k7512p490479o039110
3698i023642K239758P644834N297137N00076O77326N208872O967556K956501j532616
$$ plain form
3755 -9767785 -8960280 661445 15616774 26396750 27636987 23970546 24043621 30133288
3747 30133288 36373441 36512045 29985490 19924286 8830179 -1738736 -9693231 -13303653
3739 -13303653 -12833943 -9781870 -5159111 375143 5347940 7612896 5814790 717521
3731 717521 -4704830 -7095822 -5445784 -1480262 3095929 7934738 11246347 8546342
3723 8546342 -1857804 -13589508 -17430714 -12242240 -6100050 -5444694 -7695215 -6665253
3715 -6665253 -870032 6641583 12944602 15938205 13450067 6101309 -796625 -2642660
3707 -2642660 -1773076 -3880711 -8732692 -9550213 -3029006 4533459 4505947 -2984532 -9023642
3698 -9023642 -6783884 860950 6158087 6658163 7335489 12544361 19511917 22468418 20935802
3689B0935802j205200J311323N4177m559409o146207k088441K471560J997479
3681A2771084k043848l797267p74845L735106N401703L936345K616109L220210
3673B5064597L007426j404735p855017j0009605o160282k259343k678860k259305
3665d555124O033229J7716828J9381606O468433q614582j0701688p588Q936214
3657C4657328M679010r160292j9178767j6294372l685416P558390R290689K918391
3649A0784961l789754n042169j539324K098858K735468J417743J296448K961367
3641A0923598K813607j955391p485767o388034K055567R324511Q062481P44063
3633A8094635n715739r318149j1544512j0857781n022900K438619N726275N525440
$$ plain form
3689 20935802 19730602 21041925 21096102 16536693 10390486 8302045 10773605 12771084
3681 12771084 10727236 6929969 6155124 9890230 15291933 19228278 21844387 25064597
3673 25064597 28072023 26667288 18812271 8802666 2642384 383041 -2295819 -4555124
3665 -4555124 1478105 19194933 38576539 45044972 36430390 25728702 25721114 34657328
3657 34657328 39336338 30176046 10997279 -5297093 -8982509 -1424119 7866570 10784961
3649 10784961 6995207 1953038 413714 2512572 5248040 6665783 7962231 10923598
3641 10923598 13737205 11781814 4296047 -2091987 -36420 9288091 17350572 18094635
3633 18094635 12378896 3060747 -8483765 -19341546 -24364446 -21925827 -16199552 -10674112
3625a0674112O945888R730298Q629269L350572n25837j398841l462837o888931
3617E705469n597480J714691P236807N399207O47456j026956o04646o88604O48897
3608A3434841M245196N147027N96092l601957j903490J786966J168948k205921
3600A8667702l598086l904449n234983l930836K203943N915718J203853l722744
3592G600118K233727J3103175J2912821R70836o904746l759473m76426m427167
3584B1252865o532589Q63209P952310K347265j0081736j3114398l252264P664017
3576G098679J0043060N892919J474700m98746o42095o94033j888470k670530l46740
3567A7768744K795692L47202p370199j0225833k529103O539137N554793k095253
$$ plain form
3625 -10674112 -3728224 6002074 14631343 17981915 17456078 16057237 12594400 5705469
3617 5705469 107989 1822680 9059487 14458694 15106150 14079194 13474548 12785944 13434841
3608 13434841 17680037 22827064 23423156 19821199 17917709 19704675 20873623 18667702
3600 18667702 15069616 11165167 5930184 1999348 4203291 10119009 11322862 7600118
3592 7600118 9833845 22937020 35849841 36820677 29915931 26156458 25680032 21252865
3584 21252865 14720276 15583485 23535795 25883060 15801324 2686926 -565338 7098679
3576 7098679 17141739 23034658 24509358 24010612 23368517 22674484 20786014 18115484 17768744
3567 17768744 20564436 20911638 13541439 3315606 786503 7325640 12880433 10785180
3559A0785180m628756p90513M70270k744485k387641L640272O218773L84409n512113
3550E435396k692983N044498Q427052N665659J176373k666945n253849m138385
3542A0996816R68999M440835J927802k058050p83753L534804L027552l100229
3534A8954776p163611m291090J995992O254226O907619M526639R3114l591440
3526B3686225l753381k006226k161617l433779j725795J714449L51711o393824
3518F277763r629381l468598N600707Q012712M404148K316779L564872L176774
3510B0255776p40000m144097m318056l133282k114028l27336J384655l03398n510974
3501A049260r301090p680795j942017M096598P336217N454331j120948o181379
$$ plain form
3559 10785180 6156424 5365911 5836181 3091696 704055 4344327 10563100 10947509 5435396
3550 5435396 2742413 7786911 16213963 21879622 23055995 20389050 15135201 10996816
3542 10996816 11965815 16406650 18334452 16276402 15492649 19027453 22055005 18954776
3534 18954776 11791165 7500075 9496067 15750293 22657912 27184551 27277665 23686225
3526 23686225 19932844 17926618 15765001 12331222 10605427 12319876 12671587 6277763
3518 6277763 -3351618 -6820216 -1219509 6793203 11197351 13514130 17079002 20255776
3510 20255776 19515776 15371679 11053623 7920341 5806313 5478977 6863632 6560234 1049260
3501 1049260 -8251830 -15932625 -17874642 -13778044 -6441827 -987496 -2108444 -8289823
3493h289823k697135O837555J1234837N339930k376543k036942L808989N614730
3485A7435598J572138j664895q91369r3270j823391k791252m80224J993187R00731
3476A4157253k449170m129212k824675l32562J153441Q67348K33975K008226O478635
3467A5163259R120011N406977k339512p019243n838847k683855o67266K219969
3459A3361493P580423J1711549J0122785L815574k319106m943740l626971J73728
3451C5875735K649506n05252q163046j2665989q799857j328480J083229k514676
3443E631170n069365j876421M275385Q548583R407040P225098K298137l395003
3435B7044624o097270m614286k015691p06701J064721M559221N624513j58037
$$ plain form
3493 -8289823 -10986958 -4149403 7085434 12425364 10048821 8011879 11820868 17435598
3485 17435598 19007736 17342841 16451472 16358202 14534811 11743559 11263335 13256522 14157253
3476 14157253 11708083 7578871 4754196 4421634 5575075 6442423 6676398 8684624 15163259
3467 15163259 24283270 29690247 27350735 20331492 14492645 11808790 11141524 13361493
3459 13361493 20941916 32653465 42776250 46591824 44272718 39328978 35702007 35875735
3451 35875735 38525241 38019989 29856943 17190954 8391097 7062617 8145846 5631170
3443 5631170 561805 -1314616 2960769 11509352 20916392 28141490 30439627 27044624
3435 27044624 20947354 16333068 14317377 13610676 14675397 19234618 24859131 24701094
3427B4701094q622863r947993k191083M396492J055917o665365o925286O36551
3419c562536M649936K9731m310917m97178N331575L733894j886123j557527L145675
3410E076530J089454q382217j1542192q48617J2628075J4384502M734484n728878
3402A1411141j0836572j0513771m634249N063976J1432448R447102M025372K374859
3394A7770306K708890m80855m262763j481135N359865O422210L99650l803972
3386B2632196k382707j637780m765739n494833k25887L949165M30501n989630
3378F515286o908681k465208J552496L244039M077114L469902R77864R2935L075625
3369A3631372N367708J894967m146878n924006l878712m211880p532915p114814
$$ plain form
3427 24701094 16078231 6130238 3939155 8335647 9391564 2726199 -4199087 -3562536
3419 -3562536 1087400 1117131 -3193786 -3690964 1640611 5374505 3488382 1930855 5076530
3410 5076530 6165984 -2216233 -13758425 -14607042 -1978967 12405535 17140019 11411141
3402 11411141 574569 -9939202 -14573451 -9509475 1922973 11370075 15395447 17770306
3394 17770306 20479196 19998341 15735578 14254443 19614308 26036518 26436168 22632196
3386 22632196 20249489 18611709 13845970 8351137 8125250 12074415 12504916 6515286
3378 6515286 -393395 -2858603 -1306107 1937932 6015046 9484948 10462812 10555747 13631372
3369 13631372 18999080 20894047 16747169 10823163 6944451 2732571 -4800344 -11915158
3361a1915158K58231Q417227R619956L891654k285573m048320k431597j502049
3353D371k955189m439522l402560r03224P49801K550487O528484R719881O821011
3344A4673540j92473k678231J541150L810095j655922q000600o813859j142042
3336d58342J825318L943028J0249947J5256908R119942m424539j0568473m769026
3328B0174763J848497Q86197k714323k811191k148673l735728l181959K469578
3320A0787161P371592O317158L460836L674412L207119k121337o872071m340292
3312B1484578J064793N11567m914325p371091n731495m622654l426472J467530
3304a537569N743165K003756n018853k690036Q192994J1619862J182467q347120
$$ plain form
3361 -11915158 -11656927 -3239700 6380256 10271910 7986337 3938017 1506420 4371
3353 4371 -2950818 -7390340 -10792900 -11696124 -10946323 -8395836 -1867352 7852529 14673540
3344 14673540 14481067 11802836 13343986 17154081 15498159 7497559 683700 -458342
3336 -458342 1366976 5310004 15559951 30816859 39936801 35512262 24943789 20174763
3328 20174763 22023260 22909457 20195134 17383943 15235270 11499542 8317583 10787161
3320 10787161 18158753 24475911 27936747 31611159 34818278 32696941 25824870 21484578
3312 21484578 22549371 23060938 18146613 10775522 5044027 421373 -3005099 -1537569
3304 -1537569 4205596 6209352 1190499 -1499537 6693457 18313319 19495786 11148666
3296A1148666l400729P535694Q114728n78353m085289J300199M500760m08609
3288B4127067m993030j506932M419617L280761l522874o239294o74845P096339
3280B1986809R219877M656808j346646l817901k787832j625867j415142O96251
3272B5566357N731063Q367929L037243o656594j0979215p398347l813650n514908
3264H339878o570537m71004P146670N849761k870238o958358j750289M340382
3256G056265M847680N106542J0625608J4757751P943466n871108j2866909p947027
3248B3652268J15323K657762R94286k60711j249630l274385l393202J163417O575096
3239B6980224O108851j145664r264864j2276544r138270l333387J5830j639907
$$ plain form
3296 11148666 7747937 15283631 23398359 22820006 18734717 20034916 24535676 24127067
3288 24127067 19134037 17627105 22046722 25327483 21804609 15565315 14890470 21986809
3280 21986809 31206686 35863494 34516848 30698947 27911115 26285248 24870106 25566357
3272 25566357 31297420 39665349 42702592 36045998 25066783 17668436 13854786 8339878
3264 8339878 1769341 1298337 8445007 14294768 11424530 4466172 2715883 7056265
3256 7056265 11903945 17010487 27636095 42393846 50337312 44466204 31599295 23652268
3248 23652268 23767591 26425353 27419639 27158928 25909298 22634913 19241711 20405128 26980224
3239 26980224 33089075 31943411 22678547 10402003 1263733 -2069654 -2053824 -3693731
3231c693731m612588j861098P649187J5255794J2291162J306059p136086p585345
3223A1613354m412335l552904m931439m694359r12698N055078J0212304J1458734
3215A9835735P807165K139212j445020k560697m114595o514261o104219j272048
3207G771272L400745K379889l366516p485552o198340k376259j254004l802356
3199a0931121n477427j622952O346062J1478571Q998946J992348k751984l095511
3191D936932k213958j735967P61975O219907J0906652J1346196Q413954L776013
3183D2411704l273646j1332442j3689220n951737N425475R111436L089518l494718
3175B2296370l413772R7993L17429l006309m766823k212743K475563N638621N243833
$$ plain form
3231 -3693731 -8306319 -10167417 -2518230 12737564 25028726 26334785 19198699 11613354
3223 11613354 7201019 3648115 -1283324 -5977683 -6890381 -1835303 8377001 19835735
3215 19835735 27642900 29782112 28337092 25776395 21661800 15147539 9043320 7771272
3207 7771272 11172017 13551906 10185390 2699838 -3498502 -5874761 -7128765 -10931121
3199 -10931121 -16408548 -18031500 -11685438 -206867 8792079 10784427 8032443 4936932
3191 4936932 2722974 987007 1748982 7968889 18875541 30221737 38635691 42411704
3183 42411704 39138058 27805616 14116396 8164659 13590134 22701570 25791088 22296370
3175 22296370 18882598 18980591 19298020 16291711 11524888 9312145 11787708 17426329 22670162
3166B2670162J747829k149691l874114m107613n214118n745351q53975Q965708
3158A1438837J4312928P659802n228030j1373192p024039r18583o38223l322779
3150D906721k919448J87788J821759J257625J46294k049926n476763n731252P45208
3141g111994Q773098R460907K931628j737906l69924R16645k642973n861844k746703
3132A610934K583661K261797k486153l892183p83737M07633k108901j904577M045831
3123b65695Q709527N411751j339484k160840L773787Q461888O655864J232445
3115C0479243l200298o023373p687945n933457N63398O717493M554660n975865
3107A3493856j3481024p029301R090164J8068613J0674136k386662l933902O996270
$$ plain form
3166 22670162 24417991 22268300 18394186 14286573 9072455 3327104 2473129 11438837
3158 11438837 25751765 33411567 28183537 16810345 9786306 8867723 8229500 4906721
3150 4906721 1987273 2175061 3996820 5254445 5400739 3350813 -2125950 -7857202 -7111994
3141 -7111994 1661104 11122011 14053639 12315733 11945809 12862454 10219481 4357637 1610934
3132 1610934 4194595 6456392 3970239 78056 -705681 -298048 -2406949 -4311526 -265695
3123 -265695 8443832 13855583 12516099 10355259 14129046 22590934 29246798 30479243
3115 30479243 27278945 21255572 13567627 7634170 8197568 14915061 19469721 13493856
3107 13493856 12832 -7016469 2073695 20142308 30816444 28429782 24495880 31492150
3099C1492150J4178682O333938q514758j5025600r719715j336226L353810N517791
3091B6280072O951186M962853k563848j1819441j6357223j3963206q132905l550181
3083a8192693j438530N04120L907766O656142N921078L578392M632534R159776
3075A4728585J0721674N877300J86585l25535J141276j688260o094052m147381
3067B0400192K682712L827250l411674q268686l192972L836675J944313n385374
3059A2432436o224642R50476N637613J766882m652936o255624l845935j549364
3051a741094M57871L469509N553908M616154K979566L982661N998430M546781
3043B9863786m71113l942389k304188K091349M240699K006896k310631m519062
$$ plain form
3099 31492150 45670832 52004770 43490012 28464412 18744697 17408471 20762281 26280072
3091 26280072 33231258 38194111 35630263 23810822 7453599 -6509607 -14642512 -18192693
3083 -18192693 -19631223 -19127103 -15219337 -8563195 -2642117 936275 5568809 14728585
3075 14728585 25450259 31327559 31514144 31188609 32329885 30641625 24547573 20400192
3067 20400192 23082904 26910154 23498480 15229794 12036822 15873497 17817810 12432436
3059 12432436 6207794 7158270 12795883 14562765 9909829 3654205 -191730 -1741094
3051 -1741094 -1283223 2186286 7740194 12356348 15335914 19318575 25317005 29863786
3043 29863786 29392673 25450284 23146096 25237445 29478144 31485040 29174409 24655347
3035B4655347k487638J231311J276882m204212r844202q564732q59129N090555
3027F294182M041782N85361J962667O841380O595140k389377j2914604j5636676
3019d620145r844017k517829J068719K272961N165742J0527809J4474888J2230296
3011B8758424L497187n771805q591865m669844n64689p50302j835107J237080
3003A1309079O668574Q752802P161377O447044O484848J330636r639061j6899943
2995B1615356j2717379k650770J797442j142459k863212J510509O381830N164895
2987A7096212P280k208940K63121K777495J462237k082953l411308n49319L664348
2978A7018173M130345r02129o776640p024861j656153K196073J1197l167629O6356
$$ plain form
3035 24655347 22167709 23399020 24675902 20471690 10627488 2062756 1203627 6294182
3027 6294182 10335964 10921325 12883992 19725372 26320512 23931135 11016531 -4620145
3019 -4620145 -14464162 -16981991 -15913272 -13640311 -8474569 2053240 16528128 28758424
3011 28758424 32255611 26483806 17891941 13222097 12657408 11907106 10071999 11309079
3003 11309079 17977653 26730455 33891832 40338876 46823724 48154360 38515299 21615356
2995 21615356 8897977 6247207 8044649 6902190 4038978 5549487 11931317 17096212
2987 17096212 17103492 14894552 15157673 17935168 19397405 17314452 13903144 13353825 17018173
2978 17018173 21148518 20246389 13469749 6444888 4788735 6984808 6996005 3828376 3894732
2969C894732P553650R301141J827318n909239m582393K846438O265464K791702
2961B3988813j102705r45078j59221k479314m729453j503819O363500J2034051
2953C1466774R948454P79044r155928j2405731p197286o26890j046405o376152
2945E385880o094759K696901R186071M617014l713344l453424L881419O695993
2937A9201751K489483r0990K134043K182366k449362l923791J597057N824289
2929B6964846K124353k993896j093483M289883M830224J283976l28605p46840
2921C4330458m689183r906783r790657m680906q52421m2360Q55161J578353o23082
2912F178580l524240k856541j119745l324902n435716J131889J3290413J7255931
$$ plain form
2969 3894732 11448382 20749523 22576841 16667602 12085209 14931647 21197111 23988813
2961 23988813 22886108 21941030 21781809 19302495 14573042 13069223 19432723 31466774
2953 31466774 41415228 42194272 33038344 20632613 13435327 12808437 11762032 5385880
2945 5385880 -708879 1988022 11174093 15791107 12077763 8624339 12505758 19201751
2937 19201751 21691234 21600244 23734287 25916653 23467291 19543500 21140557 26964846
2929 26964846 29089199 26095303 25001820 29291703 34121927 35405903 35077298 34330458
2921 34330458 29641275 19734492 9943835 5262929 4410508 4368148 5223309 6801662 6178580
2912 6178580 2654340 -202201 -1321946 -4646848 -10082564 -8950675 4339738 21595669
2904B1595669Q332025k445748n632228n499646q651785j1439951p382751R48225
2896a0176190O487474Q339590R499337Q618613K661297m976296o974561k033112
2888A1446152L506393L664125j586126p883786j0404345p199327r47007L701950
2880e701971N332146O084939P015208P295553P980599J0847325J2948464R287346
2872F1089609K211856j23628K825426J622125p544349j4794884j1173227k453700
2864C1659228K61620l706884p363001p898427o366464j644383N419927P651251
2856A8012867J554725m318808k031098J448102l957065j1638023p163199O399799
2848a692700J0779139Q38727p930097m426224K838076K514655k643069m253195
$$ plain form
2904 21595669 29927694 27481946 21849718 16350072 7698287 -3741664 -11124415 -10176190
2896 -10176190 -3688716 4650874 14150211 22768824 25430121 20453825 13479264 11446152
2888 11446152 14952545 18616670 17030544 9146758 -1257587 -8456914 -9403921 -5701971
2880 -5701971 -369825 5715114 12730322 20025875 28006474 38853799 51802263 61089609
2872 61089609 63301465 63177837 66003263 67625388 60081039 45286155 34112928 31659228
2864 31659228 31920848 28213964 20850963 12952536 6586072 4941689 10361616 18012867
2856 18012867 19567592 15248784 13217686 14665788 10708723 -929300 -8092499 -1692700
2848 -1692700 9086439 9925166 1995069 -2431155 406921 2921576 278507 -3974688
2840c974688j332798L598355J0389577J5234554R790514n009259j4795852j0673898
2832C226505k166720j509555n449563m320797M42037J518918O69892L817058O988831
2823C216606K452347n078940m108071L780294N688975r12476m404038N18109M311667
2814E464473M2081m736186j611427M521562M292338j405618m718531l053319K58283
2805i46344L078049M840524L406600j580604m909535j578998N689168J0047918
2797A8046778R563084P584548O144538M361200K174188N34929j664197o361026
2789D0384042j2023545j4288163j1113166m624641J724188N329170M744339P46720
2781A0878944l440137n303034n410705m651562j512443M398507Q494809O020992
$$ plain form
2840 -3974688 -5307486 -1709131 8680446 23915000 33705514 28696255 13900403 3226505
2832 3226505 1059785 -449770 -5899333 -10220130 -9778093 -8259175 -7589283 -3772225 3216606
2823 3216606 5668953 590013 -3518058 262236 5951211 5038735 634697 1152806 5464473
2814 5464473 5506554 770368 -841059 3680503 7972841 6567223 1848692 -1204627 -946344
2805 -946344 2131705 6972229 10378829 8798225 3888690 2309692 7998860 18046778
2797 18046778 27609862 35194410 41338948 45700148 47874336 48409265 46745068 40384042
2789 40384042 28360497 14072334 2959168 -1665473 58715 5387885 10132224 10878944
2781 10878944 7438807 2135773 -3274932 -7926494 -9438937 -5040430 3454379 9475371
2773I475371j85013k210550K320370P452521P810044M911707K455375O93338q84352
2764C1838811o9886L704202M994626j340871j0866632j3071786m727990N874903
2756A6335377R540704N839841J113m433476n888579k453946M769894Q766720L690812
2747C6168460n888309r346789m228795N01502k225036p315105n167191M720263
2739G219000J3238902J2773227M356908n000415q477873m233079K542422L659787
2731B6078879k860777r526446q731191k600880J390333J767786K961434N227075
2723A3706213L328909l188811o770418k847491K684478K060315l475116o826377
2715a328298n205937j774422M4946q54773l827554n450533j049634Q259893J3674671
$$ plain form
2773 9475371 9290358 7079808 9400178 16852699 24662743 29574450 32029825 32723163 31838811
2764 31838811 31768925 35473127 40467753 39126882 28260250 15188464 10460474 16335377
2756 16335377 25876081 31715922 31717035 27283559 21394980 18941034 23710928 32477648 36168460
2747 36168460 30280151 20933362 16704567 17206069 14981033 7665928 2498737 7219000
2739 7219000 20457902 33231129 37588037 32587622 24109749 19876670 22419092 26078879
2731 26078879 23218102 13691656 4960465 2359585 3749918 5517704 8479138 13706213
2723 13706213 17035122 13846311 7075893 4228402 6912880 8973195 5498079 -1328298
2715 -1328298 -6534235 -8308657 -8263711 -9118484 -12946038 -18396571 -19446205 -11186312 2488359
2706B488359R350344J356874o83791K464386K562586j373814j635623M039228
2698A8568549P382484K512199n044739p750543o929782p436859p487661k085204
2690h271556O627608J0501286O232406j047647n005568m124755n77998K723341
2682G057117L674889K432449R47020n53078l968064p824632o023216K815699R407252
2673G965436M928862n218860q342413l421022j545517o303124o850890L648645
2665a5138883J4596833J2835580K414665k342801J574584L932325o70118n396381
2657A1805804m078684p86924j456061l647392r67130O469692J1469187Q095329
2649B6903821k427237j2762185j5071841p962604R59264K205942m807590j1186050
$$ plain form
2706 2488359 11838703 13195577 12511786 14976172 17538758 16164944 14529321 18568549
2698 18568549 25951033 28463232 23418493 15667950 8738168 1301309 -6186352 -8271556
2690 -8271556 -1643948 8857338 15089744 14042097 9036529 4911774 4333776 7057117
2682 7057117 10732006 13164455 14111475 13558397 9590333 1765701 -4257515 -1441816 7965436
2673 7965436 12894298 7675438 -666975 -4087997 -5633514 -11936638 -18787528 -15138883
2665 -15138883 -542050 12293530 14708195 12365394 13939978 17872303 17202185 11805804
2657 11805804 7727120 6940196 5484135 1836743 869613 7339305 18808492 26903821
2649 26903821 24476584 11714399 -3357442 -11320046 -10360782 -8154840 -12962430 -24148480
2641b4148480r745968k762470L339735O473591Q309004Q597852N143819j173410
2633e966327n111194j871113P577368J5755727J4006181J289436j2207551j4157212
2625f84685m170077N366496M680743j934487l856014J223708O115628M942556
2617A1683868q96681o475585p658061k294195P559331J4524108J2103967K856419
2609C1403171l929761l406771K73733J330428m83779j970139j618663j51604J056170
2600B2502785Q1405m094421q337162o859044J265484Q827483Q167287N19386n742046
2591A6331157n533351k380403k584597o591089q344573k988037O748327J3468896
2583H126330J3564193R887570N562933o08896r240464j4621806j0153817J188962
$$ plain form
2641 -24148480 -33894448 -36656918 -33317183 -26843592 -18534588 -9936736 -4792917 -5966327
2633 -5966327 -11077521 -12948634 -5371266 10384461 24390642 25680078 13472527 -684685
2625 -684685 -4854762 511734 5192477 3257990 -598024 625684 6741312 11683868
2617 11683868 10787187 4311602 -3346459 -5640654 1918677 16442785 28546752 31403171
2609 31403171 27473410 24066639 24340372 25670800 25187021 23216882 21598219 21446615 22502785
2600 22502785 22584190 18489769 10152607 3293563 4559047 13386530 21553817 22073203 16331157
2591 16331157 10797806 8417403 5832806 -758283 -9102856 -12090893 -5342566 8126330
2583 8126330 21690523 31578093 37141026 36532130 27291666 12669860 2516043 3705005
2575C705005Q133243M330286m755540j0085927r288608n778632j977513K427380
2567a3290306P691156J2834676J6085735J4904465P814973k202929q936660r458662
2559B5442448o689298m068985j666729K38414j258555o308686q823327l842635
2551f977353M510585P895091M273172j758535o666799r756526r249575l940740
2543b1670680J852393K564166Q41598M488228J2432038J3208469K257152q011713
2535G961651l858092R603082J4112652K816035j0938886j1968054k272769M077267
2527I532886K15242o897021q375387m606653j306390L46037L601153Q138165R064537
2518I712569N073147J341209J224135P73667l773149q348211p572337m621532
$$ plain form
2575 3705005 11838248 16168534 11412994 1327067 -7961541 -13740173 -15717686 -13290306
2567 -13290306 -5599150 7235526 23321261 38225726 46040699 43837770 34901110 25442448
2559 25442448 18753150 14684165 13017436 13255850 11997295 5688609 -3134718 -6977353
2551 -6977353 -2466768 5428323 9701495 7942960 1276161 -8480365 -17729940 -21670680
2543 -21670680 -19818287 -17254121 -16412523 -11924295 507743 13716212 15973364 7961651
2535 7961651 4103559 13706641 27819293 30635328 19696442 7728388 5455619 9532886
2527 9532886 9748128 2851107 -5524280 -10130933 -11437323 -11091286 -7490133 648032 9712569
2518 9712569 14785716 16126925 17351060 18124727 14351578 6003367 -1568970 -6190502
2510f190502n938812q769481m525269N462213R246324K632002l210249J022106
2502a0271668Q197582O795976o65141k968154J200077K878046p92350k696791
2494A677577N45196K848374J55420k639813j260114L27148j999760m167224p14061
2485e227257N575729Q015793N987636L870414L265889K721728K354079K282784
2477B8846795r11476r117929j6011153j3151401k331870N593278M781087K74431
2469b028238j400049m33265J13114K41594J361937K807956L095511J764168j438264
2460D084464n748298p372730l245211K579176K584186k622269l820452K588376
2452a0972758P927734M204306l786365o512366l452109k91460K298517P145114
$$ plain form
2510 -6190502 -12129314 -20898795 -25424064 -19961851 -10715527 -8083525 -11293774 -10271668
2502 -10271668 -2074086 4721890 4056749 1088595 2288672 5166718 4374368 1677577
2494 1677577 2222773 5071147 5226567 2586754 1326640 1653788 -345972 -4513196 -5227257
2485 -5227257 348472 8364265 14351901 18222315 21488204 24209932 26564011 28846795
2477 28846795 27935319 18817390 2806237 -10345164 -12677034 -7083756 -2302669 -2028238
2469 -2028238 -3428287 -3861552 -3748438 -3506844 -2144907 663049 3758560 5522728 4084464
2460 4084464 -1663834 -9036564 -12281775 -9702599 -7118413 -9740682 -13561134 -10972758
2452 -10972758 -3045024 1159282 -2627083 -9139449 -12591558 -12883018 -10584501 -3439387
2444c439387J1316709R074452K780321N20502K773825J543105n893789j2149184
2436F526554j1261647o138375j271251L401908P422070O922071J864396j172320
2428F293406J219738L558806J047996k216819j184497R36447n09650j707582K984877
2419A0422722Q827792O087864m082680j0001815o334458o49096o24216l573232
2411G2881l065578R68913M236137N548202O587170O558529K455394n199350j0613547
2402G548751q550396o92640N630436N551265J823540n7438o9594k372760n918868
2393B892296l204315P930518J7423620J4398456J587533q718621j0517332q179551
2385A3612604o224650l904607j058281r46942l814273m119010J454612P823256
$$ plain form
2444 -3439387 7877322 16951774 19732095 20252597 23026422 24569527 18675738 6526554
2436 6526554 -4735093 -10873468 -12144719 -8742811 -1320741 5601330 7465726 6293406
2428 6293406 7513144 11071950 12119946 9903127 8718630 9655077 9145427 7437845 10422722
2419 10422722 19250514 25338378 21255698 11253883 4919425 4270329 3646113 72881
2411 72881 -2992697 -2023784 2212353 7760555 14347725 20906254 23361648 18162298 7548751
2402 7548751 -1001645 -1694285 3936151 9487416 11310956 11253518 11183924 8811164 2892296
2393 2892296 -312019 7618499 25042119 39440575 41028108 32309487 21792155 13612604
2385 13612604 7387954 3483347 2425066 1478124 -2336149 -6455159 -5000547 2822709
$$ [...]
##END NTUPLES=NMR SPECTRUM
##END=
