##TITLE=31P_DE-80H_X3
 64 sc D2O
 26.2.2025
##JCAMPDX= 6.0         $$ Bruker NMR JCAMP-DX V2.0
##DATA TYPE= NMR SPECTRUM
##DATA CLASS= NTUPLES
##ORIGIN= UXNMR, Bruker Analytische Messtechnik GmbH
##OWNER= root
$$ XWIN-NMR		Version 3.5
$$ Tue Jul 15 14:29:35 2025 Russian Standard Time (UT+4h)  Yarkov@DPX200
##.OBSERVE FREQUENCY= 81.013821
##.OBSERVE NUCLEUS= ^31P
##.ACQUISITION MODE= SIMULTANEOUS
##.ACQUISITION SCHEME= undefined
##.AVERAGES= 64
##.DIGITISER RES= 17
##SPECTROMETER/DATA SYSTEM= spect
##.PULSE SEQUENCE= zgpg30
##.SOLVENT NAME= MeOD
##.SHIFT REFERENCE= (INTERNAL, MeOD, 0, 198.062)
##AUDIT TRAIL= $$ (NUMBER, WHEN, WHO, WHERE, WHAT)
$$ ##TITLE= Audit trail, XWIN-NMR		Version 3.5
$$ ##JCAMPDX= 5.01
$$ ##ORIGIN= Bruker BioSpin GmbH
$$ ##OWNER= Yarkov
$$ C:/Bruker/XWIN-NMR/data/yarkov2/nmr/P31/2/pdata/1/auditp.txt
$$ ##AUDIT TRAIL=  $$ (NUMBER, WHEN, WHO, WHERE, WHAT)
(   1,<2025-07-15 14:28:42.79 +0400>,<Yarkov>,<DPX200>,
      <created by zg, POWCHK disabled, PULCHK disabled
       configuration hash MD5:
       00 E9 B6 7A A2 85 ED C7 34 08 36 98 17 FE 4E 26
       data hash MD5: 32K
       90 26 D3 8B BF 20 62 E2 48 E1 F0 E6 33 95 55 F1>)
(   2,<2025-07-15 14:28:47.25 +0400>,<Yarkov>,<DPX200>,
      <Start of raw data processing
       efp BC_mod = 2 LB = 1.5 FT_mod = 6 PKNL = 1 PHC0 = 1672.843 PHC1 = 49.15953 SI = 64K 
       data hash MD5: 64K
       85 B6 E5 7F 25 07 35 4A 59 37 77 6C 55 4D 32 E9>)
(   3,<2025-07-15 14:29:07.48 +0400>,<Yarkov>,<DPX200>,
      <pk PHC0 = -10.6 PHC1 = 0 
       data hash MD5: 64K
       BC 8F DE 79 63 FA D0 7C 5C 4A F8 F0 9A 54 D7 57>)
$$ ##END=
$$ 
$$ hash MD5
$$ B8 3B C5 41 DD 7E 4E B6 49 3C B1 EC CE AA E4 BD
##$RELAX= 
##$RELAX= 
##$RELAX= 
##$RELAX= 
##$RELAX= 
##$RELAX= 
##$RELAX= 
##$RELAX= 
$$ Bruker specific parameters
$$ --------------------------
##$DU= <C:/Bruker/XWIN-NMR>
##$EXPNO= 2
##$NAME= <P31>
##$PROCNO= 1
##$TYPE= <nmr>
##$USER= <yarkov2>
##$AMP= (0..31)
100 100 100 100 100 100 100 100 100 100 100 100 100 100 100 100 100 100 
100 100 100 100 100 100 100 100 100 100 100 100 100 100 
##$AQSEQ= 0
##$AQ_mod= 1
##$AUNM= <au_zg>
##$AUTOPOS= <>
##$BF1= 81.014009
##$BF2= 200.13
##$BF3= 200.13
##$BF4= 200.13
##$BF5= 200.13
##$BF6= 200.13
##$BF7= 200.13
##$BF8= 200.13
##$BYTORDA= 1
##$CFDGTYP= 0
##$CFRGTYP= 5
##$CHEMSTR= <none>
##$CNST= (0..31)
1 1 145 1 1 1 1 1 1 1 1 1 1 1 1 1 1 1 1 1 1 1 1 1 1 1 1 1 1 1 1 1 
##$CPDPRG= <waltz16>
##$CPDPRG1= <>
##$CPDPRG2= <waltz16>
##$CPDPRG3= <>
##$CPDPRG4= <mlev>
##$CPDPRG5= <mlev>
##$CPDPRG6= <mlev>
##$CPDPRG7= <mlev>
##$CPDPRG8= <mlev>
##$CPDPRGB= <>
##$CPDPRGT= <>
##$D= (0..31)
0 1 0 0 0 0 0 0 0 0.06 0 0.03 2e-05 3e-06 0 0 0.0002 0 0 0 0 0 0 0 0 0 
0 0 0 0 0 0 
##$DATE= 1752575322
##$DBL= (0..7)
120 120 120 11 120 120 24 19 
##$DBP= (0..7)
150 150 150 150 150 150 150 150 
##$DBP07= 0
##$DBPNAM0= <>
##$DBPNAM1= <>
##$DBPNAM2= <>
##$DBPNAM3= <>
##$DBPNAM4= <>
##$DBPNAM5= <>
##$DBPNAM6= <>
##$DBPNAM7= <>
##$DBPOAL= (0..7)
0.5 0.5 0.5 0.5 0.5 0.5 0.5 0.5 
$$ [...]
##$SUBNAM2= <"">
##$SUBNAM3= <"">
##$SUBNAM4= <"">
##$SUBNAM5= <"">
##$SUBNAM6= <"">
##$SUBNAM7= <"">
##$SUBNAM8= <"">
##$SUBNAM9= <"">
##$SW= 400.765351723535
##$SWIBOX= (0..15)
0 1 3 0 0 0 0 0 0 0 0 0 0 0 0 0 
##$SW_h= 32467.5324675325
##$TD= 32768
##$TD0= 1
##$TE= 0
##$TE2= 300
##$TE3= 300
##$TEG= 300
##$TL= (0..7)
0 120 53 12 22 120 120 120 
##$TP= (0..7)
150 150 150 150 150 150 150 150 
##$TP07= 0
##$TPNAME0= <>
##$TPNAME1= <>
##$TPNAME2= <>
##$TPNAME3= <>
##$TPNAME4= <>
##$TPNAME5= <>
##$TPNAME6= <>
##$TPNAME7= <>
##$TPOAL= (0..7)
0.5 0.5 0.5 0.5 0.5 0.5 0.5 0.5 
##$TPOFFS= (0..7)
0 0 0 0 0 0 0 0 
##$TUNHIN= 0
##$TUNHOUT= 0
##$TUNXOUT= 0
##$USERA1= <user>
##$USERA2= <user>
##$USERA3= <user>
##$USERA4= <user>
##$USERA5= <user>
##$V9= 5
##$VALIST= <valist>
##$VCLIST= <CCCCCCCCCCCCCCC>
##$VD= 0
##$VDLIST= <DDDDDDDDDDDDDDD>
##$VPLIST= <PPPPPPPPPPPPPPP>
##$VTLIST= <TTTTTTTTTTTTTTT>
##$WBST= 1024
##$WBSW= 4
##$XGAIN= (0..3)
0 0 0 0 
##$XL= 0
##$YL= 0
##$YMAX_a= 1430
##$YMIN_a= -1473
##$ZGOPTNS= <>
##$ZL1= 120
##$ZL2= 120
##$ZL3= 120
##$ZL4= 120
##$ABSF1= 0
##$ABSF2= 0
##$ABSG= 0
##$ABSL= 0
##$ALPHA= 0
##$AQORDER= 0
##$ASSFAC= 0
##$ASSFACI= 0
##$ASSFACX= 0
##$ASSWID= 0
##$AUNMP= <proc_1d>
##$AZFE= 0.1
##$AZFW= 0.5
##$BCFW= 0
##$BC_mod= 2
##$BYTORDP= 0
##$COROFFS= 0
##$CY= -3
##$DATMOD= 1
##$DC= 0
##$DFILT= <>
##$DTYPP= 0
##$F1P= 0
##$F2P= 0
##$FCOR= 1
##$FTSIZE= 65536
##$FT_mod= 6
##$GAMMA= 0
##$GB= 0
##$INTBC= 1
##$INTSCL= 9.790993e-09
##$ISEN= 30
##$LB= 1.5
##$LEV0= 0
##$LPBIN= 0
##$MAXI= 10000
##$MC2= 0
##$MEAN= 0
##$ME_mod= 0
##$MI= 50
##$NCOEF= 0
##$NC_proc= -11
##$NLEV= 6
##$NOISF1= 182.463
##$NOISF2= 159.3651
##$NSP= 0
##$NTH_PI= 0
##$NZP= 0
##$OFFSET= 198.0616
##$PC= 4
##$PHC0= 1662.243
##$PHC1= 49.15953
##$PH_mod= 1
##$PKNL= yes
##$PPARMOD= 0
##$PSCAL= 0
##$PSIGN= 0
##$REVERSE= no
##$SF= 81.0140089999434
##$SI= 65536
##$SIGF1= 159.3651
##$SIGF2= -187.1042
##$SINO= 113.3802
##$SIOLD= 16384
##$SREGLST= <1H.CDCl3>
##$SSB= 0
##$STSI= 65536
##$STSR= 0
##$SW_p= 32467.5324675325
##$SYMM= 0
##$S_DEV= 0
##$TDeff= 32768
##$TDoff= 0
##$TI= <>
##$TILT= no
##$TM1= 0
##$TM2= 0
##$TOPLEV= 0
##$USERP1= <user>
##$USERP2= <user>
##$USERP3= <user>
##$USERP4= <user>
##$USERP5= <user>
##$WDW= 1
##$XDIM= 65536
##$YMAX_p= 316435478
##$YMIN_p= -33674372
$$ End of Bruker specific parameters
$$ ---------------------------------
##NTUPLES= NMR SPECTRUM
##VAR_NAME=  FREQUENCY,     SPECTRUM/REAL,   SPECTRUM/IMAG
##SYMBOL=    X,             R,               I
##VAR_TYPE=  INDEPENDENT,   DEPENDENT,       DEPENDENT
##VAR_FORM=  AFFN,          ASDF,            ASDF
##VAR_DIM=   65536,         65536,           65536
##UNITS=     HZ,            ARBITRARY UNITS, ARBITRARY UNITS
##FACTOR=    0.49542278885378, 1,            1
##FIRST=     16045.7642231865, 0,            0
##LAST=      -16421.768244346, 0,            0
##MIN=       -16421.768244346, -33674372,    0
##MAX=       16045.7642231865, 316435478,    0
$$ Real data points
##PAGE= N=1
##DATA TABLE= (X++(R..R)), XYDATA
$$ [...]
48034 -1991242 -1585301 -829113 -585462 -1331828 -2312800 -2297158 -981324 781625 1972894
48025 1972894 2207743 1692750 884333 268643 151552 506323 1096075 1716178 2261633
48016 2261633 2693415 3034187 3251138 3122247 2514993 1850898 1815967 2354989 2453130 1363786
48006 1363786 -354208 -1553946 -1901446 -1937245 -2019964 -1960618 -1635638 -1256075 -981358 -864418
47996 -864418 -1176298 -2120594 -3183540 -3509893 -3090621 -2815652 -3058255 -3010151 -1970542
47987 -1970542 -653559 -486329 -1916257 -3996831 -5421641 -5482646 -4281343 -2582040 -1349430
47978 -1349430 -933784 -765476 -221408 408128 331470 -503879 -1219184 -1137010 -547622 -132890
47968 -132890 -81753 -100403 -23961 -74236 -549172 -1394930 -2078239 -1959693 -984398 76377
47958 76377 394874 87802 27472 557324 932688 406950 -587246 -954649 -417450 214331
47948 214331 262948 -46843 -289936 -606551 -1187125 -1489844 -792690 611334 1597644 1717079
47938 1717079 1741238 2351670 3014616 2811553 1887674 1236704 1229885 1209470 631609 -157387
47928 -157387 -588340 -697982 -858267 -1104683 -1207751 -1162707 -1173538 -1274826 -1312796 -1221247
47918 -1221247 -1053886 -837141 -610967 -477559 -374327 32116 922354 1919631 2435020
47909 2435020 2335459 1939722 1432159 709255 -134410 -609979 -394498 141064 232264 -512320
47899 -512320 -1772708 -2839691 -3127798 -2470394 -1164597 161239 862516 703414 83227
47890 83227 -271502 -10396 461381 450384 -203123 -952515 -1175848 -734669 106927 977338
47880 977338 1481984 1368968 898327 761809 1297295 2003873 2182024 1817905 1387351 981194
47870 981194 233598 -850814 -1586757 -1373057 -388601 715555 1526103 2023702 2255979
47861 2255979 2158841 1697690 1052691 593743 565043 731151 532312 -214253 -997768 -1304536
47851 -1304536 -1345674 -1586904 -1786380 -1263312 -145173 492145 26335 -905519 -1412081
47842 -1412081 -1447330 -1349735 -976627 -112963 733903 883518 595858 712951 1265500 1385692
47832 1385692 737848 128110 346899 1155356 1846139 2157775 2134113 1663538 792412 79462
47822 79462 -37235 39945 -353919 -1034171 -1165339 -554267 16601 -39352 -295518 -98069
47812 -98069 353099 332777 -223250 -514032 40165 979440 1334188 710311 -436732 -1463512
47802 -1463512 -2124559 -2445285 -2339135 -1672890 -668647 82797 205615 -4406 68576
47793 68576 589784 1089153 1102981 774021 638808 950663 1436487 1698988 1638698 1391221
47783 1391221 1004236 371239 -471316 -1087467 -862860 359865 1879614 2580203 1948269
47774 1948269 586878 -412107 -534484 -152132 96531 -46871 -413899 -699480 -694028 -448336
47764 -448336 -301141 -535966 -951814 -1052378 -754667 -546030 -727237 -898963 -582794 -25244
47754 -25244 130943 -217331 -595392 -771265 -997199 -1350482 -1441770 -1041851 -513180 -281010
47744 -281010 -247560 -88123 169336 244009 76083 -162094 -382956 -576295 -606788 -364280
47734 -364280 -47020 42335 -39888 49304 377216 584185 420293 138741 123512 323370
47724 323370 379884 273979 449761 1073775 1490559 925556 -295067 -840078 -5073 1274847
47714 1274847 1602683 922293 386374 631971 1139023 1406573 1749639 2448985 2959823
47705 2959823 2669644 1835963 1043810 252431 -794376 -1622013 -1455348 -444887 441970
47696 441970 744927 878843 1104053 988916 186683 -925801 -1715965 -1912490 -1556430
47687 -1556430 -857953 -296314 -325710 -757721 -938990 -708648 -582658 -786069 -824477 -394694
47677 -394694 9811 -32174 -43291 592096 1544152 2024888 2011238 2104786 2340494 2060575
47667 2060575 1064691 49728 -400688 -615764 -1213839 -2130193 -2728044 -2650456 -2159925
47658 -2159925 -1700097 -1431356 -1258308 -1132862 -1171582 -1441973 -1737667 -1743417 -1442422 -1146628
47648 -1146628 -1031938 -903883 -609893 -380609 -407522 -320492 398794 1524258 2142580 1768034
47638 1768034 983821 709632 1116037 1559439 1424749 737919 -10650 -407516 -416793 -254561
47628 -254561 -56867 272682 843821 1481440 1815420 1700550 1369118 1057293 655877 -34102
47618 -34102 -770545 -927864 -264128 565383 558534 -558310 -2022876 -2846069 -2709246 -2001074
47608 -2001074 -1288917 -987870 -1257968 -1825811 -2051560 -1592190 -916675 -713442 -848851
47599 -848851 -493339 631983 1770964 2164663 1967384 1711474 1420650 890897 468821
47590 468821 758390 1607143 2076182 1579197 569308 -103471 -177093 -121142 -506859 -1400868
47580 -1400868 -2320489 -2748334 -2678228 -2517636 -2450101 -2228694 -1752416 -1395769 -1381383 -1257446
47570 -1257446 -606500 29430 -282832 -1427089 -2171997 -1742777 -773373 -351556 -664868
47561 -664868 -1044421 -1001462 -743999 -752960 -1134775 -1422385 -1010824 106808 1154658 1401097
47551 1401097 1048080 884902 1162189 1393547 1291684 1184187 1258530 1111351 509343 -6131
47541 -6131 114530 481698 229547 -841760 -2173257 -3247084 -3846355 -3720244 -2756651
47532 -2756651 -1516253 -872525 -912195 -786456 74431 1140030 1550930 1260254 903474
47523 903474 816729 767155 600099 595912 1014295 1673922 2219773 2529069 2596433 2265723
47513 2265723 1439465 428816 -297953 -682335 -986798 -1143530 -737338 153795 663142
47504 663142 140640 -944631 -1657969 -1866148 -2209015 -2952548 -3575902 -3565456 -3018492 -2334273
47494 -2334273 -1835929 -1799079 -2275539 -2720566 -2388962 -1351849 -560431 -630105 -1146868 -1489101
47484 -1489101 -1659575 -1818610 -1663678 -972412 -249555 -46539 -9005 564938 1475246 1828815
47474 1828815 1415568 985965 1080428 1425214 1686844 2001466 2374396 2263050 1299333 -40304
47464 -40304 -986907 -1341223 -1325354 -932005 -14893 1128096 1846348 1865933 1515127 1155231
47454 1155231 763905 219975 -341877 -730885 -1068444 -1658657 -2513149 -3225999 -3370605
47445 -3370605 -2897108 -2145659 -1632719 -1792142 -2600138 -3309363 -2912995 -1246020 594209
47436 594209 1380161 1180082 1118702 1760711 2428121 2334344 1683388 1146451 809288 328049
47426 328049 -200933 -300125 14665 100981 -436220 -1247031 -1784701 -1942347 -1938311 -1885231
47416 -1885231 -1723058 -1417240 -1022774 -591363 -111987 418671 830309 768625 103221 -622143
47406 -622143 -528532 577749 1862191 2437309 2325427 2067067 1789997 1287692 734312
47397 734312 546015 598071 364572 -68964 70266 987159 1673413 1042929 -694260 -2300166
47387 -2300166 -2928816 -2842340 -2812464 -3196632 -3688122 -3786668 -3365747 -2725647 -2153546 -1656757
47377 -1656757 -1231350 -1096770 -1376866 -1796434 -2057830 -2267612 -2531079 -2410068 -1469695
47368 -1469695 -226657 277917 -38679 -61517 960684 2330708 2853359 2332992 1606968
47359 1606968 1461429 1991340 2759487 3144099 2702143 1557242 351636 -366304 -552475
47350 -552475 -397447 11612 566873 999659 1112491 931467 495835 -211346 -1000852 -1494061
47340 -1494061 -1560719 -1417188 -1187141 -753612 -154542 305467 450498 306190 -232396 -1208895
47330 -1208895 -2070791 -2129262 -1692175 -1788429 -2460960 -2444981 -1157614 119906 12385 -931324
47320 -931324 -1158518 -341606 581346 1072549 1341485 1330130 754699 116107 345416 1307164
47310 1307164 1848326 1518093 1067212 983076 748859 27496 -560023 -514038 -373409 -796487
47300 -796487 -1481625 -1797475 -1890154 -2316228 -2939432 -2996283 -2157021 -953612 -173819 -148013
47290 -148013 -521847 -526298 310451 1537746 2148622 1747410 1025380 885185 1442533 2099444
47280 2099444 2264319 1816845 1187668 1058272 1562484 1798610 793787 -965206 -1817548
47271 -1817548 -1042634 232669 744309 719591 970903 1277454 892691 143240 178460 1205806
47261 1205806 2133631 2093733 1365906 644403 280334 452759 1219981 2070196 2156564 1319364
47251 1319364 237083 -671464 -1702314 -2858207 -3283770 -2425912 -1089579 -477705 -607600
47242 -607600 -559408 -13584 424654 383239 225911 174574 -184405 -1038968 -1687347 -1387888
47232 -1387888 -447740 215438 354197 526514 1014666 1342462 1067689 457466 44446
47223 44446 -25353 169069 699026 1485807 1944306 1558326 688475 184130 211928 127745
47213 127745 -393258 -838514 -801005 -742390 -1218466 -1842131 -1769259 -976634 -285434 -147481
47203 -147481 -167227 -5154 -53541 -790928 -1938243 -2760789 -2954690 -2771234 -2421566 -1856072
47193 -1856072 -1141217 -591699 -353073 -190190 67583 131467 -354001 -1142895 -1512291 -1126534
47183 -1126534 -431945 -213 204515 540723 870878 574673 -490989 -1504169 -1505938
47174 -1505938 -494533 649544 1182827 1046654 452385 -556040 -1848878 -2853411 -2901767
47165 -2901767 -1957730 -741333 -59223 -133486 -562526 -741200 -304539 589394 1297685
47156 1297685 1235029 549006 53539 287440 865571 1054532 748763 430230 339438 300616
47146 300616 359500 878188 1768010 2308358 2120850 1705691 1525637 1213754 407961 -215475
47136 -215475 254082 1421042 1933764 1358389 654713 603220 767270 412161 -426625 -1315628
47126 -1315628 -2120746 -2743428 -2785883 -2134460 -1412704 -1230405 -1353693 -1190010 -725518 -364843
47116 -364843 -138392 286073 965672 1605358 1995392 2092752 1864712 1477165 1379827 1732562
47106 1732562 2024280 1769627 1263365 1036414 893855 269072 -669690 -1136078 -930320
47097 -930320 -689313 -835418 -1087566 -1231623 -1587578 -2313819 -2868310 -2645002 -1772427 -920134
47087 -920134 -587924 -789264 -1111460 -940783 -17962 1075483 1402519 786493 -34058
47078 -34058 -511195 -914306 -1508372 -1772360 -1100461 102007 765983 529604 144779 384053
47068 384053 966238 844683 -533717 -2436072 -3446523 -2922578 -1665343 -897777 -805002
47059 -805002 -612280 -7790 324199 -101945 -598541 -178734 1032284 1957236 1924449 1233772
47049 1233772 481395 -52416 -302461 -244324 18919 334195 734317 1288443 1705541 1475414
47039 1475414 537204 -488569 -888376 -487181 364860 1191901 1675846 1773101 1725218 1841669
47029 1841669 2148415 2321242 2049211 1418063 875217 809177 1145817 1371560 1047187 309941
47019 309941 -293648 -528023 -778263 -1455643 -2326038 -2745541 -2445837 -1755665 -1105910 -679130
47009 -679130 -563506 -851322 -1401989 -1785480 -1686575 -1214768 -662353 -131653 397755 776910
46999 776910 749640 323767 -141325 -322246 -271153 -229113 -187964 126472 755203 1216774
46989 1216774 985789 196642 -440400 -486118 -224496 -121174 -185960 -218403 -406554 -1119567
46979 -1119567 -2107859 -2481072 -1753465 -524602 229403 268598 80075 -49250 -373101
46970 -373101 -1015327 -1535841 -1574731 -1581899 -2338309 -3809728 -5018731 -5185832 -4515059 -3609144
46960 -3609144 -2619354 -1461073 -470586 -107708 -93207 383975 1408343 1979794 1328143
46951 1328143 63715 -522783 10583 954602 1444703 1197433 380827 -625044 -1258196
46942 -1258196 -1115875 -508656 -305587 -980589 -2070280 -2768348 -2782681 -2361561 -1739415
46933 -1739415 -954621 -155616 305206 251598 -35247 -120816 43040 78641 -241047 -553085
46923 -553085 -292111 496906 1047401 766835 19923 -290697 163096 761810 681278 -285450
46913 -285450 -1678664 -2809542 -3136829 -2581323 -1749165 -1565685 -2300658 -3099285 -2897518
46904 -2897518 -1756770 -816106 -820918 -1222709 -1088292 -464797 -225671 -716812 -1275273 -1278008
46894 -1278008 -1035343 -1188414 -1658875 -1829938 -1601749 -1580395 -2077390 -2478717 -1977290 -663301
46884 -663301 470528 564199 -252058 -1014098 -856850 185121 1307984 1874106 2026473
46875 2026473 2189829 2252717 1762970 850944 285845 406191 610772 301337 -213781 -319210
46865 -319210 -186271 -548355 -1518413 -2317793 -2278199 -1598657 -946801 -689053 -689600 -617582
46855 -617582 -324188 -57406 -278820 -1082336 -1909297 -2133733 -1820171 -1528320 -1459721 -1285576
46845 -1285576 -835199 -398251 -148824 222737 952130 1630998 1601456 754855 -363530
46836 -363530 -1109900 -1156784 -536273 384277 1017432 971111 445064 53415 196959 723021
46826 723021 1225284 1522740 1715089 1839886 1698222 1170844 591903 523585 1071359 1663364
46816 1663364 1693965 1202920 699128 486870 449312 359336 65092 -548635 -1408510 -2083723
46806 -2083723 -2153350 -1776483 -1525446 -1603545 -1631859 -1302409 -784755 -279874 376118 1311976
46796 1311976 2161637 2425405 2126098 1757719 1685503 1879543 2136465 2281718 2219377 2030230
46786 2030230 1955432 2039861 1858832 897984 -746297 -2276645 -2916645 -2607233 -1906030
46777 -1906030 -1294336 -735124 32030 886663 1273652 865050 43619 -541951 -744207
46768 -744207 -877784 -1029338 -930101 -593167 -513393 -934526 -1371360 -1262160 -753833 -393120
46758 -393120 -293263 -91405 411868 1030395 1516329 1661465 1150182 -166867 -1758097
46749 -1758097 -2613569 -2179736 -864921 464267 1238568 1415182 1318178 1418150 1990397
46740 1990397 2788290 3230500 3030936 2438177 1769343 1037183 265455 -164985 68646
46731 68646 584535 528248 -446695 -1743950 -2492800 -2379739 -1665139 -686760 308267 997507
46721 997507 1100378 768253 549644 789472 1261036 1542211 1540566 1441743 1351777 1294738
46711 1294738 1422025 1838170 2221910 2001026 1049564 -41870 -558147 -380357 -13938
46702 -13938 -20217 -500771 -1069255 -1310283 -1295681 -1517131 -2190236 -2869030 -3057598 -2965878
46692 -2965878 -3153575 -3542472 -3428138 -2563264 -1583513 -1100734 -947707 -664048 -208767
46683 -208767 222748 630219 1008091 1127082 979253 1039614 1583889 2136428 2127069 1670141
46673 1670141 1075602 86445 -1519419 -2938917 -3063429 -2136178 -1585042 -2018797 -2453580
46664 -2453580 -1931270 -914730 -428628 -591727 -774521 -681750 -508457 -374176 -313658 -558298
46654 -558298 -1124421 -1330706 -491586 955451 1770297 1466532 836296 674952 694851 239352
46644 239352 -451997 -483010 321811 1072320 1084566 852963 1225306 2011312 2159518 1291985
46634 1291985 310663 162850 591411 622342 -97344 -1042370 -1659929 -1849863 -1675741 -1221542
46624 -1221542 -795558 -725412 -846230 -705520 -367731 -418480 -965193 -1263611 -726771 210867
46614 210867 698710 528232 107380 -256291 -484271 -375905 275739 1248914 2002679 2205814
46604 2205814 1868155 1093361 59972 -886071 -1499206 -1892401 -2207796 -2244943 -1857188
46595 -1857188 -1498091 -1771614 -2509855 -2915010 -2631165 -2040307 -1432468 -642527 195785
46586 195785 285417 -855438 -2524227 -3562838 -3668730 -3413279 -3197592 -2848514 -2200381
46577 -2200381 -1443100 -755926 -89985 488182 630354 115293 -858203 -1958842 -3000505
46568 -3000505 -3739488 -3765038 -2991585 -2061590 -1799518 -2254976 -2644583 -2316772 -1461016 -709719
46558 -709719 -302359 71819 665016 1172438 1007749 64867 -942313 -1102812 -308446
46549 -308446 611516 935262 949414 1396694 2210420 2468598 1758136 895490 803106 1182394
46539 1182394 1001032 30662 -899028 -1186824 -1223971 -1603864 -2192194 -2416326 -2078003 -1447724
46529 -1447724 -824969 -404211 -365350 -692593 -1030963 -1082207 -1033817 -1239434 -1582923 -1592558
46519 -1592558 -1182816 -830950 -882039 -1075479 -1017070 -832000 -997125 -1629132 -2279514 -2508200
46509 -2508200 -2424731 -2469852 -2734470 -2733005 -2006039 -850414 -196483 -654629 -1855907 -2903568
46499 -2903568 -3337243 -3401671 -3439289 -3380916 -2978943 -2268487 -1534542 -955796 -559108 -476969
46489 -476969 -918107 -1755302 -2404326 -2381896 -1894580 -1602892 -1773180 -1910516 -1376616 -218608
46479 -218608 814503 1061188 625591 251528 582270 1548405 2459046 2694245 2265286
46470 2265286 1631082 1068706 461132 -304130 -1067032 -1676408 -2205475 -2613666 -2508980
46461 -2508980 -1669888 -588468 23710 170268 425245 834903 661059 -458816 -1674693
46452 -1674693 -1799923 -737813 498728 1066547 1075109 1056894 1142841 1052518 669293 255756
46442 255756 27518 -234337 -869223 -1683044 -1988489 -1514828 -943398 -1108784 -1870247 -2338710
46432 -2338710 -2167898 -1939189 -2090318 -2166601 -1604702 -747193 -471402 -1065983 -2004501 -2658259
46422 -2658259 -2734584 -2141427 -967947 349546 1250870 1532732 1363746 881836 118943
46413 118943 -683551 -1067855 -824740 -279767 -11745 -333568 -989648 -1309462 -848716 -7639
46403 -7639 249975 -495585 -1608592 -2290606 -2583296 -2975779 -3386343 -3301216 -2794171 -2557410
46393 -2557410 -2786736 -2816778 -2159150 -1208057 -506230 52876 726572 1143797 758131 -159049
46383 -159049 -696370 -459312 53546 310189 402371 587702 655883 221848 -542457 -953266
46373 -953266 -653787 -39034 356277 613557 1216911 2182539 2838545 2629372 1818279 1134087
46363 1134087 939598 1034459 1095943 937142 395119 -616896 -1817758 -2596878 -2529889 -1764114
46353 -1764114 -843361 -259947 -186190 -494740 -960840 -1457749 -1920069 -2155560 -1942879 -1442971
46343 -1442971 -1213515 -1513558 -1828819 -1485936 -583894 140288 297284 192240 150360 17683
46333 17683 -452945 -1106153 -1556353 -1651736 -1567579 -1556409 -1708308 -1887670 -1928365 -1953570 -2290061
46322 -2290061 -2857179 -2968289 -2205207 -1244649 -1177942 -2091280 -3001836 -3219706 -3030805 -2886259
46312 -2886259 -2714637 -2391081 -2169731 -2156880 -1933845 -1227600 -464908 -128509 -9473 341085
46302 341085 820149 1025848 947391 776434 339543 -587025 -1594367 -1976867 -1667719 -1199173
46292 -1199173 -811372 -303497 208987 153485 -626603 -1471626 -1744544 -1630529 -1721488 -2130504
46282 -2130504 -2431320 -2300927 -1821660 -1165378 -323196 695361 1577275 1872228 1492848
46273 1492848 880761 545286 570845 758125 1063939 1525980 1829317 1455371 400655
46264 400655 -685897 -1271958 -1446898 -1480341 -1356864 -1034186 -688087 -345673 256567 1050073
46254 1050073 1376869 859548 34372 -477352 -930263 -1851910 -2924889 -3364863 -3127848
46245 -3127848 -2801529 -2472627 -1698142 -552995 321418 796864 1367328 2006663 1983563
46236 1983563 1163480 448698 390462 323105 -442969 -1422126 -1762912 -1560143 -1455445 -1445641
46226 -1445641 -1041944 -312767 137880 101593 -97645 -299884 -611000 -850844 -607013 99785
46216 99785 792652 1220276 1510059 1635799 1353267 766393 348220 204516 -127477 -887087
46206 -887087 -1592471 -1652348 -1080726 -307881 334766 619200 314220 -473718 -1143419 -1279320
46196 -1279320 -1287011 -1798208 -2543083 -2467609 -1121549 642593 1657870 1660842 1139134 429292
46186 429292 -397032 -1013219 -1032419 -818914 -1328721 -2773206 -4075975 -4179627 -3357253
46177 -3357253 -2550051 -1858323 -652405 942456 1750133 1054310 -435623 -1595190 -2148538
46168 -2148538 -2338856 -2007170 -904601 366945 670365 -311725 -1731307 -2752998 -3462423
46159 -3462423 -4298042 -5088818 -5156346 -4201265 -2701510 -1439863 -864628 -917688 -1294821
46150 -1294821 -1757761 -2212483 -2569399 -2663640 -2413177 -1984552 -1648361 -1474381 -1312547 -1087168
46140 -1087168 -940936 -1010747 -1203573 -1324744 -1349876 -1433010 -1679279 -2049810 -2486320 -2936902
46130 -2936902 -3151441 -2654557 -1237255 520190 1559672 1394577 643039 274003 497751
46121 497751 713051 413280 -277138 -956894 -1387186 -1463425 -1171919 -782929 -711405 -928487
46111 -928487 -883128 -361919 -87397 -964252 -2901220 -4875385 -6083329 -6513342 -6369146
46102 -6369146 -5535782 -3948225 -2129969 -932845 -758061 -1217499 -1548372 -1297380 -685169
46093 -685169 -367629 -750777 -1502320 -1879284 -1608160 -1254403 -1528077 -2330112 -2764675 -2178014
46083 -2178014 -981561 -235641 -461501 -1086385 -1154388 -411088 505829 859726 557264
46074 557264 103911 70772 682647 1694927 2510801 2586727 1927034 1120073 760296 886926
46064 886926 1042528 750088 -129361 -1294139 -2098149 -1965026 -957823 178738 747653
46055 747653 743556 584554 428514 107938 -376212 -710333 -663327 -344418 -57763 -142192
46045 -142192 -851418 -1986669 -2670656 -2023577 -290517 1125102 1087020 -78718 -1111440
46036 -1111440 -1293059 -1032561 -1120929 -1809540 -2671541 -3109512 -2914922 -2453754 -2305501 -2621349
46026 -2621349 -2914711 -2641256 -1904512 -1378881 -1578376 -2425289 -3502461 -4419691 -4851162
46017 -4851162 -4549004 -3616721 -2644866 -2277692 -2584306 -3003516 -2968133 -2496405 -2109072 -2214205
46007 -2214205 -2659983 -2938085 -2786015 -2461325 -2346144 -2417805 -2325680 -1945361 -1563309 -1433516
45997 -1433516 -1456693 -1487089 -1653521 -2049325 -2335154 -2087687 -1451324 -1008386 -1034570 -1325919
45987 -1325919 -1726052 -2240566 -2529246 -1971851 -606148 567730 700725 61484 -595880
45978 -595880 -1138717 -1869925 -2638608 -2963370 -2859846 -2729477 -2505987 -1767193 -747876
45969 -747876 -363876 -982790 -1915383 -2388825 -2304401 -1769497 -715139 544173 1128888
45960 1128888 605044 -384054 -1055198 -1465889 -1948433 -2214486 -1870499 -1343617 -1325824 -1547870
45950 -1547870 -1064014 303299 1661013 2212488 1965051 1250878 339071 -336731 -324290
45941 -324290 196093 487289 206593 -241318 -448324 -495951 -492433 -249886 233525 515812
45931 515812 332440 22895 -51685 -91646 -434068 -919653 -1148596 -1070892 -857336 -460855
45921 -460855 139636 428431 -260720 -1739426 -2862115 -2701506 -1531207 -378571 174784
45912 174784 399747 715431 1042496 1111197 1080548 1321200 1599772 1086383 -483715 -2088354
45902 -2088354 -2375266 -1159439 476787 1409076 1305446 397936 -890404 -1949364 -2187249
45893 -2187249 -1556945 -594095 222605 862527 1428419 1848693 2047787 2064727 1811339 1044849
45883 1044849 -194513 -1393690 -2046311 -2141944 -2039382 -2041765 -2187615 -2262778 -1968205 -1272317
45873 -1272317 -556480 -154162 116085 549384 855378 493654 -323503 -733789 -502559
45864 -502559 -401602 -954185 -1581603 -1559562 -1140300 -980294 -953642 -403153 649256 1366278
45854 1366278 1186297 419869 -326200 -814534 -1129939 -1337610 -1379018 -1190576 -901952 -920587
45844 -920587 -1587959 -2616726 -3160503 -2687363 -1551630 -509946 9761 -51286 -617185
45835 -617185 -1360855 -1748641 -1661397 -1627253 -1970201 -2138230 -1519235 -602280 -528766 -1551807
45825 -1551807 -2658166 -2800209 -1938075 -784766 -21821 144195 68679 363669 1154699
45816 1154699 1730535 1375190 415587 -144614 17320 218852 -118554 -720332 -1051530
45807 -1051530 -1054689 -965999 -882181 -862695 -1052190 -1322365 -1126029 -125206 1231451 2124048
45797 2124048 2248078 1996651 1827709 1714764 1263390 242771 -1040444 -1890901 -1794472
45788 -1794472 -858352 339928 1282935 1821154 2052420 2070579 1859421 1374905 729336
45779 729336 226418 49153 -33681 -364278 -824059 -979018 -817621 -748803 -698208 11953
45769 11953 1399156 2228225 1508909 3049 -751254 -521213 -375856 -804053 -1068183
45760 -1068183 -581754 180734 522466 398635 79202 -301317 -501566 -188324 454235
45751 454235 781580 646173 599045 840296 760274 -38386 -1014017 -1500606 -1569998 -1545691
45741 -1545691 -1332566 -853392 -545510 -740687 -1042923 -958533 -661226 -500541 -276035 259852
45731 259852 644754 290349 -496145 -895861 -762294 -641312 -783345 -920480 -947777 -1087946
45721 -1087946 -1379902 -1642343 -1929404 -2423682 -2918291 -3014013 -2795508 -2686971 -2658254 -2254478
45711 -2254478 -1483718 -980972 -1066108 -1217219 -789171 135054 858261 762539 -225885 -1582159
45701 -1582159 -2525366 -2687009 -2446468 -2338960 -2255633 -1663581 -548767 405774 683213
45692 683213 507925 400912 542969 746912 768512 521282 202399 201931 621112 963410
45682 963410 665740 -162996 -982539 -1677623 -2541245 -3393162 -3492675 -2641624 -1695163 -1453507
45672 -1453507 -1526848 -925765 467943 1647752 1702603 813996 -102439 -442445 -403022 -566873
45662 -566873 -1197825 -1989169 -2418125 -2240496 -1633476 -963713 -463214 -45571 564868 1382258
45652 1382258 1885929 1513100 481671 -290225 -286749 2513 -137010 -725110 -1348226 -1841945
45642 -1841945 -2134553 -1866709 -930524 -77730 -140958 -810108 -1036500 -555792 -100941 -121559
45632 -121559 -281638 -347377 -540804 -735419 -342164 548110 892992 180807 -683882 -675809
45622 -675809 -54711 298794 259180 290335 450885 485910 524557 795267 932060 427991
45612 427991 -422395 -854965 -757489 -674017 -831260 -982082 -1148042 -1661276 -2391370 -2705376
45602 -2705376 -2347828 -1699294 -1048386 -273156 623781 1347755 1869518 2474024 2998602
45593 2998602 2710990 1366449 -161434 -803074 -510895 -155899 -453545 -1291689 -1914627
45584 -1914627 -1579534 -272092 1116623 1646801 1417613 1315172 1583860 1391279 254820
45575 254820 -830069 -523723 973349 2104565 1982174 1340547 1234444 1574822 1511578
45566 1511578 792729 41338 -235493 -304090 -669194 -1277858 -1604529 -1379126 -889630 -548565
45556 -548565 -446029 -435103 -415168 -355380 -223124 -88632 -144086 -408559 -580085 -433692
45546 -433692 -192582 -190111 -344447 -378149 -392326 -672436 -1001800 -859828 -407778 -510758
45536 -510758 -1431035 -2231804 -2060402 -1405350 -1286366 -1613365 -1307270 40617 1551280
45527 1551280 2253496 2111111 1587231 919903 300122 192418 836563 1686228 1891770
45518 1891770 1262673 377806 -157483 -223766 -70825 -50688 -402664 -958084 -1110508 -459523
45508 -459523 511512 810683 99664 -896329 -1320881 -1161399 -986419 -1010264 -906141 -518719
45498 -518719 -296029 -767478 -1805355 -2686238 -2885069 -2618566 -2497496 -2735331 -2890925
45489 -2890925 -2471642 -1636284 -1066447 -1126079 -1385022 -1137410 -260533 642972 922633 520242
45479 520242 -85726 -418993 -405480 -315271 -407144 -665294 -888064 -984253 -1056893 -1139061 -993078
45468 -993078 -360787 614858 1407953 1618501 1360839 1084836 1082010 1235564 1242452 1034981
45458 1034981 908319 1131998 1469192 1316988 461025 -533973 -947253 -737445 -390241
45449 -390241 -59831 589789 1575740 2203661 1881878 952419 223905 -99172 -476490 -1092417
45439 -1092417 -1452799 -1114409 -378072 55923 -133066 -732487 -1401262 -1867980 -1829302 -1082922
45429 -1082922 99373 1020944 1210252 891213 644852 769186 1207782 1915395 2820020
45420 2820020 3391875 2823690 1018956 -977477 -2029476 -2160103 -2219603 -2504520 -2454190
45411 -2454190 -1772828 -1028813 -770485 -756275 -620669 -700578 -1436092 -2348268 -2504972 -1873994
45401 -1873994 -1335335 -1283372 -1072310 -128350 1142335 2004536 2361656 2538387 2534953 2107933
45391 2107933 1380830 825413 677199 740289 715256 433777 -111255 -672167 -833958 -531183
45381 -531183 -316902 -706589 -1378536 -1523512 -964904 -376612 -261537 -269786 152439 884689
45371 884689 1354374 1359576 1166678 897606 353081 -438387 -941227 -705523 -37143 267497
45361 267497 -145802 -788678 -973528 -658352 -412686 -587548 -814401 -512926 266621 798765
45351 798765 511224 -373538 -1144640 -1374086 -1192437 -904188 -613843 -330061 -247474 -690020
45341 -690020 -1724749 -2933987 -3672178 -3587534 -2902865 -2203387 -1964747 -2263098 -2860157
45332 -2860157 -3463015 -3862260 -3914169 -3567368 -3000517 -2624467 -2739921 -3132290 -3169027 -2447992
45322 -2447992 -1255644 -206739 488196 1121538 1847698 2314341 2165275 1623737 1189082
45313 1189082 884431 262772 -788962 -1699987 -1900850 -1526670 -1116882 -841998 -434384
45304 -434384 176409 585641 427014 -92536 -391968 -174809 247747 269374 -441862 -1636143
45294 -1636143 -2645644 -2863216 -2197485 -1200424 -722731 -1212065 -2167205 -2438275 -1378408
45285 -1378408 324100 1300279 1034359 341870 177437 492923 696321 775860 1253198
45276 1253198 2161306 2782405 2516835 1502576 297193 -559339 -623003 201779 1302229
45267 1302229 1817572 1696694 1752322 2420468 3086821 2997619 2199915 1118056 -135465
45258 -135465 -1392790 -1995898 -1555465 -715385 -315827 -151316 517246 1490934 1738105
45249 1738105 944484 -47978 -477976 -445149 -301864 -142096 -107647 -366339 -571594 -209763
45239 -209763 297744 -150266 -1588679 -2566904 -2125109 -1218038 -1324592 -2448433 -3463270
45230 -3463270 -3791534 -3663506 -3150022 -2094016 -905902 -445710 -1001552 -2035376 -2935822
45221 -2935822 -3459100 -3521780 -3153253 -2631007 -2232530 -1997275 -2060994 -2778522 -3969840 -4593077
45211 -4593077 -3986124 -2966332 -2705190 -2908058 -2344164 -1002735 -288922 -856956 -1633848
45202 -1633848 -1564451 -1126042 -1266079 -1737952 -1508789 -358468 820100 1146656 548665
45193 548665 -460396 -1298883 -1615078 -1373974 -730211 134990 911519 1103146 513974
45184 513974 -319754 -719958 -784986 -1065619 -1460738 -1363937 -949252 -1168542 -2096791 -2449541
45174 -2449541 -1462160 -221175 -161110 -1046486 -1563039 -1327456 -1064089 -1063557 -742921 147301
45164 147301 939190 1025653 693340 594640 856206 1040537 742322 37296 -542415 -493381
45154 -493381 73668 481074 293309 -140120 -169658 389507 1210660 1831399 1790303 813348
45144 813348 -712776 -1825328 -1979193 -1581198 -1141313 -466959 675841 1695738 1867265
45135 1867265 1494695 1429778 1706986 1671730 1269718 1068705 1007827 338980 -933227 -1711053
45125 -1711053 -1401752 -885108 -1253098 -2337634 -3140391 -3135041 -2529059 -1730907 -1153100 -1128964
45115 -1128964 -1454902 -1367010 -517732 336542 177934 -979343 -2179262 -2738429 -2817926
45106 -2817926 -2829589 -2806489 -2531083 -1974552 -1388753 -1040539 -987369 -1168092 -1642812 -2501171
45096 -2501171 -3405650 -3570614 -2644711 -1435850 -1167075 -1975540 -2706414 -2322757 -998030
45087 -998030 337383 965481 663336 -380833 -1526727 -2020260 -1808024 -1661258 -2116242
45078 -2116242 -2683108 -2559280 -1777077 -1075383 -804794 -533760 193501 1104128 1412524
45069 1412524 713542 -469957 -1214971 -1355494 -1763791 -3082444 -4550866 -4856170 -3962321
45060 -3962321 -3082247 -2772250 -2263020 -1101328 -167333 -191059 -385321 243681 1109492
45051 1109492 1012884 293131 355346 1248838 1456325 370293 -638562 -306247 698615
45042 698615 953170 276035 -494532 -995920 -1478224 -1807416 -1434992 -401274 434247
45033 434247 343444 -575204 -1696284 -2409896 -2349980 -1579832 -699542 -387206 -660813 -889423
45023 -889423 -671722 -369599 -524047 -1014611 -1165762 -591550 421675 1387294 2113335
45014 2113335 2576649 2633005 2187813 1514912 1056514 908846 776243 431041 -51539 -497856
45004 -497856 -749503 -583021 55473 654082 474249 -483168 -1332581 -1448646 -1265063 -1468615
44994 -1468615 -1879587 -1831648 -1378884 -1290620 -1819354 -2236142 -1878940 -1130567 -951650 -1674890
44984 -1674890 -2586102 -2708777 -1911174 -1135103 -1329004 -2171554 -2308265 -1091670 462999
44975 462999 979706 474693 30095 81099 55294 -330722 -510069 -106043 380420 385624
44965 385624 61645 -232485 -560801 -996164 -1143170 -670143 99676 657699 979228 1218275
44955 1218275 1162187 611993 -10676 -99554 256935 414233 78394 -450237 -846790 -1064172
44945 -1064172 -1103676 -949994 -752238 -700654 -723683 -601889 -315861 -6065 273045 452918
44935 452918 304604 -206290 -579433 -246269 699700 1635992 2183545 2461362 2691201 2953824
44925 2953824 3194408 3043245 1864782 -400220 -2582619 -3219846 -2224290 -968443 -592004
44916 -592004 -877375 -978104 -560007 135517 783456 1113690 994819 730083 859661 1370505
44906 1370505 1569163 1064909 351129 -8113 -203097 -612786 -938234 -674513 -115947
44897 -115947 -30023 -428460 -495120 161330 914259 1039230 690417 650121 1411569 2674096
44887 2674096 3515458 3096536 1561678 166056 -5333 584940 487525 -701433 -1675319
44878 -1675319 -1179566 307154 1320204 1309782 999543 1129224 1661964 2207094 2498619
44869 2498619 2332174 1637517 818304 525625 862086 1216545 1106871 789794 755611 958987
44859 958987 901318 281178 -720710 -1652141 -2060296 -1729022 -897688 -121729 288799 560224
44849 560224 1021125 1596208 1987971 2145910 2196220 2043510 1469890 627051 20230 -115744
44839 -115744 -102855 -311832 -603087 -484360 269862 1287987 1856415 1495915 384922
44830 384922 -778842 -1424383 -1574364 -1575299 -1533006 -1307467 -964480 -791223 -784472 -577573
44820 -577573 -109009 69792 -422254 -1002132 -689347 557967 1618464 1531769 663567
44811 663567 209280 738096 1653947 2155783 2331300 2906673 3994973 4602335 3746412
44802 3746412 1844489 481798 724455 2090852 3367556 3958395 4006892 3603458 2627560
44793 2627560 1373233 612240 719826 1210610 1482538 1603314 1924239 2291095 2277933
44784 2277933 2050554 2267107 2980916 3299195 2514276 1116648 211591 208023 560963 639250
44774 639250 348369 -59897 -318266 -219076 247534 736631 855875 682390 630224 791732
44764 791732 876386 894150 1318966 2267722 3037768 2912316 2041061 1069011 270873 -407811
44754 -407811 -800454 -698381 -401231 -403263 -608362 -528035 -221930 -305421 -939228 -1560205
44744 -1560205 -1827876 -2117667 -2746634 -3372469 -3577674 -3455086 -3143220 -2359503 -1010405
44735 -1010405 177935 336175 -464303 -1380356 -1853751 -1960695 -1915037 -1837795 -1937134 -2332302
44725 -2332302 -2687273 -2520921 -1904089 -1380255 -1164013 -901432 -334823 235681 355850
44716 355850 -2082 -412107 -355584 423911 1689195 2784308 3133136 2689443 1804156
44707 1804156 833926 109791 30515 739455 1800233 2584193 2875890 2725744 1962388
44698 1962388 489666 -1045053 -1655152 -1236138 -726758 -854843 -1346002 -1595165 -1438394
44689 -1438394 -917256 17205 1028161 1217748 121440 -1473456 -2329378 -2122285 -1458583
44680 -1458583 -840625 -294843 134601 237201 26580 -262415 -597159 -1081227 -1483068
44671 -1483068 -1397818 -964396 -855750 -1346198 -1867096 -1754722 -1045546 -248815 314559 603003
44661 603003 556552 120727 -499774 -914570 -914008 -643927 -444293 -569778 -971739 -1299707
44651 -1299707 -1241875 -906471 -702438 -808381 -996756 -1062776 -1119893 -1273179 -1294880 -932486
44641 -932486 -328785 196471 593905 910691 822275 -108371 -1627940 -2758620 -2818754 -2144259
44631 -2144259 -1570360 -1503318 -1740752 -1893564 -1678170 -1066262 -482665 -577383 -1389162 -2004139
44621 -2004139 -1578875 -503952 94202 -93741 -283686 48312 417678 311887 93810
44612 93810 267634 469827 23909 -862315 -1313781 -1063201 -723154 -794164 -1101108 -1262362
44602 -1262362 -1075409 -387881 745317 1677561 1643017 808954 193710 323929 694760
44593 694760 853566 1172264 1957820 2532047 2030273 687764 -481861 -1034433 -1351515
44584 -1351515 -1693801 -1770940 -1329083 -589744 13442 167803 -193699 -702597 -616978 439425
44574 439425 1887175 2824353 3122729 3328231 3611559 3567995 3096727 2678033 2548823 2360425
44564 2360425 2019488 2137293 3066267 4051066 4054370 3139592 2369120 2449477 3067564 3570438
44554 3570438 3772947 3921067 4184722 4407625 4289751 3776969 3279617 3361241 4081365 4788733
44544 4788733 4743879 3847612 2622606 1647476 1208962 1327981 1801510 2233776 2276259 1910740
44534 1910740 1434936 1226758 1543937 2332253 3088257 3173334 2526937 1840092 1686627 1697161
44524 1697161 1060058 -261623 -1367901 -1564665 -1153700 -840470 -785131 -630562 -221544
44515 -221544 152633 225761 148794 303274 838092 1456342 1653665 1210442 462428 -9969
44505 -9969 11613 225886 313657 383579 722710 1254489 1545013 1368554 1024345 975573 1306786
44494 1306786 1659030 1651650 1287106 940139 959840 1277896 1459408 1187302 596762 -4407
44484 -4407 -625271 -1497209 -2472132 -2905535 -2397418 -1376651 -591849 -191460 271239 1001875
44474 1001875 1639356 1845958 1729167 1478045 1065900 633256 675965 1334382 1870214 1509943
44464 1509943 588098 97568 163917 -165009 -1385161 -2617503 -2715113 -1665338 -314256
44455 -314256 775574 1485919 1578361 884272 -136 -56896 904806 1949564 2167274 1575791
44445 1575791 671643 -295899 -1187831 -1630579 -1405152 -928914 -782866 -852020 -457740 616439
44435 616439 1693075 1969060 1393611 553823 -106423 -663613 -1323126 -1892233 -1860526 -1049505
44425 -1049505 -13221 448962 191068 -131122 55695 480018 444692 -162140 -695420
44416 -695420 -631262 -235860 -159668 -617638 -1234848 -1585721 -1621597 -1556590 -1530736 -1482010 -1274028
44405 -1274028 -869023 -368783 101700 534341 1018750 1556376 1944888 1939230 1556720 1148476
44395 1148476 1060941 1202409 1051730 227289 -968633 -1727924 -1539575 -714729 -17840
44386 -17840 123693 -100150 -304318 -376403 -467030 -693833 -993041 -1208843 -1237584 -1094127
44376 -1094127 -872452 -634603 -356041 -27322 224897 223665 -32845 -319287 -394692 -223281
44366 -223281 9268 54841 -159105 -356492 -91796 674526 1243806 771719 -684179 -2007142
44356 -2007142 -2135586 -1134614 57542 724587 885922 869999 825421 748527 661066 545531
44346 545531 248911 -375560 -1253772 -2070595 -2450699 -2217785 -1585978 -1056893 -985395 -1256569
44336 -1256569 -1504237 -1565247 -1510636 -1310941 -830467 -241787 -77558 -594994 -1320012 -1563173
44326 -1563173 -1280574 -1042466 -1106996 -923404 147128 1805170 2905503 2664618 1486113
44317 1486113 369319 -281030 -885432 -1797863 -2658785 -2837446 -2155077 -875768 699523
44308 699523 2215791 3096659 2970508 2239680 1700009 1535216 1217922 543335 148022
44299 148022 595756 1394465 1476504 490917 -841094 -1610663 -1598510 -1264413 -1152311 -1379243
44289 -1379243 -1578472 -1333361 -701108 -179817 -89227 -191363 -63925 381096 954270 1531788
44279 1531788 2060832 2383225 2346532 2018728 1603028 1253367 1090766 1148684 1135077 623812
44269 623812 -214145 -508071 186971 1063031 1049600 353311 148682 795595 1327220 963222
44259 963222 247560 164358 790473 1458848 1793886 1884808 1668710 846337 -522025 -1800543
44249 -1800543 -2315625 -1918340 -1003229 -146175 282796 295832 122994 -96668 -353553 -571637
44239 -571637 -653394 -728658 -994830 -1214846 -813319 283256 1321737 1599448 1311260 1089617
44229 1089617 1024597 721243 168254 -101227 203623 710019 935442 871222 798635 828754
44219 828754 872508 869463 812739 662530 431956 284094 350903 471001 303877 -200794
44209 -200794 -585254 -333586 461735 1094453 1005828 351672 -343587 -828779 -1096079 -970797
44199 -970797 -306844 443754 503326 -195214 -814886 -747018 -396927 -459109 -935268 -1376219
44189 -1376219 -1622411 -1676742 -1244939 -185226 795756 732251 -290459 -1128870 -988133
44180 -988133 -213219 428058 601004 336573 -266302 -912521 -1135383 -812557 -366378 -210748
44170 -210748 -287552 -330716 -262493 -135838 10492 83684 35406 110041 575935 1125156 1116949
44159 1116949 642621 672848 1667229 2648572 2389704 1153886 427115 988018 1989319
44150 1989319 2107603 1031159 -456038 -1465457 -1735908 -1544645 -1216529 -864229 -564488
44141 -564488 -541182 -865924 -1062008 -508589 598216 1221439 791828 54192 70769 793942
44131 793942 1333881 1364298 1398906 1696887 1778903 1287409 614686 303746 348955 421729
44121 421729 324990 -60948 -764244 -1305416 -863449 613181 1915815 1820230 519687
44112 519687 -784256 -1416840 -1612390 -1545086 -916513 256726 1209138 1268026 703502 299087
44102 299087 343781 448495 213049 -274482 -578126 -349207 345046 1013125 1148472 752607
44092 752607 352212 420676 910936 1410034 1554889 1209088 480431 -261382 -597148 -486679
44082 -486679 -315123 -363601 -467672 -369598 -94258 277787 830184 1404172 1376606 476673
44072 476673 -439807 -223389 1003921 1934528 1844282 1414028 1464685 1762602 1716808 1523683
44062 1523683 1721269 2050177 1761521 939008 557970 1079423 1791904 1860464 1383830 1008379
44052 1008379 993888 1141660 1332094 1637678 1998538 2145503 1853399 1104718 83625
44043 83625 -851523 -1326007 -1270067 -999267 -831125 -738293 -543212 -312062 -299617 -551723
44033 -551723 -822815 -925296 -930383 -912271 -686435 -23673 919890 1611890 1689353 1381042
44023 1381042 1249785 1559212 2034744 2250668 2112600 1903011 1939952 2243827 2513185 2462058
44013 2462058 2214292 2207065 2558625 2778393 2451756 1959266 1892462 1858018 763625 -1412910
44003 -1412910 -3052653 -2767129 -1147568 184521 703769 1121839 1759398 2005304 1462652
43994 1462652 550967 -294141 -1109861 -1805970 -1948826 -1511824 -1030389 -619944 308589
43985 308589 1835046 2888244 2573798 1517668 1100836 1792383 2922578 3682163 3674747
43976 3674747 2907256 1944130 1672008 2184450 2330436 1206284 -327418 -653395 328428
43967 328428 1087984 628939 -389237 -938847 -943410 -802713 -492580 156321 829091 1036155
43957 1036155 770125 403744 175565 104195 141241 108077 -255549 -899469 -1355073 -1244569
43947 -1244569 -663263 81292 749994 1013646 497749 -626250 -1481503 -1403733 -770664
43938 -770664 -447360 -630999 -807650 -734627 -781641 -1138281 -1304593 -808467 -56150 103099
43928 103099 -410518 -681669 13522 1213649 1854038 1609381 1155556 1115796 1286217 1125028
43918 1125028 562307 -47020 -472021 -691258 -627484 -227355 290880 654255 923580 1291021
43908 1291021 1571449 1339239 598885 -88371 -246486 59374 473493 750623 824251 743334
43898 743334 643282 619607 639353 727237 1091154 1788094 2421692 2531619 2161865 1670385
43888 1670385 1148672 519453 66820 250459 977014 1630449 1891333 1995675 2145259
43879 2145259 2242028 2283034 2432794 2616452 2621339 2613855 2844816 2844550 1873061 387640 -19264
43868 -19264 1314753 3084705 3747957 3422660 3217292 3456805 3645423 3671474 3911919 4359343
43858 4359343 4644100 4829551 5312432 5994191 6360469 6348986 6377657 6545993 6572944 6523327
43848 6523327 6815870 7435070 7868024 7925704 7920754 7927165 7617459 7036513 6801459 7215237
43838 7215237 7800707 8033945 7972602 7840796 7558451 7064788 6605320 6291919 5832730 5123466
43828 5123466 4674946 4949934 5596692 5846892 5434084 4629948 3604934 2369686 1297534
43819 1297534 1024061 1538777 1836948 956978 -761757 -1915362 -1652493 -679176 -313730
43810 -313730 -803686 -1167058 -713377 8672 184851 24399 345446 1223135 1913401 2056077
43800 2056077 2087020 2293484 2294375 1865377 1587654 2067958 2936133 3251854 2718519 1929987
43790 1929987 1444013 1108652 481217 -370232 -761684 -133746 1201468 2221204 2186303
43781 2186303 1331648 442002 -8741 1621 463404 1282114 1842342 1326871 -238333
43772 -238333 -1754232 -2206284 -1687162 -966677 -443171 39607 603261 1083462 1354656
43763 1354656 1544754 1826496 2136751 2155317 1583746 551303 -292125 -316184 412273 1202793
43753 1202793 1510641 1388104 1189845 1181320 1475452 1953341 2149546 1640082 686140 52990
43743 52990 27135 112035 -77513 -202976 127706 636136 870600 984657 1372414 1830041
43733 1830041 1791001 1293704 1062103 1562154 2462960 3108447 3154347 2718144 2242718 2215138
43723 2215138 2692051 3100646 2814202 1920282 1131353 944415 1167263 1281694 1031891
43714 1031891 631430 537986 975389 1595479 1805921 1547395 1411348 1752070 2111004 1957123
43704 1957123 1582903 1605612 1828178 1384294 31967 -1408973 -2079079 -1970874 -1616325
43695 -1616325 -1397989 -1400401 -1515891 -1456054 -989917 -339914 -21053 -181717 -478860 -702176
43685 -702176 -1057212 -1636894 -2076314 -2015456 -1510923 -714828 418605 1725317 2538040
43676 2538040 2337283 1497421 900851 929266 1289240 1732680 2386920 3253310 3876831 3849243
43666 3849243 3390657 3089347 3144470 3171012 2797777 2192994 1820111 1835361 1980492 2020960
43656 2020960 2008377 2069628 2231949 2569231 3195021 3891078 4073270 3486330 2695436 2484091
43646 2484091 2955269 3678052 4532351 5788148 7346573 8537962 8872728 8514219 7830983
43637 7830983 6959205 6017409 5247128 4614195 3703958 2391502 1255371 919097 1265053
43628 1265053 1687613 1860740 1855702 1754721 1606903 1583113 1712124 1616320 1010843 359068
43618 359068 448845 1277309 1951272 1917115 1773714 2469009 4011706 5430945 5891891 5448860
43608 5448860 4702209 4106616 3788482 3751988 3938181 4147140 4193810 4188121 4408251 4786346
43598 4786346 4779514 3990503 2760778 1885681 1817964 2355363 2975649 3217484 2897775 2321838
43588 2321838 2151005 2629054 3066542 2664388 1792156 1700611 2806422 4069968 4467954
43579 4467954 4287640 4318068 4468541 4125905 3460069 3303542 3789057 4077267 3620333 2903808
43569 2903808 2647221 2892120 3178490 3123060 2600667 1866941 1703502 2840135 4914635
43560 4914635 6602178 7200979 7516110 8633178 10373410 11705405 12279019 12645238 13114324
43551 13114324 13361272 13289585 13381849 13813391 13961114 13334754 12443683 12118501 12355386 12490814
43541 12490814 12281267 12120566 12273643 12573495 12918255 13416005 13910545 14048014 14090097
43532 14090097 14963276 16993175 19171381 20371098 20901188 22061650 24350741 26970227
43524 26970227 29142716 31037172 33022208 34673107 35088577 33905178 31600040 28978853
43516 28978853 26631859 24681178 22792308 20554309 17977917 15452923 13213991 11213572
43508 11213572 9586115 8729925 8678025 8841381 8675002 8171230 7434606 6364431 5205029
43499 5205029 4763736 5366635 6091572 5875313 5027681 4738338 5330695 6007618 6211658
43490 6211658 6134292 5807426 4880068 3656989 3231319 3963002 4758387 4575392 3811553
43481 3811553 3375786 3161351 2508221 1657124 1537699 2266199 2948900 3034788 2907788 2983255
43471 2983255 3114594 3190251 3524639 4233789 4840017 4922622 4649211 4272239 3634885 2680885
43461 2680885 1994319 2203827 3111702 4001425 4609751 5150407 5459745 4886756 3314208
43452 3314208 1736810 1347342 2255195 3486627 4171118 4382855 4748594 5514741 6271235
43443 6271235 6567809 6537338 6701541 7256548 7838620 8060138 7979750 7827888 7526884 6871710
43433 6871710 6103191 5863226 6445787 7386538 7962152 7895577 7442993 6998881 6780221 6738537
43423 6738537 6643127 6383068 6222800 6486370 6918166 6791388 5923625 5139985 5260575 6000097
43413 6000097 6494903 6637221 7060819 7863190 8297539 8017946 7755112 8200339 8904477
43404 8904477 8995002 8507542 8224215 8475984 8908112 9324915 9965581 10843379 11508365 11704275
43394 11704275 11719969 11824875 11815682 11437361 10896383 10606855 10641215 10729601 10676271 10533485
43384 10533485 10403837 10217295 9735017 8822916 7783817 7249142 7499898 8043201 8225709
43375 8225709 8163811 8564319 9580470 10405592 10249753 9271256 8228097 7583984 7324790
43366 7324790 7350093 7600732 7931230 8223937 8587146 9198259 10027131 10925506 11903075 13102752
43356 13102752 14525493 15888305 16727116 16690469 15941085 15236391 15292004 16062144 17049526
43347 17049526 18290378 20351210 23158164 25680332 27360618 29106576 31969396 35399739
43339 35399739 37977711 39661663 42022741 46017851 50710632 54796908 58491258 63112307
43331 63112307 69413607 77195906 86234046 96690991 108619696 121781948 136141404
43324 136141404 152021383 169532623 188144322 206911384 224711026 240029729 250962166
43317 250962166 256017493 255004258 248848877 238549130 224643469 207787530 189394915
43310 189394915 171237927 154462929 139264650 125404776 112698157 101094914 90774347
43303 90774347 82198182 75576656 70211508 64983111 59686438 55156625 51685115 48182452
43295 48182452 43706259 39062487 35723578 33608977 31321637 28475996 26247992 25251339
43287 25251339 24361196 22491710 20360322 19377044 19601257 19984942 20094033 20350092 20828117
43278 20828117 21042268 20979903 21306100 22313522 23493090 24412457 25354649 26828116 28972133
43269 28972133 31614380 34435372 37033295 39407963 42416170 47061788 53225630 59802635
43261 59802635 66149165 72414494 78140049 81703575 82014882 79960869 77195091 74076049
43253 74076049 69845279 64406347 58697468 53374305 48288254 43448890 39424897 36350204
43245 36350204 33405357 29901668 26316906 23681024 22300844 21545665 20585582 18971679
43237 18971679 16815069 14777682 13604782 13323717 13190073 12708226 12270250 12347566 12512065
43228 12512065 11943174 10666030 9563318 9198611 9266913 9248844 9009625 8628351 8171676
43219 8171676 7831108 7863646 8228381 8631535 9001431 9501518 10011357 10108793 9733426 9368352
43209 9368352 9341459 9419598 9331617 9203298 9198844 9233684 9346360 9802105 10454409 10621691
43199 10621691 10112919 9745809 10168742 10779886 10707932 10361164 10879337 12291668 13440023
43190 13440023 13769267 13981332 14624866 15202755 15249022 15305007 16049939 17156353 17794499
43181 17794499 17791879 17584262 17406673 17206894 17049438 16965828 16645649 15846831 14871939 14106741
43171 14106741 13393594 12481635 11808730 12087593 13231363 14390213 15013589 15245027 15341184
43162 15341184 15401816 15661666 16296876 16847429 16581836 15617151 14928911 14976688 15083823 14608058
43152 14608058 14004130 14100590 14862229 15569961 15871653 15962053 15965639 15870649 16001064 16835687
43142 16835687 18212905 19277505 19479500 19265439 19536131 20662394 22244823 23663858
43134 23663858 24644401 25344968 26086012 27083063 28425581 30197826 32447450 35021162 37639583
43125 37639583 40230690 42974527 45882348 48614170 51001740 53531055 56917873 61307258
43117 61307258 66275710 71553603 77305828 83700671 90732011 98673713 108254723 120017142
43109 120017142 133753227 148912329 165400551 183667568 204078975 226389808 249625062
43102 249625062 272113400 291701859 306346247 314737772 316435478 311658449 301247745
43095 301247745 286661949 269512771 250938623 231641566 212465098 194442583 178088128
43088 178088128 163084538 149030799 136198681 125165366 115955907 108045285 101092194
43081 101092194 95143025 90104727 85587285 81486722 78264728 76316230 75369371 74844587
43073 74844587 74548860 74634560 75068013 75600653 76216997 77141413 78284299 79064233 78996061
43064 78996061 78178406 76930852 75153459 72437746 68848772 65254685 62596520 60892894
43056 60892894 59223483 56800579 53886406 51466517 50122281 49503408 48940443 48277832
43048 48277832 47913685 48215128 49156173 50487789 52063034 53933324 56133588 58319470
43040 58319470 59694707 59587372 58196932 56463920 55007651 53522587 51515056 49251429
43032 49251429 47447061 46244044 45134972 43865643 42787999 42225171 42081391 42268179
43024 42268179 42946573 44060756 45157349 46048927 47204158 49015759 51015158 52290086
43016 52290086 52448224 51733956 50411167 48504296 46028414 43057751 39658968 36101699
43008 36101699 32959506 30583679 28636943 26612032 24660430 23363207 22784625 22393793
43000 22393793 21934369 21666291 21583654 21148132 20220657 19624764 20151666 21370478 22076038
42991 22076038 21768586 21125676 21067041 21887696 23346622 25056428 26538041 27302445 27296669
42982 27296669 27186595 27922351 29967756 33013329 36369508 39533320 42443582 45359005
42974 45359005 48531288 51883323 54922765 57018528 57839728 57522774 56397588 54643740
42966 54643740 52324528 49676529 47125270 44912039 42843163 40521851 37746491 34636369
42958 34636369 31545886 28991963 27478036 27120124 27460684 27803782 27705929 27095205 26148851
42949 26148851 25282693 25022448 25493422 26147558 26406835 26514941 27285902 29001668 31086820
42940 31086820 32996244 34859337 36966075 39159148 41205779 43377838 46090062 49150091
42932 49150091 51903235 54066069 55953968 57866510 59647704 60932827 61525982 61455565
42924 61455565 60893039 60081837 59188747 58238700 57324023 56728648 56599974 56670017 56677409 56966680
42914 56966680 58222827 60605285 63581488 66656728 69774453 72859112 75506803 77464221
42906 77464221 78997545 80385135 81365626 81541361 81113556 80737816 80738031 80894362 80974135 81045370
42896 81045370 81223950 81527598 82143435 83540044 86130140 90010643 95128475 101455130
42888 101455130 108854373 117014150 125685604 134750678 143807903 151903910 158019023 161724490
42880 161724490 163031857 161706821 157267976 149857001 140666007 131089763 121632347 111993368
42872 111993368 102069395 92416247 83715943 76224203 69865233 64451796 59566403 54605702
42864 54605702 49355537 44340605 40236211 37073585 34400094 32065047 30311530 29075568
42856 29075568 27775524 26037715 24176542 22640329 21368538 20093899 18961724 18338977
42848 18338977 18156941 17944015 17480042 16965441 16533450 16068942 15596448 15338710 15157170
42839 15157170 14417206 12830379 11108168 10263271 10378355 10556678 10113779 9357275 9009664
42830 9009664 9226111 9507637 9437970 9201788 9342955 10162895 11388918 12346908 12454505
42821 12454505 11656977 10478002 9650491 9626370 10328736 11278764 11957042 12130488 11924179
42812 11924179 11626456 11445022 11436641 11601731 11969531 12572372 13352599 14113919 14636699 14942681
42802 14942681 15406546 16425308 17962538 19666209 21496151 23830799 26680600 29282468
42794 29282468 31128242 33123363 36825512 42453880 48571383 54040389 59249199 64654929
42786 64654929 69061047 70620343 69153005 66173439 62717197 58494564 53410391 48501885
42778 48501885 44632552 41324891 37784484 34267983 31485211 29320644 27210917 25292938
42770 25292938 24035143 23053515 21524916 19690057 18708322 18884999 19239978 19154694 19276889
42761 19276889 20256546 21695659 23154011 25249524 28678213 32712073 35795082 37415562
42753 37415562 38406221 39427453 40053007 39551005 37910981 35817738 33965759 32509705
42745 32509705 30919513 28435886 25007797 21662286 19521038 18548424 17733606 16395828
42737 16395828 14729676 13088757 11425487 9676112 8174680 7373843 7452868 8304738 9509376
42728 9509376 10246437 9809367 8501369 7545861 7741632 8586771 9086486 9008598 8826384
42719 8826384 8718364 8290811 7325811 6280637 5792384 5908559 6024336 5552441 4544277
42710 4544277 3584632 3118185 3075190 3254164 3752266 4629068 5370311 5294736 4509723 3857572
42700 3857572 3793044 3943883 3973995 4134654 4545872 4664036 4103251 3401932 3253685 3482190
42690 3482190 3586425 3835919 4815551 6141710 6735292 6379391 5974954 6101298 6307550
42681 6307550 6105736 5728967 5499989 5292903 5097119 5330861 6042579 6522212 6330098
42672 6330098 6053416 6340538 6789161 6627595 6047523 5937010 6501948 7004131 6826995
42663 6826995 6118010 5402639 5137533 5553238 6352628 6657250 5836589 4299399 2922395
42654 2922395 1935202 1108512 809364 1810067 3899624 5677780 6141387 5721610 5366831
42645 5366831 5368472 5612572 6269996 7484515 8782011 9474574 9437449 8981829 8221690 7118019
42635 7118019 5997617 5510040 6053790 7482984 9212437 10383562 10248860 8814860 6952880
42626 6952880 5585597 4979379 5031658 5753769 6970342 7980536 8230583 8115836 8440863
42617 8440863 9229594 9774727 9789107 9731829 9903293 9964209 9597461 9026877 8598206 8380252
42607 8380252 8435823 8910656 9495338 9362162 8177647 6821893 6550641 7612792 9129382
42598 9129382 10181930 10578822 10631684 10648506 10776171 11056261 11437464 11776570 11898051 11704259
42588 11704259 11298632 10968024 10919305 11065590 11219312 11400281 11699270 11952230 11965059 12045106
42578 12045106 12796203 14248662 15692821 16593243 17166606 17784466 18394101 19003305 20176925
42569 20176925 22326891 24833941 26673092 27830527 29356964 31928202 35010603 37687355
42561 37687355 39802242 41965021 44724111 47996946 51160196 53567352 55094703 56193746
42553 56193746 57271754 58123039 58217976 57423281 56057324 54293175 51981105 49175221 46431294
42544 46431294 44359816 43094396 42294338 41455753 40209067 38626393 37311637 36877038
42536 36877038 37211572 37519477 37180485 36373099 35846177 36302866 37899701 39970693 41343134
42527 41343134 41449487 41121561 41699229 43325151 44870804 45747450 46897889 49433867 53049047
42518 53049047 56599437 59763886 63236303 67549902 72648315 78590216 85772484 94198737
42510 94198737 103203188 112264408 121650794 131908569 142970473 154038735 164196328
42503 164196328 172956064 180286355 186179166 190198696 191590814 189953583 185618126 179225822
42495 179225822 171260920 162312180 153368690 145183368 137464330 129338668 120604992 111917473
42487 111917473 103746834 95906081 88271586 81207710 74891257 68855034 62709382 56855253
42479 56855253 51985900 48235851 45252894 42739031 40452042 38038812 35436180 33192802
42471 33192802 31825120 30992163 29807418 27856350 25472979 23187287 21381671 20299238
42463 20299238 19810443 19285813 18292430 17313123 17104923 17405756 17094534 15774418 14368496
42454 14368496 13821602 13996696 14330790 14815357 15590389 16138166 15805456 14897753 14377120
42445 14377120 14464829 14319344 13296064 11909276 11221181 11659277 12722259 13611214 13930982
42436 13930982 13911074 14055526 14501127 14790104 14466181 13753653 13293701 13292294 13376736 13289684
42426 13289684 13195261 13169258 12931354 12363014 11833731 11684088 11781171 11909568 12167112 12563998
42416 12563998 12682201 12294041 11947073 12258815 12882485 12922484 12252744 11621599 11440866
42407 11440866 11332498 11076904 11135806 11765006 12321389 12076544 11227002 10475279 10010562
42398 10010562 9593281 9371744 9822393 10865405 11694901 11673408 10995476 10370388 10391849
42389 10391849 11240183 12591624 13723693 14094410 13963941 14120533 14866343 15629173 15773168
42380 15773168 15451567 15348294 15799562 16519479 17112864 17542127 18031099 18706475 19455608
42371 19455608 20106435 20701258 21554583 22981154 24963335 27171881 29369050 31736024
42363 31736024 34708547 38436528 42427505 45847343 48311700 50338988 52848461 56248874
42355 56248874 60284735 64728738 69670952 74810569 78968445 80933223 80603088 78721772
42347 78721772 75665861 71229266 65610026 59756122 54384818 49334286 44337802 39822048
42339 39822048 36294303 33391454 30345748 27231914 24932670 23742731 22732687 20912744
42331 20912744 18578112 16941430 16511328 16319300 14996025 12410385 9892021 8746025
42323 8746025 8850872 9033284 8643515 8246189 8657689 9814093 10949407 11561000 11748146
42314 11748146 11746950 11585276 11241343 10842399 10610455 10718821 11141868 11528937 11394688 10665837
42304 10665837 9899207 9672447 9848985 9751093 9028451 8069688 7536028 7694210 8187917
42295 8187917 8301453 7568847 6352001 5651740 6023915 6846887 7087591 6660430 6460202
42286 6460202 7033348 7848772 8105754 7699905 7042096 6417627 6010700 6198895 7216504
42277 7216504 8630426 9661065 10039523 10156667 10360487 10523835 10408682 10065972 9650226
42268 9650226 9119795 8397547 7652610 7129825 6794236 6455184 6216201 6421385 7016955
42259 7016955 7349034 6952533 6294857 6244342 6874388 7360106 7159816 6673186 6403404 6103919
42249 6103919 5392334 4739047 4949024 5796212 6117372 5431765 4601900 4512081 4884242 4993349
42239 4993349 4885385 5059630 5353082 5101605 4352280 4012214 4554159 5294220 5368502 4914809
42229 4914809 4772580 5292638 5975829 6257281 6224781 6403889 7021301 7640443 7541734 6480933
42219 6480933 5074384 4323199 4654569 5505599 5963442 5725547 5249831 5028611 5025840 4950788
42209 4950788 4794461 4771442 4835872 4622647 3942063 3043576 2271932 1751071 1588082 2044698
42199 2044698 3106061 4074039 4104566 3202445 2282396 2138812 2705241 3434387 3980250
42190 3980250 4238943 4087954 3508552 2804200 2327438 2063956 1785252 1524042 1556256 1919971
42180 1919971 2272728 2286970 1940955 1382785 774060 340407 295515 554562 731017 592802
42170 592802 363775 412714 810641 1397282 2117355 2979835 3741761 3994309 3676828 3230836
42160 3230836 3059812 3031792 2726588 2027072 1228123 664915 491373 743052 1296798 1771352
42150 1771352 1813860 1572114 1571979 2022896 2580334 2939650 3267139 3759342 4125019 3889743
42140 3889743 2993627 1763182 540587 -325315 -445088 183378 969231 1435209 1847886
42131 1847886 2596940 3314065 3396690 3138290 3361194 4020687 4271680 4011583 4140032 4931900
42121 4931900 5406613 4961733 4431445 4593325 4715555 3811903 2466968 1936551 1980347
42112 1980347 1228035 -421046 -1384461 -680322 756435 1571586 1668108 1720557 1927300
42103 1927300 2027241 1962492 1818803 1495159 985799 659352 779207 1028113 935047 559375
42093 559375 411296 863259 1846584 2902518 3391701 2959916 1944481 1013505 360972
42084 360972 -275184 -752387 -395939 928345 2268031 2641292 2168354 1633390 1380277
42075 1380277 1271074 1379148 1963724 2834071 3373313 3268807 2797038 2351843 2042295
42066 2042295 1793526 1571932 1460387 1625647 2132635 2736993 3098480 3280828 3662072
42057 3662072 4180258 4174893 3346824 2390559 2155709 2585762 3073625 3477934 4040694 4555816
42047 4555816 4482646 3869824 3386694 3353140 3454384 3533753 3905445 4605210 5040460 4823031
42037 4823031 4402274 4384392 4640504 4602036 4147430 3671512 3425028 3276663 3122721 3124862
42027 3124862 3422395 3862838 4181296 4348282 4587681 4995968 5224159 4742221 3545863
42018 3545863 2421764 2225677 2930912 3674428 3782419 3484492 3518031 4244363 5277984
42009 5277984 5843450 5421268 4184484 2883955 2230453 2376250 3020126 3820760 4491507
42000 4491507 4711330 4379638 3918774 3874132 4153081 4097347 3429005 2668168 2396743 2549564
41990 2549564 2754389 2974096 3362687 3752578 3804188 3583991 3524252 3761949 3905008 3583455
41980 3583455 2934928 2363208 2029945 1818072 1690844 1809422 2227391 2680987 2875655
41971 2875655 2884330 3021160 3341664 3572471 3607243 3684707 3838297 3600819 2755060 2069664
41961 2069664 2565853 4068499 5219383 5154225 4527765 4507004 5301175 6203354 6676283
41952 6676283 6760456 6582889 6099122 5414221 4921127 4922254 5296485 5632302 5607745 5268233
41942 5268233 5011261 5201133 5707690 5977337 5672795 5033068 4439937 3903736 3272608
41933 3272608 2713142 2562733 2784878 2969035 2891948 2746831 2750886 2805570 2664563 2275635
41923 2275635 1874482 1805860 2207764 2786386 3033730 2821296 2612832 2871132 3444976 3849009
41913 3849009 3955849 3975646 3870645 3350987 2520914 1978714 2037880 2293619 2266467 2103359
41903 2103359 2264305 2782627 3247098 3370736 3203453 2873911 2486683 2247401 2345775 2673899
41893 2673899 2928478 3004678 3017405 2957097 2708216 2471199 2686751 3281105 3451680 2691346
41883 2691346 1708788 1681033 2684191 3573083 3539669 3066674 2978625 3236267 3312315 3257000
41873 3257000 3539433 4045364 4131501 3719290 3478131 3690259 3748222 3212756 2654777 2819184
41863 2819184 3463233 3730431 3372455 2913169 2756988 2770001 2700805 2470921 2047311 1480698
41853 1480698 1035908 860350 628204 5427 -662225 -748881 -382777 -347789 -847797 -1147374
41843 -1147374 -745477 -174741 -157350 -590562 -964898 -1263458 -1701700 -1915642 -1267251 73628
41833 73628 1105777 1213343 821866 632754 728970 770048 674445 669801 837122 990700
41823 990700 991903 909225 834272 738574 581095 431028 414334 612472 1048971 1670942 2255622
41812 2255622 2432222 1985664 1177309 609856 655701 1086128 1352108 1153009 634061 139763
41802 139763 -50188 177443 684286 1080709 1033900 641111 321682 298471 400533 461161
41792 461161 675700 1382417 2604694 3916648 4645963 4211626 2586124 598702 -562952
41783 -562952 -509522 -94348 -324133 -1042536 -1235545 -546400 228029 352601 158468 313276
41773 313276 615622 294793 -665883 -1314003 -974394 -50088 687797 1029799 1175541 1191154
41763 1191154 1149468 1378677 1919365 2065544 1251106 228798 410366 1898828 3123295
41754 3123295 2828310 1581189 728624 633676 761004 909503 1321858 1811126 1792406 1239805
41744 1239805 809423 892555 1204463 1373411 1275025 744563 -288024 -1247286 -1292918 -506807
41734 -506807 70100 -75603 -180932 590440 1925382 2934253 3319984 3314412 2993256 2400162
41724 2400162 1945973 1930500 1966408 1595989 1198640 1506404 2397039 2964784 2743129 2137310
41714 2137310 1650694 1358213 1153323 859461 105070 -1193638 -2184863 -1721773 120533
41705 120533 1889446 2435215 2120784 2007799 2437856 2891060 2809913 2081554 974625
41696 974625 -35364 -581076 -757413 -903089 -936379 -374160 770730 1638113 1453780
41687 1453780 416240 -696347 -1373104 -1434838 -748982 521052 1692089 2185769 2198950
41678 2198950 2265635 2406115 2294036 2061612 2245335 2943914 3633814 3860570 3578626 2817627
41668 2817627 1663882 695775 740627 1827268 2879072 2859621 1865749 718923 -141795
41659 -141795 -833064 -1325056 -1219611 -372944 692544 1291447 1325007 1283609 1541634 1891746
41649 1891746 1920139 1705428 1854602 2743279 3941726 4614985 4380593 3550430 2632002
41640 2632002 1902757 1474398 1429163 1711176 2058270 2202887 2091161 1888687 1868725 2242157
41630 2242157 2903096 3379238 3297030 2903537 2817017 3195657 3505775 3270192 2687450 2240110
41620 2240110 1994626 1655387 1125475 629329 349629 265617 320203 475236 629794 718244
41610 718244 824105 954936 825072 201113 -623921 -1120343 -1268148 -1520476 -1913078 -1750236
41600 -1750236 -509399 1337570 2806483 3422549 3357318 2817474 1863328 788832 124266
41591 124266 72957 288114 381183 388283 577269 1027119 1569071 1958327 1955855 1440156 636415
41580 636415 86203 178124 789783 1535612 2209645 2754505 2951517 2545832 1753149 1279227
41570 1279227 1554128 2108077 2039012 1141647 300021 558329 1931847 3391711 4007162
41561 4007162 3808336 3421213 3199488 3055924 2936168 2968904 3120840 3141052 2990262 2951845
41551 2951845 3133457 3230919 3043850 2852701 2904800 2835241 2097241 817981 -266897 -680819
41541 -680819 -547587 -82181 747131 1898429 2999450 3628880 3631535 3082889 2216194 1429584
41531 1429584 1026315 862426 590914 308300 503513 1221303 1817080 1874360 1863603 2388644
41521 2388644 3164420 3381562 2912836 2513131 2806467 3630401 4481274 5079359 5268166
41512 5268166 4825335 3785774 2716654 2244256 2329320 2336439 1887831 1352134 1266771 1482395
41502 1482395 1300606 527236 -75494 221918 982025 1070879 220976 -577481 -489019 43694
41492 43694 129305 -122589 237273 1518241 2818232 3125715 2523137 2038702 2523634 3813812
41482 3813812 4883865 4828384 3791676 2803981 2579947 2780044 2740926 2515103 2577981 2782149
41472 2782149 2455593 1595971 1123174 1592852 2311768 2208600 1146743 -72319 -677515
41463 -677515 -498125 134296 632444 501483 -186650 -783015 -758485 -228461 390900 929999
41453 929999 1393444 1677869 1742434 1800527 1963444 1955459 1605978 1365350 1804601 2746049
41443 2746049 3412411 3364059 2798194 2012420 1164580 588191 697605 1330003 1682418 1244504
41433 1244504 474980 252776 886953 1918388 2703302 2952102 2830724 2742556 2943985
41424 2943985 3264934 3295942 2890689 2321249 1891574 1612861 1341618 988833 453899 -379320
41414 -379320 -1334768 -1834977 -1429003 -395134 434528 483929 -70626 -573439 -470294 377691
41404 377691 1716501 3068485 3969344 4227916 4045997 3866390 4054595 4670889 5466293
41395 5466293 6026065 5968762 5200646 4104966 3349183 3284062 3560712 3541991 3055822 2489072
41385 2489072 2180955 2109383 2227354 2604987 2991983 2758859 1737999 718769 521130
41376 521130 863524 816983 205750 -198874 133692 884548 1602888 2277116 2889890 3081130
41366 3081130 2696094 2171396 1967578 2046729 2242790 2609107 2944523 2536598 1044895
41357 1044895 -725010 -1614569 -1457130 -1022881 -866308 -926976 -1117664 -1509701 -1867863
41348 -1867863 -1718006 -1080792 -565869 -519481 -576500 -278898 324478 932403 1399736 1606357
41338 1606357 1330004 626127 50902 114512 645264 998247 829294 454863 484597 1198875
41328 1198875 2210281 2703690 2165581 932383 -123245 -442740 -137218 399818 843221
41319 843221 880367 298702 -617884 -1131597 -781715 147020 1056826 1628415 1786643 1486090
41309 1486090 910523 578911 808681 1273222 1528055 1797989 2701656 4191253 5280840
41300 5280840 5048504 3644620 2131319 1457949 1677326 2058877 1892433 1181832 531053
41291 531053 441202 953280 1941577 3287137 4533735 4879148 4038851 2825618 2271193
41282 2271193 2314105 1973410 781333 -620388 -1436595 -1649194 -1709012 -1783195 -1682724 -1270640
41272 -1270640 -665854 -195694 -215939 -701406 -996170 -403235 865868 1810714 1883481 1560841
41262 1560841 1400173 1176860 520022 -122855 57941 1023411 1850833 1881446 1336065 817709
41252 817709 732872 1168731 1790838 1883104 1094313 168455 240137 1254891 1845257 1130470
41242 1130470 -90398 -517091 -108803 135141 -193884 -439090 -81109 407153 281631
41233 281631 -395162 -841069 -515550 336144 1028227 1101938 658978 166178 -25613 37327
41223 37327 117133 163633 323291 602518 748204 550103 94483 -401035 -868429 -1337256
41213 -1337256 -1662571 -1504272 -684482 473334 1266651 1181589 383179 -412371 -606063
41204 -606063 -219180 276599 479374 293821 -171567 -673310 -862336 -550185 16669 410227
41194 410227 564027 720899 779217 191930 -1149858 -2358883 -2434072 -1510900 -650060 -425669
41184 -425669 -345947 184608 951530 1368032 1379949 1411401 1617055 1699771 1444285 1000688
41174 1000688 559444 95486 -408778 -748725 -730267 -491851 -375853 -489231 -578705 -448153
41164 -448153 -376256 -861307 -1868979 -2626992 -2510333 -1973449 -2078568 -3025364 -3741038 -3261444
41154 -3261444 -1977083 -963728 -532270 -224342 10991 -368515 -1383900 -2182836 -2234882
41145 -2234882 -2109714 -2465235 -2885858 -2511015 -1445643 -685264 -709842 -917928 -600459
41136 -600459 113953 534084 249882 -508872 -1124812 -1099124 -493319 117179 291147 197080
41126 197080 189140 140331 -326730 -1083398 -1574451 -1667071 -1786326 -2072914 -2071385 -1553539 -1045568
41115 -1045568 -1119583 -1658605 -2251000 -2807692 -3257257 -3110522 -2042337 -634224 168669
41106 168669 194952 -3901 -172885 -535675 -954118 -755753 296731 1507061 2083244
41097 2083244 1977459 1551402 911719 62084 -646055 -780865 -430320 -100262 -61797 -159652
41087 -159652 -257643 -520844 -1117738 -1836275 -2182622 -1873273 -1138554 -427438 163510 917004
41077 917004 1825797 2273959 1826205 1051294 873943 1195826 1013726 74543 -543839 -8787
41067 -8787 1003051 1412927 1354289 1611950 1980621 1509719 258925 -558148 -440470 -358283
41057 -358283 -1109065 -2010259 -2017367 -1300266 -800115 -824005 -1012257 -1249648 -1611370 -1664499
41047 -1664499 -861978 379623 944424 504829 -95823 -170945 -79472 -398491 -935407 -1129293
41037 -1129293 -916833 -580826 -71557 891797 2174594 3216811 3674077 3696287 3571498
41028 3571498 3399333 3115291 2594385 1772154 890408 516113 993011 1910327 2450970
41019 2450970 2289258 1823928 1491481 1250031 929103 730872 1032278 1844765 2780409
41010 2780409 3475784 3762438 3472118 2450461 914855 -465874 -1094354 -952325 -433997
41001 -433997 173116 786799 1222329 1190111 727413 318279 355903 691206 919999 876929
40991 876929 564971 -118611 -1092746 -1686524 -1187929 64238 747838 61879 -1295737
40982 -1295737 -2053495 -1852121 -1281818 -773674 -190037 492732 801678 388794 -350478
40973 -350478 -617864 -45376 964524 1629092 1467778 732349 173966 256620 676949 860276
40963 860276 775913 868390 1238422 1416511 1104918 655685 495780 463881 152209 -313875
40953 -313875 -325665 352389 1117824 1095299 92193 -1101657 -1454893 -803045 -85209 -269627
40943 -269627 -1201428 -1903177 -1891430 -1562748 -1198640 -412156 932789 1969628 1804209
40934 1804209 842336 288079 513580 803500 686354 584181 895870 1268856 1260163 1128826
40924 1128826 1415848 2069481 2457463 2084437 1020983 -191028 -890466 -838579 -580161
40915 -580161 -929164 -1921766 -2694161 -2618131 -2048477 -1593500 -1198026 -505813 323707 846945
40905 846945 1077404 1289080 1317891 841018 222127 220116 812791 1147255 798790 208816
40895 208816 -384122 -1462597 -3084979 -4084386 -3328577 -1306726 423349 1075009 1063177
40886 1063177 838533 343232 -254747 -289297 456773 1217112 1217047 729101 597409 1025611
40876 1025611 1431221 1368207 1005358 608014 26292 -1015177 -2318890 -3179764 -3003528
40867 -3003528 -1912271 -684413 -25958 98336 306931 980043 1802997 2238208 2228519
40858 2228519 2183392 2382017 2663714 2688674 2273059 1465772 522835 -155510 -283239 4853
40848 4853 222917 -18809 -693023 -1430555 -1763895 -1352113 -231805 1061448 1806790 1656768
40838 1656768 819145 -280220 -1317001 -2061425 -2357726 -2272363 -2085573 -2009027 -2048364 -2180998
40828 -2180998 -2429013 -2673198 -2675880 -2422326 -2145219 -1855901 -1217513 -147389 823779 1161153
40818 1161153 963369 569730 -103046 -1215465 -2250513 -2393492 -1689093 -1073442 -1041701
40809 -1041701 -934930 89748 1866697 3405192 3968007 3657064 3144723 3030990 3280865
40800 3280865 3250433 2555035 1817611 1976265 2827316 3062613 2061772 809521 460895
40791 460895 763205 701820 92161 -433494 -593264 -570891 -239724 621383 1437174 1304147
40781 1304147 422108 -86922 19574 -263447 -1299681 -1862626 -982695 299357 236737
40772 236737 -1163186 -2196661 -1716223 -226934 1194283 2050675 2356162 2264064 2049724
40763 2049724 1904000 1596499 847814 55390 6501 747678 1394602 1294379 778632 494816
40753 494816 582870 868163 1309122 1784069 1883372 1437748 940855 957685 1359052 1592364
40743 1592364 1467126 1198069 899327 578389 474905 803011 1179351 896988 -115073
40734 -115073 -1083322 -1273351 -669192 318280 1324511 2007512 2046816 1543928 1102390 1136264
40724 1136264 1322292 1066051 295463 -560883 -1195903 -1623142 -1866714 -1870011 -1702540 -1500283
40714 -1500283 -1199288 -679661 -178902 -149109 -598402 -974091 -882023 -541902 -280268 23976
40704 23976 553185 893011 359875 -990073 -2177586 -2322191 -1530350 -575327 27043
40695 27043 355190 679427 1058344 1354465 1435339 1274044 938661 539020 175085 -48607
40685 -48607 8499 382091 747751 511333 -565867 -1874148 -2387779 -1688834 -356013
40676 -356013 733787 1215181 1193564 750435 -77088 -943899 -1305972 -994887 -354910 300999
40666 300999 1038089 1938757 2742467 3144924 3228512 3288449 3389591 3373171 3148964 2711087
40656 2711087 2049388 1338946 960524 919496 533159 -681226 -1990935 -2127717 -1026675
40647 -1026675 -11649 35180 -191389 345680 1445355 2123084 2093558 1879291 1736244
40638 1736244 1403282 853783 446087 245482 -70595 -503204 -602926 -233849 137019 123409
40628 123409 -141307 -425715 -712852 -892534 -696811 -189250 196224 324845 509801 760544
40618 760544 547153 -300917 -1108349 -1276358 -1116453 -1179474 -1272995 -833976 98100 953023
40608 953023 1380268 1336263 794746 46142 -106365 714873 1616006 1450782 500875 106099
40598 106099 655280 1111821 796347 456630 910236 1566432 1234705 -104969 -1262909
40589 -1262909 -1415599 -969745 -782428 -1062159 -1290697 -1015788 -474246 -309146 -693174
40580 -693174 -1025646 -768381 -278022 -256896 -557596 -312373 675326 1521339 1573825 1336736
40570 1336736 1554741 2082231 2360888 2469253 2886446 3562646 4023518 4168741 4186492 3845298
40560 3845298 2728444 1194058 287253 487118 1171284 1536807 1493324 1410952 1489928 1663735
40550 1663735 1749150 1489514 818438 225455 410242 1356228 2190880 2235393 1762611 1398802
40540 1398802 1235736 1018909 871354 1214861 2046109 2799171 3000145 2739804 2460088
40531 2460088 2510702 2888075 3169042 2772513 1596232 356432 -69199 322419 656453
40522 656453 318607 -331088 -650311 -705668 -1055560 -1731891 -2067551 -1653323 -916262 -426746
40512 -426746 -64685 631242 1542759 2025750 1899046 1780895 2183762 2728672 2654174 1834812
40502 1834812 870551 294682 118395 171037 488425 1152345 1946036 2428369 2382593 2062914
40492 2062914 1878090 1863187 1670785 1187811 865213 1069984 1333013 863072 -175105
40483 -175105 -636977 45270 999468 1152307 697884 556397 842585 848914 361676 -23439
40473 -23439 35619 189971 241557 541395 1189048 1630138 1526806 1344429 1536141 1753601
40463 1753601 1481471 941292 683627 673093 484882 133266 -6850 67880 37842 -30239
40453 -30239 284156 947385 1320448 1015927 445606 289018 728282 1383853 1783359 1771584
40443 1771584 1590933 1565602 1619065 1293724 469201 -228889 -181406 274565 248202 -403802
40433 -403802 -852326 -522165 115277 342039 256924 495385 1160523 1609373 1326900 612648
40423 612648 232229 559778 1225507 1602736 1529186 1397999 1519959 1649295 1383576 853353
40413 853353 620702 903174 1300040 1406311 1345462 1480348 1840097 2058985 1761205 904988
40403 904988 -89979 -513483 53908 1192879 1955331 1898545 1525091 1478737 1657450 1527843
40393 1527843 1054439 741663 776664 723581 307738 35873 587104 1791026 2694631 2678682
40383 2678682 2108886 1719414 1701751 1716009 1556113 1355484 1200299 1013861 898622 1118652
40373 1118652 1553695 1643853 1182929 703999 651467 639747 159800 -364441 -77360 894375
40363 894375 1477238 1245390 1063750 1718086 2666480 2795553 1949281 1045604 881730 1356919
40353 1356919 1821341 1835893 1575026 1584043 2026034 2252262 1549230 320739 -124405 797635
40343 797635 2208133 3038477 3299458 3486851 3474612 2914923 2216316 2067894 2267248 2075115
40333 2075115 1580100 1582858 2094087 2131157 1315740 594439 861964 1765128 2446159 2686408
40323 2686408 2701919 2553077 2480045 3149630 4684034 5913133 5533512 3787370 2170523
40314 2170523 1645136 1934047 2423320 2833954 2925331 2422037 1540827 925258 763035 558760
40304 558760 59336 -238628 76334 585803 719842 734870 1303415 2348611 3028652 2909723
40294 2909723 2504964 2449961 2678459 2757850 2667755 2801758 3330908 3951449 4290494 4309532
40284 4309532 4255093 4396940 4864035 5547903 6044783 5823101 4637651 2818831 1108440
40275 1108440 194773 346076 1313000 2445680 3014955 2683324 1777521 990924 718170
40266 718170 744074 652337 417840 401370 777257 1218757 1313059 1123263 1065117 1252543
40256 1252543 1284015 823310 133929 -222547 -70814 268016 438806 319661 -70891 -527238
40246 -527238 -543189 239664 1324538 1631374 799639 -244891 -466043 -46152 55402
40237 55402 -420223 -746337 -377280 325302 736471 773557 768584 948084 1326629 1808053
40227 1808053 2143639 2047128 1559032 1064482 794406 570138 187454 -243848 -514932 -570625
40217 -570625 -371831 155437 806204 1087544 846381 626317 1049391 2032734 2904994 3106102
40207 3106102 2528977 1437967 372312 -104730 81445 407129 405545 187918 54611
40198 54611 -38758 -207149 -183517 304580 954546 1276142 1376888 1739605 2345680 2685215
40188 2685215 2588737 2370721 2151384 1765083 1418895 1651490 2394251 2804119 2363083 1487992
40178 1487992 725891 78538 -426318 -292019 595169 1320450 1052612 386784 612040
40169 612040 1849373 2904576 2966198 2479896 2141749 1946539 1664970 1497061 1634421
40160 1634421 1680347 1149166 258837 -332239 -387532 -183304 114579 630356 1355886 2021687
40150 2021687 2436818 2560087 2217871 1228675 -52112 -777235 -484928 375929 1032501
40141 1032501 1181870 956754 503932 24201 -84259 335188 787298 689431 209721 -49236
40131 -49236 -79218 -407267 -965454 -941052 -115943 543802 318903 29618 951019 2836640
40121 2836640 4046235 3583725 2124535 949502 691405 1332736 2604995 3889001 4274233
40112 4274233 3326844 1653641 379067 142666 688860 1196883 926623 -152975 -1238900
40103 -1238900 -1469954 -918757 -490768 -756934 -1299226 -1394148 -932434 -377032 -133998 -274674
40093 -274674 -642538 -937499 -844787 -322852 294508 572095 287296 -433464 -1080345 -1041129
40083 -1041129 -319782 182032 -339658 -1409351 -1786181 -1165237 -531878 -647212 -1095048
40074 -1095048 -1222345 -1131880 -1170056 -1233692 -1249841 -1592946 -2270551 -2394320 -1309040 362454
40064 362454 1639859 2474313 3157397 3205997 2161159 970305 1035328 2054966 2327330
40055 2327330 1248370 18050 -389099 -481930 -974100 -1574550 -1766263 -1723975 -1721529 -1500695
40045 -1500695 -887854 -235935 315288 1155230 2202338 2560607 1924005 1366768 1793190
40036 1793190 2438173 1995663 585357 -539188 -753006 -406618 185994 918356 1272355
40027 1272355 708438 -333631 -836877 -620715 -409487 -514001 -492245 -257629 -462753
40018 -462753 -1396194 -2347662 -2512156 -1878540 -889198 126860 831057 834337 216756 -419103
40008 -419103 -769121 -1181870 -1868313 -2394238 -2455713 -2552609 -3202412 -3931755 -3857741 -3040336
39998 -3040336 -2407685 -2339771 -2168437 -1351616 -405393 -121271 -342336 -240661 347587 636703
39988 636703 122706 -590493 -682351 -324788 -285638 -602844 -559633 -26689 164380 -365543
39978 -365543 -638495 371669 2100859 3006897 2556040 1682429 1330007 1420933 1408902 1078815
39968 1078815 514405 -132485 -555880 -461121 -54182 67511 -298396 -722064 -853349 -870687
39958 -870687 -987166 -1012211 -741070 -373053 -178506 -47312 311894 940469 1615641 2057737
39948 2057737 2038405 1549545 909873 357688 -425144 -1835463 -3367318 -3847810 -2921893
39939 -2921893 -1591555 -891651 -733243 -545002 -303106 -196013 96356 885283 1656897
39930 1656897 1702161 1292360 1283670 1694008 1663922 899163 201225 260191 677535 614615
39920 614615 -87369 -819076 -932171 -318979 520638 911651 710479 498364 793187 1318296
39910 1318296 1553455 1723004 2429143 3385485 3487365 2374355 1008003 261085 -224503
39901 -224503 -1127302 -2076140 -2031578 -731014 947791 1941097 1851300 1055497 400172 552412
39891 552412 1242098 1439158 702504 -73603 128089 917710 1066558 389798 -12948 436664
39881 436664 789560 -63391 -1734221 -2765107 -2353623 -1026692 218011 875617 1065560
39872 1065560 1164083 1435192 1812778 1998290 1869005 1678299 1679456 1699118 1368360 725430
39862 725430 292767 498657 1224767 1974538 2319104 2147561 1671839 1269459 1169725 1190623
39852 1190623 883566 25264 -1090542 -1875598 -1879500 -1035001 295334 1388638 1479337
39843 1479337 307739 -1573364 -3138445 -3588270 -2758807 -1034964 918721 2388620
39835 2388620 2886337 2453383 1704036 1414257 1899531 2700287 2931835 2113598 719906
39826 719906 -231729 -235851 216027 332159 -46928 -514169 -857748 -1208241 -1430769 -1021132
39816 -1021132 76987 1067173 1191579 674775 251619 50692 -371786 -1017424 -1275227
39807 -1275227 -922926 -532741 -484266 -243599 744561 1919453 2161407 1315733 358126
39798 358126 -18179 -192067 -684454 -1147486 -896661 -52907 550452 512790 302677 461116
39788 461116 880822 1092298 893699 466322 164489 397658 1379188 2685050 3368890
39779 3368890 2916535 1870854 1115910 809324 561581 395174 671985 1057043 565447
39770 565447 -909903 -1989719 -1476897 -11585 831291 671988 517853 996633 1538044
39761 1538044 1518257 1185163 970920 724908 244926 -110121 -63197 -147275 -955724 -1985273
39751 -1985273 -2125565 -1242340 -431774 -550239 -1212686 -1540268 -1303304 -901902 -622484
39742 -622484 -392746 -107375 178455 363693 433023 518124 865106 1552421 2182944 2150720
39732 2150720 1387827 560783 281925 403118 409190 229180 177530 247134 54587 -436907
39722 -436907 -679461 -257140 568885 1286482 1724275 1912934 1751621 1284589 1037510 1509121
39712 1509121 2425657 3035709 3087039 2907386 2508418 1400245 -360556 -1656277 -1478932
39703 -1478932 -189138 1042267 1732821 2300773 2962992 3279010 2942940 2316721 1850784
39694 1850784 1466781 821189 -195070 -1434583 -2560626 -2954638 -2106710 -458761 670793
39685 670793 529150 -117475 -67458 641310 908949 265561 -492675 -534733 -99667 59383
39675 59383 -187255 -326056 -103963 69103 -309257 -1155032 -1850015 -1907282 -1478971 -1137894
39665 -1137894 -1191996 -1383188 -1336724 -1075701 -858210 -701156 -427983 -98353 33431 19618
39655 19618 253009 847227 1338175 1221298 531314 -298934 -913162 -1175211 -1083417 -784331
39645 -784331 -509125 -297804 68159 711989 1432931 1980531 2315278 2406198 2066941 1312919
39635 1312919 647932 600167 1079839 1524146 1551547 1136320 326538 -708615 -1426703 -1298430
39625 -1298430 -561502 -55406 -105460 -101512 497591 1280680 1545991 1454109 1791786 2682233
39615 2682233 3273041 2907170 2013789 1469821 1486976 1570668 1332032 872544 458915 253645
39605 253645 372157 791289 1102337 751812 -242680 -1107539 -1126476 -458184 117038 100955
39595 100955 -381262 -1028371 -1759380 -2590796 -3405819 -3991304 -4174204 -3882985 -3224142 -2507320
39585 -2507320 -2012395 -1716554 -1437768 -1213907 -1240369 -1403099 -1272115 -767266 -476204 -951434
39575 -951434 -1899558 -2477121 -2337108 -1996470 -2079465 -2502121 -2629970 -2138251 -1479012 -1355799
39565 -1355799 -1790944 -1976565 -1274163 -169831 220378 -374414 -937253 -475330 703065
39556 703065 1492412 1420233 979309 712249 613675 463029 170761 -339539 -1109681 -1845508
39546 -1845508 -2055652 -1647296 -1003185 -369752 362789 1135885 1552873 1533888 1591628 2025129
39536 2025129 2329917 1950296 1204428 810155 780667 524045 -84384 -488584 -368678 -73460
39526 -73460 58369 200657 571222 965146 1111821 1114910 1183048 1241473 1180751 1226332 1638635
39515 1638635 2185103 2315872 1858204 1245148 1029753 1364210 1945979 2307038 2167655
39506 2167655 1639354 1065428 602527 75955 -661401 -1417451 -1893026 -2042464 -1947699 -1507676
39496 -1507676 -632243 314128 713289 479514 278733 693231 1395800 1490089 624048 -530570
39486 -530570 -1010421 -603173 -1039 39383 -487510 -952345 -889871 -456076 -73732 120121
39476 120121 299942 598230 956503 1239036 1281180 920406 246874 -248170 -123695 381072
39466 381072 537253 85765 -335577 41923 1190489 2385407 3000163 2902788 2277883
39457 2277883 1474715 968059 1050541 1480278 1726788 1623969 1489910 1547115 1594459 1451546
39447 1451546 1400464 1835708 2610272 3070030 2776460 2006906 1485434 1689598 2408757 2962232
39437 2962232 2949368 2790349 3281012 4483982 5393689 5067497 3855269 2969710 2891801
39428 2891801 2851399 2096705 1021870 487608 452516 37196 -1112904 -2244536 -2496297
39419 -2496297 -1949047 -1333070 -1060371 -970908 -837059 -667862 -515641 -340203 -174786 -183111
39409 -183111 -387679 -468430 -23800 927467 1804739 1973371 1467423 1082611 1550672 2668381
39399 2668381 3521035 3600194 3338636 3362811 3616398 3616799 3287693 2998916 2893264 2747543
39389 2747543 2536703 2550731 2754116 2574025 1698796 702853 446550 1062465 1873367 2115933
39379 2115933 1441403 -31321 -1709769 -2722827 -2603818 -1787492 -1086666 -748269 -426099
39370 -426099 2314 165261 -119418 -397652 -116429 700804 1556697 1996572 1836541 1196007
39360 1196007 564260 535913 1148610 1720495 1701232 1467309 1830391 2877485 3795827 3879299
39350 3879299 3262597 2555113 2180399 2280845 2867146 3690350 4192092 3979298 3304685
39341 3304685 2803016 2797646 3119957 3537812 3999738 4400978 4496732 4288782 4223412 4663566
39331 4663566 5294338 5426614 4899968 4319106 4246750 4468390 4331145 3628181 2807457 2335028
39321 2335028 2181561 2047032 1833380 1680792 1672453 1752786 1931837 2344356 2991102 3555344
39311 3555344 3651905 3243953 2666261 2212916 1873912 1576943 1479293 1733101 2037069 1813724
39301 1813724 987585 277012 425598 1314365 2133345 2324317 2025254 1626321 1278158
39292 1278158 965172 747211 679988 636974 418250 -1097 -432139 -626013 -405488 262737
39282 262737 1223732 2186662 2860113 3031108 2606862 1752446 957058 698893 919897 1027692
39272 1027692 598066 -43265 -137803 620681 1645136 1931087 958546 -832659 -2418638
39263 -2418638 -3046644 -2727681 -1955972 -1165847 -600842 -451661 -724924 -1035226 -943248 -556616
39253 -556616 -409571 -662813 -855862 -627268 -241022 -137685 -385771 -893530 -1702217 -2604546
39243 -2604546 -2899416 -2174464 -1084783 -659076 -937794 -1010630 -409409 313042 609132
39234 609132 792992 1388087 2151762 2384974 1989906 1617612 1728543 1962885 1666433 823516
39224 823516 182974 394823 1185478 1623396 1230884 552548 416810 882955 1271711 1089786
39214 1089786 503096 -49442 -255951 69240 879674 1636404 1611380 699224 -408695
39205 -408695 -1032612 -1096493 -738071 134009 1465305 2651260 3062457 2770920 2276479
39196 2276479 1701057 797640 -322380 -1056270 -1027528 -509694 14439 373569 637237
39187 637237 831146 920574 875071 607469 50584 -570682 -785374 -431688 736 -119591
39177 -119591 -770398 -1295072 -1254172 -923765 -753702 -654806 -260720 240149 138501 -754638
39167 -754638 -1676681 -1957293 -2014953 -2631829 -3512783 -3453817 -2046665 -399738 203941 -247388
39157 -247388 -815148 -869977 -538423 -246820 -279955 -559884 -570218 161551 1256594 1676263
39147 1676263 1088294 402455 373122 378527 -512080 -1850152 -2387156 -2050406 -2009538 -2734857
39137 -2734857 -3327643 -3118777 -2663536 -2544560 -2328867 -1556667 -822493 -848584 -1163122 -791187
39127 -791187 181918 827332 882143 928549 1125777 886730 46887 -634788 -597928 -339207
39117 -339207 -585057 -1157928 -1300704 -825298 -327906 -339192 -757812 -1205365 -1580849 -2050166
39107 -2050166 -2619583 -2933331 -2597150 -1678118 -747147 -307617 -263219 -136194 215005 355532
39097 355532 -121286 -942045 -1355382 -977127 -215250 270257 371728 533965 971049 1272463
39087 1272463 1052432 671090 809763 1440634 1795947 1422709 672571 -25130 -696687
39078 -696687 -1272878 -1245244 -541715 -133395 -852975 -1983238 -2050978 -865557 328642
39069 328642 754314 950468 1406681 1581974 994346 255746 54878 -115041 -1089772 -2404956
39059 -2404956 -2754811 -1892193 -897674 -508554 -294559 237928 744256 744445 445339 302556
39049 302556 356267 525519 1014517 1828372 2316159 1843752 671770 -388701 -987163
39040 -987163 -1394238 -1852132 -2281783 -2499625 -2272509 -1343039 112894 1271106 1479997
39031 1479997 1113975 965636 980339 436553 -648021 -1279354 -916938 -213267 124932
39022 124932 343756 865945 1284820 1012960 416070 348931 841549 1166788 1086008 1119791
39012 1119791 1540096 1932004 1938701 1736743 1555828 1348279 1151098 1182019 1338783 1177616
39002 1177616 652585 314018 484030 809170 971658 1238428 1823895 2238859 1863939
38993 1863939 816270 -276875 -1053469 -1501031 -1637482 -1630422 -1864051 -2300719 -2142429
38984 -2142429 -822050 966224 1992487 2019815 1777924 1596549 1080431 193850 -417381
38975 -417381 -549987 -931443 -2006707 -2989291 -2812973 -1520506 -65669 860720 1195293
38966 1195293 1065662 684149 487941 756318 1169456 1260553 1187283 1500788 2204477 2618948
38956 2618948 2255075 1338196 374194 -346694 -683012 -535915 -65354 290226 237385 -139779
38946 -139779 -685630 -1397792 -2137955 -2436498 -1964956 -1095717 -652414 -1066159 -1973942 -2655885
38936 -2655885 -2671178 -2031551 -1000921 39679 598800 261249 -887749 -2080304 -2366655
38927 -2366655 -1452657 28994 1147782 1478744 1241325 866969 655520 710203 874338
38918 874338 728664 -14390 -989337 -1326257 -523453 1011736 2473324 3478632 4087031
38909 4087031 4222906 3638445 2557865 1818317 1955238 2465786 2498342 2090054 2033227 2441803
38899 2441803 2274203 822546 -950274 -1445938 -562243 205862 -68726 -470069 320390
38890 320390 2065304 3278616 3100694 2017799 849929 -122767 -876163 -1212093 -999892
38881 -999892 -457143 90293 439595 358237 -389177 -1591262 -2513993 -2601848 -2020634 -1267458
38871 -1267458 -579593 -72374 -80925 -765273 -1521776 -1433191 -392325 766572 1426865 1936699
38861 1936699 2843302 3818739 3897131 2637374 581818 -1395137 -2749554 -3261074 -2880429
38852 -2880429 -1865682 -774182 -30416 352208 487647 345329 -11642 -261720 -295295
38843 -295295 -565852 -1446836 -2437638 -2667967 -2142413 -1748323 -1932907 -2197918 -2202377 -2456655
38833 -2456655 -3280533 -3856047 -3237558 -1798033 -691757 -234675 124374 472869 327449
38824 327449 -115670 46725 833176 1009893 -51460 -1273110 -1469711 -1046068 -1032708
38815 -1032708 -1257422 -811384 135496 428662 -198576 -642855 -82421 927486 1376731
38806 1376731 990402 132877 -758269 -1251488 -1029363 -297035 359569 725095 1059298
38797 1059298 1354014 1205808 676746 499162 991285 1474339 1262451 554737 -185033
38788 -185033 -978321 -1753514 -1787138 -715843 465272 572605 62025 435354 1908475
38779 1908475 2981654 2577935 1401603 667942 523960 423575 227535 85657 -204048
38770 -204048 -857133 -1455280 -1413619 -903929 -615293 -700012 -614046 -14341 753980 1154753
38760 1154753 1013584 516891 34909 -31276 398997 854044 768780 162012 -511055 -1101368
38750 -1101368 -1814474 -2471849 -2395713 -1367821 -159282 388301 432467 725160 1391471
38741 1391471 1777916 1526524 1173239 1402386 2105098 2537420 2241984 1503526 916517
38732 916517 725144 670803 414148 15711 -87698 365444 1027831 1236400 750359 19429
38722 19429 -362518 -322066 -301905 -680901 -1307977 -1572152 -915159 586121 2081569 2587365
38712 2587365 1940758 979857 592656 755728 775131 298736 -339267 -748341 -960355 -1114831
38702 -1114831 -1095120 -784058 -400696 -264440 -397559 -601392 -717679 -566056 105903 1238715
38692 1238715 2233861 2525814 2223029 1755228 1103895 17974 -1086803 -1252014 -256873
38683 -256873 907958 1275181 1077639 1187732 1812894 2364567 2392650 2043348 1650696 1381928
38673 1381928 1299359 1359184 1321119 997450 577425 373454 297899 -19376 -617843 -1149523
38663 -1149523 -1479530 -1873253 -2413486 -2655150 -2174671 -1240517 -659699 -1003153 -2046025
38654 -2046025 -2881144 -2665032 -1509525 -564159 -828347 -1885495 -2304173 -1402270 -37186
38645 -37186 652410 695684 907129 1461772 1631255 939128 -63478 -423024 164906 1148243
38635 1148243 1756800 1662771 1100411 489685 31753 -272741 -322409 60052 710120 1075196
38625 1075196 859153 450105 381787 624794 837260 1082351 1673336 2324116 2139646 742640
38615 742640 -1068278 -2160716 -2279410 -2090716 -2265699 -2895991 -3688692 -4332819 -4600718
38606 -4600718 -4349447 -3588007 -2516400 -1484709 -911565 -1098137 -1925419 -2739697 -2763668
38597 -2763668 -1821603 -635054 -215530 -858157 -1849026 -2303475 -2146157 -1968578 -1998460
38588 -1998460 -1705220 -628495 855875 1989309 2513689 2632804 2385952 1692541 899686
38579 899686 587342 747127 777731 432349 131936 115067 -36906 -619363 -1171881 -1192608
38569 -1192608 -1001761 -1235857 -1808422 -2057102 -1732181 -1165492 -558075 197655 935140
38560 935140 1128764 633927 17098 -140758 65120 111989 -267836 -862825 -1249695 -1119015
38550 -1119015 -475307 364955 1044724 1431946 1526321 1247657 579017 -175301 -613722 -714029
38540 -714029 -791999 -1024430 -1348686 -1777783 -2374591 -2884816 -2869016 -2328726 -1782308 -1588039
38530 -1588039 -1615439 -1708500 -1960322 -2298602 -2328501 -1952038 -1703617 -2065772 -2815908 -3425475
38520 -3425475 -3710410 -3661557 -3058576 -1826638 -481018 352178 621021 539122 -52607
38511 -52607 -1298019 -2557355 -2907601 -2405925 -2036053 -2297864 -2640201 -2456687 -1806140
38502 -1806140 -833448 665169 2543077 3878693 3962668 3246591 2638341 2247851 1562028
38493 1562028 573898 -100031 -193843 -126652 -222352 -222011 160937 656897 733677 234994 -487118
38482 -487118 -916706 -739539 -41949 740287 1175330 1178967 946586 650407 373478 215875
38472 215875 215336 261061 335585 660820 1222951 1346074 336744 -1445743 -2803342 -3136849
38462 -3136849 -3019591 -3045471 -2810808 -1650104 105750 1371768 1631744 1354085 1148134
38453 1148134 1130367 1186339 1297043 1427497 1500792 1621647 1963102 2344243 2337644 1925232
38443 1925232 1590194 1527003 1200608 49763 -1673164 -3112331 -3642833 -3237232 -2288979
38434 -2288979 -1394799 -1030058 -1057535 -809366 -50648 461162 -58135 -1164899 -1654023
38425 -1654023 -1206163 -728324 -906100 -1290262 -1236884 -962047 -1000942 -1218939 -1161598 -983260
38415 -983260 -1130376 -1304084 -729249 450551 1014569 320490 -637278 -441717 945837
38406 945837 2244414 2455572 1772184 945775 333775 -244279 -1063414 -2145536 -3215123
38397 -3215123 -3856939 -3769703 -2944783 -1646693 -311058 541830 534016 -205096 -1006844 -1243931
38387 -1243931 -942429 -647368 -720396 -993130 -1135220 -1118216 -1161668 -1346037 -1460399 -1250626
38377 -1250626 -729368 -189946 57661 -94717 -581846 -1264043 -1880607 -2041692 -1532997
38368 -1532997 -645596 25813 154318 -159682 -761480 -1568581 -2205733 -2013565 -834156
38359 -834156 511478 991521 461477 -388749 -1001824 -1384872 -1663295 -1749640 -1583065 -1320506
38349 -1320506 -1144358 -1110091 -1216648 -1411804 -1577087 -1726263 -2044858 -2419656 -2222386 -1119088
38339 -1119088 125381 386449 -343667 -1025107 -1132454 -1166665 -1347796 -889845 725161
38330 725161 2590305 3373957 2947492 2203173 1703166 1367178 1163353 1202939 1297336 1208700
38320 1208700 1196967 1548981 1740155 965058 -528110 -1560098 -1609693 -1413812 -1728599
38311 -1728599 -2271793 -2254858 -1355332 146249 1649612 2427708 2140015 1411749 1298511
38302 1298511 1911916 2225283 1550298 484156 -66168 -107042 -212058 -547723 -933783
38293 -933783 -1430130 -2150923 -2781511 -2916999 -2673285 -2440170 -2281448 -2079949 -1968466 -2065968
38283 -2065968 -2098314 -1870565 -1782427 -2192654 -2591245 -2229337 -1379438 -1064062 -1550288 -2006534
38273 -2006534 -1772243 -1113427 -490630 91823 621773 685332 47951 -870342 -1546335 -1963045
38263 -1963045 -2289174 -2395086 -2139934 -1773419 -1573734 -1370171 -902472 -420427 -383725 -632856
38253 -632856 -379042 810324 2285126 2784711 1671667 -292360 -1485720 -930852 744876
38244 744876 2055358 2287322 2005131 1936827 1956023 1507973 586927 -225526 -501999 -331208
38234 -331208 -55998 6408 -325710 -971036 -1619402 -2061536 -2320470 -2312129 -1719830 -537919
38224 -537919 585806 1022553 958950 1021759 1292013 1287430 850440 392216 153085 -162465
38214 -162465 -788039 -1465247 -1896031 -2151935 -2295386 -2035489 -1211417 -297533 70240 -115589
38204 -115589 -382193 -567155 -937575 -1534795 -1932485 -1809976 -1352941 -868534 -367215 167138
$$ [...]
##END NTUPLES=NMR SPECTRUM
##END=
