##TITLE=31P_DE-80H_X3
 64 sc D2O
 26.2.2025
##JCAMPDX= 6.0         $$ Bruker NMR JCAMP-DX V2.0
##DATA TYPE= NMR SPECTRUM
##DATA CLASS= NTUPLES
##ORIGIN= UXNMR, Bruker Analytische Messtechnik GmbH
##OWNER= root
$$ XWIN-NMR		Version 3.5
$$ Wed Jul 16 14:54:09 2025 Russian Standard Time (UT+4h)  Yarkov@DPX200
##.OBSERVE FREQUENCY= 81.013821
##.OBSERVE NUCLEUS= ^31P
##.ACQUISITION MODE= SIMULTANEOUS
##.ACQUISITION SCHEME= undefined
##.AVERAGES= 64
##.DIGITISER RES= 17
##SPECTROMETER/DATA SYSTEM= spect
##.PULSE SEQUENCE= zgpg30
##.SOLVENT NAME= MeOD
##.SHIFT REFERENCE= (INTERNAL, MeOD, 0, 198.062)
##AUDIT TRAIL= $$ (NUMBER, WHEN, WHO, WHERE, WHAT)
$$ ##TITLE= Audit trail, XWIN-NMR		Version 3.5
$$ ##JCAMPDX= 5.01
$$ ##ORIGIN= Bruker BioSpin GmbH
$$ ##OWNER= Yarkov
$$ C:/Bruker/XWIN-NMR/data/yarkov2/nmr/P31/2/pdata/1/auditp.txt
$$ ##AUDIT TRAIL=  $$ (NUMBER, WHEN, WHO, WHERE, WHAT)
(   1,<2025-07-16 14:53:38.82 +0400>,<Yarkov>,<DPX200>,
      <created by zg, POWCHK disabled, PULCHK disabled
       configuration hash MD5:
       00 E9 B6 7A A2 85 ED C7 34 08 36 98 17 FE 4E 26
       data hash MD5: 32K
       75 23 7D 4B AF D6 63 CE 65 93 50 67 5F 7B FE 8F>)
(   2,<2025-07-16 14:53:46.29 +0400>,<Yarkov>,<DPX200>,
      <Start of raw data processing
       efp BC_mod = 2 LB = 1.5 FT_mod = 6 PKNL = 1 PHC0 = 1662.243 PHC1 = 49.15953 SI = 64K 
       data hash MD5: 64K
       8B 0A 16 44 11 F0 71 C0 C8 D4 AC B5 7A DF 8D 0D>)
$$ ##END=
$$ 
$$ hash MD5
$$ 95 12 D3 48 F8 0E 82 30 3A 62 2A 0F 81 4F 6A 4B
##$RELAX= 
##$RELAX= 
##$RELAX= 
##$RELAX= 
##$RELAX= 
##$RELAX= 
##$RELAX= 
##$RELAX= 
$$ Bruker specific parameters
$$ --------------------------
##$DU= <C:/Bruker/XWIN-NMR>
##$EXPNO= 2
##$NAME= <P31>
##$PROCNO= 1
##$TYPE= <nmr>
##$USER= <yarkov2>
##$AMP= (0..31)
100 100 100 100 100 100 100 100 100 100 100 100 100 100 100 100 100 100 
100 100 100 100 100 100 100 100 100 100 100 100 100 100 
##$AQSEQ= 0
##$AQ_mod= 1
##$AUNM= <au_zg>
##$AUTOPOS= <>
##$BF1= 81.014009
##$BF2= 200.13
##$BF3= 200.13
##$BF4= 200.13
##$BF5= 200.13
##$BF6= 200.13
##$BF7= 200.13
##$BF8= 200.13
##$BYTORDA= 1
##$CFDGTYP= 0
##$CFRGTYP= 5
##$CHEMSTR= <none>
##$CNST= (0..31)
1 1 145 1 1 1 1 1 1 1 1 1 1 1 1 1 1 1 1 1 1 1 1 1 1 1 1 1 1 1 1 1 
##$CPDPRG= <waltz16>
##$CPDPRG1= <>
##$CPDPRG2= <waltz16>
##$CPDPRG3= <>
##$CPDPRG4= <mlev>
##$CPDPRG5= <mlev>
##$CPDPRG6= <mlev>
##$CPDPRG7= <mlev>
##$CPDPRG8= <mlev>
##$CPDPRGB= <>
##$CPDPRGT= <>
##$D= (0..31)
0 1 0 0 0 0 0 0 0 0.06 0 0.03 2e-05 3e-06 0 0 0.0002 0 0 0 0 0 0 0 0 0 
0 0 0 0 0 0 
##$DATE= 1752663218
##$DBL= (0..7)
120 120 120 11 120 120 24 19 
##$DBP= (0..7)
150 150 150 150 150 150 150 150 
##$DBP07= 0
##$DBPNAM0= <>
##$DBPNAM1= <>
##$DBPNAM2= <>
##$DBPNAM3= <>
##$DBPNAM4= <>
##$DBPNAM5= <>
##$DBPNAM6= <>
##$DBPNAM7= <>
##$DBPOAL= (0..7)
0.5 0.5 0.5 0.5 0.5 0.5 0.5 0.5 
##$DBPOFFS= (0..7)
0 0 0 0 0 0 0 0 
##$DE= 6
##$DECBNUC= <off>
##$DECIM= 4
##$DECNUC= <off>
##$DECSTAT= 4
##$DIGMOD= 1
##$DIGTYP= 9
##$DL= (0..7)
0 0 52 120 120 21 21 25 
$$ [...]
##$SUBNAM2= <"">
##$SUBNAM3= <"">
##$SUBNAM4= <"">
##$SUBNAM5= <"">
##$SUBNAM6= <"">
##$SUBNAM7= <"">
##$SUBNAM8= <"">
##$SUBNAM9= <"">
##$SW= 400.765351723535
##$SWIBOX= (0..15)
0 1 3 0 0 0 0 0 0 0 0 0 0 0 0 0 
##$SW_h= 32467.5324675325
##$TD= 32768
##$TD0= 1
##$TE= 0
##$TE2= 300
##$TE3= 300
##$TEG= 300
##$TL= (0..7)
0 120 53 12 22 120 120 120 
##$TP= (0..7)
150 150 150 150 150 150 150 150 
##$TP07= 0
##$TPNAME0= <>
##$TPNAME1= <>
##$TPNAME2= <>
##$TPNAME3= <>
##$TPNAME4= <>
##$TPNAME5= <>
##$TPNAME6= <>
##$TPNAME7= <>
##$TPOAL= (0..7)
0.5 0.5 0.5 0.5 0.5 0.5 0.5 0.5 
##$TPOFFS= (0..7)
0 0 0 0 0 0 0 0 
##$TUNHIN= 0
##$TUNHOUT= 0
##$TUNXOUT= 0
##$USERA1= <user>
##$USERA2= <user>
##$USERA3= <user>
##$USERA4= <user>
##$USERA5= <user>
##$V9= 5
##$VALIST= <valist>
##$VCLIST= <CCCCCCCCCCCCCCC>
##$VD= 0
##$VDLIST= <DDDDDDDDDDDDDDD>
##$VPLIST= <PPPPPPPPPPPPPPP>
##$VTLIST= <TTTTTTTTTTTTTTT>
##$WBST= 1024
##$WBSW= 4
##$XGAIN= (0..3)
0 0 0 0 
##$XL= 0
##$YL= 0
##$YMAX_a= 1734
##$YMIN_a= -347
##$ZGOPTNS= <>
##$ZL1= 120
##$ZL2= 120
##$ZL3= 120
##$ZL4= 120
##$ABSF1= 0
##$ABSF2= 0
##$ABSG= 0
##$ABSL= 0
##$ALPHA= 0
##$AQORDER= 0
##$ASSFAC= 0
##$ASSFACI= 0
##$ASSFACX= 0
##$ASSWID= 0
##$AUNMP= <proc_1d>
##$AZFE= 0.1
##$AZFW= 0.5
##$BCFW= 0
##$BC_mod= 2
##$BYTORDP= 0
##$COROFFS= 0
##$CY= -3
##$DATMOD= 1
##$DC= 0
##$DFILT= <>
##$DTYPP= 0
##$F1P= 0
##$F2P= 0
##$FCOR= 1
##$FTSIZE= 65536
##$FT_mod= 6
##$GAMMA= 0
##$GB= 0
##$INTBC= 1
##$INTSCL= 9.790993e-09
##$ISEN= 30
##$LB= 1.5
##$LEV0= 0
##$LPBIN= 0
##$MAXI= 10000
##$MC2= 0
##$MEAN= 0
##$ME_mod= 0
##$MI= 50
##$NCOEF= 0
##$NC_proc= -14
##$NLEV= 6
##$NOISF1= 182.463
##$NOISF2= 159.3651
##$NSP= 0
##$NTH_PI= 0
##$NZP= 0
##$OFFSET= 198.0616
##$PC= 4
##$PHC0= 1662.243
##$PHC1= 49.15953
##$PH_mod= 1
##$PKNL= yes
##$PPARMOD= 0
##$PSCAL= 0
##$PSIGN= 0
##$REVERSE= no
##$SF= 81.0140089999434
##$SI= 65536
##$SIGF1= 159.3651
##$SIGF2= -187.1042
##$SINO= 113.3802
##$SIOLD= 16384
##$SREGLST= <1H.CDCl3>
##$SSB= 0
##$STSI= 65536
##$STSR= 0
##$SW_p= 32467.5324675325
##$SYMM= 0
##$S_DEV= 0
##$TDeff= 32768
##$TDoff= 0
##$TI= <>
##$TILT= no
##$TM1= 0
##$TM2= 0
##$TOPLEV= 0
##$USERP1= <user>
##$USERP2= <user>
##$USERP3= <user>
##$USERP4= <user>
##$USERP5= <user>
##$WDW= 1
##$XDIM= 65536
##$YMAX_p= 436212486
##$YMIN_p= -100915819
$$ End of Bruker specific parameters
$$ ---------------------------------
##NTUPLES= NMR SPECTRUM
##VAR_NAME=  FREQUENCY,     SPECTRUM/REAL,   SPECTRUM/IMAG
##SYMBOL=    X,             R,               I
##VAR_TYPE=  INDEPENDENT,   DEPENDENT,       DEPENDENT
##VAR_FORM=  AFFN,          ASDF,            ASDF
##VAR_DIM=   65536,         65536,           65536
##UNITS=     HZ,            ARBITRARY UNITS, ARBITRARY UNITS
##FACTOR=    0.49542278885378, 1,            1
##FIRST=     16045.7642231865, 0,            0
##LAST=      -16421.768244346, 0,            0
##MIN=       -16421.768244346, -100915819,   0
##MAX=       16045.7642231865, 436212486,    0
$$ Real data points
##PAGE= N=1
##DATA TABLE= (X++(R..R)), XYDATA
$$ [...]
##PAGE= N=2
##DATA TABLE= (X++(I..I)), XYDATA
7339a1991860N703068K484112l017971m382496j13155M987027O428172N243530
7331E340427M863902N195059L158920j596040n019643l458147K176642P648003
7323A8309123Q926786M476351l411428r127117q430284l621309j330114m054880
7315A737128p039750n326758m71219K721970L137221L006156K700356N97630k519658
7306a456924l560130k031872p67125q81532K6443L093021N303524L835665N72044
7297D133114l65160K156779N605389O824678M213532j203079n307885l906515
7289A2150853J667952M484818L04857o458656q456199m904710j142979k01131
7281b555195P4850J467217K004782k14927l493532m820723l328233j43493L100927
$$ y = [-11991860, -6288792, -3804680, -6822651, -11205147, -11318302, -6331275, 96897, 5340427, 10204329, 15399388, 18558308, 16962268, 11942625, 8484478, 10661120, 18309123, 27235909, 31712260, 28300832, 19173715, 10743431, 7122122, 5792008, 1737128, -5302622, -10629380, -11100599, -8378629, -5241408, -2235252, 465104, 1062734, -1456924, -5017054, -7048926, -7816051, -8697583, -8671140, -5578119, -274595, 3561070, 4133114, 3767954, 5924733, 11530122, 18354800, 22568332, 21365253, 16057368, 12150853, 13818805, 18303623, 18608480, 12149824, 3693625, -1211085, -2354064, -2555195, -2480345, -1013128, 991654, 776727, -2716805, -7537528, -10865761, -11009254, -7908327]
7272g908327M664783L632272J230607m50618j091936j566572j444242J7817J137066
7263a779150q3731j482493R47179N940025P426378L389965j162881k090133j324102
7254I781057j375057o01990J799593J733168l218666p688316n405255J116939
7246c858527M279659K271279l65592j127333j557408j779994O1212K809796L095002
7237C828094J561185K135942M336320K747246l999794r739530r063672m163302
7229a2357511m18931N44823J90826q19677k121691j715402J840775O347290P684086
7220h25412M340900j081192m575311m402383k343459j106009n89006J434407M367979
7211d779486L970665j112823n701710m885919j058409P34590R64238K859796M668611
$$ y = [-7908327, -3243544, 388728, 1619335, 1168717, 76781, -1489791, -2934033, -2916216, -1779150, -1862881, -3345374, -2398195, 3541830, 10968208, 14358173, 13195292, 11105159, 9781057, 8406000, 7804010, 9603603, 11336771, 8118105, 429789, -4975466, -3858527, 421132, 2692411, 2326819, 1199486, -357922, -2137916, -2076704, 733092, 3828094, 5389279, 7525221, 11861541, 14608787, 10608993, 869463, -8194209, -12357511, -12776442, -12231619, -12040793, -12860470, -14982161, -16697563, -14856788, -8509498, -825412, 3515488, 2434296, -2141015, -6543398, -8886857, -9992866, -10581872, -9147465, -4779486, -808821, -1921644, -7623354, -12509273, -13567682, -12833092, -11868854, -9009058, -4340447]
7202d340447K571687p43098O06731M655999L636816k428507m639125K8932L478186
7193B827174Q7733m502437l719133N0309K273868M280561P068663N303724l647195
7184A0023267j1368571q570635J361064P899048P850739N340835J929959l101265
7176A1364441n949103k523662K186991n38423q932765j1985337n475159K949628
7168a8903389O307441O597789P614767P682373L951996j838920n899393o805625
7160a292961n029325j647987J081808J442963J129933K634044M146567K000136
7152D465178k104127k363561J795776L805611n82475p212457r447295n971709
7144a7615059k98348M109686O035675O069761N215867K944614k035455p359116
$$ y = [-4340447, -1768760, -2511858, -1905127, 2750872, 6387688, 3959181, -679944, -651012, 2827174, 2914907, -1587530, -5306663, -5256354, -2982486, 1298075, 8366738, 13670462, 10023267, -1345304, -9915939, -8554875, -655827, 7194912, 12535747, 14465706, 11364441, 5415338, 2891676, 5078667, 4540244, -4392521, -16377858, -21853017, -18903389, -12595948, -5998159, 1616608, 9298981, 13250977, 11412057, 5512664, -1292961, -6322286, -7970273, -6888465, -5445502, -4315569, -1681525, 2465042, 4465178, 2361051, -2510, 1793266, 5598877, 5016402, -2196055, -11643350, -17615059, -17913407, -13803721, -7768046, -1698285, 3517582, 6462196, 4426741, -2932375]
7136b932375p038083j48358M702589L10080p269549o517516K120671O880372K491903
7127g400266l589371m565643l014481k480185n95467L866054N827554K224453
7119i727352j617482k77889L108995K603169j397457m482761n000148l397855
7111b0188780N17124M934326N489644J830098m61770J220058J817315k143858
7103f985843n410218k670527J918146J563074k062890k742410m55643K01171r98565
7094a7643705q83052l68402k779372o239891n374972J62715N345640P035587N998885
7085a4746567L311884K41862m02349J763737K130115j899170n003731j747519
7077a6351738L642320L281476k010604n145940m587712m090374l028474K250622
$$ y = [-2932375, -9970458, -10118816, -5416227, -5106147, -12375696, -18893212, -16772541, -9892169, -7400266, -10989637, -15555280, -18569761, -21049946, -21645413, -17779359, -11951805, -9727352, -11344834, -11622723, -8513728, -5910559, -7308016, -11790777, -16790925, -20188780, -19671656, -14737330, -9247686, -7417588, -7879358, -6659300, -4841985, -6985843, -12396061, -15066588, -13148442, -11585368, -13648258, -16390668, -16846311, -16645140, -17643705, -18526757, -18895159, -21674531, -27914422, -33289394, -33126679, -27781039, -20745452, -14746567, -11434683, -11192821, -11595170, -9831433, -7701318, -9600488, -14604219, -16351738, -12709418, -9427942, -11438546, -16584486, -21172198, -25262572, -28291046, -26040424]
7069b6040424Q490216Q232852K798884J210190M712785M140360l951100r992775
7061a0399012n829870L200582P157162M659197N51296k977600n971215o327136
7053a5936596k504364K448677M577382M119001L397555K795615J921707J482294
7045B301271J341873J03368j517886r91968R42924O45717j446664m83355L850994
7036D746274N168701P68902l102216j335669J661541j28588m216059m550643j612792
7027b600549P821K68347K202792M531142L326253m51019j942817j15418J456868
7018F683420Q59640m65246j684729l352821m721470m470727l391608k834343k027820
7009a5405704l42315K46054j136312j140121K546771O136704N434367L086608
$$ y = [-26040424, -17550208, -9317356, -6518472, -5308282, -595497, 3544863, -406237, -10399012, -16228882, -13028300, -5871138, -1211941, -660645, -3638245, -9609460, -15936596, -18440960, -15992283, -11414901, -7295900, -3898345, -1102730, 818977, 2301271, 3643144, 3746512, 2228626, 1236658, 2179582, 2825299, 1378635, 895280, 4746274, 9914975, 10683877, 7581661, 6245992, 7907533, 7778945, 3562886, -987757, -2600549, -2592728, -2324381, -121589, 4409553, 7735806, 7284787, 5341970, 5226552, 6683420, 7543060, 7077814, 5393085, 2040264, -2681206, -7151933, -10543541, -13377884, -15405704, -15748019, -15501965, -16638277, -17778398, -15231627, -9094923, -3660556, -573948]
7001e73948L506431L994782o94764p186748o654606R19519N556966K196535k684861
6992a620694k808960j389201l105475m398078O01797Q984154J1628155N271260
6984A3162958l970997q642344o902645j709673K838982L733065O85323l261246
6976d066577m293018j704557J557702K371601P46721o41493L8812J356951O37773
6967c996085j747301k169245R97260M230865L515010K17713j206948j70982k64465
6958e94178k686159l961108j565460K032854K988557Q21894k389534m979316n773961
6949a6106411l483604J423252N457448N063322P27304l116363k489277J997733
6941a0526596N481814M045767k84700j695123J273040K937093j152304o328178
$$ y = [-573948, 2932483, 6927265, 6232501, -954247, -7608853, -6689334, -1132368, 1064167, -1620694, -4429654, -5818855, -8924330, -13322408, -12720611, -3736457, 7891698, 13162958, 9191961, 549617, -6353028, -8062701, -5223719, -1490654, -805331, -4066577, -8359595, -10064152, -8506450, -6134849, -5388128, -6029621, -5990809, -4633858, -3996085, -5743386, -7912631, -6915371, -2684506, 830504, 1048217, -158731, -329713, -594178, -3280337, -7241445, -8806905, -6774051, -3785494, -2963600, -5353134, -10332450, -16106411, -19590015, -18166763, -12709315, -7645993, -6918689, -10035052, -12524329, -10526596, -5044782, -999015, -1283715, -2978838, -1705798, 1231295, 78991, -6249187]
6933f249187m621750L291841Q374066N487633j039994n270797o526104n936385
6925a2490677k503198L224389O438019L674815k150090n872689n877776k818822
6917a8376029L021688R208600J0537690N756822Q21588M28022P97823k968417
6909I227787p021776m471869K227624M008048q78933n098850m552448k896872
6901i457289k358408Q7465M143160L476264l193672o950163j418675O605382P079342
6892a986594J306394k107412j284741j331350l139917k102280K065819L490645
6884e089436j94405m103236m233877k619306k023599j788863j491136k587088
6876b4130946l586114O7224P607925J0826723N335996j772308j701161L381951
$$ y = [-6249187, -10870937, -7579096, 794970, 6282603, 5242609, -28188, -6554292, -12490677, -14993875, -11769486, -5331467, -1656652, -3806742, -9679431, -15557207, -18376029, -15354341, -6145741, 4391949, 10148771, 10970359, 11398381, 12196204, 9227787, 2206011, -2265858, -38234, 3969814, 3090881, -2007969, -6560417, -9457289, -11815697, -11728232, -7585072, -4108808, -7302480, -14252643, -15671318, -9065936, -1986594, -680200, -2787612, -4072353, -5403703, -8543620, -10645900, -8580081, -5089436, -5283841, -9387077, -13620954, -16240260, -18263859, -20052722, -21543858, -24130946, -27717060, -27649836, -20041911, -9215188, -3879192, -5651500, -7352661, -3970710]
6868c970710M717135P09625j775095J135925N157516N010519P64891m319013p502205
6859g1412o963114k743945J578254J871530j168195l105729k284646j088526o63324
6850a4639107N47652K182108J369388j348201q85509M624675R627164Q318056
6842I796226K272013k750996m430764m610307m984158n667760o252786n573367
6834b2201899k403172J564354K291111p47217k673508n335M298201N891037N197709
6825h788719M456131K713433j056124l540232j849153M28497j342503m046353
6817a3025023j311079M832913N768493R4060l592512j51818M465790L382074q26248
6808c63350j835836p9039n77412l508268l983482m99972K349892P03195l173115
$$ y = [-3970710, 746425, 1456050, -319045, 816880, 5974396, 10984915, 11749806, 7430793, -71412, -7034526, -9778471, -8200217, -6328687, -7496882, -10602611, -12887257, -13975783, -14639107, -14091455, -11909347, -10539959, -11888160, -12773669, -8148994, 1478170, 9796226, 12068239, 9317243, 4886479, 276172, -4707986, -10375746, -16628532, -22201899, -24605071, -23040717, -20749606, -21496823, -24170331, -24175666, -19877465, -13986428, -8788719, -4332588, -1619155, -2675279, -6215511, -8064664, -7636167, -8978670, -13025023, -14336102, -9503189, -3734696, -3640636, -7233148, -7384966, -2919176, 462898, -363350, -2199186, -2278225, -2855637, -6363905, -10347387, -10847359, -8497467, -7794272, -10967387]
6799a0967387m257406j360778J665092R60306k356325l276715P94733O170229
6791a2628251O866456J761158m146712n422599j433137L858957N771355L025873
6783b346900p21560o77459K518493K743969k531833o917060l876944K420385K391685
6774f997224m193153p305125j573548O365694Q465757N511765K405707P6186k302170
6765D53889k557135P22579L654635K300240p59211r23776J71158k683728q831502
6756h452851j1258374n811999L756373J0563937J1146997P069920K535547M71421
6748A0020971j97436k275439m976573m252144J42814K532004n31630m518251l722159
6739g777843L01324K363261K068673K500119L249363J406298k060680l262367
$$ y = [-10967387, -15224793, -16585571, -14920479, -13960173, -16316498, -19593213, -18798480, -12628251, -5761795, -4000637, -8147349, -13569948, -15003085, -11144128, -5372773, -2346900, -3068460, -3745919, -1227426, 1516543, -1015290, -7932350, -11809294, -9388909, -6997224, -11190377, -18495502, -20069050, -13703356, -5237599, 274166, 2679873, 2756059, 453889, -2103246, -1380667, 2273968, 4574208, 3814997, 2891221, 3062379, 378651, -8452851, -19711225, -25523224, -21766851, -11202914, -55917, 7014003, 9549550, 10020971, 9823535, 7548096, 2571523, -1680621, -1537807, 994197, 462567, -4055684, -7777843, -7476519, -5113258, -3044585, -544466, 2704897, 4111195, 2050515, -1211852]
6731a211852j900193j163277j999208k841337l800246n542260n518523j493602
6723b5470498K697370J821094j701760j286892K162442J322325m180843n476985
6715c0113747J511235R105022R515471N177059K020874M5402k799187l849154
6707i387025n41329K772695O64980l996926m063185Q21559M535551M413562L472017
6698a308101L146852J262416j706444j385648K806961M685211J13677n526001
6690B088923l827920M825808J1320804R757779M336409J994442K298401m14157
6682C2380489o485349r057551m619935O05493m97300n302421o158215k718679
6674a853468j521897m214758n129457j971320O1579j776359k395209J339952L685336
$$ y = [-1211852, -3112045, -4275322, -6274530, -9115867, -12916113, -18458373, -23976896, -25470498, -22773128, -20952034, -22653794, -23940686, -21778244, -20455919, -24636762, -30113747, -28602512, -19497490, -9982019, -4804960, -2784086, -2738684, -5537871, -9387025, -9928354, -7155659, -6490679, -10487605, -14550790, -13729231, -9193680, -4780118, -1308101, 1838751, 3101167, 1394723, 9075, 2816036, 7501247, 7614924, 2088923, -1738997, 3086811, 14407615, 24165394, 28501803, 30496245, 32794646, 32380489, 25895140, 16837589, 12217654, 12823147, 12325847, 7023426, 865211, -1853468, -3375365, -7590123, -12719580, -14690900, -14629321, -16405680, -18800889, -17460937, -13775601]
6665a3775601J84793k582836K971361J1110011R975780N14841m324577O9257L128754
6656G271783l016104j0258871p266627K689258O991194K543355j456359Q46290
6648a656081L864301J393882k837752j816956K633500K209301m824172j0527109
6640a1561086q693445k867047M35434J066161K658957M745787M130225K130541
6632g954473L176898O278262N204735j275266o358787n278064j845942j008981
6624i061618j127905J055870L347853K528633J376125L840978O480061K928319
6616A1368316m739610p621949l060694J942681J799257n96925m50597J763441
6608D03920L160665L302645K671421N92067j966979j466280K777113N675466K675769
$$ y = [-13775601, -13590808, -16173644, -13202283, -2092272, 7883508, 8398349, 4073772, 4143029, 7271783, 4255679, -6003192, -13269819, -10580561, -3589367, -1046012, -2502371, -1656081, 2208220, 3602102, 764350, -1052606, 1580894, 3790195, -1033977, -11561086, -20254531, -23121578, -22686144, -21619983, -18961026, -14215239, -10085014, -7954473, -4777575, 1500687, 6705422, 5430156, -928631, -6206695, -8052637, -9061618, -10189523, -9133653, -5785800, -3257167, -1881042, 1959936, 8439997, 11368316, 6628706, -993243, -4053937, -2111256, -311999, -908924, -1359521, 403920, 3564585, 6867230, 9538651, 10130718, 8163739, 6697459, 9474572, 15150038, 17825807]
6599A7825807l691618p217152n816817k413147K59385K085379L532910M235145
6591H799892L728182K001702m16929k241353k447217j983757k548358l239210
6583A652952j402936K161574K778553q97588l364464p8457M631674L107992m024642
6574D564658q324609n817969k183074l161781n599960k865921M378741Q763553
6566a0246362O678800K511882J205872J541414Q418k282824j397275K230338L776174
6557D026437J700341J31942J397237J354153l497768q422055o232379J365341
6549h176751N223379J604902l321095l511618q48488M99644J408691M266008O637035
6540C781707M694586L33485j302704R7954M91626p36894k4461K742113K577495
$$ y = [17825807, 14134189, 6917037, 1100220, -1312927, -1053542, 1031837, 4564747, 8799892, 12528074, 14529776, 14112847, 11871494, 9424277, 7440520, 4892162, 1652952, 250016, 2411590, 5190143, 4292555, 928091, 849634, 5481308, 8589300, 4564658, -3759951, -9577920, -11760994, -14922775, -20522735, -23388656, -19009915, -10246362, -3567562, -1055680, 150192, 1691606, 1700024, -582800, -1980075, 250263, 4026437, 5726778, 5858720, 7255957, 8610110, 5112342, -3309713, -9542092, -8176751, -2953372, -1348470, -4669565, -8181183, -9029671, -8530027, -7121336, -2855328, 3781707, 8476293, 8809778, 7507074, 7605028, 8096654, 7359760, 7335299, 10077412, 12654907]
6531A2654907k224964o183531n035849k857424n315709r609576q089913m97718
6523b7159777M857819L283744L9903J062010L563263J903005j430953J086795
6515a2794191Q898933J2139731O097064r97961j42988M589535K370795p329473
6507A2831445j3174870q044289J519438N200082K027156j047325K49376L214878
6499B775891K854819k521022r414488j1158945l967864P347354J2730607Q325290
6491F971642J139714q49114Q63885j01835l537711l332739J160451K661964k671570
6482B304687q227721n911587K312018P164959M081796k519096o218383n302381
6474a2315708j996323J190214K835464K919192L259652N508292P418222L937833
$$ y = [12654907, 10429943, 4246412, -789437, -3646861, -8962570, -18572146, -26662059, -27159777, -22301958, -19018214, -18978311, -17916301, -14353038, -12450033, -13880986, -12794191, -3895258, 8244473, 14341537, 13343576, 13200588, 17790123, 20160918, 12831445, -343425, -8387714, -6868276, -1668194, 358962, -688363, -438987, 2775891, 5630710, 3109688, -6304800, -17463745, -21431609, -14084255, -1353648, 6971642, 8111356, 7262242, 8126127, 8024292, 4486581, 1153842, 2314293, 4976257, 2304687, -5923034, -11834621, -9522603, -2357644, 1724152, -794944, -7013327, -12315708, -14312031, -13121817, -10286353, -7367161, -4107509, 1400783, 8819005, 12756838]
6466A2756838n371242j2721171j0399589j502594L197805k55473l889757p5149
6458a8260332P309840R462177N396338P73278k454943o291777q326907l503603
6450a5895929M816351O235759q68374n315935k96354N647043K735654m216873
6442g158658m689547l0856L12339m146121m763929P83963N428235N507495M924538
6433c832541N042752J981290l192743k870433M055269P926120K737726m455927
6425G391513m972908j053286R7618k345406m820139o590929p617084m622187L347522
6416b1185286J0086227R859504N457707K377291L40771k471109k858613J139631
6408B746123L152902k373045q845320o546175R57650K042384l666205n063671
$$ y = [12756838, 7385596, -5335575, -15735164, -17237758, -14039953, -14295426, -18185183, -18260332, -10950492, -1488315, 3908023, 4681301, 2226358, -4065419, -12392326, -15895929, -11079578, -4843819, -5712193, -11028128, -11324482, -5677439, -2941785, -7158658, -11848205, -11879061, -11566722, -15712843, -20476772, -19692809, -14264574, -8757079, -3832541, 1210211, 3191501, -1242, -2871675, 1183594, 9109714, 11847440, 7391513, 2418605, 1365319, 1462937, -882469, -5702608, -12293537, -19910621, -24532808, -21185286, -11099059, -1239555, 4218152, 6595443, 6936214, 4465105, 1606492, 2746123, 5899025, 3525980, -5319340, -11865515, -10907865, -8865481, -12531686, -17595357]
6400a7595357J257648N840448L192478J95397K447259M400892K96193n251897
6392e216939n688703l293615l260492l897869j203334K349184K115073J52445
6384a7944250J641828N636460P046197N346999M061171L536767J221692k251317
6376H295547l760648l438806l765842m114019k238211j08672j731639n417577
6368a6279867m768682J742643P871668P682862K034959l954225n865504k044854
6360a3581000M948783Q575287M406978l575164p176029m568884j496645j478243
6352a3944917j146163K444861N962602N203794J777592o0159O596o34160k169485
6343b559439k373149q74658L46805M65620Q63992K456234L933978L079152r11555
$$ y = [-17595357, -16337709, -10497261, -7304783, -7109386, -4662127, -261235, 34958, -5216939, -10905642, -14199257, -17459749, -21357618, -22560952, -20211768, -18096695, -17944250, -16302422, -10665962, -3619765, 1727234, 5788405, 9325172, 10546864, 8295547, 4534899, 1096093, -2669749, -6783768, -9021979, -9130651, -10862290, -16279867, -21048549, -19305906, -11434238, -3751376, -1716417, -5670642, -11536146, -13581000, -8632217, -56930, 4350048, 774884, -6401145, -10970029, -12466674, -13944917, -15091080, -12646219, -6683617, -1479823, 297769, 237610, 244206, -389954, -2559439, -4932588, -5807246, -5460441, -4994821, -4130829, -1674595, 2259383, 5338535, 4426980]
6334D426980o035458q192226m714416K119219O775742O581768M222570L035233
6326H219412K389576R4420k773042k938076j39433K146543J650390M6360n12125
6317H184025j056873l544536o259160m851984J179898N941304L737612l161053
6309A69233o789008l583974J445383K065839j217630l369813k228824Q3231J600992
6300a1824571K418238K653896K004704J270844J424676J424847k90990k787989
6292c706345m109986m746038n925040n559702p67016N756611P334081K421787
6284i301648k866753l098666J50705K308599J861277P5964j580471j610060M52345
6275a3608708J674752j392061o055755n004367L028358R738400Q097273J489309
$$ y = [4426980, -1608478, -9800704, -14515120, -12395901, -5620159, 961609, 5184179, 8219412, 10608988, 10703408, 7930366, 4992290, 4852857, 6999400, 8649790, 8696150, 8184025, 7127152, 3582616, -2676544, -7528528, -6348630, -407326, 3330286, 169233, -6619775, -10203749, -8758366, -6692527, -7910157, -11279970, -13508794, -13425563, -11824571, -9406333, -6752437, -4747733, -3476889, -2052213, -627366, -918356, -3706345, -7816331, -12562369, -18487409, -24047111, -24814127, -19057516, -11723435, -9301648, -12168401, -15267067, -15116362, -12807763, -10946486, -10870522, -12450993, -14061053, -13608708, -11933956, -13326017, -19381772, -24386139, -21357781, -11619381, -3522108, -2032799]
6267b032799k463581k307792j584382j338811K7336J907701K146708J125431Q74912
6258c645277J686090K856998M212224L920956j165852r238285j2478134p219108
6250b1070388k1438K169434K061940M756362O680624K018656m525047l493251
6242a1423108L248540M924398l38423l324962m88104P86235k928779m463179j35274
6233a4142656K125879l182306p907471k844816P067068J0628426O927165L441395
6225B112684K399033k89013n051776p359497n633912k783608n16160J570033K487191
6216a3065025J350653P62458L071266N306120L598162K42052P3043K182209K069799
6207E590737Q35r1037J451425O92777k133407k995608j674153j582203k411507
$$ y = [-2032799, -4496380, -6804172, -8388554, -9727365, -9700029, -7792328, -5645620, -4520189, -3645277, -1959187, 897811, 5110035, 9030991, 7865139, -1373146, -13851280, -21070388, -21091826, -18922392, -16860452, -12104090, -5423466, -3404810, -7929857, -11423108, -8174568, -3250170, -3588593, -6913555, -7401659, -6615424, -9544203, -14007382, -14142656, -12016777, -15199083, -23106554, -25951370, -18884302, -8255876, -1328711, 2112684, 4511717, 4222704, -829072, -8188569, -13822481, -16606089, -17122249, -15552216, -13065025, -11714372, -10951914, -7880648, -2574528, 1023634, 1265686, 1338729, 3520938, 5590737, 5591572, 5500535, 6951960, 7644737, 5511330, 2515722, 841569, -740634, -3152141]
6198c152141p72757J884424L68541m481689n725408j618853J688283J064406R65433
6189i779761L610725L905237m57215k528464L005264R644210Q242895J044363
6181A6687254k450998j19421J532790q51096l467036l513782l281680m075738
6173D60293k790234K207321O681517N704750K40509m533348n506784l743385j828896
6164c108257j516476l217603n703766o406850l676655R12529L777170L486895
6156a5453013K512174L514782N029683L522803l24402j265038K589419N490604
6148E617012J904262m460059n492676r88964J256215j859333m095360r69630K410733
6139f677800L94004k790267L97794P682947R233205K045837o060834p836189n010402
$$ y = [-3152141, -3924898, -2040474, -1671933, -6153622, -11879030, -13497883, -11809600, -10745194, -9779761, -6169036, -2263799, -2721014, -5249478, -2244214, 7399996, 15642891, 16687254, 14236256, 14116835, 15649625, 14798529, 11331493, 7817711, 4536031, 460293, -2329941, -122620, 6558897, 12263647, 12504156, 7970808, 2464024, -1279361, -3108257, -4624733, -7842336, -13546102, -19952952, -23629607, -22717078, -18939908, -15453013, -12940839, -9426057, -4396374, -873571, -1197973, -2463011, 126408, 5617012, 7521274, 3061215, -2431461, -3420425, -2164210, -4023543, -8118903, -9088533, -6677800, -6283796, -9074063, -8676269, -993322, 8239883, 10285720, 4224886, -3611303, -8621705]
6130h621705l010519k920349k062509J017467N154866Q028508P377033K913353
6122G876145k031909l377074j564697q97339k807217l723920j380222J098167
6114f808066N96212l85352J875048N037620L517021k209750n022038j195900M101325
6105d93880M304217N50748r57201J438061K937786K50648l148706k171164K454695
6096E165204N331991L733518K90949j671191k136168k602372l250733l968029
6088H93169n816114q609469q677643k774242O011617J0028306N876374j629381
6080d697383n926059o053013m788360k252325L713175J1058075J2771857N458693
6072I284660m673660q367581m416925q9113o63207l183360k475141P86780J974724
$$ y = [-8621705, -11632224, -14552573, -16615082, -15597615, -10442749, -2414241, 4962792, 7876145, 5844236, 2467162, 902465, 5126, -2802091, -6526011, -7906233, -6808066, -6211854, -6597206, -4722158, 315462, 3832483, 1622733, -3399305, -4595205, -493880, 3810337, 4361085, 3403884, 4841945, 7779731, 8030379, 4881673, 2710509, 5165204, 10497195, 14230713, 14521662, 12850471, 10714303, 8111931, 4861198, 893169, -4922945, -13532414, -22210057, -24984299, -18972682, -8944376, -3068002, -4697383, -10623442, -16676455, -21464815, -23717140, -20003965, -8945890, 3825967, 9284660, 4611000, -3756581, -8173506, -8262619, -8925826, -12109186, -14584327, -13797547, -11822823]
6063a1822823J66142r04836O30907J812414j02255l064480l091088L94710M324894
6054a1656415N767546M140612Q82107j338046k53179L260602N049247K244621
6046H097095k823207n290370l625672n29881J597759L294825N535286P056055
6038A3311890N742540J523791l289761n990795n355533k479496k87941j226091
6030A948604m606919o898219n386696j077285K645358L663054K639853J340912
6022e731338N24648l40062k043395m653080p042773p267735m323713q3264J687565
6013b9273147l48636k643328p86524M388539P654678O756894N157031N586286
6005c508207N142324P95681l898725l528692m2055l2104l401704l062031K424426
$$ y = [-11822823, -11656681, -12561517, -11930610, -10118196, -10220451, -13284931, -16376019, -15981309, -11656415, -5888869, -1748257, -866150, -2204196, -2457375, 803227, 5852474, 8097095, 5273888, -16482, -3642154, -4172035, -2574276, 720549, 6255835, 13311890, 19054430, 20578221, 17288460, 11297665, 5942132, 3462636, 3174695, 1948604, -2658315, -9556534, -14943230, -16020515, -13375157, -9712103, -7072250, -5731338, -5206690, -5546752, -7590147, -12243227, -19286000, -26553735, -30877448, -30960712, -29273147, -29621783, -32265111, -33051635, -28663096, -21008418, -14251524, -9094493, -3508207, 1634117, 2429798, -1468927, -4997619, -5039674, -5071778, -8473482, -11535513, -9111087]
5996i111087M821324o67724o466007l868711L283019N035754J037683k18055M003169
5987b150635P066287M524961j25294l285300o106386q308950n490053K543247
5979a1332123P879088M831164j587969l719663k555199l656611n943298l423146
5971a9507757L386797O634309K792864k386755l104731j410769k128421m601304
5963b0325767m218196K13644M910525O338283N014171L969995N138096P283903
5955H324654O664897M90081r082967j5265252j2851762m180154K846745L374297
5947a9679461O68408J031438M816543N605716o40601q685109r631049k191750
5939b8705865N777605P404837M209263J625065J393430J950761K998364M779268
$$ y = [-9111087, -4289763, -4957487, -11423494, -15292205, -12009186, -6973432, -5935749, -6153804, -2150635, 4915652, 9440613, 9315319, 6030019, -76367, -8385317, -13875370, -11332123, -3453035, 1378129, -209840, -3929503, -6484702, -10141313, -16084611, -19507757, -16120960, -9486651, -6693787, -9080542, -12185273, -13596042, -15724463, -20325767, -24543963, -24330319, -19419794, -13081511, -8067340, -4097345, 1040751, 8324654, 14989551, 15479632, 6396665, -8868587, -21720349, -25900503, -23053758, -19679461, -19011053, -17979615, -13163072, -7557356, -8197957, -16883066, -26514115, -28705865, -22928260, -15523423, -11314160, -9689095, -8295665, -6344904, -3346540, 1432728]
5931A432728M779257P16203l803508k611179L160585M684154k368702j0766578
5923d777040j1182087m347445J677421L195626L237080L601049J846782k516347
5915i264961n250348l749984j141245m45154R09512O011448J1271862J0220807
5907H561937L236972k244942j550712K200096L934828K892008J100508m40814
5899A7689881j415181j029737J14029m59530k969191l215337K018151R013127
5891A9746212J0311580L535857n931505j1112700r956399n682970k696435k582219
5883d368579l152013j578434J385615K035583p42596l395776l123878k201427
5875a5141505l557478m894085j791365N028646J0237607J0593265O736939N0357
$$ y = [1432728, 6211985, 6928188, 3124680, 513501, 3674086, 8358240, 5989538, -4777040, -15959127, -20306572, -18629151, -15433525, -12196445, -8595396, -6748614, -9264961, -14515309, -18265293, -19406538, -19851692, -18942180, -12930732, -1658870, 8561937, 11798909, 9553967, 8003255, 10203351, 14138179, 17030187, 18130695, 17689881, 16274700, 15244963, 15358992, 14899462, 11930271, 8714934, 10733085, 19746212, 30057792, 33593649, 27662144, 16549444, 6593045, 910075, -1786360, -4368579, -7520592, -9099026, -7713411, -5677828, -6420424, -9816200, -12940078, -15141505, -18698983, -23593068, -25384433, -20355787, -10118180, 475085, 7212024, 7262381]
5867G262381o850786q247116j136911P421831O805773k237442p640052l456124
5859h078446K036904M68582l727303k379792K167735K093368j607493j221451
5851a0247896L308266L551981k908204p488580l426131M677393Q445054O429881
5843B341764K673831k96144k185977k282817o11635N91351m46m14618J042243
5834H57552K398042J335612o05596p04122K08296l04781j158697Q16686M600104
5825G443096M804379q60440p591509r241657n651926j645077j91075L60782K356515
5816a0216912N142288O604716O249977M729016J827794k351969n028865l030045
5808C926000K099678M707939K078526k383399m727114n446936n956051m007846
$$ y = [7262381, 411595, -7835521, -8972432, -1550601, 5255172, 3017730, -4622322, -8078446, -6041542, -5572960, -9300263, -11680055, -9512320, -7418952, -9026445, -10247896, -6939630, -3387649, -6295853, -13784433, -17210564, -12533171, -4088117, 2341764, 5015595, 4719451, 2533474, 250657, -360978, 230373, 229927, -184691, 857552, 3255594, 4591206, 3985610, 3281488, 3489784, 3185003, 2026306, 2842992, 7443096, 12247475, 11387035, 3795526, -5446131, -11098057, -12743134, -12934209, -12573427, -10216912, -5074624, 1530092, 7780069, 12509085, 14336879, 11984910, 6956045, 3926000, 6025678, 10733617, 12812143, 10428744, 5701630, 254694, -5701357, -9709203]
5800i709203K374748Q842786Q551804J629273m511941m664288p32617L347628
5792E128190O198902O865790L421740l075193p169028n161742j12779K367833
5784H463713J122150o70936p15060M17193J545628K434501L136480L284186K192633
5775B1210488l27330k581698j466993L377869O853420L520465m689247j0235043
5767A5661931r928738p982878p680637o107980p37133M364263M273962J174737
5759f962473P12913L049285L432313K04092l302737m277790l111223r11131J591222
5750i575529L120130L328917M040297N514230L706601l812253j1215390j0091682
5742a4984679j259975N603831M747900M23256j233376j67492L77279o24337k385239
$$ y = [-9709203, -7334455, 1508331, 10060135, 11689408, 7177467, 2513179, 1780562, 5128190, 11327092, 18192882, 21614622, 18539429, 11370401, 6208659, 6095880, 8463713, 9585863, 8914927, 8199867, 8617060, 10162688, 12597189, 15733669, 19017855, 21210488, 20883158, 18301460, 16834467, 20212336, 27065756, 30586221, 25896974, 15661931, 5733193, -2249685, -9930322, -16038302, -16775435, -12411172, -8137210, -6962473, -6249560, -3200275, 232038, 436130, -2866607, -7144397, -10255620, -11166751, -9575529, -6455399, -3126482, 913815, 6428045, 10134646, 6322393, -4892997, -14984679, -16244654, -10640823, -5892923, -5469667, -6703043, -6870535, -6493256, -7117593, -9502832]
5733i502832m214451m443935j216597L504463M802474J898372r9065J843570L902359
5724c525642K227159l58210M72983K710388J483904k079189k002418L098698P517674
5715I545347O128437P3672o166730r601910r369672n739757m34171L558746L842811
5706h163227J97058n138856q243261o215072n75419L745123M525242N014239Q089979
5697f764194J0568408P528391K49627n195640o168942m990723k995157O46365
5689g121865L732262J722042m015555n397862J016772P980808P945481L755318
5681I617401K191186J825532l380646j0709526r741378J528385J1356694R548608
5673A2236256M01445n333899m848565k381317P14740N504018P592545M94345j1836171
$$ y = [-9502832, -13717283, -18161218, -19377815, -15873352, -11070878, -9172506, -9271571, -7428001, -3525642, -1298483, -1656693, -1183710, 1526678, 3010582, 931393, -1071025, 2027673, 9545347, 15673784, 15747456, 9580726, -21184, -9390856, -15130613, -15564784, -12006038, -8163227, -7966169, -13105025, -21348286, -27563358, -28138777, -24393654, -19868412, -14854173, -6764194, 3804214, 11332605, 11582232, 6386592, 217650, -4773073, -7768230, -7121865, -3389603, -1667561, -5683116, -11080978, -10064206, -2083398, 5862083, 9617401, 11808587, 13634119, 10253473, -456053, -10197431, -8669046, 2687648, 12236256, 12637701, 7303802, 2455237, 73920, 788660, 6292678, 13885223, 14379568, 2543397]
5664B543397j5925265o633424M372098M563618j954376j930909O336679J0869371
5656B241189M543882n080557q286162o394831n764277n513319n34307O501253
5648a8287129O544701j294097n775118J361781J2873353J5029156N520549m672892
5640A1300304o349962k072839N99753r7228l67632J461412K543585L05921m119715
5631C203599p734045q390428n495806n70955K588755J160078k549855l208864
5623b0997521J18774K231782k82392l291556j385435L262246M098078P42019n29093
5614a6033098K541931M296165J057581j776163J749351P439371O427036p22173
5606D980001l762103K232299R188951P308074j467806o815220l960718J693494
$$ y = [2543397, -13381868, -20015292, -15643194, -11079576, -13033952, -14964861, -8628182, 2241189, 6785071, 1704514, -6581648, -12976479, -18740756, -24254075, -24788382, -18287129, -11742428, -13036525, -18811643, -17449862, -4576509, 10452647, 15973196, 11300304, 4950342, 2877503, 3477256, 3380028, 3012396, 4473808, 7017393, 7323314, 3203599, -4530446, -12920874, -18416680, -18987635, -16398880, -15238802, -17788657, -20997521, -20878747, -18646965, -18929357, -22220913, -23606348, -20344102, -16246024, -15504005, -16033098, -13491167, -9195002, -8137421, -9913584, -8164233, -724862, 5702174, 4980001, 1217898, 3450197, 12639148, 19947222, 18479416, 11664196, 7703478, 9396972]
5598I396972L317439M78954l202735n577360o022892l216542K765070P364932
5590E303838N366412j436416m821230p49124M507180K855057l933069o857606
5582B35042l159159j59660l378143p306240l508184N971837J0223566L936310
5574B855369n833949q937643l737453K928064M360351m740n463775o676666k243795
5565b2754237M002735O899237N490645L214113K346032J036075k475274n541481
5557g782155m477458q57419j93741l768926n830975j443121N727345P513382K401046
5548h712022k039198K90751N021349L372552m455948p955284k54844J1667917
5540c064727J5164891P362338l015074q069354q637743q594267p676972m160246
$$ y = [9396972, 12714411, 13193365, 9990630, 4413270, -1609622, -4826164, -2061094, 5303838, 10670250, 9233834, 4412604, 3663480, 8170660, 11025717, 7092648, 235042, -2924117, -3083777, -6461920, -13768160, -17276344, -11304507, -1080941, 2855369, -2978580, -11916223, -15653676, -12725612, -8365261, -8370001, -13833776, -20510442, -22754237, -18751502, -11852265, -6361620, -3147507, -801475, 234600, -2240674, -7782155, -12259613, -13117032, -13310773, -17079699, -22910674, -24353795, -18626450, -11113068, -8712022, -10751220, -10460469, -5439120, -2066568, -6522516, -14477800, -14732644, -3064727, 12100164, 19462502, 16447428, 8378074, -259669, -8853936, -16530908, -20691154]
5532b0691154j03983J755194L777099R654128J5697697J3240710J732646p614391
5524A7447946o111949J02009o32959p338470p366994L712575J3502274R685918
5516B3000350k392963p894770l545640J52076l198703p201179n156458j117274
5508g354561j686432m253546k222426K469667J684750n354674r806689n618365
5500c2142276L139001R259003J0344515P347243J207209n369628p425014l138625
5492a6778572L239240O762621P060445N810425K891268j392197l789455k218935
5484A584840N6352j302754n129969o654630m529170j787943p73147j007644j347313
5475b0891378o34405K782592Q292811J0850011O108592k659978p425240n206323
$$ y = [-20691154, -20795137, -19039943, -15262844, -5608716, 10088981, 23329691, 25062337, 17447946, 11335997, 11438006, 10805047, 3466577, -3900417, -187842, 13314432, 23000350, 20607387, 12712617, 9166977, 9319053, 6120350, -1080829, -6237287, -7354561, -9040993, -13294539, -15516965, -13047298, -11362548, -16717222, -26523911, -32142276, -29003275, -19744272, -9399757, -2052514, -845305, -6214933, -13639947, -16778572, -13539332, -6776711, 283734, 6094159, 8985427, 7593230, 3803775, 1584840, 1641192, 338438, -4791531, -11446161, -15975331, -17763274, -18536421, -19544065, -20891378, -21525783, -18743191, -10450380, 399631, 6508223, 3848245, -3576995, -8783318]
5467h783318l36213L131220N550103O899147M168784k822487p967100o039229
5459f199093n3332L353037L314599M053995O199325N057540j326901p665173p855233
5450a121236k611278K372757L612049J914206j215988n207262q171807o838981
5442a7267540q23708N403853P248483N118918K383074q278l027135m664627r60064
5433f597024O527718R585600L532962n345263p511657k707889R95252n97151l065388
5424e182840j598973K214422M297281L727123J274089l321241q548490r167815
5416a6306444k146305P289282J0582865O351310J446016J278354L519049K984480
5408A4998607q75309m112496l899245j264499J086527J454608m01743l679104
$$ y = [-8783318, -9119531, -5988311, -438208, 6460939, 10629723, 7807236, -159864, -6199093, -6252425, -2899388, 415211, 4469206, 10668531, 15726071, 14399170, 6733997, -1121236, -3732514, -1359757, 2252292, 4166498, 2950510, -2256752, -10428559, -17267540, -18091248, -12687395, -5438912, -319994, 2063080, 2054802, -972333, -5636960, -6597024, -69306, 9516294, 13049256, 7703993, 192336, -2515553, -1520301, -2117452, -5182840, -6781813, -4567391, -270110, 3457013, 4731102, 1409861, -7138629, -16306444, -18452749, -11163467, -580602, 5770708, 7216724, 8495078, 12014127, 14998607, 14123298, 10010802, 6111557, 4847058, 5933585, 7388193, 6986450, 3307346]
5400C307346o555938o805193l614281J103174L924172K889776q29177m151240
5392a0731361m543168j576717K677110M485487J412094m318737p011358l890924
5384b3497574J228404L124863K329282L274194O294228O793442L324445Q40337
5376C711621K879514N495558L597951n75238j305509O62000r17086o955171j0373878
5367c780238o796538j778526k623053o974506n734145L558096J2139047J0783221
5359a206642J171973o866828p434472l725722j145979J03982K620603N170844
5351a1312241L574659k102575o206175m879916o25771K724245N306524P959503
5343e561747P754991K289648m028650m390596L71133K603882n80652l072153M38003
$$ y = [3307346, -3248592, -10053785, -13668066, -12564892, -8640720, -5750944, -6580121, -10731361, -15274529, -16851246, -14174136, -9688649, -8276555, -12595292, -19606650, -23497574, -22269170, -19144307, -16815025, -13540831, -7246603, -453161, 2871284, 3711621, 6591135, 12086693, 15684644, 15109406, 13803897, 14465897, 13548811, 6593640, -3780238, -10576776, -12355302, -14978355, -21952861, -27687006, -24128910, -11989863, -1206642, -34669, -6901497, -14335969, -18061691, -19207670, -19103688, -16483085, -11312241, -7737582, -9840157, -16046332, -20926248, -21552019, -18827774, -13521250, -5561747, 2193244, 4482892, 454242, -3936354, -3565221, -961339, -1541991, -4614144, -4176141]
5334d176141O294837P539501L387846j433898l677487l350367q99165K586561
5326F271687L748702K36154m858650o012466k623134N31556K73042j498023j909275
5317e840407q21412Q33144K913055M524847L590232k9086l298323l715929k225216
5308d069095r99436o48299j074916k335031k813571J63694N187225N861269o66195
5299a394355p282814m831130M991644J1150043P948269J528504l29198J523083
5291A3304046J617617r82203l203012m574293p131721r539760p112711R18499
5283a6703538Q207336P747479j90186q197189r271951l636684J920631J720366
5275a8403736k321561l571918L05584M703805N607823N316923P178686Q612582
$$ y = [-4176141, 2118696, 9658197, 13046043, 11612145, 7934658, 4584291, 3685126, 6271687, 10020389, 10256543, 5397893, -614573, -3237707, -2706151, -2433109, -3931132, -5840407, -6661819, -5828675, -2915620, 1609227, 5199459, 5170373, 1872050, -1843879, -4069095, -5068531, -5716830, -6791746, -9126777, -11940348, -11776654, -6589429, -728160, -1394355, -8677169, -13508299, -8516655, 2633388, 10581657, 12110161, 11780963, 13304046, 14921663, 13939460, 10736448, 6162155, -969566, -10509326, -17622037, -16703538, -8496202, -748723, -938909, -9136098, -18408049, -22044733, -20124102, -18403736, -20725297, -24297215, -23991631, -19287826, -13680003, -8363080, -1184394, 7428188]
5267G428188M892758k336126o447192n161978k734943k581164l271756k793249
5259a3005462j546313K52175L188209N225873K844204k468126m193677j6149L983646
5250e735620J818584m148549p203852m800583M20255M574124M414026o04083m888738
5241a6154436m25202J1508385J7588336P878069r867342j8582565j2205139l97286
5233b0657180N592063M243625O68853r58978J81296K358030K884679J289426L84987
5224d013199J760897K470819p4608k811566j750506P75208j37601l354005m201136
5215a1335697l750297o860565j1255796q200555L709898J4136021J4090648O409526
5207c056817n57586l197014k523077J78558K879596K563553m19596j668918M70355
$$ y = [7428188, 12320946, 9984820, 3537628, -1624350, -4359293, -6940457, -10212213, -13005462, -14551775, -14299600, -11111391, -5885518, -3041314, -5509440, -9703117, -9719266, -5735620, -3917036, -8065585, -15269437, -20070020, -19649765, -15075641, -10661615, -11265698, -16154436, -16579638, -5071253, 12517083, 20395152, 10527810, -8054755, -20259894, -20657180, -15065117, -10821492, -10152639, -11111617, -10930321, -8572291, -5687612, -4398186, -4013199, -2252302, 218517, 143909, -2667657, -4418163, -3642955, -3780556, -7134561, -11335697, -15085994, -21946559, -33202355, -41402910, -37693012, -23556991, -9466343, -3056817, -3614403, -6811417, -9334494, -9155936, -6276340, -3712787, -4132383, -5801301, -5330946]
5198e330946J908752k13506k469447r85249K129997K478653j96579l226498n236013
5189a1140836n539744k821995J899462M270780K134907r46231q44161J636809
5181a1351009L360271L539950K795857Q98101j598371k603896j677802n44220
5173g181119R55593M613770Q081094N671284k298972p640253n457551n65432J288897
5164b532689J438148K651034K978830J201108J100063L757192L130873l317987
5156A0406572p555281l311753K436891P66848l778736j261920O120805P898304
5148A1721730K559140k408845m465077o458668n896158J669461R939872P693985
5140A4355440k514347o527384o78339L555252n14072n637010n487691l598534
$$ y = [-5330946, -3422194, -3635700, -6105147, -7090396, -4960399, -2481746, -2678325, -5904823, -11140836, -16680580, -19502575, -17603113, -13332333, -11197426, -12143657, -12987818, -11351009, -7990738, -4450788, -1654931, -756830, -2355201, -4959097, -6636899, -7181119, -6225526, -1611756, 6469338, 12140622, 9841650, 2201397, -3256154, -3821586, -2532689, -1094541, 1556493, 4535323, 5736431, 6836494, 10593686, 13724559, 10406572, 2851291, -460462, 1976429, 2743277, -1035459, -2297379, 3823426, 11721730, 14280870, 11872025, 7406948, 948280, -4947878, -3278417, 6661455, 14355440, 11841093, 5313709, 4635370, 8190622, 7676550, 2039540, -3448151, -7046685]
5132g046685k164559L235682J1109328J0758583k48700q800692n614108P87817
5124B016666n57804n937338o537874l972762l807060l370940R39217K952001k945953
5115b1221847q445931k890400Q003485J0260851L942208J546376O639194R924277
5107G758213O545533K405605J450687N8077l073226l420606l88598J46357l486376
5098G995666n343418k544373M0323o60948q75904J428992J758084k298427n675218
5089f175223m245245j370375p66126J68542L902772O081398K328361l160211l244586
5080f480693J183180L133196P24434n93601K596100N914884L196689m784172j0359131
5071e469114p593391N60768N287504K379601k717622k466213K767169O392399
$$ y = [-7046685, -9211244, -5975562, 5133766, 15892349, 15643649, 6842957, 1228849, 2016666, 1458862, -4478476, -11016350, -14989112, -18796172, -22167112, -21227895, -18275894, -21221847, -29667778, -32558178, -24554693, -14293842, -10351634, -8805258, -2166064, 7758213, 14303746, 16709351, 18160038, 18218115, 15144889, 11724283, 11335685, 11482042, 7995666, 2652248, 107875, 148198, -512750, -1388654, 40338, 1798422, -500005, -6175223, -10420468, -11790843, -12556969, -12388427, -8485655, -2404257, -75896, -3236107, -6480693, -5297513, -2164317, -1439883, -2033484, 562616, 6477500, 9674189, 4890017, -5469114, -13062505, -12501737, -7214233, -4834632, -7552254, -10018467, -7251298, -858899]
5063h58899N454792L181102K028043N76703j228629k5344M705394P504800L898240
5054B5236202l413619q843687j0695834r957782o101169R21676O760892O026754
5046f6567o67492o779788p160541k788247J609535K452690n8425k486912j456945
5037a7402692K536632N264751L661304m49032k718505j439067R50896J041492
5029h554221j665998l821128j424495N099880R907407P963450J622501k120035
5021G007361p88176J249174N31977k65707K133538M982915L186056k430437n436438
5012A0170263k276275L399892N522086J966002m468716r080277q461208k684447
5004e912680M413486Q075977O597450K139196k200125m996007o109289n249672
$$ y = [-858899, 4595893, 7776995, 9805038, 10381741, 9153112, 9127768, 13833162, 21337962, 25236202, 21822583, 12978896, 2283062, -7674720, -13775889, -12854213, -6093321, -66567, -734059, -7513847, -14674388, -17462635, -15853100, -13400410, -13458835, -15945747, -17402692, -14866060, -9601309, -5940005, -6389037, -9107542, -10546609, -9595713, -8554221, -10220219, -14041347, -15465842, -10365962, -458555, 7504895, 9127396, 7007361, 6219185, 7468359, 8000336, 7734629, 9868167, 14851082, 18037138, 15606701, 10170263, 7893988, 11293880, 16815966, 18781968, 14313252, 5232975, -3228233, -5912680, -1499194, 6576783, 13174233, 15313429, 13113304, 8117297, 2008008, -3241664]
4996c241664k143444K252550N627758N747434K152713l153728o673819n863693
4988e295893j393896L282672N258665M760086L677567K329238l14804l300138
4980I003497l621242r97617K70665k825957o655970n519461p8237L657468L358714
4971c408140K948699N144275O835156M405457o50272m290466m787363k799753
4963C397593K4737P01688k833800p238375o251734P1293M233210K534829R39791
4954d420768M794301R216045O776244l46206l925360j939530O45100Q13663l79491
4945A1233998k517102n186638m620147J441478P395072O267693R13537Q2200M335071
4936A9345162N308324n30574o707357p247630m118634j542231N2023J455508J723525
$$ y = [-3241664, -5385108, -3132558, 2495200, 8242634, 10395347, 7241619, 567800, -5295893, -6689789, -3407117, 1851548, 6611634, 10289201, 12618439, 12303635, 9003497, 5382255, 4384638, 4655303, 1829346, -4826624, -10346085, -10424322, -6766854, -3408140, -459441, 4684834, 11519990, 15925447, 15275175, 10984709, 6197346, 3397593, 3422330, 4124018, 1290218, -5948157, -12199891, -12128598, -7895388, -5360559, -4420768, 373533, 9589578, 16365822, 16019616, 12094256, 10154726, 10799826, 11613489, 11233998, 8716896, 3530258, -1089889, 351589, 7746661, 14014354, 14927891, 15010091, 19345162, 24653486, 24122912, 17415555, 10167925, 6049291, 4507060, 4559083, 6014591, 7738116]
4927G738116L95891j331942k582244k563713K38436M314494L670059l664014r337990
4918c122907n074110M025804O242723N65624l545547j710565J672786L961207
4910C015015O327625O231043O74601l759308J925787J2267331J2859917L135622
4902D2677633k954253l88566R96921k873408l197481K725721M870686L5787j234416
4893D0658624M567198N853528k052982p021529k631342K20934m352073n280022
4885B9962336K407070O118958J375127K939368J4229696J5397755J848133K15643
4877G4494086J9793365K8316299J3371300K1521656P7019120J02935206J0040324
4870C47491356j50192072k18540942j31162278p66343M2330324Q634695r322022
$$ y = [7738116, 8134007, 6802065, 4219821, 1656108, 1894544, 6209038, 9879097, 6215083, -3122907, -8197017, -4171213, 2071510, 2637134, -908413, -2618978, -946192, 3015015, 9342640, 15573683, 16248284, 12488976, 14414763, 26682094, 39542011, 42677633, 39723380, 39334814, 40331735, 37458327, 34260846, 36986567, 41857253, 41893040, 40658624, 45225822, 51079350, 49026368, 42004839, 39373497, 39594431, 35242358, 29962336, 32369406, 38488364, 39863491, 42802859, 57032555, 72430310, 74278443, 74494086, 94287451, 122603750, 135975050, 157496706, 234515826, 337451032, 347491356, 197299284, -21241658, -152403936, -153170279, -110839955, -102205260, -111527282]
4863a11527282J3960549K8123058J0724557m574548K092517Q201336o24585n416309
4855e9040707N954765J5406040Q117080l236521l620213J132884P66611j313982
4847c5834043L37565J357356j162252r12882M389036O134853l290n260767k592810
4838c3547234J987390J301741j001109R00633L913539K387391j701909k613481
4830b8373039N35656M710944P698819P927335M490523J66182o89006J173534J196950
4821a162102l45096J423125N839405N439705k184203r318470q898647l515563
4813a2721846L06544P24407n14174k458371m265645m082830j566008J573680M624330
4804a8379913P692945Q442140M096849k911991o645416n480922l109053j937391
$$ y = [-111527282, -97566733, -69443675, -58719118, -63293666, -61201149, -52999813, -53624398, -59040707, -53085942, -37679902, -29562822, -32799343, -36419556, -35286672, -34520061, -35834043, -35496478, -34139122, -35301374, -36214256, -31825220, -25690367, -25693657, -30954424, -33547234, -31559844, -30258103, -31259212, -30358579, -26445040, -24057649, -25759558, -28373039, -27837383, -23126439, -15427620, -7500285, -3009762, -2843580, -3532586, -2359052, -1162102, -1507198, -84073, 5755332, 11195037, 9010834, -307636, -9206283, -12721846, -12415302, -11690895, -12205069, -14663440, -18929085, -23011915, -24577923, -23004243, -18379913, -10686968, -2244828, 1852021, -1059970, -7705386, -13186308, -16295361, -18232752]
4796a8232752j241863j321133k870510k688816K590072Q660302P596312J93765
4788g314623m340798k116647R86477L56246j173600j004143j549253l713220m063940
4779b3933501k188730k434333m649859k332830N457082R856755N709011N1088
4771a4465317J69429K192200m962k820058J1840M808082L393573k927394n515703
4762a5158310k176918J108602J115164Q07926J708547R83503k565112n938423
4754b0115021o683788n464844l406028r37203Q42018J225002J528339K525990
4746c0485535K268506N8515l81895L434369O945134M419922j637579l643416l3991
4737a9055970L711182M382821M179034M363641K964771M1205j240989l52532j75267
$$ y = [-18232752, -19474615, -20795748, -23666258, -26355074, -23765002, -15104700, -7508388, -7314623, -11655421, -13772068, -12785591, -12429345, -13602945, -14607088, -16156341, -19869561, -23933501, -26122231, -28556564, -33206423, -35539253, -30082171, -20225416, -14516405, -14465317, -14295888, -12103688, -12108650, -14928708, -14916868, -10108786, -6715213, -9642607, -15158310, -17335228, -16226626, -15111462, -14303536, -12594989, -11611486, -14176598, -20115021, -26798809, -32263653, -35669681, -36606884, -35764866, -34539864, -33011525, -30485535, -28217029, -28158514, -28540409, -25106040, -18160906, -13740984, -15378563, -19021979, -19055970, -15344788, -10961967, -6782933, -2419292, 545479, 586684, -654305, -1006837, -1182104]
4728a182104o04971K083691P312731Q517366L023389k593251j725516K809519
4720A7640854L693723p48329o671808j1182445j2799619q852905M41173P268517
4712a1210839L556982o821602j0872291l255407O934457R174253M333619k54645
4704h415473k230252l845113m642383k641709n73090k523244n109466r28505Q200503
4695b2708732J0953764K982177n398831l937564L025116M739260N52164j497875
4687a1290521J129041L136443K171812J969490L790471L664675L17138j992784
4679B895765j165500o46455k320453l032821j473256j452208m118943l874618
4671a5188489K409174Q231011O215163o66724l767811j314176J000589m5074j828084
$$ y = [-1182104, -1787075, 296616, 7609347, 16126713, 19150102, 16556851, 14831335, 17640854, 21334577, 20586248, 13914440, 2731995, -10067624, -18920529, -18479356, -11210839, -7653857, -14475459, -25347750, -28603157, -21668700, -12494447, -8160828, -8415473, -10645725, -14490838, -19133221, -21774930, -22348020, -24871264, -29980730, -30909235, -22708732, -11754968, -8772791, -14171622, -18109186, -15084070, -10344810, -9792646, -11290521, -10161480, -7025037, -4853225, -2883735, 906736, 4571411, 4888549, 2895765, 1730265, 1083810, -1236643, -4269464, -5742720, -7194928, -11313871, -15188489, -12779315, -4548304, 1666859, 1000135, -2767676, -4081852, -3081263, -3126337, -4954421]
4662d954421j884379r15917N57401L144232N460494M768034J681648Q5120J267271
4653I209483K006936m2138k632719k794250j713969k908786o684816r062347o605158
4644b1227764q14552L331510K860598k45341j934971q16773J072948J410323M2150
4635a6321872j235267j19155M156945Q848005R156758L698511l016679n927886
4627g60640n184263l553048j058057K938402N146293K586725m40307K222842O897867
4618H795814L466694q131971j5173294r836697K00889M505712L873249M052743
4610h246861L936061k24463m712205k871285L471273O356437L396022r72706l922862
4601c790589o038468o305194l003661J371389K911048K689866L856187M436659
$$ y = [-4954421, -6838800, -7754717, -7197316, -4053084, 1407410, 6175444, 7857092, 7942212, 9209483, 11216419, 11174281, 8541562, 5747312, 4033343, 1124557, -5560259, -14622606, -21227764, -22042316, -18710806, -15850208, -16095549, -18030520, -18847293, -17774345, -16364022, -16321872, -17557139, -17676294, -13519349, -4671344, 4485414, 8183925, 5167246, -760640, -5944903, -9497951, -10556008, -7617606, -2471313, 115412, -324895, 1897947, 8795814, 12262508, 4130537, -11042757, -20879454, -20678565, -16172853, -12299604, -8246861, -4310800, -4535263, -9247468, -12118753, -8647480, -2291043, 1104979, 132273, -3790589, -9829057, -16134251, -19137912, -17766523, -14855475, -12165609, -8309422, -3872763]
4593c872763M58478n533855p096675l999940j811644k128938j290372J510361
4585b3765348K967007K587855K977640L305447P38260j923891N58931M796167
4577g757932J664567p784160j0837141j950269P933214P548444J164528k10003
4569a0228752M116782O103174K996200k6194L23976J095878j025118n073236p775919
4560i493209o795883k144292L207397M950768J672216l543683o795878o780379
4552b5722943l959901N91736M431563N176663L870956L510688L726843J638486
4544f735909j370933j31821M916390N943081o03426p410129p003735k760217k044221
4535a7200920l615424q38017N462671O998856R26063n744097o603573l832428
$$ y = [-3872763, -3414285, -8948140, -16044815, -20044755, -21856399, -23985337, -25275709, -23765348, -20798341, -18210486, -15232846, -11927399, -11189139, -13113030, -12554099, -7757932, -6093365, -13877525, -24714666, -26664935, -18731721, -11183277, -10018749, -10228752, -6111970, -8796, 2987404, 2961210, 3285186, 4381064, 3355946, -1717290, -9493209, -16289092, -18433384, -15225987, -10275219, -8603003, -12146686, -18942564, -25722943, -29682844, -29091108, -24659545, -19482882, -15611926, -12101238, -8374395, -6735909, -8106842, -8238663, -3322273, 2620808, 2017382, -5392747, -12396482, -15156699, -17200920, -20816344, -21654361, -16191690, -9192834, -8266771, -14010868, -20614441, -24446869]
4527b4446869k647384l137398j797288J860987M434176L677423J429236P01420
4519a9925697J389446O29160k378112l981029o64626N326452Q327602O824073
4511d452731M585938L836828K285723j156735l009948j255295j03014l552999
4503b822233p470200m337161N122167J1045966O334924m677138j1354614q276388
4495a6434677R4147N357956M363265J474699J587319L205346J508888l127751
4487a970808m892960j660900J235645p18041m046311k726349K756857O663916
4479e358951O071225L012711o7732k546780l765963k856691q93729n20045k581479
4470i507434m379664j954574N354504J2057101J0171395j299804j2362906j2400097
$$ y = [-24446869, -27094253, -30231651, -32028939, -30167952, -25733776, -22056353, -20627117, -19925697, -18536251, -17907091, -20285203, -24266232, -24930858, -19604406, -11276804, -4452731, 133207, 3970035, 6255758, 5099023, 2089075, 833780, 730766, -2822233, -10292433, -14629594, -9507427, 1538539, 7873463, 3196325, -8158289, -16434677, -16340530, -10982574, -6619309, -5144610, -3557291, -351945, 1156943, -1970808, -6863768, -8524668, -7289023, -8007064, -12053375, -14779724, -12022867, -5358951, 712274, 3724985, 3657253, 1110473, -2655490, -5512181, -6405910, -6925955, -9507434, -13887098, -15841672, -10487168, 1569933, 11741328, 10441524, -1921382, -14321479]
4462a4321479l437579L318723L561725L628200O658942N909782k427894r762275
4454f871855p330544k03620J144972k580222k612570K065074M067254J421910
4446a0899601L69765L504880N604019L552439J289345J731386J596496j924557
4438D824172n483347m400193R70402O227762P183255K507921m431184p017388
4430C81400k825463K028917J223070j739777O47090O292323N694907k296129p751465
4421A654873n066827o17246q46886k531428p68416J902674J455718N98835L491131
4412g27572P298929O307853R95192l200156l419787p97291K592013L879595J29270
4403A3058046o756353r774862n846076p06315n8786r78948J662123N145636L290794
$$ y = [-14321479, -17759058, -14440335, -10878610, -7250410, -591468, 5318314, 2890420, -6871855, -14202399, -14406019, -13261047, -15841269, -18453839, -16388765, -12321511, -10899601, -10529836, -7024956, -1420937, 2131502, 3420847, 5152233, 6748729, 4824172, -659175, -5059368, -4088966, 2138796, 9322051, 11829972, 7398788, 381400, -2444063, -415146, 807924, -931853, -284763, 6007560, 11702467, 9406338, 1654873, -3411954, -4029200, -4876086, -7407514, -8175930, -6273256, -4817538, -4218703, -727572, 6571357, 12879210, 13874402, 10674246, 7254459, 6457168, 9049181, 12928776, 13058046, 6301693, -3473169, -9319245, -10025560, -10084346, -11063294, -9401171, -4255535, -964741]
4394i64741k305375m025319r234L902997M033679L142515L632621L230594k6714
4385A0611023l542047l794101j034842J802942K687431J597349k99397j745461
4377F282897k512811l096983k847885m51340K487433J628403l562687p045795
4369i118768m278804K97409k60368l933432k350303N500406J0408203O209157
4361B473500j310223l236170K10576J971326o42488l442857l307537k648580m184465
4352a4116918n631490l116753K189131M933492L186975J246134K762963M485235
4344d061231J043555n807189q274402l347718K965201M360669K075062N70814
4336a0475239Q4864j600306l373445k378037O52358K875784M406202O530082O704347
$$ y = [-964741, -3270116, -7295435, -7304669, -3401672, 632007, 3774522, 7407143, 10637737, 10611023, 7068976, 3274875, 2240033, 4042975, 6730406, 8327755, 8028358, 6282897, 3770086, 673103, -2174782, -2626122, -138689, 1489714, -2072973, -9118768, -13397572, -13100163, -13360531, -17293963, -19644266, -14143860, -3735657, 2473500, 1163277, -2072893, -1862317, 109009, -533479, -3976336, -7283873, -9932453, -14116918, -19748408, -22865161, -20676030, -15742538, -12555563, -11309429, -8546466, -4061231, -3017676, -8824865, -17099267, -20446985, -17481784, -13121115, -11046053, -10475239, -10390375, -11990681, -15364126, -17742163, -17089805, -14214021, -9807819, -3277737, 3426610]
4327C426610J866915m175310m171498J082726K549209l292503q326434n068819
4319a6109104J898509L481142r8234j275121J791718L219218O84682j09540M456462
4310b060268Q511121M986410l188240o646490k373723L326931M520825K384460
4302I461026P32361K1402j141423k390930l083912m461559o632458o092344p18803
4293a4306640M867009M224928j645942n522576m167613j396516l88360N36230
4285a7799480K427246K498592l7510p09494L092755O713334N152098J112784L49321
4276B799646K568586L372950K519116L242808M856859L115076k207146o489204
4268A3778691p404846p094199o722128m535101k10224L973766O776285P724349
$$ y = [3426610, 5293525, 1118215, -3053283, -1970557, 578652, -2713851, -11040285, -16109104, -14210595, -10729453, -10827687, -12102808, -10311090, -7091872, -6407190, -6516730, -2060268, 6450853, 11437263, 8249023, 1602533, -771190, 2555741, 7076566, 9461026, 10193387, 10214789, 9073366, 6682436, 3598524, -863035, -7495493, -13587837, -14306640, -9439631, -5214703, -6860645, -12383221, -16550834, -17947350, -18335710, -17799480, -15372234, -12873642, -12911152, -13620646, -10527891, -3814557, 1337541, 2450325, 2799646, 5368232, 8741182, 11260298, 14503106, 19359965, 22475041, 20267895, 13778691, 6373845, -720354, -7442482, -11977583, -12187807, -8214041, -1437756, 6286593]
4260F286593L840415o318751j5238656j2052834J733305J1184787P368733r37406
4252d133814j735353K575425K043327k873670k982146K478536L679645l345843
4244d293893j0227887j0165196p331000o424534l039755O678366J4920329J2136175
4236g747395L255528J659071Q693498J1919794N124933k544138k140194J761579
4228A9982676R37778k532152k060306K22776k722873r091913r476885j514732
4220f255631O369245O839265J214989n560518r609576p163522K351801J0690810
4212a123137P420293m946880j1635072n436574L554750L829255j099898n15617
4204i952880O249386J0099833N957506k240739q175048q161133j888198O068389
$$ y = [6286593, 10127008, 3808257, -11430399, -23483233, -21749928, -10565141, -3196408, -4133814, -5869167, -3293742, -1250415, -4124085, -7106231, -4627695, -948050, -4293893, -14521780, -24686976, -32017976, -38442510, -41482265, -34803899, -19883570, -7747395, -4491867, -2832796, 5860702, 17780496, 22905429, 20361291, 18221097, 19982676, 20920454, 18388302, 16327996, 16550772, 13827899, 4735986, -4740899, -6255631, 113614, 6952879, 8167868, 2607350, -7002226, -14165748, -11813947, -1123137, 6297156, 1350276, -10284796, -15721370, -12166620, -8337365, -9437263, -9952880, -3703494, 6396339, 12353845, 10113106, 1938058, -6223075, -8111273, -2042884]
4196b042884Q111288K157612m901750o762878n781536o168295n604846j358518
4188b2351807J544622j869038n587635p66494Q578477J0083501J797282n450774
4180a4021866m486787O62541M566955O898410P317292L927811o80944p04315L438027
4171F917124N086123K064339q96274j264015j485797k050779q27078M41815j505506
4162F479952l119675J149416O687663M127501l584016m263390K717609N119669
4154A5314729n25871l766723o10504o4434m507276l490769N204676R242433N480458
4145B2276719P051822J5848112J4957844L965073R480439L4648963L2245147k9878391
4137A10595728j01289346j00546949k6068859L9252383L8999883N436858n992280
$$ y = [-2042884, 6068404, 8226016, 3324266, -3438612, -9220148, -15388443, -20993289, -22351807, -20807185, -22676223, -28263858, -29030352, -20451875, -10368374, -8571092, -14021866, -18508653, -17846112, -13279157, -6380747, 936545, 4864356, 4183412, 3479097, 6917124, 12003247, 14067586, 13171312, 11907297, 10421500, 8370721, 7543643, 7985458, 6479952, 3360277, 4509693, 11197356, 15324857, 11740841, 7477451, 10195060, 15314729, 14788858, 11022135, 10411631, 10347197, 5839921, 2349152, 7553828, 16796261, 22276719, 29328541, 45176653, 60134497, 64099570, 73580009, 108228972, 140474119, 110595728, 9306382, -91240567, -117309426, -78057043, -39057160, -33620302, -39612582]
4130c9612582O315283J0875109K731633J101301P917915P175542k874408q054297
4122a4424504n117097m717069r063538q456139m34780N835475N379549K799437
4114b8198666J527761N64815J383586O087746R622741N154176l935978p940781
4106a5734600m854300l87147L009554O166285N723973r91296o495789j909804
4098a5473124O827850N829071m458158r172505k521773M299800K436019k304604
4090a4537424k407988m63097l74970J584134Q087043J2397999P738663j922548
4082A0101812q199769r170617p090701j904159N351040Q516707L743155l485295
4074b137827n915640m669613m698935m860739j001615M480741N226208J585554
$$ y = [-39612582, -33297299, -22422190, -19690557, -18589256, -10671341, -3495799, -6370207, -14424504, -19541601, -24258670, -33322208, -41778347, -42213127, -36377652, -30998103, -28198666, -26670905, -26106090, -24722504, -18634758, -9012017, -3857841, -7793819, -15734600, -20588900, -20976047, -17966493, -11800208, -6076235, -7067531, -13563320, -15473124, -8645274, -2816203, -7274361, -16446866, -18968639, -14668839, -12232820, -14537424, -16945412, -17408509, -17783479, -16199345, -8112302, 4285697, 12024360, 10101812, 1902043, -7268574, -14359275, -16263434, -10912394, -2395687, 1347468, -2137827, -8053467, -12723080, -17422015, -22282754, -23284369, -18803628, -13577420, -11991866]
4066a1991866L64591M156582Q250830Q478530N601725J323862l940474q206563
4058D037217q254800m331103k56452J994892L717706N161474M537111K162505
4050H768550P80296M16342k249353p445328j0012609o433718j51958L363107L350818
4041i613853K051474k68351l857527n429876j293507N768840Q125255L156279
4033a361266k902331l233759J089464M063669L318848J387687k23268l016126
4025h77082o624745o940748k386393J505520j349155p996836r031365j497711
4017c5198515O247467N542171j068226m044183o0728M715130M398351R05316l43469
4008a8906686J928595M715336N731224N200060L883850K286286J249828Q76104
$$ y = [-11991866, -11627275, -7470693, 780137, 9258667, 14860392, 16184254, 12243780, 4037217, -4217583, -8548686, -8805138, -6810246, -3092540, 2068934, 6606045, 8768550, 9548846, 9965188, 7715835, 270507, -9742102, -16175820, -16327778, -12964671, -9613853, -7562379, -7830730, -11688257, -17118133, -18411640, -12642800, -4517545, -1361266, -4263597, -7497356, -6407892, -2344223, 974625, 2362312, 2139044, -877082, -7501827, -14442575, -16828968, -15323448, -16672603, -24669439, -33700804, -35198515, -28951048, -23408877, -24477103, -28521286, -28582014, -23866884, -19468533, -18563217, -18906686, -16978091, -12262755, -6531531, -1331471, 2552379, 4838665, 6088493, 6964597]
4000F964597n60976m002664o427805l687772K913012O392226K390977m970665
3992i89070q092503m841779M04494L348403L856487L485531K457946O32167q23012
3983e61336p57721l7098n83190k764951m845917m946164k824367L66639L585641
3974a3368464O582919Q762395Q129471L164089l816118p446138n298860j206796
3966d497502q0832j244988o04720J928808K332987n3526p83939J932380L418299
3957B346967K63796l196611j576431K260924J467897l165314l529045L266886
3949a860931R815741Q627729J797357l355212m061111k987605k207516j432370
3941D336082j319398l609130p086513p308392k412848L415253M854173K224218
$$ y = [6964597, 6403621, 2400957, -4026848, -7714620, -4801608, 1590618, 3981595, -989070, -9081573, -13923352, -13518858, -10170455, -6313968, -2828437, -370491, 261676, -561336, -1319057, -1356155, -1939345, -4704296, -9550213, -14496377, -17320744, -16954105, -13368464, -6785545, 1976850, 10106321, 13270410, 9454292, 2008154, -3290706, -4497502, -4578334, -5823322, -6428042, -4499234, -2166247, -2219773, -3003712, -1071332, 2346967, 2610763, -585848, -2162279, 98645, 1566542, -1598772, -5127817, -1860931, 7954810, 16582539, 18379896, 15024684, 10963573, 7975968, 5768452, 4336082, 3016684, -592446, -7678959, -14987351, -17400199, -13984946, -9130773, -6906555]
3933f906555L46300J292190K062820N56615k03622K711508N596254K268350n757090
3924A966770r368819m125794L061887L375113k111309n260865k728139J054870
3916a4136286J998431J602587K810761M990192N243807K344651k170951n495428
3908b812236n693372l543553j883401j914558j496297J049950L482404K993803
3900i817260J086255J136639K528487J812888j014359k310280r02490L53439k56467
3891g383148q39336O91766M269929Q500348J0188712M785294p097749j5347281
3883b231465j0313858L051496R711625M356905k742253k292561J986654K947593
3875D474136J536472J314599K49274l203315l442199K850613P188517O38611j0142594
$$ y = [-6906555, -6560255, -5268065, -3205245, -2648630, -2852252, -140744, 5455510, 7723860, 1966770, -7402049, -11527843, -8465956, -5090843, -7202152, -12463017, -15191156, -14136286, -12137855, -10535268, -7724507, -2734315, 2509492, 4854143, 2683192, -2812236, -8505608, -12049161, -13932562, -15847120, -17343417, -16293467, -12811063, -9817260, -8731005, -7594366, -5065879, -3252991, -4267350, -6577630, -7480120, -7126681, -7383148, -8222484, -7530718, -3260789, 5239559, 15428271, 20213565, 13115816, -2231465, -12545323, -9493827, 217798, 4574703, 1832450, -460111, 1526543, 4474136, 6010608, 7325207, 7574481, 4371166, 928967, 3779580, 10968097, 11606708, 1464114]
3866A464114j0794581n86935P023504M789504j63284n17325R72524j58749j480853
3857E47919O65492M096792M864553L063716L52416l330726o893409o874509k839508
3848f347264M07290n65284l095824l410723k181713j885860k328358j890359k04282
3839b1502377K546962N816851P019266L835193q59558j579110J080216O01509
3831c041048m632270p758492l953040K541003O033134O897920O540437K390484
3823E018128n481847r696035n394721J120491J893219k20287J898373N802691
3815e059988L737403k405380l038786K585967M292085k414813r071999p771978
3807a9147489k254779q0124j430848j619230Q77015M215255O855055P397385M646695
$$ y = [1464114, -9330467, -9917402, -2893898, 1895606, 1732322, 1214997, 2187521, 2028772, 547919, 1213411, 5310203, 10174756, 13238472, 13590888, 10260162, 3366753, -3507756, -6347264, -5939974, -6505258, -9601082, -13011805, -15193518, -17079378, -19407736, -21298095, -21502377, -18955415, -13138564, -6119298, -2284105, -3143663, -4722773, -3642557, -3041048, -7673318, -15431810, -19384850, -16843847, -10810713, -3912793, 2627644, 5018128, -463719, -10159754, -15554475, -14433984, -12540765, -12761052, -10862679, -5059988, -1322585, -3727965, -6766751, -4180784, 111301, -2303512, -11375511, -19147489, -21402268, -21482392, -22913240, -24532470, -23655455, -19440200, -12585145, -5187760, -541065]
3798e41065Q63150O29379L818526M671650P06713l111456k648570j010025k008757
3789A369545l143928j036126J309042m40712l780208l664524j645048k633950
3781a3665909m794926j546831O704095J1604290R022973M230829K431095J525759
3773A5511375j832840n366097n367554l066276j687068r06542N08278j78527n593690
3764g978941j1069155q514815J944722J0451371R753717L837360P77777J349192
3756E51228O7417m516845o840179k875396L188910M142364p68674n101616l412986
3747a5565777K691750P142188N958358M70540m447500m475894N71581O199824
3739a454930P077645K373879l363159n337969l522140j411811r12075p08658K96124
$$ y = [-541065, 322085, 951464, 4769990, 9441640, 10148353, 7036897, 4388327, 3378302, 1369545, -1774383, -2810509, -1501467, -1942179, -5722387, -9386911, -11031959, -13665909, -18460835, -20007666, -13303571, -1699281, 7323692, 11554521, 13985616, 15511375, 13678535, 8312438, 2944884, -121392, -1808460, -2715002, -2206724, -2385251, -7978941, -19048096, -27562911, -25618189, -15166818, -5413101, -1575741, -797964, 551228, 618645, -3898200, -10738379, -13613775, -10424865, -6282501, -7051175, -12152791, -15565777, -12874027, -5731839, 226519, 697059, -3750441, -8226335, -7654754, -1454930, 5622715, 7996594, 4633435, -704534, -4226674, -5638485, -6550560, -7259218, -6963094]
3730f963094N95376j227936l237593k334515O75570J349359j876407m352025j175620
3721a8546885N420753Q491363N609730J310434l85613j021390k849474l696402
3713e667484j145258J696590L45343l214716l233503j3091l337n048346q597453
3704b4881255n582467J84560K666732K251494K544085L000597J050171j383097
3696b0149180j75006L515337M300168P22102l242161m600828l655366q4857O733459
3687a6636332J2511346J0245646N61711o506016m307251J358775J224712m202717
3679e750126p195647n429373l919777m780266l298059L017918Q090790N096399
3671a4168141l015225o472455j293813N964184P180732K611653r05269K80312
$$ y = [-6963094, -6367718, -7595654, -10833247, -13167762, -12492192, -11142833, -13019240, -17371265, -18546885, -13126132, -4634769, 974961, 2285395, 1899782, 878392, -1971082, -5667484, -6812742, -5116152, -4770809, -7985525, -11219028, -11232119, -11235456, -16283802, -24881255, -30463722, -30279162, -27612430, -25360936, -22816851, -19816254, -18766083, -20149180, -20324186, -16808849, -12508681, -11786579, -15028740, -19629568, -23284934, -23369791, -16636332, -4124986, 6120660, 6682371, 176355, -4130896, -2772121, -1547409, -5750126, -12945773, -18375146, -22294923, -27075189, -30373248, -27355330, -19264540, -14168141, -17183366, -23655821, -24949634, -18985450, -11804718, -9193065, -10098334, -9818022]
3663i818022K420029N49527m242160o373198l292535J730644M557561M877269
3655i590885M571335L998568K322616o7904k101747m055296o417505p369755m462745
3646b3173318R60113M027853K184431j566138k674985m23057K299384L059586
3638a5306131J976322P84990J403812M546624Q200245Q384679L360964l405970
3630I945535o561432n114123l224599m173976n737514l315540L437019R243670
3622e500960Q817416K614792l711301n046933j349485L243485M914302L393284
3614G374600J327874J254865L187752M629176K883349k217850p865995j0868345
3606b94574j0377768p505002l084415K373708O627348O238482Q71350m528346
$$ y = [-9818022, -7397993, -6848466, -11090626, -17463824, -20756359, -19025715, -14468154, -9590885, -5019550, -1020982, 1301634, 1233730, -868017, -4923313, -11340818, -18710573, -23173318, -22213205, -18185352, -16000921, -17567059, -20242044, -20665101, -18365717, -15306131, -13329809, -12544819, -11141007, -6594383, 1605862, 9990541, 13351505, 9945535, 3384103, -1730020, -4954619, -9128595, -14866109, -18181649, -14744630, -5500960, 3316456, 5931248, 2219947, -2826986, -4176471, -932986, 3981316, 7374600, 8702474, 9957339, 13145091, 17774267, 20657616, 18439766, 10573771, -294574, -10672342, -18177344, -21261759, -18888051, -12260703, -6022221, -5150871, -9679217]
3598i679217m195925J969380P990806Q072690K302296l978505n806773l413126
3590f738374j346890k594930m715016l793239j172847j945610n886022n533607
3582c3726535K715923J0700251Q500989n97955l662995L599995J1057575R208331
3574G795579J706812k232268j305573j205516m329558p336612p158910l869209
3566a7935255J180543N492427N403966O40835k928816k61045M740556L883251
3558B16462l413819r153480p977771l251962o17461r71094j987144k116228p03238
3549b9975735K439027N635488O220781L840069M18886k855690n128593l619434
3541b3025201K895065Q796767O544543k095626o915922l669629l522k890370p611919
$$ y = [-9679217, -13875142, -11905762, -3914956, 4157734, 6460030, 2481525, -3325248, -6738374, -8085264, -10680194, -15395210, -19188449, -20361296, -22306906, -28192928, -33726535, -31010612, -20310361, -11809372, -12407327, -16070322, -12470327, -1412752, 7795579, 9502391, 7270123, 5964550, 4759034, 429476, -6907136, -14066046, -17935255, -16754712, -11262285, -5858319, -5217484, -8146300, -8407345, -3666789, 216462, -3197357, -12350837, -20328608, -23580570, -24198031, -25169125, -27156269, -29272497, -29975735, -27536708, -21901220, -15680439, -11840370, -11421484, -14277174, -19405767, -23025201, -20130136, -11333369, -4788826, -6884452, -13800374, -17470003, -17473525, -20363895, -27975814]
3532b7975814n790868J288172N293858L645714J893068M114075P504191P336400
3524b691204K892394k424336m287370r27120M643849O879847L745544j246704
3516F584900m191913m836772l818895k49912M735835O243397J665475m857675
3508A274440p903158p168443m775912q29585L593793L998889r52346m982695k921511
3499b0666528P93447j00794k336066R58107O945338O905257J331216o08779L498136
3490c280666O253433M104176K311813L474819K442109k999750o741816m872917
3482F91201k252196l064263l649885p44121J552125l46962k377333m70383J904496
3473h757321R78310L62887L650563O044651K197419l306437k745685J922641K668302
$$ y = [-27975814, -33766682, -32478510, -27184652, -23538938, -21645870, -17531795, -10027604, -2691204, 201190, -2223146, -6510516, -7437636, -2793787, 4086060, 7831604, 6584900, 2392987, -2443785, -6262680, -6512592, -1776757, 4466640, 6132115, 1274440, -6628718, -13797161, -18573073, -19402658, -15808865, -11809976, -12762322, -17745017, -20666528, -19873081, -19973875, -22309941, -21351834, -14406496, -7501239, -6170023, -6778802, -3280666, 2972767, 7076943, 9388756, 12863575, 15305684, 12305934, 5564118, 691201, -1560995, -4625258, -8275143, -9019264, -7467139, -7814101, -10191434, -10661817, -8757321, -7779011, -7416124, -3765561, 2279090, 4476509, 1170072, -1575613, 347028, 3015330]
3464C015330j410074l967380k535977r58524j724282l496929n299294o470664
3456b2847794m157364K434969P442999N142767q42058k571468L24515J925457
3448a3147977R32544J117182K217556J31175m024140m715655k239200k356233
3440b2084748m843069k886317L998827P259971L215429q37835M42060J553338
3432a4182344k797732o797759k653688N907696Q762610M014522j234836k229242
3424a1210773p04472Q95377K102221J751742j106830l554809j535515L392383
3416i970676N007607R54313m078209m980239k264323K70597Q78892M85102k08612
3407a3905548j462213k451497q29275M084299Q698764Q252383L057941r81127
$$ y = [3015330, 1605256, -2362124, -4898101, -5856625, -7580907, -11077836, -16377130, -22847794, -27005158, -24570189, -17127190, -11984423, -12826481, -15397949, -15073434, -13147977, -12215433, -11098251, -8880695, -8749520, -12773660, -17489315, -19728515, -22084748, -26927817, -29814134, -25815307, -18555336, -15339907, -16177742, -15735682, -14182344, -16980076, -23777835, -26431523, -20523827, -11761217, -7746695, -8981531, -11210773, -11915245, -11019868, -8917647, -7165905, -8272735, -11827544, -13363059, -9970676, -4963069, -4008756, -8086965, -13067204, -15331527, -15060930, -14182038, -13696936, -13905548, -15367761, -17819258, -18648533, -14564234, -5865470, 2386913, 5444854, 4463727]
3399D463727J81303L353089K923749j360331n233977o523837o227551m356598
3391a2780426j26407M126917M731884K516903J586866K482091K440020J940476
3383F918324L644792M961264Q24471n026687k657369O584381P642479n754219
3375A7137436j8175089j3455087J213882O590761R1673l639178J490511M479089
3367d266002k499241j1175192j1513335o417625l347581j048296N136037J1449415
3359b3681820J0188335K814264j380626R51021L371306O19701l931318m519633
3351a5568770j292560J306183J232604K92109L07888Q73438Q59648J51506o80755
3342a2518709j385292j979290k004483n02092K785042O144151O498378K392813
$$ y = [4463727, 4645030, 7998119, 10921868, 9561537, 4327560, -2196277, -8423828, -12780426, -12906833, -8779916, -4048032, -1531129, 55737, 2537828, 4977848, 6918324, 10563116, 15524380, 16348851, 11322164, 8664795, 15249176, 22891655, 17137436, -1037653, -14492740, -13278858, -6688097, -6596424, -10235602, -8745091, -4266002, -6765243, -17940435, -29453770, -35871395, -39218976, -40267272, -35131235, -23681820, -13493485, -10679221, -12059847, -11108826, -7737520, -7117819, -11049137, -15568770, -16861330, -15555147, -14322543, -14030434, -13722546, -12849108, -11989460, -11837954, -12518709, -13904001, -15883291, -17887774, -18389866, -15604824, -9460673, -2962295, -569482]
3334e69482l282346m848119K12160P229992Q557057K516152m243137m995388j028913
3325d52024J449348K55792j445211j773712k534119m091170l352776O47824L895153
3316g400895L345092J509375J338907P02097l021581o221715l206714M411654
3308h543780Q680102N708309k54551l816186m504438m290384l400225j153528
3300a1574681J694616L670700M119701K890594J65055k461605k525725L12429
3292c708916K917883J656577l451975q228009q331120l860857O89642J844819
3284b0471956J312615K668621N206970N041892K094778Q04575K566808L145635
3276B369938M37374r82837K544628O890081O357682K284819o23935k408319n514441
$$ y = [-569482, -3851828, -8699947, -8487787, -1257795, 7299262, 9815414, 5572277, 576889, -452024, 997324, 1253116, -192095, -1965807, -4499926, -8591096, -11943872, -11296048, -7400895, -4055803, -2546428, -1207521, -505424, -3527005, -9748720, -12955434, -8543780, 136322, 5844631, 5590080, 1773894, -2730544, -7020928, -10421153, -11574681, -9880065, -6209365, -2089664, 800930, 965985, -1495620, -4021345, -3708916, -791033, 865544, -2586431, -10814440, -19145560, -23006417, -22316775, -20471956, -19159341, -16490720, -11283750, -6241858, -4147080, -3342505, -775697, 2369938, 2807312, 1824475, 4369103, 11259184, 17616866, 19901685, 19277750, 16869431, 11354990]
3267A1354990q030590o769429m106212l932799l677314J009477O305231N001557
3259b845089m48172q92658L720703L668505l654499q647635n358342n35388r52688
3250a5945263k610756J2735L578927L199240J899429L819500N046514O76671m821230
3241e144233l914863J946935N762332O165808N995618L955736k083320o809123
3233E874890l557196L166966K601797n141763q304436j420620O803434O997901
3225G020973J153714l321334l751098j503383K381072N805754M945828l61907
3217A2369619m657100m161969j949496k061684k828767p63823K378703J839886
3209A65369k584607n973118m707510K0039M606371O009577K926537k983275p000453
$$ y = [11354990, 3324400, -3445029, -7551241, -11484040, -15161354, -14151877, -7846646, -2845089, -3293261, -4185919, -465216, 3203289, -451210, -9098845, -14457187, -14992575, -15945263, -18556019, -18543284, -14964357, -11765117, -9865688, -6046188, -999674, -323003, -5144233, -9059096, -7112161, -1349829, 4815979, 10811597, 14767333, 12684013, 5874890, 2317694, 5484660, 8086457, 2944694, -5359742, -6780362, 23072, 7020973, 8174687, 4853353, 1102255, -401128, 1979944, 7785698, 12731526, 12369619, 7712519, 3550550, 1601054, -460630, -3289397, -4053220, -1674517, 165369, -2419238, -8392356, -13099866, -13079827, -8473456, -2463879, 462658, -2520617, -9521070]
3200i521070n111079J340024O409931N783226J206279k083613j606647J8525q10472
3191d374896l834891n876850n556751m159045j877183K782710Q214260Q699590
3183e983056J966668n533952n833094Q0832M290180L282514J300360K090720L389385
3174i49443J833139j422106l094227k647993j907889j840795k044565k120828
3166a4194707j914898j245212k13249Q63180J660553J227689j463260m678825
3158a9958729l871490K335451Q243614P643568K657659M73713K198693J807891
3150A530370l116446o949053n027191n75292J161288J13630j456020l685411n993830
3141b3997955m097141L636659J0407749Q449141L45783l912016n63355L866037
$$ y = [-9521070, -14632149, -13292125, -6882194, -1098968, 107311, -1976302, -3582949, -3564424, -4374896, -8209787, -14086637, -19643388, -23802433, -25679616, -22896906, -14682646, -5983056, -4016388, -9550340, -15383434, -15302602, -11012422, -7729908, -6429548, -4338828, -949443, 883696, -538410, -3632637, -6280630, -8188519, -10029314, -12073879, -14194707, -16109605, -17354817, -17568066, -16704886, -15044333, -13816644, -15279904, -19958729, -23830219, -21494768, -13251154, -5607586, -2949927, -2476214, -277521, 1530370, -1586076, -8535129, -13562320, -14137612, -12976324, -12862694, -14318714, -18004125, -23997955, -28095096, -24458437, -14050688, -5601547, -5255764, -9167780, -9731135, -5865098]
3133e865098K917673j536349l780149k225850N11424K505237L830340M251948
3125F09176K865621K49746j374839j199521j485334m316303p334530n438984K190171
3116a5234797R314849R363595L280122k252082l134685r99063R35210J020244
3108B293393j374849n079723n848802r32837M790629L376494m116576p130727
3100a4022998m64337P414999O260944j805109o905008n490311j901715J053912
3092a5859623M301886O156103K556188m722875p444898j705046N959409O845234
3084c913622Q92778m214239k664378L634467Q006756N998072n53913n909813o607305
3075e331197m271256k074800p05891N17547Q83892n72971k607033l029289j393789
$$ y = [-5865098, -2947425, -4483774, -8263923, -10489773, -9978349, -7473112, -3642772, 609176, 3474797, 3724543, 2349704, 1150183, -335151, -4651454, -11985984, -17424968, -15234797, -5919948, 3443647, 6723769, 4471687, 1337002, 337939, 1273149, 2293393, 918544, -4161179, -10009981, -10942818, -6152189, -2775695, -6892271, -14022998, -14487335, -7072336, -811392, -2616501, -9521509, -15011820, -16913535, -15859623, -11557737, -5401634, -2845446, -7568321, -15013219, -16718265, -10758856, -3913622, -3020844, -7235083, -9899461, -6264994, 1741762, 7739834, 7185921, 1276108, -5331197, -9602453, -11677253, -12383144, -11865597, -10981705, -11554676, -14161709, -17190998, -18584787]
3066a8584787J346191L996763M380755O43317m332814m018756K497492O996213
3058g075626L278519k808499j865511M322432N762934O1532m861798m032959j349133
3049h568109n10771K02100J137546j139373n222258l252589O140996J1942190
3041G29732N377866o642684j1205686o871889k250118j162298O04195M898282
3033a6522600O982038L357480k668956n304525k341866L681417P503111N089826
3025b24075j598731n562533l417613n4516o96754k353403O44332N955623O095231
3016a212439O19866k905383o07995K773468K282409r17956l858097o104153p025945
3007a6956225m344277J405348N540834N215812K734333Q30391q24275k232883
$$ y = [-18584787, -17238596, -13241833, -8861078, -8217761, -12550575, -16569331, -14071839, -7075626, -3797107, -6605606, -8471117, -4148685, 1614249, 1675781, -3186017, -7218976, -8568109, -9078880, -8876780, -7739234, -8878607, -14100865, -17353454, -11212458, 729732, 6107598, -535086, -11740772, -18612661, -20862779, -22025077, -21420882, -16522600, -9540562, -6183082, -8852038, -14156563, -16498429, -12817012, -5313901, -224075, -1822806, -7385339, -10802952, -10857468, -11554222, -13907625, -13263293, -7307670, -1212439, -592573, -3497956, -4105951, -1332483, 949926, 31970, -3826127, -9930280, -16956225, -21300502, -19895154, -14354320, -9138508, -6404175, -5573784, -6398059, -8630942]
2999h630942j243334J943985L209368P43724j764484j636249j875540m786685
2991a4040157n794658J05190Q862691J1095345M274548m490360p680412m699932
2983a2367745P9062K510009J443007o53546K64795M853763Q359125O214429L26817
2974A1029716l491213l099133j273535l70601j3043J49129l85732o86394Q38445
2965B697639K915098K480448j36858j192220K49783L70729l091461o607909o044673
2956h359424k997082k041139l303978k012230M120013J0328802R790298K168182
2948G693442n168477n545418j010376P55547k739356n247666j288380M929833
2940g620851M960171j763635p205709n945186j329275R00881m0412j418675j638315
$$ y = [-8630942, -9874276, -7930291, -4720923, -3977199, -5741683, -7377932, -9253472, -14040157, -19834815, -19729625, -10866934, 228411, 4502959, 12599, -7667813, -12367745, -12288683, -9778674, -8335667, -8989213, -8724418, -3870655, 4488470, 10702899, 11029716, 7538503, 4439370, 3165835, 2795234, 2782191, 2931320, 2545588, 1859194, 2697639, 5612737, 8093185, 7956327, 6764107, 7013890, 7384619, 4293158, -2314751, -8359424, -11356506, -13397645, -16701623, -18713853, -14593840, -4265038, 5525260, 7693442, 2524965, -3020453, -4030829, -3275282, -6014638, -11262304, -12550684, -7620851, -2660680, -4424315, -11630024, -17575210, -18904485, -18003604, -18044016, -19462691, -21101006]
2931b1101006o25157J489014L644189M166380L378207L255764L449139J259322
2923a084148k965604m739534k235372N6158k198200o714757q251979n499531o92708
2914c4325675M417058Q290974Q419701M653835J033769M50045O66869m73821l55136
2905g222381K545266L040905k901011q762010n446787L688697O500297M70375
2897h086649l964642o60738L167280J95269m926527m222330P13269L034250K404376
2888a2346442L618516O687326O721462K614601j171087j514231J9662Q38403J46653
2879E614863j723686l495219l187974r01158L51573o45989n97654K513922M272753
2870B201431j6987o549681p163849j486542J979513k042969q350427q358040l51978
$$ y = [-21101006, -21726163, -20237149, -16592960, -12426580, -9048373, -5792609, -2343470, -1084148, -4049752, -8789286, -11024658, -10968500, -13166700, -19881457, -28133436, -33632967, -34325675, -29908617, -21617643, -13197942, -8544107, -7510338, -7060293, -6393424, -6867245, -7222381, -4677115, -1636210, -4537221, -13299231, -18746018, -15057321, -8557024, -8086649, -12051291, -12712029, -9544749, -9349480, -14276007, -18498337, -17785068, -14750818, -12346442, -8727926, -2040600, 4680862, 7295463, 6124376, 4610145, 4629807, 5468210, 5614863, 3891177, 395958, -2792016, -3693174, -3341601, -3987590, -4585244, -2071322, 2201431, 2184444, -4365237, -11529086, -13015628, -11036115, -13079084, -21429511, -29787551, -30139529]
2861c0139529R338230J2654200O553249l846560q972595m687735K360905L044046
2853a3695789k186472n134457k686079j69584p55396P8666N352664R208684N274612
2844d713151k457238m453074R80651N952364M079182k477410p587769p975842
2836a8652287m216838J403246O294263Q899617R572226Q859033N555316j054361
2828A6660215p576345q778693m350290J3194K4127j845860j194295Q68598m23258
2819f602607m967353o297083n44277P173138Q998041M573355N93591J020714K690195
2810F637714J545820j474140l243216l387380l252472k863722k318147l570120
2802a1925663o901124p920065k765504N208502Q912461O767147L273517J028136
$$ y = [-30139529, -20801299, -8147099, -1593850, -5440410, -14413005, -19100740, -16739835, -13695789, -15882261, -21016718, -23702797, -23872381, -24627777, -24549111, -19196447, -9987763, -4713151, -7170389, -11623463, -10642812, -4690448, -611266, -3088676, -10676445, -18652287, -22869125, -21465879, -15171616, -6271999, 3300227, 12159260, 17714576, 16660215, 9083870, 305177, -4045113, -4031919, -4007792, -5853652, -7047947, -6179349, -6602607, -11569960, -17867043, -18411320, -11238182, -2240141, 2333214, 2926805, 3947519, 6637714, 8183534, 6709394, 3466178, 78798, -3173674, -6037396, -8355543, -11925663, -18826787, -26746852, -29512356, -24303854, -15391393, -8624246, -5350729, -4322593]
2794d322593j546817l854932j536370N656329J0257364O061448l090199q128403
2786e04173n788456m70091L038088M080894L814768K457150J10230j771008j308345
2777C659057J304314K746267l95694o253984p594827o92189P377363N994392m341284
2768A803415j1400228p537693M57606K440563o74241p32414L789538O326086L312134
2759b215234j342961l753602n243716p744456r173556o491456l13493N970186
2751c0308288R821789J0856628J0043464Q520742O219109J849124m392909q998256
2743C611403q333212l302663J382991K416357N25776j523373j607031L98026K117491
2734d314235O56015l073648l927989P63150O105141N178611j511732o365662m197013
$$ y = [-4322593, -5869410, -9724342, -11260712, -5604383, 4652981, 10714429, 7624230, -504173, -6292629, -6762720, -3724632, 356262, 4171030, 6628180, 6738410, 4967402, 3659057, 4963371, 7709638, 7313944, 1059960, -6534867, -7227056, 150307, 6144699, 1803415, -9596813, -17134506, -16676900, -14236337, -14910578, -15642992, -11853454, -5527368, -2215234, -3558195, -7311797, -12555513, -20299969, -29473525, -35964981, -36278474, -30308288, -20486499, -9629871, 413593, 8934335, 15153444, 17002568, 12609659, 3611403, -4721809, -8024472, -6641481, -4225124, -3699348, -5222721, -6829752, -6431726, -4314235, -3658220, -6731868, -10659857, -9896707, -3791566, 1387045, -124687, -6490349, -10687362]
2725a0687362K340209O747985M750022l220007j1967917j4230699p119255L968523
2717b9418501J0740836J0531459O505366J661937k460369l146008P47468M010238
2709h27574L03740p339645q984603k438441K916828N48162l210436L78540Q579152
2700a0074277J1502367O397269k0711j763862N67073L574768N037561L672397
2692A8892585o64348n581083p697499o038461k347217J162435K784500J601587
2684B112499j170448k556816j373431K12780J63956o06382m49820O09767K154138
2675i03757L739424K662876l755200j1288250j0473950K22051R315677P192782
2667c288347J22885P3731N164986K657550r300628j6210448p621572P805564J4290587
$$ y = [-10687362, -8347153, -1599168, 3150854, -69153, -12037070, -26267769, -33387024, -29418501, -18677665, -8146206, -1640840, 21097, -2439272, -5585280, -4837812, -827574, -523834, -7863479, -16848082, -19286523, -16369695, -15821533, -19031969, -18653429, -10074277, 1428090, 7825359, 7804648, 6040786, 6607859, 10182627, 15220188, 18892585, 18228237, 12647154, 4949655, -1088806, -3436023, -2273588, 510912, 2112499, 942051, -1614765, -2988196, -2775416, -2611460, -3217842, -3667662, -3057895, -903757, 2835667, 5498543, 1743343, -9544907, -20018857, -19796806, -10481129, -3288347, -3165462, -3091731, 2073255, 4730805, -4569823, -20780271, -28401843, -20596279, -6305692]
2658f305692Q258215j509231p241274p800431m379192J406628N661935M696385
2650g212657J79903k405636j058303O12048n73761k432527o06030M788139P969456
2641g39368L786237n492426j1427752q575104q41614L626737K600383J076597
2633a5986310K725995M901453L944575R77614q60630j548566k634130k964515
2625a1444514k72893M098652N940990L296248k079430p520131j0637492q892994
2617b7511564k140756M581862N184086L36781k803699l5273M721189N884508L923886
2608g858980K996269L704418K777376j064896n205657p173838o964783m926952
2600b3717043r78657L032917L856050J661499J014658M322300P364563N145624
$$ y = [-6305692, 1952523, 443292, -6797982, -14598413, -18977605, -17570977, -11909042, -7212657, -7032754, -9438390, -10496693, -9884645, -10458406, -12890933, -13496963, -8708824, -739368, 3046869, -2445557, -13873309, -22448413, -23290027, -19663290, -17062907, -15986310, -13260315, -8358862, -4414287, -3436673, -4297303, -5845869, -8479999, -11444514, -11717407, -7618755, -1677765, 1618483, -460947, -7981078, -18618570, -27511564, -29652320, -25070458, -19886372, -19549591, -22353290, -22388563, -17667374, -11782866, -7858980, -4862711, -1158293, 1619083, 554187, -4651470, -11825308, -18790091, -23717043, -24695700, -21662783, -17806733, -16145234, -15130576, -10808276, -3443713, 1701911]
2592A701911j05450j619261K106133N383749L834606k13083k679787l431085l861259
2583A116474k630736J788884O498847O697277K248144k056194k857097j691990
2575I113609j698633l533704n334858m891778j352183L816041P419667P305206
2567A0843367M363461Q88323k028484m116194m530906l124031j793510j941263
2559a439237j844422L86894K563260J112390k649442l488433K22975M470009N906979
2550E240973N526861M535958J531465l420756o351564m843767k430015l281613
2542c492458n287688l368294J880289M154448K68123n480398p137200m039291
2534b2502469j43544J408661J043847R77850K294193L987526M416083L339322
$$ y = [1701911, 1596461, -22800, 2083333, 7467082, 11301688, 11088605, 8408818, 4977733, 1116474, -1514262, 274622, 6773469, 13470746, 15718890, 13662696, 10805599, 9113609, 7414976, 3881272, -1453586, -6345364, -7697547, -3881506, 3538161, 10843367, 15206828, 16095151, 14066667, 9950473, 5419567, 2295536, 502026, -1439237, -3283659, -2896765, -333505, 778885, -1870557, -5358990, -5136015, -666006, 5240973, 10767834, 15303792, 16835257, 13414501, 7062937, 2219170, -210845, -3492458, -8780146, -12148440, -10268151, -6113703, -5845580, -11325978, -18463178, -22502469, -22646013, -21237352, -20193505, -19215655, -16921462, -12933936, -8517853, -5178531]
2526e178531K111639J840052K092415J787425N69625j209044l016272l946101
2518d948792k818294N38962M400128O189305M412177k98064n380043p672250n613414
2509a1190285o02816M184582O214015M689585N62257l384772m011933j484878
2501e024245q2855k671036n824929m194798J268964M171456J784355j780176k451594
2492a4804858j031769N98775K760398M812554L928483M43377o20985K570295M444010
2483C100280Q59440k922216r3469N775223N201866k404741p248124l290596M030765
2474C008428O764404M463513J484682n71010k880134m696336l475554N24114L027750
2465G649857M83573m924759o605082j137305O293440O905265o33676p819636p083489
$$ y = [-5178531, -3066892, -1226840, 865575, 2653000, 3222625, 2013581, -1002691, -4948792, -7767086, -7228124, -2827996, 3361309, 7773486, 7475422, 2095379, -5576871, -11190285, -11793101, -7608519, -1394504, 3295081, 3857338, 472566, -3539367, -5024245, -5107100, -7778136, -13603065, -17797863, -16528899, -12357443, -10573088, -12353264, -14804858, -15836627, -15237852, -12477454, -7664900, -3736417, -3293040, -3914025, -1343730, 3100280, 3959720, 1037504, 944035, 6719258, 11921124, 9516383, 2268259, -1022337, 3008428, 9772832, 14236345, 15721027, 15150017, 12269883, 7573547, 4097993, 4622107, 7649857, 8133430, 3208671, -3396411, -4533716, 1759724, 8664989, 8031313, 211677, -6871812]
2456f871812j081117K368816J070502q28527m53476J040204K135340K283022M86468
2447A49420k702445l080832K142583Q501341R085900L968710j046727l404311
2439A3613639m527936l319844K225092P330686M343257m353135p611145k354687
2431E345927J694460j498686m432151J57540O214944M865610m32371o52774K842779
2422A4105278J322878n619231r382307o454020k254008l49445K068960N914620
2414f47275O337096O82099o175046p882370l601583K860160O774494M652135k598154
2405D01556q100577n597327J895366N342709K018103j646691p26471J588804R16047
$$ y = [-6871812, -7952929, -5584113, -4513611, -5342138, -5795614, -4755410, -2620070, -337048, 149420, -2553025, -5633857, -3491274, 5010067, 14095967, 18064677, 17017950, 13613639, 9085703, 5765859, 7990951, 15321637, 19664894, 15311759, 7700614, 5345927, 7040387, 5541701, 1109550, 1267090, 7482034, 12347644, 11915273, 11262499, 14105278, 15428156, 9808925, 426618, -6027402, -8281410, -8630855, -6561895, -647275, 5689821, 6371920, 196874, -7685496, -11287079, -8426919, -1652425, 2999710, 401556, -7699021, -13296348, -11400982, -6058273, -4040170, -5686861, -6413332, -4824528, -3908481]
$$ [...]
##END NTUPLES=NMR SPECTRUM
##END=
