##TITLE=31P_DE-80H_X3
 64 sc D2O
 26.2.2025
##JCAMPDX= 6.0         $$ Bruker NMR JCAMP-DX V2.0
##DATA TYPE= NMR SPECTRUM
##DATA CLASS= NTUPLES
##ORIGIN= UXNMR, Bruker Analytische Messtechnik GmbH
##OWNER= root
$$ XWIN-NMR		Version 3.5
$$ Mon Jul 14 14:50:28 2025 Russian Standard Time (UT+4h)  Yarkov@DPX200
##.OBSERVE FREQUENCY= 81.013821
##.OBSERVE NUCLEUS= ^31P
##.ACQUISITION MODE= SIMULTANEOUS
##.ACQUISITION SCHEME= undefined
##.AVERAGES= 64
##.DIGITISER RES= 17
##SPECTROMETER/DATA SYSTEM= spect
##.PULSE SEQUENCE= zgpg30
##.SOLVENT NAME= DMSO
##.SHIFT REFERENCE= (INTERNAL, DMSO, 0, 198.062)
##AUDIT TRAIL= $$ (NUMBER, WHEN, WHO, WHERE, WHAT)
$$ ##TITLE= Audit trail, XWIN-NMR		Version 3.5
$$ ##JCAMPDX= 5.01
$$ ##ORIGIN= Bruker BioSpin GmbH
$$ ##OWNER= Yarkov
$$ C:/Bruker/XWIN-NMR/data/yarkov2/nmr/P31/2/pdata/1/auditp.txt
$$ ##AUDIT TRAIL=  $$ (NUMBER, WHEN, WHO, WHERE, WHAT)
(   1,<2025-07-14 14:49:51.90 +0400>,<Yarkov>,<DPX200>,
      <created by zg, POWCHK disabled, PULCHK disabled
       configuration hash MD5:
       00 E9 B6 7A A2 85 ED C7 34 08 36 98 17 FE 4E 26
       data hash MD5: 32K
       82 38 70 53 D2 96 9F 54 B3 F0 F6 76 22 C0 C6 6C>)
(   2,<2025-07-14 14:49:56.85 +0400>,<Yarkov>,<DPX200>,
      <Start of raw data processing
       efp BC_mod = 2 LB = 1.5 FT_mod = 6 PKNL = 1 PHC0 = 1676.443 PHC1 = 49.15953 SI = 64K 
       data hash MD5: 64K
       76 49 96 65 A9 C6 C1 26 54 20 36 1A 79 32 25 3B>)
$$ ##END=
$$ 
$$ hash MD5
$$ 22 E1 9F 37 31 63 38 DF 08 EE 1F CC F5 EB 7C DB
##$RELAX= 
##$RELAX= 
##$RELAX= 
##$RELAX= 
##$RELAX= 
##$RELAX= 
##$RELAX= 
##$RELAX= 
$$ Bruker specific parameters
$$ --------------------------
##$DU= <C:/Bruker/XWIN-NMR>
##$EXPNO= 2
##$NAME= <P31>
##$PROCNO= 1
##$TYPE= <nmr>
##$USER= <yarkov2>
##$AMP= (0..31)
100 100 100 100 100 100 100 100 100 100 100 100 100 100 100 100 100 100 
100 100 100 100 100 100 100 100 100 100 100 100 100 100 
##$AQSEQ= 0
##$AQ_mod= 1
##$AUNM= <au_zg>
##$AUTOPOS= <>
##$BF1= 81.014009
##$BF2= 200.13
##$BF3= 200.13
##$BF4= 200.13
##$BF5= 200.13
##$BF6= 200.13
##$BF7= 200.13
##$BF8= 200.13
##$BYTORDA= 1
##$CFDGTYP= 0
##$CFRGTYP= 5
##$CHEMSTR= <none>
##$CNST= (0..31)
1 1 145 1 1 1 1 1 1 1 1 1 1 1 1 1 1 1 1 1 1 1 1 1 1 1 1 1 1 1 1 1 
##$CPDPRG= <waltz16>
##$CPDPRG1= <>
##$CPDPRG2= <waltz16>
##$CPDPRG3= <>
##$CPDPRG4= <mlev>
##$CPDPRG5= <mlev>
##$CPDPRG6= <mlev>
##$CPDPRG7= <mlev>
##$CPDPRG8= <mlev>
##$CPDPRGB= <>
##$CPDPRGT= <>
##$D= (0..31)
0 1 0 0 0 0 0 0 0 0.06 0 0.03 2e-05 3e-06 0 0 0.0002 0 0 0 0 0 0 0 0 0 
0 0 0 0 0 0 
##$DATE= 1752490191
##$DBL= (0..7)
120 120 120 11 120 120 24 19 
##$DBP= (0..7)
150 150 150 150 150 150 150 150 
##$DBP07= 0
##$DBPNAM0= <>
##$DBPNAM1= <>
##$DBPNAM2= <>
##$DBPNAM3= <>
##$DBPNAM4= <>
##$DBPNAM5= <>
##$DBPNAM6= <>
##$DBPNAM7= <>
##$DBPOAL= (0..7)
0.5 0.5 0.5 0.5 0.5 0.5 0.5 0.5 
##$DBPOFFS= (0..7)
0 0 0 0 0 0 0 0 
##$DE= 6
##$DECBNUC= <off>
##$DECIM= 4
##$DECNUC= <off>
##$DECSTAT= 4
##$DIGMOD= 1
##$DIGTYP= 9
##$DL= (0..7)
0 0 52 120 120 21 21 25 
$$ [...]
##$SUBNAM3= <"">
##$SUBNAM4= <"">
##$SUBNAM5= <"">
##$SUBNAM6= <"">
##$SUBNAM7= <"">
##$SUBNAM8= <"">
##$SUBNAM9= <"">
##$SW= 400.765351723535
##$SWIBOX= (0..15)
0 1 3 0 0 0 0 0 0 0 0 0 0 0 0 0 
##$SW_h= 32467.5324675325
##$TD= 32768
##$TD0= 1
##$TE= 0
##$TE2= 300
##$TE3= 300
##$TEG= 300
##$TL= (0..7)
0 120 53 12 22 120 120 120 
##$TP= (0..7)
150 150 150 150 150 150 150 150 
##$TP07= 0
##$TPNAME0= <>
##$TPNAME1= <>
##$TPNAME2= <>
##$TPNAME3= <>
##$TPNAME4= <>
##$TPNAME5= <>
##$TPNAME6= <>
##$TPNAME7= <>
##$TPOAL= (0..7)
0.5 0.5 0.5 0.5 0.5 0.5 0.5 0.5 
##$TPOFFS= (0..7)
0 0 0 0 0 0 0 0 
##$TUNHIN= 0
##$TUNHOUT= 0
##$TUNXOUT= 0
##$USERA1= <user>
##$USERA2= <user>
##$USERA3= <user>
##$USERA4= <user>
##$USERA5= <user>
##$V9= 5
##$VALIST= <valist>
##$VCLIST= <CCCCCCCCCCCCCCC>
##$VD= 0
##$VDLIST= <DDDDDDDDDDDDDDD>
##$VPLIST= <PPPPPPPPPPPPPPP>
##$VTLIST= <TTTTTTTTTTTTTTT>
##$WBST= 1024
##$WBSW= 4
##$XGAIN= (0..3)
0 0 0 0 
##$XL= 0
##$YL= 0
##$YMAX_a= 1209
##$YMIN_a= -1102
##$ZGOPTNS= <>
##$ZL1= 120
##$ZL2= 120
##$ZL3= 120
##$ZL4= 120
##$ABSF1= 0
##$ABSF2= 0
##$ABSG= 0
##$ABSL= 0
##$ALPHA= 0
##$AQORDER= 0
##$ASSFAC= 0
##$ASSFACI= 0
##$ASSFACX= 0
##$ASSWID= 0
##$AUNMP= <proc_1d>
##$AZFE= 0.1
##$AZFW= 0.5
##$BCFW= 0
##$BC_mod= 2
##$BYTORDP= 0
##$COROFFS= 0
##$CY= -3
##$DATMOD= 1
##$DC= 0
##$DFILT= <>
##$DTYPP= 0
##$F1P= 0
##$F2P= 0
##$FCOR= 1
##$FTSIZE= 65536
##$FT_mod= 6
##$GAMMA= 0
##$GB= 0
##$INTBC= 1
##$INTSCL= 9.790993e-09
##$ISEN= 30
##$LB= 1.5
##$LEV0= 0
##$LPBIN= 0
##$MAXI= 10000
##$MC2= 0
##$MEAN= 0
##$ME_mod= 0
##$MI= 50
##$NCOEF= 0
##$NC_proc= -14
##$NLEV= 6
##$NOISF1= 182.463
##$NOISF2= 159.3651
##$NSP= 0
##$NTH_PI= 0
##$NZP= 0
##$OFFSET= 198.0616
##$PC= 4
##$PHC0= 1676.443
##$PHC1= 49.15953
##$PH_mod= 1
##$PKNL= yes
##$PPARMOD= 0
##$PSCAL= 0
##$PSIGN= 0
##$REVERSE= no
##$SF= 81.0140089999434
##$SI= 65536
##$SIGF1= 159.3651
##$SIGF2= -187.1042
##$SINO= 113.3802
##$SIOLD= 16384
##$SREGLST= <1H.CDCl3>
##$SSB= 0
##$STSI= 65536
##$STSR= 0
##$SW_p= 32467.5324675325
##$SYMM= 0
##$S_DEV= 0
##$TDeff= 32768
##$TDoff= 0
##$TI= <>
##$TILT= no
##$TM1= 0
##$TM2= 0
##$TOPLEV= 0
##$USERP1= <user>
##$USERP2= <user>
##$USERP3= <user>
##$USERP4= <user>
##$USERP5= <user>
##$WDW= 1
##$XDIM= 65536
##$YMAX_p= 406041887
##$YMIN_p= -442810338
$$ End of Bruker specific parameters
$$ ---------------------------------
##NTUPLES= NMR SPECTRUM
##VAR_NAME=  FREQUENCY,     SPECTRUM/REAL,   SPECTRUM/IMAG
##SYMBOL=    X,             R,               I
##VAR_TYPE=  INDEPENDENT,   DEPENDENT,       DEPENDENT
##VAR_FORM=  AFFN,          ASDF,            ASDF
##VAR_DIM=   65536,         65536,           65536
##UNITS=     HZ,            ARBITRARY UNITS, ARBITRARY UNITS
##FACTOR=    0.49542278885378, 1,            1
##FIRST=     16045.7642231865, 0,            0
##LAST=      -16421.768244346, 0,            0
##MIN=       -16421.768244346, -442810338,   0
##MAX=       16045.7642231865, 406041887,    0
$$ Real data points
##PAGE= N=1
##DATA TABLE= (X++(R..R)), XYDATA
$$ [...]
44020f919057Q381411Q225554J771948n341251o344459k748850n00861j74336
44012c649901J408742K570629r85896o289715n318096J808989N482069J111719
44004c861460m242613l796177p52182m16849o19687K537413N663047L387277j447635
43995c548866j640302K592859M095462K92568l552216l064702K19033L652222
43987i53942O737911P792613L731417l817682p820055n124807j562466l142366
43979d159377o625337n031451O28652K810055k48303k005865Q28716K566961r83324
43970a2219273l785981R04040P489255M753651o009110j0761508k785305P526579
43962a4887652Q282600K469053O88962M223912N329545J066219l283883m038162
$$ plain form
44020 -6919057 1462354 9687908 11459856 6118605 -225854 -2974704 -3475565 -3649901
44012 -3649901 -2241159 329470 -656426 -6946141 -12264237 -10455248 -4973179 -3861460
44004 -3861460 -8104073 -11900250 -12652432 -13069281 -13688968 -11151555 -5488508 -2101231 -3548866
43995 -3548866 -5189168 -2596309 1499153 1791721 -1760495 -4825197 -4606164 -953942
43987 -953942 5783969 13576582 17307999 13490317 5670262 545455 -1017011 -4159377
43979 -4159377 -10784714 -15816165 -15187513 -12377458 -12625761 -14631626 -13802910 -11235949 -12219273
43970 -12219273 -16005254 -15101214 -7611959 -2858308 -8867418 -19628926 -22414231 -14887652
43962 -14887652 -6605052 -4135999 -3447037 776875 6106420 7172639 3888756 -149406
43954a49406l338242k671375k36671L349426L943683R65589r51721j65118j267693
43945e21528o289841r009765l742281M723779O492742k80101p510532q011707
43937b4149234l267107N88808J081646J430564N007386R603578R260867K485897
43929B042405m168854l946500Q13153K180243j526825l758471n26384L522567
43921e368666K826119j017684k883625j307469J867332M921382N615672J550376
43913F203437m642259n231228K195843Q806230N591338l374894o505122j209367
43905A833978L735882K018530k581785m257080l274112k393154j065669K089071
43897c894339M695113L277567j024700l213907q32073K780965K296204l348681
$$ plain form
43954 -149406 -3487648 -6159023 -6395694 -3046268 897415 1863004 911283 746165 -521528
43945 -521528 -6811369 -15821134 -19563415 -14839636 -8346894 -8626995 -16137527 -24149234
43937 -24149234 -27416341 -26827533 -25745887 -24315323 -19307937 -9704359 -443492 2042405
43929 2042405 -2126449 -6072949 -5259796 -3079553 -4606378 -8364849 -8891233 -5368666
43921 -5368666 -2542547 -3560231 -6443856 -7751325 -5883993 -962611 4653061 6203437
43913 6203437 1561178 -3670050 -1474207 7332023 12923361 9548467 3043345 1833978
43905 1833978 5569860 7588390 5006605 749525 -2524587 -4917741 -5983410 -3894339
43897 -3894339 800774 4078341 3053641 -160266 -992339 1788626 4084830 736149
43889G36149r155279r079604k813233L757438N427300L092316J034454J211876
43881e788583K638007M234995N113447L712709J67536j923777N2643K803653J113232
43872A2123862m001976o060898k211377L231012N064608K566616k143083o407708
43864B161056o808920j912879L211466J075218o962211r831941j689979Q315884
43856a2442306P980100p94283n349854o52590N337657N574714L500936M309033
43848G463407M820930l01369p157554o553481J720308P216059L338821l854522
43840F692599n385897j879977k75182j826949j019502M018227P309997L851496
43832A1484812k457306l616554K228031Q708916Q516349P77964q196641j0659076
$$ plain form
43889 736149 -8419130 -17498734 -20311967 -16554529 -11127229 -8034913 -7000459 -5788583
43881 -5788583 -3150576 1084419 6197866 9910575 10078111 8154334 8206977 11010630 12123862
43872 12123862 8121886 2060988 -150389 3080623 8145231 10711847 8568764 2161056
43864 2161056 -4647864 -6560743 -3349277 -2274059 -9236270 -19068211 -20758190 -12442306
43856 -12442306 -4462206 -5256489 -10606343 -11258933 -5921276 -346562 3154374 7463407
43848 7463407 12284337 11982968 4825414 -1728067 -7759 7208300 10547121 6692599
43840 6692599 1306702 -573275 -848457 -2675406 -3694908 323319 7633316 11484812
43832 11484812 9027506 5410952 7638983 16347899 24864248 25642212 17445571 6786495
43824F786495m981807K246999L357211j469057n340261m547955k641038l226774
43816i816187m172747k577119o65522j616263l307118k215782n36521k313634
43808b7220893m414761Q3273R069264J1030332J117209j0077303r699732O99767
43800b9412844Q615515P692387L820212M208363P317643O729669R22938m872708
43792E021175n518927j714671J583062J025941j735115k380401Q21034M741584
43784A843682N008854J492741j362582m30631J614697O1191m373781n477918k38967
43775a862714N936753N887704J90575m108648k989447Q32524L279131L057913
43767A0223791j30850o294818j2149099j2187757n605673J593264M005240K716529
$$ plain form
43824 6786495 1804688 4051687 7408898 5939841 599580 -3948375 -6589413 -9816187
43816 -9816187 -13988934 -16566053 -17231575 -18847838 -22154956 -24370738 -24907259 -27220893
43808 -27220893 -31635654 -31552381 -22483117 -11452785 -10335576 -20412879 -30112611 -29412844
43800 -29412844 -20797329 -13104942 -9284730 -5076367 2241276 8970945 9893883 5021175
43792 5021175 -497752 -2212423 -629361 396580 -1338535 -3718936 -2897902 1843682
43784 1843682 6852536 8345277 6982695 6552064 8166761 8227952 3854171 -1623747 -1862714
43775 -1862714 4074039 9961743 10152318 6043670 3054223 3886747 7165878 10223791
43767 10223791 10092941 3798123 -8350976 -20538733 -26144406 -24551142 -20545902 -17829373
43759a7829373J446164J136630J498816L478640O228955N796178J221053k146476
43751H30587l00585K653418J115940k700442k961545l09048J22040j498921m55526
43742c504082K759781K132370l554390p885256o131614q82975L353911N237454
43734h474801M690123J562655k130606l513228l248470l879978m118912p56043
43726a9869260M204914N492078L633551M065411O685756N423254r7201k339926
43718G198577J398764L957187Q35614j851185J670200O550665N447379k99044
43710B4908157n118772q233156j0586851r163538k713925K453431R75472k401500
43702i880682q77094K432481M87937m246862l625684J724373L532007N77354N44109
$$ plain form
43759 -17829373 -16383209 -15246579 -13747763 -10269123 -4040168 1756010 2977063 830587
43751 830587 530002 3183420 4299360 1598918 -1362627 -1671675 -1549635 -3048556 -3504082
43742 -3504082 -744301 1388069 -2166321 -10051577 -16183191 -17066166 -13712255 -8474801
43734 -8474801 -3784678 -2222023 -4352629 -7865857 -11114327 -14994305 -19113217 -19869260
43726 -19869260 -15664346 -10172268 -6538717 -2473306 4212450 9635704 9538503 7198577
43718 7198577 8597341 12554528 13390142 11538957 13209157 19759822 25207201 24908157
43710 24908157 19789385 11556229 969378 -8194160 -10908085 -8454654 -7479182 -9880682
43702 -9880682 -10757776 -8325295 -7837358 -12084220 -15709904 -13985531 -10453524 -9876170 -9332061
43693i332061O026031R588467N860537n39414l012405j664563k56728l85920k023651
43684D260293m929196o877849m872759o8122K728385J692278l69490j680819l398849
43675a3516128m769079k434006L190059O539958M834869K251109K880989M338640
43667C316411K488486j374655k848395j542921j154869l144758m350876j796725
43659a0408302K606844M096815J397966j093462P51777M249124L243945k107194
43651B737513m554758q85221K626616N05319k628782k10606M319158L081852k453043
43642B538048m006312j011872r74561n060921n424265M77241M594449J926016
43634f942177j378134K62019J883166k455566q315139p908811k364871J753325
$$ plain form
43693 -9332061 -3306030 6282437 12142974 11603560 8591155 6926592 6669864 6283944 4260293
43684 4260293 -668903 -7546752 -12419511 -12487633 -9759248 -8066970 -8436460 -10117279 -13516128
43675 -13516128 -18285207 -20719213 -17529154 -10989196 -6154327 -3903218 -1022229 3316411
43667 3316411 5804897 4430242 1581847 38926 -1115943 -4260701 -8611577 -10408302
43659 -10408302 -7801458 -3704643 -2306677 -3400139 -2648362 1600762 4844707 2737513
43651 2737513 -1817245 -2702466 -75850 429469 -2199313 -2409919 1909239 4991091 2538048
43642 2538048 -1468264 -2480136 -3454697 -8515618 -13939883 -13462642 -8868193 -6942177
43634 -6942177 -8320311 -8058292 -6175126 -8630692 -16945831 -24854642 -27219513 -25466188
43626b5466188L331254N436281O923662M150684r28675k360512Q93456M035514
43618c984524L579272K3882n044937r070438p647055M20227Q563182R091175L476212
43609e93004n1468J524063L031942N91480k422836j196190L305732N611195K028021
43600A1828935n473997j0374751p437536P67346N336876J885930l155243j670828
43592h293268L860104M018553l092746q917513o834111j55354M580763N892008
43584h941564N677313M720076L712558M453957O243068M823612j268637o779409
43576A2640974o376812k353828j155808m334023p646585p765682n088968o05057
43568b2685789M997647Q789995P144034J296590k906209k732399j834177l187706
$$ plain form
43626 -25466188 -22134934 -16698653 -9774991 -5624307 -6552982 -8913494 -8020038 -3984524
43618 -3984524 -405252 -381370 -5426307 -14496745 -22143800 -21723573 -13160391 -4069216 -593004
43609 -593004 -644472 879591 3911533 4503013 2080177 883987 4189719 9800914 11828935
43600 11828935 6354938 -4019813 -11457349 -10690003 -5353127 -3467197 -6622440 -8293268
43592 -8293268 -4433164 -414611 -3507357 -12424870 -19258981 -19414335 -14833572 -8941564
43584 -8941564 -3264251 1455825 5168383 9622340 15865408 20689020 19420383 12640974
43576 12640974 6264162 3910334 2754526 -1579497 -9226082 -16991764 -22080732 -22685789
43568 -22685789 -17688142 -8898147 -1754113 -457523 -3363732 -6096131 -7930308 -11118014
43560a1118014l318896J752766Q151813P956079K88745p495772r825168p991283
43552b1599730m387898J251169O977409P041591K65466n778527m891968j290744
43544b2413232j641356l352931J57874O613492Q172639N391457N791626Q677042
43536G396611M734399o460303j2102164n305037L622308L115028l161310n280432
43528a3440900l024937j805535l61136N206075J0602235Q867203K917469P74118
43520I734592J565291j503993o849448o431543r75892M92200k784388j139648
43512g892829P906845J3242101P008446l554183p911037o278413m571570l528968
43504e579608r41385J325278L48974j758311j015577K340375N491164P054004
$$ plain form
43560 -11118014 -14436910 -12684144 -4532331 3423748 3712493 -3783279 -13608447 -21599730
43552 -21599730 -25987628 -24736459 -17759050 -10717459 -10451993 -16230520 -21122488 -22413232
43544 -22413232 -24054588 -27407519 -27249645 -20636153 -12463514 -7072057 -1280431 7396611
43536 7396611 12131010 5670707 -6431457 -11736494 -8114186 -4999158 -8160468 -13440900
43528 -13440900 -16465837 -18271372 -18632508 -13426433 -2824198 6043005 8960474 9734592
43520 9734592 11299883 9795890 2946442 -3485101 -4460993 -3968793 -6753181 -7892829
43512 -7892829 14016 13256117 20264563 16710380 8799343 2520930 -2050640 -5579608
43504 -5579608 -6520993 -5195715 -4846741 -6605052 -7620629 -5280254 210910 7264914
43496G264914N612760j073656j0770269j5053411q154679N281791J5097054J5428568
43488A3633072P259133m218275j1537401r200499j64320N902588M219844K42121
43480F136263K80855K502686J813672j585249l841029l480875j160664K563169
43472C228828N318448L563343j135979k185286J829178M003715Q24976j444179
43464A4003044J376162K434425l940755r879192n838831K220112J488236o557914
43456d694713q696838j562665M465816L377264J035295K251968L731423L475377
43448C382927M935776P503680M420929m811408j0729451q040016l179468k014914
43440h531945n57617M708783P127786j11940j1480100j5937830j1233094l512613
$$ plain form
43496 7264914 12877674 11804018 1033749 -14019662 -22174341 -16892550 -1795496 13633072
43488 13633072 20892205 16673930 5136529 -4063970 -4228290 1674298 5894142 6136263
43480 6136263 6417118 8919804 10733476 9148227 5307198 1826323 665659 3228828
43472 3228828 8547276 12110619 10974640 8789354 10618532 14622247 15447223 14003044
43464 14003044 15379206 17813631 13872876 3993684 -1845147 374965 1863201 -4694713
43456 -4694713 -13391551 -14954216 -10488400 -7111136 -6075841 -3823873 -92450 3382927
43448 3382927 8318703 15822383 20243312 15431904 4702453 -3337563 -6517031 -8531945
43440 -8531945 -9089562 -4380779 2747007 2635067 -8845033 -24782863 -36015957 -39528570
43432c9528570K670737O586933P711778O668924O274191O506803L299496k778227
43424b587935l469527M720882J2047601Q289774j916904o298294k637579J247223
43416I395241J429614O30703m76856l305559l953386K639929J1149719J0201188
43408B7710593k50107p287093l693230K619004K096780l593941p757705q964543
43400H79758q743431o140602j123629K277990K050726K103313M829830N649962
43392A783917J021780l903970k838612J366452J924681l70258M83806M374799
43384C842595N249866J898065j19436J921210M141285L467390J742892L46293
43376B2490160k521998o190139n538952J026724O818502N178043j243644m905526
$$ plain form
43432 -39528570 -36857833 -30270900 -22559122 -15890198 -9616007 -3109204 190292 -2587935
43424 -2587935 -6057462 -1336580 10711021 19000795 17083891 10785597 8148018 9395241
43416 9395241 10824855 11455558 10978702 7673143 3719757 6359686 17509405 27710593
43408 27710593 27460486 20173393 16480163 19099167 21195947 17602006 9844301 879758
43400 879758 -7863673 -14004275 -15127904 -12849914 -10799188 -8695875 -3866045 1783917
43392 1783917 2805697 -1098273 -3936885 -2570433 -645752 -1016010 -532204 3842595
43384 3842595 9092461 10990526 10871090 12792300 16933585 20400975 22143867 22490160
43376 22490160 19968162 13778023 8239071 9265795 16084297 21262340 20018696 15113170
43368A5113170m285512m210795o244610n359994J626060R084839Q326521j044958
43360A3004721r392091p881909J077752O653917K497844o039305r219099m934146
43352a4232316K06615Q97015n94782J90861K595188K739432L17498r87477O15467
43343h252499K670432K573599Q09907r43834k208465k741873j408113K157102
43335g343744O015896P468497N423469R17266l334137l992500k60997L590375
43327H484125K225403l081623n006951q73615K219401k206635q999795q088614
43319a5328304L42366O082983L991912m08495k148991l785796o732340n201266
43311b3187931L618911J0981576P708205j410603m674821j257830m41944m670590
$$ plain form
43368 15113170 10827658 6616863 372253 -4987741 -3361681 5723158 14049679 13004721
43360 13004721 3612630 -4269279 -3191527 3462390 5960234 -79071 -9298170 -14232316
43352 -14232316 -14025701 -13128686 -13723468 -13532607 -10937419 -8197987 -7880489 -8867966 -8252499
43343 -8252499 -5582067 -3008468 -2198561 -3142395 -5350860 -8092733 -9500846 -7343744
43335 -7343744 -1327848 6140649 11564118 12481384 9147247 5154747 4893750 8484125
43327 8484125 10709528 7627905 2620954 1747339 3966740 1760105 -7239690 -15328304
43319 -15328304 -14985938 -8902955 -4911043 -5319538 -7468529 -11254325 -17986665 -23187931
43311 -23187931 -19569020 -8587444 -879239 -2289842 -6964663 -8222493 -8664437 -13335027
43303a3335027o017508j235761K076118p87348k588614L816988J2793407J3914429
43295H636684O918511P2177k522573l591707m974585n158437l756439k034641
43287f411010K55578K988781K398614l642684q635431l911291P651532J2866763
43279C560852N521255n333711q150880l105616J578761J996369R13180J061245
43271a958545K311504M164816O015417N731189K248124j228521q73148J498273
43263A7909109M32517m677072p898392n024144P56745L930939L850235L479874
43255A2759811L531023K039197j146666l561259m171739m710443n947075n896887
43247g104038l511176j157111p54801R5527M531434J0386248J1798588O792984
$$ plain form
43303 -13335027 -19352535 -20588296 -18512178 -19299526 -21888140 -18071152 -5277745 8636684
43295 8636684 15555195 15627372 13104799 9513092 4538507 -619930 -4376369 -6411010
43287 -6411010 -6155432 -3166651 -768037 -4410721 -13046152 -16957443 -9305911 3560852
43279 3560852 9082107 3748396 -4402484 -7508100 -5929339 -3932970 -3019790 -1958545
43271 -1958545 352959 4517775 10533192 16264381 18512505 17283984 16410836 17909109
43263 17909109 18341626 13664554 5766162 742018 1498763 5429702 9279937 12759811
43255 12759811 16290834 18330031 17183365 13622106 9450367 4739924 -1207151 -7104038
43247 -7104038 -10615214 -11772325 -12527126 -12431599 -7900165 2486083 14284671 21077655
43239B1077655l35012m622974n166909l802207k567401l293384o094088p246904
43231a2051224k668225N019677P711667K742930k538943j269273K801974J662324
43223A410907m156699o482919j755580M813609P527586O366668L904815J509919
43215A3138306l9448n72463j962112n449396p727120m740124Q96862K497486l17193
43206d275202j025557K474370L870928p81940n863702m968663n95193R48285p55279
43197a0971953j919182j831928k044267j480373J468271M600377N379496N892306
43189i07253Q299321Q400134J085166r638508j3900207q987628j968227J023046
43181a6594156J145053J402221J602122J168746J609031L481714M836058M532046
$$ plain form
43239 21077655 20742643 16119669 10952760 7150553 4583152 1289768 -4804320 -12051224
43231 -12051224 -14719449 -9699772 -1988105 754825 -1784118 -3053391 -251417 1410907
43223 1410907 -2745792 -9228711 -10984291 -6170682 1356904 7723572 11628387 13138306
43215 13138306 13098858 12526395 10564283 5114887 -2612233 -7352357 -6455495 -3958009 -4275202
43206 -4275202 -5300759 -2826389 1044539 262599 -5601103 -10569766 -11164959 -10216674 -10971953
43197 -10971953 -12891135 -14723063 -16767330 -18247703 -16779432 -12179055 -6799559 -907253
43189 -907253 7392068 15792202 16877368 7238860 -6661347 -15648975 -17617202 -16594156
43181 -16594156 -15449103 -14046882 -12444760 -11276014 -9666983 -6185269 -1349211 3182835
43173C182835L628479K431155p4110l107240m455915m470359n199116n154870
43165a3219141n10333P153542J0338465N640235j147488l447724k537415l482251
43157a212110o459028p188225l765484J378161N140501O038361L915594J08538
43149b043692k917171l911382l703136k769577j75064L815582O726025O985903
43141B007488N325978J942885l831624r245828q496561j038652N072059L205890
43133e058365k195927k119533L535881O261191K135671k864386k763283l14080
43125c382831j563599n734743n891085J107696R752532J2484817Q545629L597518
43117A8915934J462864n6382l585922o142735l151288L210461N424560J005711
$$ plain form
43173 3182835 6811314 9242469 9168359 6061119 1605204 -2865155 -8064271 -13219141
43165 -13219141 -13729474 -6575932 3762533 9402768 8255280 4807556 2270141 -1212110
43157 -1212110 -7671138 -14859363 -18624847 -17246686 -12106185 -6067824 -2152230 -2043692
43149 -2043692 -4960863 -8872245 -12575381 -15344958 -15520022 -11704440 -4978415 2007488
43141 2007488 7333466 9276351 5444727 -3801101 -12297662 -13336314 -8264255 -5058365
43133 -5058365 -7254292 -9373825 -5837944 423247 2558918 -305468 -3068751 -3382831
43125 -3382831 -4946430 -10681173 -16572258 -15464562 -5712030 6772787 15318416 18915934
43117 18915934 20378798 20322416 16736494 10593759 7442471 10652932 16077492 17083203
43109A7083203m035043m023477p83144Q28655k97089k698398n751948p878750
43101g555991n706286M87866M825773M192691L667799P532179J0210190M672751
43093B2326972m336470n944018L2099L215790l84179l464933j799321j468248
43085H177692o461401r884893n248836K041575L240892k57483j176143R01242
43077h667355O50072k335596l507261k307288k132634k183448J547045O792504
43069a2143961N872740j660901n935681n44926P748207Q605398K117992k932872
43061A125996j576042K672707M413384K482203q31780l117052l482914k681630
43053i95128j999327j478980j87867J248513N20550k553338m554557l140046q38929
$$ plain form
43109 17083203 13048160 9024683 8241539 9070194 8773105 6074707 322759 -7555991
43101 -7555991 -13262277 -12774411 -7948638 -3755947 -88148 7444031 17654221 22326972
43093 22326972 17990502 12046484 12078583 15294373 14910194 11445261 9645940 8177692
43085 8177692 1716291 -8168602 -13417438 -11375863 -8134971 -8392454 -9568597 -8667355
43077 -8667355 -8017283 -10352879 -13860140 -16167428 -18300062 -20483510 -18936465 -12143961
43069 -12143961 -6271221 -7932122 -13867803 -14412729 -6664522 1940876 4058868 1125996
43061 1125996 -450046 2222661 6636045 9118248 8286468 5169416 1686502 -995128
43053 -995128 -2994455 -4473435 -4661302 -3412789 -2892239 -5445577 -10000134 -13140180 -13979109
43044a3979109r42950j577216J702598P930328J0139970M188507n306693r843255
43036g687820n684935L669325J1352991J1964263M903157m817031j0360036r398200
43028f058286n571798k684201J30304N151580J0316167J0619664M887723k307442
43020A4483711o086429n964378m388126l048644k019812r67144K03635J310342
43012f476845J960495K105704K275552K442342J442700r70164k418446n01984
43004a40646L446121N781958N371725M083674K728813J21242l392490n312980
42996A2687417m910003l968389k559726J397858O566119P432238K458666k087382
42988A7016798j100836J220309j717135p592836q368163l018755J072605n3731
$$ plain form
43044 -13979109 -14922059 -16499275 -14796677 -6866349 3273621 7462128 2155435 -7687820
43036 -7687820 -13372755 -9703430 1649561 13613824 18516981 13699950 3339914 -6058286
43028 -6058286 -11630084 -14314285 -14183981 -9032401 1283766 11903430 16791153 14483711
43020 14483711 8397282 2432904 -1955222 -5003866 -7023678 -7990822 -7787187 -6476845
43012 -6476845 -4516350 -2410646 -135094 2307248 3749948 2779784 361338 -140646
43004 -140646 3305475 9087433 14459158 18542832 21271645 21392887 18000397 12687417
42996 12687417 7777414 3809025 1249299 2647157 9213276 16645514 19104180 17016798
42988 17016798 15915962 17136271 15419136 7826300 -541863 -3560618 -2488013 -2541744
42980b541744j338345K551292Q940296J1186590O995079m58034o790152r208356
42972I336626p374641l702358j278565m29220R53175L451508N020161M182873
42964A0159559J666930j361000l864256l983815j131823J086775j577766p094709
42956f100105q499998l226914L632906O691703N959643L672988Q47051q76876
42948B100398M38401K220812j142992q808845j1956438o210773J092281J954898
42940b0312258m37764J409687O060512O182083J558740p43686J835452M387850
42932e9384L462383Q94849j768733n018097o698937l072600L953389P518625N321195
42923D532690K001119Q24906j01537j879161k450381k166786m096189o413359
$$ plain form
42980 -2541744 -3880089 -1328797 7611499 18798089 25793168 25335134 18544982 9336626
42972 9336626 1961985 -1740373 -3018938 -3448158 -2494983 956525 5976686 10159559
42964 10159559 11826489 10465489 6601233 2617418 1485595 2572370 994604 -6100105
42956 -6100105 -14600103 -17827017 -14194111 -7502408 -1542765 2130223 2977274 2100398
42948 2100398 2538799 4759611 3616619 -5192226 -17148664 -23359437 -22267156 -20312258
42940 -20312258 -20750022 -19340335 -13279823 -7097740 -5539000 -6282686 -4447234 -59384
42932 -59384 3402999 4297848 2529115 -2488982 -9187919 -12260519 -8307130 -788505 4532690
42923 4532690 6533809 7358715 7257178 5378017 2927636 760850 -3335339 -9748698
42915i748698k872840N712519R469612L978533k230815j367842J412427j551272
42907B801624n940435l099648L559329L263793l510338n160996J486862N408671
42899a191138n81165q012985o151523J916885N354633J876123j090491J153640
42891f726021N099008N794277K912652r30127l679709m436285l226931j185688
42883f378824L35183Q38602J26423k089886m637806m450894J93805O802386J0788322
42874A527311R850108N105894p94698n174732o365820n090586l848023l721463
42866h512009l391502k383123k510280l977607l339424J069185M680099K674991
42858a5689670j649099o64408N856755R337089M223303m527703q445485n459719
$$ plain form
42915 -9748698 -12621538 -6909019 2560593 6539126 4308311 2940469 4352896 2801624
42907 2801624 -3138811 -6238459 -2679130 584663 -2925675 -8086671 -6599809 -1191138
42899 -1191138 -1772303 -9785288 -15936811 -14019926 -8665293 -6789170 -7879661 -6726021
42891 -6726021 -1627013 4167264 7079916 6149789 2470080 -1966205 -5193136 -6378824
42883 -6378824 -6043641 -5205039 -5078616 -7168502 -11806308 -16257202 -16063397 -9261011 1527311
42874 1527311 11377419 16483313 15688615 10513883 4148063 -942523 -4790546 -8512009
42866 -8512009 -11903511 -14286634 -16796914 -20774521 -24113945 -23044760 -18364661 -15689670
42858 -15689670 -17338769 -18003177 -12146422 -2809333 1413970 -3113733 -11559218 -17018937
42850a7018937N9341L373308K679269l94573j294342L008618Q297911O665085
42842E375680j562610n516887J582682J1234253J0436697l53822q696595p607047
42834D892351k339061L91327Q27634J330025Q95254j420327l074827j811798J045368
42825G35946L410280M568387L249663j259238m830696j825803N182544O523116
42817A5754199l33908o001748l914923r19203m987122j0538084p285185J910660
42809a6315314N165503J107481N57526P775880J3125697Q415852j571606q387171
42801I873848j1291060j2775340j0769407l284952M659743O677210M205962L216243
42793i487753M320578K822701k651965p535789p420814k681712K965146N711039
$$ plain form
42850 -17018937 -16959596 -13586288 -10907019 -11301592 -12595934 -9587316 -1289405 5375680
42842 5375680 3813070 -1703817 -121135 11113118 21549815 21195993 12499398 4892351
42834 4892351 2553290 2944617 3772251 5102276 5997530 4577203 1502376 -309422 735946
42825 735946 4146226 8714613 11964276 10705038 5874342 4048539 9231083 15754199
42817 15754199 15420291 9418543 5503620 4584417 -402705 -10940789 -18225974 -16315314
42809 -16315314 -11149811 -10042330 -9484804 -1708924 11416773 19832625 18261019 9873848
42801 9873848 -1417212 -14192552 -24961959 -28246911 -23587168 -16909958 -12703996 -9487753
42793 -9487753 -5167175 -2344474 -4996439 -12532228 -19953042 -22634754 -19669608 -13958569
42785a3958569M254116J449445J876222N697184P364832L041999l542991o009303
42777A72935l378228O03260L618221N785002O403021M393964J076964j357696
42769A7317443l045034m672966m382806n55802M049079N330061L337059L69087
42761A7746121l893877r606448j1575397m589518O699032J1434606P083142K186676
42753A5484337K532224L163869j477317p321664p298715k826596j289441m810474
42745c843777q123421o549813r32193M906433P739785O487640L031975N44633
42737C261262p71816l739659p989475p991516j368905N192640M401637o08755
42729i614587j089237L515005N152243O18884l569807k231929R02041J120840
$$ plain form
42785 -13958569 -9704453 -8255008 -6378786 -681602 6683230 9725229 6182238 172935
42777 172935 -3205293 -2602033 1016188 6801190 13204211 17598175 18675139 17317443
42769 17317443 14272409 9599443 5216637 4660835 8709914 14039975 17377034 17746121
42761 17746121 13852244 4245796 -7329601 -11919119 -5220087 6214519 13297661 15484337
42753 15484337 18016561 21180430 19703113 12381449 5082734 2256138 966697 -3843777
42745 -3843777 -11967198 -18517011 -19449204 -14542771 -6802986 -315346 2716629 3261262
42737 3261262 2489446 -1250213 -9239688 -17231204 -18600109 -13407469 -9005832 -9614587
42729 -9614587 -10703824 -7188819 -2036576 -1417692 -4987499 -7219428 -6317387 -5196547
42721e196547R85859M322997P404905L899769m111202p860089m275467L14649
42713d515126J79570k142470j143656L111384N854266M807131K411946J159055
42705I722100R3954k674138n899144n741334l76977P252716J1923342J0771967
42697B5072486N162868j020264m053361k592390R03784J635912k401375p147423
42689A5560237p151757l362403k203091n708538p481240k075081N758621O858426
42681A95174M79240n099464m487219j112802K55854M79253J824357J866684k940940
42672h539863j0029044j2200521n987726M842610J3567484J5545085J0259012
42665G457037J938516k463896K81460N134435M300214k350925o519343k656227
$$ plain form
42721 -5196547 -4210688 112309 7517214 11416983 7305781 -554308 -4829775 -4515126
42713 -4515126 -4335556 -6478026 -7621682 -4510298 1343968 6151099 8563045 9722100
42705 9722100 9816054 7141916 1242772 -4498562 -4875539 2377177 14300519 25072486
42697 25072486 30235354 29215090 25161729 22569339 23473123 25109035 22707660 15560237
42689 15560237 8408480 5046077 2842986 -2865552 -10346792 -12421873 -6663252 195174
42681 195174 674414 -4425050 -8912269 -10025071 -9769217 -9289964 -7465607 -5598923 -8539863
42672 -8539863 -18568907 -30769428 -36757154 -31914544 -18347060 -2801975 7457037
42665 7457037 9395553 6931657 7213117 12347552 16647766 14296841 7777498 5121271
42657E121271M211576N078050j374779p821419q057960l680061l02882m42134
42649g268338k234233l245139k719003m04301L985292Q843233J0255897N930150
42641A3143558j156543n456890n082305k721907k90795L414684P871319P955971
42633A7677092N06741q677836j0204483l333651K718295J167188l893407m540095
42625h580156k62035K473451k22795n227415p300624m790993J34855M382918O212260
42616a3180534O160976O073662O255238M337004j162018o913124p445167k310710
42608h184673K372908J312396l288183m972664j557991K742885L560276J354453
42600f660593j086420k989432m647108m385274o34528L633478L346657p47640
$$ plain form
42657 5121271 9332847 14410897 13036118 5214699 -2843261 -6523322 -6826204 -7268338
42649 -7268338 -9502571 -12747710 -15466713 -15871014 -11885722 -3042489 7213408 13143558
42641 13143558 11987015 6530125 1447820 -1274087 -1564882 1849802 9721121 17677092
42633 17677092 18183833 9505997 -698486 -4032137 -1313842 -146654 -4040061 -8580156
42625 -8580156 -8842191 -6368740 -6591535 -11818950 -19119574 -23910567 -23775712 -19392794 -13180534
42616 -13180534 -7019558 -945896 5309342 9646346 8484328 1571204 -5873963 -8184673
42608 -8184673 -5811765 -4499369 -7787552 -12760216 -14318207 -11575322 -8015046 -6660593
42600 -6660593 -7747013 -10736445 -15383553 -19768827 -20403355 -16769877 -13423220 -14170860
42592a4170860j614511L727449Q195587M095235m854592p784028j711034N169889
42584h946865O123629M141526M277007M692420J191006m075525n472753l292650
42576a362205l433250p761757j0821821p683476n10365M956037O315760N515930
42568a4785147M908696M689153L715286J332600j877459m684533o111686n507222
42560a8320312k402297K445587O369057P271749O659489P389461Q396564N854388
42552B3663686N97174j194765K106562K935861m391665j2932448j1640054j958281
42544b813930L510782j008255p148950n680356J132984N022183L318035k68383
42536c935890k254682j807868O35057L185762L252430J358213J331036M078797
$$ plain form
42592 -14170860 -15785371 -12057922 -3862335 232900 -4621692 -12405720 -14116754 -8946865
42584 -8946865 -2823236 1318290 5595297 10287717 11478723 7403198 1930445 -1362205
42576 -1362205 -4795455 -12557212 -23379033 -31062509 -31572874 -26616837 -20301077 -14785147
42568 -14785147 -9876451 -5187298 -1472012 -139412 -2016871 -6701404 -12813090 -18320312
42560 -18320312 -20722609 -18277022 -11907965 -4636216 2023273 9412734 17809298 23663686
42552 23663686 24260860 23066095 25172657 28108518 23716853 10784405 -855649 -2813930
42544 -2813930 696852 -311403 -7460353 -13140709 -12007725 -6985542 -3667507 -3935890
42536 -3935890 -6190572 -7998440 -7363383 -4177621 -925191 433022 1764058 5842855
42528E842855N018559J184746l206720k995551k92266o70884l578774l055258
42520a753293K541695P520896O432222J08014o773774j0383011r310146n017090
42512a6634487j492288j324976j790958J663864P732475R423277L542228m144437
42504c025302o101864k275292J385639J670400J212654K909297N032788M049401
42496D857721N77847l78514M052838R764206R607125J993252o766803r559934
42488A4147738n817376m15771K540027K431012K72196k607314m306103l549619
42480B694790j509987m74075p17138p32475m48043j695730m827560p039689n363715
42471b0113622k93685M394189N073442J664946j862528j139924L588845P278666
$$ plain form
42528 5842855 10861414 12046160 8839440 5843889 5551623 4880739 1301965 -1753293
42520 -1753293 788402 8309298 14741520 14849534 8075760 -2307251 -11617397 -16634487
42512 -16634487 -18126775 -19451751 -21242709 -19578845 -11846370 -2423093 1119135 -3025302
42504 -3025302 -9127166 -11402458 -10016819 -8346419 -7133765 -4224468 808320 4857721
42496 4857721 5435568 5057054 9109892 18874098 28481223 30474475 23707672 14147738
42488 14147738 8330362 7914591 10454618 12885630 13157826 10550512 6244409 2694790
42480 2694790 1184803 710728 -6410 -738885 -1186928 -2882658 -7710218 -14749907 -20113622
42471 -20113622 -20407307 -16013118 -10939676 -9274730 -11137258 -12277182 -8688337 -1409671
42463a409671O151867K293512J70330L93793M6524k004558l835738m193655l888224
42454f275820l230485j421751R74113J930782Q84345p00251j523198o44476L280709
42445f726032R077555J0825000M213332n353845p818648k423331J020128k876628
42437f2469p167360m312095K104285M300143K519069K147944L414784K712710
42429E657011P98014P79838N52319l436018o843456k271413P087415R748962L148438
42420A5221110k841592k561966k723522q104587j0706981k651185Q868045J0788440
42412E287762K913093l776106m215553l302657l908447k152223L415270P334710
42404A595849N551656J199808j488433l204801n761470p184153m895620o29389
$$ plain form
42463 -1409671 4742196 7035708 7206038 7599831 7646355 5641797 1806059 -2387596 -6275820
42454 -6275820 -9506305 -10928056 -9953943 -8023161 -7138816 -7839067 -9362265 -10006741 -6726032
42445 -6726032 2351523 13176523 17389855 12036010 4217362 1794031 2814159 -62469
42437 -62469 -7229829 -11541924 -9437639 -5137496 -2618427 -470483 2944301 5657011
42429 5657011 6455025 7234863 7787182 4351164 -2492292 -4763705 2323710 12072672 15221110
42420 15221110 12379518 9817552 7094030 -1010557 -11717538 -14368723 -5500678 5287762
42412 5287762 8200855 4424749 209196 -3093461 -7001908 -9154131 -5738861 1595849
42404 1595849 7147505 8347313 6858880 3654079 -2107391 -9291544 -14187164 -14816553
42396a4816553J611952P02395j022786q88603J888608N543699O605656L222530
42388B846898k216250n918335p410502q182407o803180o27846P475992J0180689
42380a0654941N367919p31486k441288j250822o97201m65197L90864r5400k095705
42371a2673257q48899N818687J1335102Q645989J145279k110784L96721K125891
42363A3834729l17040l640249n273044o151577n317861J58660P866124J0350700
42355A1510442N791497J357769K176088L704848J34213n441323n603949L28695
42347A3958280N965417O458858K276469m003139r727088j1792783q563329k267124
42339g694439L199980O191392O896197M915433M90584l312654l327734o17245
$$ plain form
42396 -14816553 -13204601 -12502206 -13524992 -14413595 -12524987 -6981288 -375632 2846898
42388 2846898 630648 -5287687 -12698189 -20880596 -27683776 -28311622 -20835630 -10654941
42380 -10654941 -5287022 -6018508 -8459796 -9710618 -10407819 -10873016 -10482152 -10577552 -12673257
42371 -12673257 -13522156 -7703469 3631633 12277622 13422901 11312117 11708838 13834729
42363 13834729 13517689 9877440 4604396 -1547181 -6865042 -6706382 1159742 11510442
42355 11510442 17301939 18659708 20835796 24540644 24674857 19233534 13629585 13958280
42347 13958280 19923697 26382555 28659024 24655885 14928797 3136014 -5427315 -7694439
42339 -7694439 -4494459 1696933 8593130 13508563 13999147 10686493 7358759 6741514
42331F741514J049333M90485j46903N40037J582079K116770K536539K628798J016198
42322A8554850k634370o383906p726031n856870k369173j82947r25462k672756
42314a0196665j659287K723436O351787N343383Q86523k778842l465586j863343
42306d658594J025670M304582N906025L804549j428709o955291j0078284r254043
42298a7334095m422542J742688M734477K897450k33750p05541N43021J12722j891606
42289a4557176k138071M89421L324336L654250J280716k164670m052031j960734
42281a6123959L396653P793921Q402984O831030M604906m66560q590528j2753272
42273f904825o699532M100471Q032230L357171l37594K448511N891257L952013
$$ plain form
42331 6741514 7790847 8281332 8134429 8674466 10256545 12373315 14909854 17538652 18554850
42322 18554850 15920480 9536574 1810543 -4046327 -6415500 -6598447 -7523909 -10196665
42314 -10196665 -11855952 -9132516 -2780729 2562654 3449177 670335 -2795251 -4658594
42306 -4658594 -3632924 671658 6577683 10382232 8953523 1998232 -8080052 -17334095
42298 -17334095 -21756637 -20013949 -15279472 -12382022 -12615772 -13321313 -12778292 -12665570 -14557176
42289 -14557176 -16695247 -16205826 -12881490 -9227240 -7946524 -10111194 -14163225 -16123959
42281 -16123959 -12727306 -4933385 3469599 10300629 14905535 14438975 5848447 -6904825
42273 -6904825 -13604357 -9503886 -1471656 1885515 1547921 3996432 9887689 13839702
42265A3839702n90729l044638m399098o018201m327010J959303N955679K395939
42257E770947k272506O86223O949916M601547o479308j2706090o340205L852950
42249e936526O148271J077557l354011m580602n357928n030120k13905O393432
42241a0853832O455004k072340r733763o851542L612504R538980M649425m861048
42233a0116612r111782n470101J381674O583493Q515537O994471K531764k183963
42225h75519l348341N4599M985925P429474N452938j64731o063911p623615l322468
42216c475649K028202J784472l995529p907011m472889L151929P691551O264665
42208A069741K220073M72547K884457O842122P456641K821169k928736m481389
$$ plain form
42265 13839702 13248973 10204335 5805237 -212964 -4539974 -2580671 3375008 5770947
42257 5770947 3498441 4184664 11134580 15736127 9256819 -3449271 -9789476 -5936526
42249 -5936526 211745 1289302 -2064709 -6645311 -12003239 -17033359 -17247264 -10853832
42241 -10853832 -4398828 -6471168 -16204931 -23056473 -19443969 -9904989 -5255564 -10116612
42233 -10116612 -19228394 -24698495 -23316821 -16733328 -8217791 -1223320 1308444 -875519
42225 -875519 -4223860 -4169261 816664 8246138 13699076 13534345 7470434 -153181 -3475649
42216 -3475649 -1447447 337025 -3658504 -11565515 -16038404 -12886475 -5194924 1069741
42208 1069741 3289814 3762361 6646818 13488940 20945581 23766750 20838014 16356625
42200A6356625k816913l502423p392713q832646m875413j8085J535215K059061
42192g487292M049777L873562j740390p543567n748401K514578Q782083Q362289
42184E062639L378837l045577q492766q885477k256154N630356O854320K416426
42176F62604M74176L671182O160486L927861m1514k393653l316204k172911K452392
42167I424419O233379J799715q592250j2625319n199096L350356K990959j434169
42159d052006m04946L822904K561315l114024m327513r6230J558571j771703l133755
42150h957387O60373L125838k57000l678377k90660O803413R219965M691179j645178
42141I672166m354282j813642L912320P420420L156955p542709j5136226j1999572
$$ plain form
42200 16356625 13539712 10037289 2644576 -6188070 -11063483 -11081568 -9546353 -7487292
42192 -7487292 -3437515 436047 -1304343 -8847910 -14596311 -12081733 -3299650 5062639
42184 5062639 8441476 5395899 -3096867 -11982344 -14238498 -8608142 -1753822 662604
42176 662604 1136780 4807962 10968448 14896309 14854795 12461142 9144938 6972027 9424419
42167 9424419 15657798 17457513 8865263 -3760056 -8959152 -5608796 -2617837 -4052006
42159 -4052006 -4456952 -634048 1927267 -1186757 -5514270 -5610500 -4051929 -5823632 -8957387
42150 -8957387 -8297014 -5171176 -5428176 -9106553 -9397213 -2593800 6626165 11317344 9672166
42141 9672166 5317884 3504242 7416562 14836982 17993937 10451228 -4684998 -16684570
42133a6684570j878245N227160N770157M896029O717244Q583961O854103L137463
42125B2623302J071104J31379k839703p201782q248914m161226P43715K133889
42117D251764K036796N053628R513212P824581k522997j2990301j3360015m631645
42109d824977K587835J981569j737394j471490K196517L638029J558419L30058
42101D258566K440849M558782K845779j256964l391877k620828k143339l874323
42093H16645n470644m230393j594440r93820k218997j443358K437255M983766
42085g713986K226817k944796l985370O45225N649976N904353K047556j680196
42077A49579k242429O32256M880528O644466L028385l876433q050036o399450
$$ plain form
42133 -16684570 -18562815 -13335655 -7565498 -2669469 4047775 12631736 19485839 22623302
42125 22623302 23694406 23825785 20986082 13784300 5535386 1374160 2117875 4251764
42117 4251764 6288560 11342188 20855400 28679981 26156984 13166683 -193332 -4824977
42109 -4824977 -2237142 -255573 -1992967 -3464457 -1267940 2370089 3928508 4258566
42101 4258566 6699415 11258197 14103976 12847012 9455135 6834307 4690968 816645
42093 816645 -4653999 -8884392 -10478832 -11472652 -13691649 -15135007 -12697752 -7713986
42085 -7713986 -5487169 -8431965 -12417335 -11772110 -6122134 -217781 1829775 149579
42077 149579 -2092850 -1460594 3419934 10064400 13092785 9216352 1166316 -5233134
42069e233134k123552N31937J636052K867523L015751P52094q00134J870774N314134
42060G831445K496771n942411j0621068o044446J845355M714180L138260L280689
42052F98775N875730N376801n01662o336950n700772J168536P895888Q272493
42044A6748839J613882o448414q661232l476288K735866K819566k546151o059716
42036c273648l257616K486193N060033K712740j508375m289345m924646m388611
42028a1383275l343228j843897o21447j243630l641608m557322j228055L755963
42020b4106499N198849L308394L637965P216154P521585J713055k408007J714123
42012C795619O847551J889690r703868j3838651o780195J031327L119416M784634
$$ plain form
42069 -5233134 -7356686 -6824749 -5188697 -2321174 694577 1446671 646537 2517311 7831445
42060 7831445 10328216 4385805 -6235263 -12279709 -10434354 -5720174 -2581914 698775
42052 698775 6574505 11951306 11449644 5112694 -588078 580458 8476346 16748839
42044 16748839 18362721 11914307 3253075 -223213 2512653 5332219 2786068 -3273648
42036 -3273648 -6531264 -4045071 1014962 3727702 2219327 -2070018 -6994664 -11383275
42028 -11383275 -14726503 -16570400 -17191847 -18435477 -22077085 -26634407 -27862462 -24106499
42020 -24106499 -18907650 -15599256 -11961291 -4745137 2776448 4489503 2081496 3795619
42012 3795619 10643170 12532860 2828992 -11009659 -17789854 -16758527 -13639111 -8854477
42004h854477Q923269Q438866L24152n483462j311505M842692K403061m283480
41996D999116m086623K325689N415505L329577K115882K752152J181529r61564
41988A7071263J178008M070692L28625n905870k944561P769495J0465532j185498
41980C0847686j3648604j3511150n032102M22259J240810K281200L596457K589066
41972H785622J364169K974158M892081L603674J247009J104363J133544j632622
41964B3471998m844974n127614l943299l340011j082950L707175N672434J197196
41956A5709955l928239k566634K844358N552187N938287Q494124J1215189Q255677
41948E1514904J229255k040002M51414K917605J691064j098713l745388o900375
$$ plain form
42004 -8854477 68792 8507658 8831810 3348348 2036843 6879535 9282596 4999116
41996 4999116 912493 3238182 8653687 11983264 14099146 16851298 18032827 17071263
41988 17071263 18249271 22319963 22648588 16742718 13798157 21567652 32033184 30847686
41980 30847686 17199082 3687932 -1344170 -921911 318899 2600099 6196556 8785622
41972 8785622 10149791 13123949 18016030 21619704 22866713 23971076 25104620 23471998
41964 23471998 18627024 13499410 9556111 6216100 5133150 8840325 14512759 15709955
41956 15709955 11781716 9215082 12059440 17611627 23549914 32044038 43259227 51514904
41948 51514904 52744159 50704157 51155571 54073176 55764240 54665527 50920139 44019764
41940D4019764q942203p052751l565984l938316p546124p643487j736192M731083
41932H325790O554839M476439J307798j687829k995016j015148K280777K745931
41924A9993581K87627r51670P08798K470972K242485R27556q08173l138272m367034
41915A7365870k623940M6381M55940K9757J641737K257005l256541j1447795j2508170
41906h039756m446474L777835N428270L605605K809326J687632j446606l615552
41898b39720k689706j528255k143980j699794J603509M577400M803694M303780
41890F986928L934369P86451m979419p804442n583893l518917m442863l332257
41882a7954043K738901P466963N365063J129394P98856J084264l027538o881294
$$ plain form
41940 44019764 35077561 28024810 24458826 20520510 12974386 5330899 3594707 8325790
41932 8325790 14880629 19357068 20664866 18977037 15982021 14966873 17247650 19993581
41924 19993581 20281208 19329538 20038336 22509308 24751793 25679349 24871176 21732904 17365870
41915 17365870 14741930 14788311 15244251 15274008 16915745 19172750 15916209 4468414 -8039756
41906 -8039756 -12486230 -8708395 -3280125 325480 3134806 4822438 3375832 -239720
41898 -239720 -2929426 -4457681 -6601661 -8301455 -6697946 -2120546 2683148 6986928
41890 6986928 10921297 11707748 6728329 -1076113 -6660006 -10178923 -14621786 -17954043
41882 -17954043 -15215142 -7748179 -2383116 -1253722 -454866 629398 -2398140 -9279434
41874i279434l288923M200058O575163L955092L250192M297714Q21277o017710
41866D513429p668884k551200J416726N37658L80890M093789O380500L698842
41858A0801750R96943K640418M562609J724531k915566l400680k79694Q77660
41850A5007971k302842o799204q109056l585116N249121J1575084Q521200j653486
41842A7903672p934465l757293M182491M742618l295180j0652388r443528r57781
41834i211854P585498J0084147N564481j681683n662340m206095o89855O76333
41826B458632l50201j573804k481342l866502m644922k509612K206792O123845
41818d637114O760619M683996J307206k921580o807751p205694k268502M785105
$$ plain form
41874 -9279434 -12568357 -8368299 -1793136 2161956 5412148 9709862 10531139 4513429
41866 4513429 -3155455 -5706655 -4289929 -3752271 -3371381 722408 7102908 10801750
41858 10801750 11798693 14439111 19001720 20726251 17810685 14410005 14130311 15007971
41850 15007971 12705129 5905925 -2203131 -5788247 -539126 11035958 19557158 17903672
41842 17903672 9969207 6211914 10394405 15137023 11841843 1189455 -8254073 -9211854
41834 -9211854 -1626356 8457791 14022272 12340589 6678249 2472154 1782299 2458632
41826 2458632 2108431 534627 -1946715 -5813217 -10458139 -12967751 -10760959 -4637114
41818 -4637114 2123505 6807501 8114707 5193127 -1614624 -8820318 -11088820 -6303715
41810f303715Q024229N581265J651552M69770R33249j95684k139097j475718J325221
41801G871072J923423p47687k703220k014161j986655m001631l107174L723951
41793a042082R824824O813870k324757o316299j325062M387822L145752k000402
41785A1163666l376160L72806M003485L511986J77474k318813k115019l88616
41777A1030809N74868J45347l97647m58179j044620j980800r38146K337555L801643
41768A3070830P57234l005385k322794J405203K735853P13994j227707k457450
41760I669778n145744p452919m497768K561077N857711J820502l696207m381507
41752e265077j653640k68221q79937j057911k672J250559J776878J036271j72604
$$ plain form
41810 -6303715 1720514 7301779 8953331 9423101 10356350 10160666 8021569 6545851 7871072
41801 7871072 9794495 9046808 6343588 4329427 2342772 -1658859 -4766033 -1042082
41793 -1042082 8782742 15596612 13271855 6955556 5630494 10018316 13164068 11163666
41785 11163666 7787506 8160312 12163797 15675783 15853257 13534444 11419425 11030809
41777 11030809 11605677 11751024 11353377 10895198 9850578 7869778 6931632 9269187 13070830
41768 13070830 13828064 10822679 8499885 9905088 12640941 13354935 12127228 9669778
41760 9669778 4524034 -2928885 -7426653 -4865576 992135 2812637 -883570 -5265077
41752 -5265077 -6918717 -7186938 -8066875 -9124786 -9127458 -7876899 -6100021 -5063750 -5236354
41743e236354J066480N515310P474040J050559r335349j2586910o153513J264220
41735a6941517M261656P380137J2762248J2699787K770597p357828o718903P27428
41727I583605L638065R42019k7490J514603j74267m466221m528297m71270P7217
41718F087964l766689l276153M840728J1384017Q154422l25878m856474m286533
41710A3955404l512063m052177l604252j968860j249196j402030k60988K371663
41702B77501L863214K090619j905180m501552k717847K032639M210173M77855
41694C827422n184359n998859j183886L988880O319618P376053P538224L735650
41686B0418743m113529r824066q109790j321328M573885P415868Q531881Q032819
$$ plain form
41743 -5236354 -4169874 1345436 8819476 9870035 534686 -12052224 -18205737 -16941517
41735 -16941517 -12679861 -5299724 7462524 20162311 22932908 15575080 8856177 9583605
41727 9583605 13221670 14163689 14136199 15650802 15476535 11010314 6482017 6010747 6087964
41718 6087964 2321275 -954878 3885850 15269867 23424289 23098411 18241937 13955404
41710 13955404 10443341 6391164 2786912 818052 -431144 -1833174 -2094162 277501
41702 277501 4140715 6231334 4326154 -175398 -2893245 -860606 3349567 3827422
41694 3827422 -1356937 -7355796 -8539682 -4550802 1768816 9144869 16683093 20418743
41686 20418743 16305214 6481148 -1628642 -2949970 1623915 9039783 17571664 25604483
41678B5604483M959563O81916j794835j544469j15627J179349K178811K728660
41670C3877851K550871J817021O43898j147351k895224l136909j825728q13673
41662B9070756q50188p1702K656343M768525L072492j114232k832220J01601L854560
41653C8655935L246751j409596m208073j032078M718369O039888J323665l797451
41645D3537410m332609j973123j060311k134271k999995l063126k162261K115894
41637B7927608J0402475J6925934J5514239R293954P269622J1089291J2988474
41630A11411597Q653059M233750O822427J4700524K1778921K6110877K8807809
41623B22518964K9284016K7338949K6402299K8899067L0721832K5556233J3164270
$$ plain form
41678 25604483 30564046 31245962 29451127 27906658 27791031 28970380 31149191 33877851
41670 33877851 36428722 38245743 38889641 37742290 34847066 31710157 29884429 29070756
41662 29070756 28220568 28148866 30805209 35573734 38646226 37531994 34699774 34801375 38655935
41653 38655935 41902686 40493090 36285017 35252939 39971308 46011196 47334861 43537410
41645 43537410 39204801 37231678 36171367 34037096 31037101 27973975 25811714 27927608
41637 27927608 38330083 55256017 70770256 80064210 87333832 98423123 111411597
41630 111411597 120064656 124298406 131120833 145821357 167600278 193711155 222518964
41623 222518964 251802980 279141929 305544228 334443295 365165127 390721360 403885630
41616D03885630r16607j2259960k0218948k5541957k9214489l2079834l2354595
41609B51299240k5995775j3414206k991595k657771r492233j2877603p274150
41602A76595907K910043J0686076J3768340J3977048J3709477J4621446J7365021
41595B63633358K1430532K5933872K9736007L0068417K3685669J1554032m49560
41588D05592327q430157j5072022k3901737l2513475l6379151l6228868l5572802
41581B17494115l3210291k5251683j3782274o459371o912965j1512645j5918687
41574A04446199j8486627j6674281p542446N484209J2692502Q662535j585377
41567H6996714r632919j2235554j0307531m771803K129076N245318J264115o585905
$$ plain form
41616 403885630 402969023 390709063 370490115 344948158 315733669 283653835 251299240
41609 251299240 225303465 211889259 208897664 206239893 196747660 183870057 176595907
41602 176595907 179505950 190192026 203960366 217937414 231646891 246268337 263633358
41595 263633358 285063890 310997762 340733769 370802186 394487855 406041887 405592327
41588 405592327 397162170 382090148 358188411 325674936 289295785 253066917 217494115
41581 217494115 184283824 159032141 145249867 138790496 131877531 120364886 104446199
41574 104446199 85959572 69285291 61742845 67227054 79919556 88582091 86996714
41567 86996714 77363795 65128241 54820710 50048907 52177983 57423301 58687416 52101511
41559E2101511j1998476j2310404r188717m503985J302467P333196J1167036J0398316
41551D4300944N189487o63958k647122q30911q9480k636917l634756J215562P115843
41542D7318692O237308J12567k804938j193700k127119o995275p747561j545525
41534C1254449K212226l251832j0142595q127072j51212L977465L218471L538526
41526B2528426N516225M966130K415249J060274j520094q244028j2217966m730848
41518I773368P730900Q834762l750610j3980978j0657808j555962J535408n17027
41510b587947n91716J724121K733399K812726L526224K361303k386606o824750
41502G66754p635591o950464n477060J282799J2669500J7397966Q333521m741639
$$ plain form
41559 52101511 40103035 27792631 18603914 14099929 15402396 22735592 33902628 44300944
41551 44300944 49490431 48826473 46179351 45348440 45258960 42622043 38987287 40202849 47318692
41542 47318692 53556000 53668567 50863629 49669929 47542810 40547535 32799974 31254449
41534 31254449 33466675 30214843 20072248 11945176 11793964 15771429 18989900 22528426
41526 22528426 28044651 33010781 35426030 36486304 34966210 26722182 14504216 9773368
41518 9773368 17504268 26339030 22588420 8607442 -2050366 -3606328 -2070920 -2587947
41510 -2587947 -3179663 -1455542 1277857 4090583 7616807 9978110 7591504 766754
41502 766754 -6868837 -13819301 -19296361 -18013562 -5344062 12053904 20387425 15645786
41494A5645786q283249m114898k665571l273181K905216J3243345J4287267L481175
41486C1225890n926101n702733l330830n880998p506454j942138M549907L557145
41478I043688j180431q94938L720957O174763O806249J0218901J3604706R340293
41470E6834188j680357r703920r651939o137123m056687k552472k67792Q68412
41462B3652310Q4801J84994K549851M190081K262243k046565n790891p098041
41454A7988783m906714K52502M356419K968445k496535n572107l101134J246809
41446A0736468L165784K913869K153159O6128l911556o699743m847259K38471
41438C815321L324844J129599m485913q451905o953672r41945M738379O790186
$$ plain form
41494 15645786 7362537 3247639 582068 -2691113 214103 13457448 27744715 31225890
41486 31225890 25299789 19597056 16266226 10385228 2878774 936636 5486543 9043688
41478 9043688 7863257 6968319 10689276 16864039 23670288 33889189 47493895 56834188
41470 56834188 55153831 45449911 35797972 29660849 25604162 23051690 22783898 23652310
41462 23652310 23737111 23922105 26471956 30662037 32924280 30877715 25086824 17988783
41454 17988783 13082069 13334571 17690990 20659435 18162900 12590793 9489659 10736468
41446 10736468 13902252 16816121 18969280 19035408 15123852 8424109 3576850 3815321
41438 3815321 7140165 8269764 3783851 -4668054 -11621726 -12563671 -7825292 -1035106
41430a035106O871074P456842O556655J100029n805966p296180k877393N11336
41422E481291o67659j716399Q64577K258076k478560q669801p875961m19024N216783
41413h006677M328110R08563N57667L739402O898456O521356J561641n354932
41405A1153586r131022o794420l56864O235995J0810264J1923153P959795P90410
41397C2590897l558025k667811k448306q164477j4353137j1513282p53107P089530
41389c777718O694956L605673L051533K598445o69509l834906l960710l686378
41381B1386n684773o971716m336012p82922m71221r23735K987866R401726J0702002
41372C942601M437338k778999l932220k09688J519202j983884o100506m292696
$$ plain form
41430 -1035106 5835968 13292810 19849465 20949494 15143528 7847348 4969955 5481291
41422 5481291 4813632 3097233 3961810 6219886 3741326 -4928475 -12804436 -13223460 -8006677
41413 -8006677 -3678567 -2770004 -2212337 1527065 8425521 14946877 16508518 11153586
41405 11153586 2022564 -4771856 -5128720 1107275 11917539 23840692 31800487 32590897
41397 32590897 29032872 26365061 23916755 15752278 1399141 -10114141 -10867248 -3777718
41389 -3777718 2917238 6522911 9574444 12172889 11503380 7668474 3707764 21386
41381 21386 -5663387 -12635103 -16971115 -17754037 -18225258 -19148993 -16161127 -6759401 3942601
41372 3942601 8379939 5600940 1668720 1459032 2978234 994350 -5106156 -9398852
41364i398852K814704P124487L502881k699441l041397J411687J846816m069009
41356b508124q085582m285413K028813L496407J595949J524722K121587o54782
41348d766423m148026k084038M453731P783674N170106J794938J571808K198558
41340A1974328Q09380j694319l656675m708414l602899Q06019N521171N718592
41332A1167183J926414p68848j236906l233350o656907n962560l66787K616507
41324b515254j129655m735133j169013N047674N452224J892128L050649R099860
41316A4993480J0544198L346902m355586m204384R66847K371309k927365j0096342
41308A0639059j3311058j0402461k897217M873137P928657N049612N70503l33512
$$ plain form
41364 -9398852 -6584148 540339 4043220 1343779 -1697618 -285931 1560885 -2508124
41356 -2508124 -10593706 -14879119 -12850306 -9353899 -7757950 -6233228 -4111641 -4766423
41348 -4766423 -8914449 -10998487 -6544756 1238918 6409024 8203962 9775770 11974328
41340 11974328 12783708 11089389 7432714 2724300 -878599 -72580 5448591 11167183
41332 11167183 13093597 12324749 11087843 7854493 1197586 -4764974 -5131761 -2515254
41324 -2515254 -3644909 -8380042 -9549055 -4501381 950843 2842971 5893620 14993480
41316 14993480 25537678 28884580 24528994 20324610 21291457 23662766 20735401 10639059
41308 10639059 -2671999 -13074460 -15971677 -11098540 -3169883 1879729 2450232 2116720
41300B116720K531348N053915M324255J278512j652162l337241m167885m913382
41292A234080n539911m501833j01221O172942R154509N627918k77916j158283
41284A0610285L498761N529840q92877j0345746j2764617o493175R75920M399959
41276e481650O174902Q845778R123502L859555k950050m926682k254399j69704
41268A2221252l22922L85535K947079M184931K315961m30036j764882j507598
41260A8029320P75019N349941Q769698O505410Q75048J70761O859801J2814376
41252F0149374J0624743L810651J03721q1192j138504k383864L01020M528331
41244G5914280K559016o254322j2301591q148121K012046Q791240Q480460L879368
$$ plain form
41300 2116720 4648068 9701983 14026238 15304750 13652588 10315347 6147462 1234080
41292 1234080 -4305831 -8807664 -8908885 -2735943 6418566 12046484 11768568 10610285
41284 10610285 14109046 19638886 18746009 8400263 -4364354 -10857529 -9881609 -5481650
41276 -5481650 693252 9539030 18662532 22522087 19572037 14645355 12390956 12221252
41268 12221252 11898330 12283865 15230944 19415875 21731836 21301800 19536918 18029320
41260 18029320 18804339 24154280 32923978 39429388 40304436 40475197 47334998 60149374
41252 60149374 70774117 74584768 74688489 74607297 73468793 71084929 71385949 75914280
41244 75914280 78473296 72218974 59917383 51769262 53781308 62572548 71053008 74932376
41236G4932376j297089m377556l105996K152295O549117M772154k902145j0531699
41228F6191457j2462738q470462l550319k960011o432961p628557j559806P605740
41220C0732343R735561J002216j0594788j4407805q912277j309694K173159J704679
41212A0123394N98980N01935O10045l01799j891521k069697M14957L145308K033957
41203A3165559k816634o016548l708148J238107L660510L085241K533884K609413
41195A3751384J507136k95586n29905j25065k416530o570545p098513j940540
41187c718164L715190M566985K138619J128392K150449K296769R06137N20759
41179A3705136K614108N475655O206156K937395l929524j0803510j2783032q892579
$$ plain form
41236 74932376 73635287 69257731 66151735 68304030 74853147 79625301 76723156 66191457
41228 66191457 53728719 45258257 41707938 38747927 32314966 24686409 23126603 30732343
41220 30732343 40467904 41470120 30875332 16467527 7555250 6245556 8418715 10123394
41212 10123394 10722374 11224309 11834354 11532555 9641034 7571337 7986294 11131602 13165559
41203 13165559 10348925 4332377 624229 1862336 5522846 8608087 11141971 13751384
41195 13751384 15258520 14962934 14433029 14307964 11891434 5320889 -1777624 -3718164
41187 -3718164 -2974 4564011 6702630 7831022 9981471 12278240 13184377 13705136
41179 13705136 16319244 21794899 28001055 30938450 27008926 16205416 3422384 -5470195
41171e470195l996421k968873m675516m713571k087557Q87292L621004P016865
41163a2386972Q912592N710425n59298k678115J992505P363102P184134K984958
41155A8523331j60342j242421j981613j663071J001952L234300J285397k988089
41147A6009444m204244j566942N90543M14593R97379M000002N970532L355606
41139B5566913k479114p215053p740958l435456L337245P252945M462593j944613
41131A7804502m936783k821409o55901j369083j854015n41057j746457p463287
41123c583490j1220740o983117P48745L415779J156668N69085K430258J392348
41115a2074464k568212k413437M169027R947733Q587602K782509j712920l701615
$$ plain form
41171 -5470195 -9466616 -12435489 -17111005 -21824576 -23912133 -23024841 -19403837 -12386972
41163 -12386972 -3474380 2236045 1676747 -1001368 991137 8354239 15538373 18523331
41155 18523331 18362989 17120568 15138955 13475884 14477836 17712136 18997533 16009444
41147 16009444 11805200 10238258 10828801 11243394 12240773 16240775 22211307 25566913
41139 25566913 23087799 15872746 8131788 4696332 8033577 15286522 19749115 17804502
41131 17804502 12867719 10046310 9390409 8021326 6167311 5626254 3879797 -3583490
41123 -3583490 -14804230 -21787347 -21038602 -17622823 -16466155 -15897070 -13466812 -12074464
41115 -12074464 -14642676 -17056113 -12887086 -2939353 5648249 8430758 6717838 3016223
41107C016223m149430k270915J127530J606506k262342m547372L1955P103374
41099c44471P656029J09262q068293r789298m914923J751782N119040L127485
41091e353387j427224l274306j047782R82296q5973r95123J255262K591816j775301
41082i129722p169639m175843O807307J4334625J1078912K458322l101433n205575
41074E896954p564954q899949n031343K451099O551327M148714k37481j323177
41066d008810J87268J61283j931005j926331K700872Q054028P920767K001222
41058A3159294l210087k778099Q25538K647750K490611K838722K321482k363036
41050A5932175q586482q923402k015057L960902K089478m072303o231864k275992
$$ plain form
41107 3016223 -1133207 -3404122 -2276592 -670086 -2932428 -7479800 -7447845 -344471
41099 -344471 7311558 7420820 -647473 -10436771 -15351694 -13599912 -8480872 -5353387
41091 -5353387 -6780611 -10054917 -11102699 -10120403 -10206376 -11201499 -9946237 -7354421 -9129722
41082 -9129722 -16299361 -20475204 -13667897 666728 11745640 14203962 11102529 5896954
41074 5896954 -1668000 -10567949 -15599292 -13148193 -6596866 -2448152 -2685633 -4008810
41066 -4008810 -3821542 -3660259 -5591264 -7517595 -4816723 3237305 11158072 13159294
41058 13159294 9949207 7171108 7996646 10644396 13135007 15973729 18295211 15932175
41050 15932175 7345693 -1577709 -3592766 368136 2457614 -1614689 -7846553 -10122545
41042a0122545L161753N997576N670544K836215j012107k579968N3436L455938
41034G460842J997599m543146r720689p638649O33149Q257560Q764269J359623
41026F570558q077960j1536928o020801L838436J0794453J1293050O281792j219396
41018A1923204o947586o667228n16345N369947N257535P41780k198671j592802
41010E369834n51728r53394j218865o24398q06737j867878j510433N37008J510989
41001a15602N47284K37906J435052J225917j278050j972554J610324N048978L271434
40992A0010689j353729k691715k06495J392532O29446R59618L658813N142986
40984A7542145L141942L00836q51099j829221l847142l814269O83708N229511
$$ plain form
41042 -10122545 -6960792 -963216 4707328 7543543 6531436 3951468 4004904 7460842
41034 7460842 9458441 4915295 -4805394 -12444043 -11810894 -3553334 5210935 6570558
41026 6570558 -1507402 -13044330 -19065131 -15226695 -4432242 6860808 13142600 11923204
41018 11923204 4975618 -1691610 -2207955 3161992 8419527 9161307 6962636 5369834
41010 5369834 4818106 3864712 2645847 2021449 1214712 -653166 -2163599 -1626591 -115602
41001 -115602 431682 669588 2104640 3330557 2052507 79953 1690277 6739255 10010689
40992 10010689 8656960 5965245 5758750 7151282 7780728 8740346 12399159 17542145
40984 17542145 20684087 20984923 20133824 18304603 14457461 10643192 11326900 16556411
40976A6556411K955084n512695j1609115r491848l107084l24383k760118m549444
40968a7843192m81874P316689J1730999Q694446J759660j944596K2350K847592
40960A2102074J378856k241832j220762N810876J1624926R297824O95254p050798
40952C0396418j0390716j0388864p546529j660815L812258L820513n93879k709017
40944D739369l08901Q14606l125925o960837m970403k96414J266013J977992P440740
40935E76240J4070497J2011008P14623q845588r777291p024561n684074k038067
40927e997213O559023J1776731M690088q910659j4313504p230164K239333M786310
40919f400055J896328r62219k738512m401924m145816M8980N947272Q808776O362019
$$ plain form
40976 16556411 19511495 13998800 2389685 -7102163 -10209247 -10533630 -13293748 -17843192
40968 -17843192 -18325066 -11008377 722622 9417068 11176728 9232132 9254482 12102074
40960 12102074 13480930 11239098 10018336 15829212 27454138 36751962 37447216 30396418
40952 30396418 20005702 9616838 2070309 409494 4221752 8042265 7448386 4739369
40944 4739369 4430468 5245074 2119149 -4841688 -9812091 -10108505 -8842492 -6864500 576240
40935 576240 14646737 26657745 27372368 18526780 8749489 1724928 -3959146 -5997213
40927 -5997213 561810 12338541 17028629 8117970 -6195534 -13425698 -11186365 -6400055
40919 -6400055 -4503727 -5465946 -8204458 -12606382 -16752198 -16703218 -10755946 -1947170 4414849
40910D414849M84201m581640n208633j674328J459668N79214k115104k249988
40902h891761n24547j244580m057236l588326J395588N181267M215695K422261
40894e091639L352191L452113j054553n969075m861514Q17844M741126N941849
40886A328342Q127317J0491338P792681j27745o761396q156703o742130m607923
40878A343781l43639N054686O431946K316159j797907j916699j217449k959085
40870F911793m084270j522711R68909q68700l516710j516493K177529L66347n977333
40861g061639q364793l520246K728295M827944L264949J42395l595678n277430
40853a6856203k230738J935672K79197o182392q134628j882713M907020N758986
$$ plain form
40910 4414849 4899050 317410 -4891223 -6565551 -5105883 -4526669 -6641773 -8891761
40902 -8891761 -9416308 -10660888 -14718124 -18306450 -16910862 -11729595 -7513900 -5091639
40894 -5091639 -1739448 1712665 658112 -5310963 -10172477 -9354633 -4613507 1328342
40886 1328342 9455659 19946997 27739678 27611933 20850537 12693834 5951704 1343781
40878 1343781 1000142 6054828 12486774 14802933 13005026 11088327 9870878 6911793
40870 6911793 2827523 1304812 2273721 1405021 -2111689 -3628182 -1450653 -1084306 -7061639
40861 -7061639 -15426432 -18946678 -16218383 -11390439 -8125490 -7983095 -11578773 -16856203
40853 -16856203 -19086941 -17151269 -16872072 -23054464 -31189092 -33071805 -28164785 -22405799
40845b2405799M945389Q062651J1059809P235466o44685m347759k371305M53015
40837A986782K267393M394466M875061Q82836l947974l471017O86137J537896
40829I211580j447914k373346m26678r98097m260141l608694J697226L403614
40821A197550j493423l995429K538731J0548319R346997R23649m455024l277919
40813A1333451m20428O11361M01890j094498m012850m665576O91642Q872680J2568874
40804B4286546R469334L588826r56367k449141n637M732310O159685Q37317o498576
40795C9164297q605004n296518j443028J698582N668499P764702L862520k490767
40787D0323283l122264K026411M333136J31261m314551m122593l025776n158126
$$ plain form
40845 -22405799 -17460410 -9397759 1662050 8897516 8252831 3905072 1533767 1986782
40837 1986782 4254175 8648641 13523702 14406538 10458564 6987547 7673684 9211580
40829 9211580 7763666 5390320 4963642 3965545 -294596 -3903290 -2206064 1197550
40821 1197550 -295873 -4291302 -1752571 8795748 18142745 19066394 14611370 11333451
40813 11333451 10913023 11524384 11926274 10831776 6818926 2153350 2844992 11717672 24286546
40804 24286546 33755880 37344706 36388339 33939198 33933561 38665871 44825556 45662873 39164297
40795 39164297 30559293 25262775 23819747 25518329 31186828 38951530 42814050 40323283
40787 40323283 37201019 39227430 43560566 43691827 39377276 35254683 32228907 27070781
40779B7070781p693116o802427m310751l244862k400346j37421J668538J965111
40771F115507L520016P031864P652838K441791l807000n514498m287035m427213
40763H726270n241961l965051k103615k279857k237553J330061N792956N946172
40755E967422K133566r43718j300249j5115K658339N689067N047148l52140l931956
40746A4952364k09598N138284K863918m928918p766070l395056n7758j561527
40738E035639j904096K192044M705380J482462j870892K43662M008730L549233
40730A7442162N75588p79964k527885p953123j2926702j0723305k716805L456783
40722a6153251M425585K928450J231993l36836M3500L576041O443979M304391
$$ plain form
40779 27070781 19377665 12575238 8264487 5019625 2619279 2481858 4150396 6115507
40771 6115507 9635523 16667387 24320225 26762016 22955016 17440518 13153483 8726270
40763 8726270 3484309 -480742 -2584357 -4864214 -7101767 -5771706 21250 5967422
40755 5967422 8100988 7157270 5857021 5841906 8500245 14189312 19236460 18884320 14952364
40746 14952364 14742766 19881050 22744968 17816050 10049980 6654924 6597166 5035639
40738 5035639 3131543 5323587 10028967 11511429 9640537 9884199 13892929 17442162
40730 17442162 18017750 17237786 14709901 6756778 -6169924 -16893229 -19610034 -16153251
40722 -16153251 -11727666 -8799216 -7567223 -7904059 -7860559 -4284518 2159461 6463852
40714F463852K4104k21847K516517J576128l295148m772942n58999K277623o98974
40705C310314l929149k125397K14756k919450p868861p363160k999637j697756
40697b5378340k627619J218944Q763153R825605J380209n862354k926521M209627
40689a1397296M654485q94251l116153M53776K989864M22712l416708m794713
40681a5098284n043404n188387k815200K303997N514429M131883J938510K877189
40673a1379267M988886N015431M572856O480853Q468789O184802R6577n694926
40665A8734001r190157j0085782o597743J086749O576795L807688l333007n498371
40657d499827j610994K82025l148842n008964r5639N995600N393894o77235n378436
$$ plain form
40714 6463852 6487956 6266109 8782626 10358754 7063606 2290664 1731665 4009288 3310314
40705 3310314 -618835 -2744232 -2529476 -5448926 -13317787 -20680947 -23680584 -25378340
40697 -25378340 -28005959 -26787015 -18023862 -8198257 -6818048 -12680402 -15606923 -11397296
40689 -11397296 -6742811 -7637062 -10753215 -10299439 -7309575 -6886863 -10303571 -15098284
40681 -15098284 -20141688 -25330075 -28145275 -25841278 -20326849 -16194966 -14256456 -11379267
40673 -11379267 -6390381 -1374950 3197906 9678759 18147548 24332350 24428927 18734001
40665 18734001 9543844 -541938 -7139681 -6052932 523863 4331551 998544 -4499827
40657 -4499827 -6110821 -5828796 -8977638 -13986602 -14082241 -8086641 -2692747 -3369982 -8748418
40648h748418o430905o310541n657495l081333M02226K664738M814581Q669966
40640a3677181J1045474O691746k853529r152259p160853j018887K382800J573531
40632a2169158m29780k000988m012865o053293n128767M47112P452189J0192608
40624a1702942O939227K139091O72300J612216P71898j632942q29187L950409
40616A920070O308284J765224m512752m513599Q98437L408895m21318m719908
40608A33333l506441J138624L039942M67339k709640k797451l78768J278529M44162
40599b890371j062128l58671K169185K657736r02892m911311m213245J016721
40591h494976N188923L929413j461136o066000o002519j492058K930895K282179
$$ plain form
40648 -8748418 -15179323 -21489864 -27147359 -30228692 -29826466 -27161728 -22347147 -13677181
40640 -13677181 -2631707 4060039 1206510 -7945749 -15106602 -16125489 -13742689 -12169158
40632 -12169158 -12598938 -14599926 -18612791 -24666084 -29794851 -29347739 -21895550 -11702942
40624 -11702942 -4763715 -2624624 -1952324 -340108 431790 -1201152 -2030339 1920070
40616 1920070 8228354 9993578 5480826 967227 1865664 5274559 4853241 133333
40608 133333 -3373108 -2234484 805458 1272797 -1436843 -4234294 -4613062 -3334533 -2890371
40599 -2890371 -3952499 -4311170 -2141985 515751 -387141 -5298452 -9511697 -8494976
40591 -8494976 -3306053 623360 -837776 -6903776 -12906295 -14398353 -11467458 -9185279
40583i185279k770368n317058n87120O982097R090812M442955q48342k890221
40575a082524l735977m678963k665234L388512Q302268P129870J996695k016291
40567F638356m454024p825814j0658161q116666L46547Q711513J1130870P910815
40559C683436L384508M3668l328872q279363j2905232j2618217n345305M826582
40551c0538795J0967478J0246813N696094J242130k000346l738135k525617J594627
40543i055751M992575M068640k71575m016484m626477k273084J785065N668145
40535c728946P094244N495114K867280Q46949j204694l351605l164242J59199
40527E013299K411733n47067o116280q097336n352871k215878r15154N20912K284446
$$ plain form
40583 -9185279 -11955647 -17272705 -17859825 -10877728 -1786916 2656039 1807697 -1082524
40575 -1082524 -4818501 -9497464 -12162698 -8774186 -471918 6657952 8654647 6638356
40567 6638356 2184332 -5641482 -16299643 -24416309 -24069762 -15358249 -4227379 3683436
40559 3683436 7067944 7111612 3782740 -4496623 -17401855 -30020072 -35365377 -30538795
40551 -30538795 -19571317 -9324504 -3628410 -2386280 -4386626 -8124761 -10650378 -9055751
40543 -9055751 -4063176 5464 -266111 -4282595 -8909072 -11182156 -9397091 -3728946
40535 -3728946 3365298 8860412 11727692 12574641 11369947 8018342 4854100 5013299
40527 5013299 7425032 6877965 761685 -7335651 -12688522 -14904400 -15819554 -15298642 -13014196
40518a3014196J088309l202642m991957p87142M913302N956642L089515J167566
40510e780603P78928j082146l187498j14895Q061713J2377489N818683o089213
40502A0782458j1097039n571928J587442J613529k867872l293989J668880M788284
40494b390235J868774k081572j433835Q64381j503557o952836p243003K9340P228298
40485a1614245P389960L157375R12535Q55131j165911m716954m619869K15943
40477i586035M055859K498333j577361l320989l122216m157635n389157k535871
40469b3135072M189817Q541744O253131P41527j741722K42990L393528M805839
40461C291782L375678j879545r982421j5025759j0576518J392673J0684754J0584324
$$ plain form
40518 -13014196 -11925887 -15128529 -20120486 -20907628 -15994326 -10037684 -6948169 -5780603
40510 -5780603 -5001675 -6083821 -9271319 -9386214 -1324501 11052988 16871671 10782458
40502 10782458 -314581 -5886509 -4299067 -2685538 -5553410 -8847399 -7178519 -2390235
40494 -2390235 -521461 -2603033 -4036868 -3172487 -4676044 -11628880 -18871883 -18842543 -11614245
40485 -11614245 -4224285 -1066910 -154375 700756 -465155 -5182109 -9801978 -9586035
40477 -9586035 -5530176 -3031843 -4609204 -7930193 -11052409 -15210044 -20599201 -23135072
40469 -23135072 -18945255 -10403511 -4150380 -3408853 -5150575 -4907585 -1514057 3291782
40461 3291782 6667460 4787915 -5194506 -20220265 -30796783 -29404110 -18719356 -8135032
40453h135032N421660L284169M984069M935452O36944m118583n266896l353364
40445a611581j669316k365582m798012n835649k563550L384739O194710L544053
40437e720188J112623M633339J0096819Q794316Q34781m796305m285793l645558
40429G024034o308528o102668R77247O891185K945346n196750n137967K853084
40421b055017O103620p01391p690778n183822K890692O683980M381286J680842
40413F109412J664102J837046l58994m023577o361387n023514m428M917113M782537
40404C538310l01485m028088j662919L626534N446063K748383k71689j113927
40396G981182j204648j653040j176359R44920L096785L481897J721887k017292
$$ plain form
40453 -8135032 -2713372 570797 5554866 10490318 11127262 7008679 1741783 -1611581
40445 -1611581 -3280897 -5646479 -10444491 -16280140 -18843690 -15458951 -9264241 -5720188
40437 -5720188 -4607565 25774 10122593 18916909 19751690 14955385 10669592 7024034
40429 7024034 715506 -5387162 -4409915 2481270 5426616 229866 -4908101 -2055017
40421 -2055017 4048603 3347212 -4343566 -9527388 -6636696 47284 4428570 6109412
40413 6109412 7773514 9610560 9251566 5227989 -1133398 -6156912 -6161340 -1244227 3538310
40404 3538310 3236825 -791263 -2454182 1172352 6618415 9366798 9095109 7981182
40396 7981182 6776534 5123494 3947135 4892055 7988840 11470737 13192624 11175332
40388A1175332o957961j0290648q496764j339202P071405J1847931J0679811M130144
40380A7820048m653625j0231227q301298p60790N054044M304958q8476k296331
40372H47303j508017j487136l262956k884638K047465P302248O766944O31790
40364H453003m711750m812637j817003L2889K74865J017494K172836J643204m00012
40355A852889j198332J43933J284238O99790k66442q68465k679044n342295m609911
40346a0983639J149569N771185K507829n228578p199739p98351N043245L174809
40338f563670j315074M98804P249382R078974K289721n252667n264299J85697
40330I06868K989175N50316k095561r73680J094102l75175m067786m621553r23283
$$ plain form
40388 11175332 4217371 -6073277 -14570041 -15909243 -8837838 3010093 13689904 17820048
40380 17820048 13166423 2935196 -5366102 -6126892 -1072848 3232110 3143634 847303
40372 847303 -660714 -2147850 -5410806 -8295444 -6247979 1054269 7821213 8453003
40364 8453003 3741253 -1071384 -2888387 -2855498 -2580633 -1563139 609697 2252901 1852889
40355 1852889 654557 798490 2082728 2782518 2516076 1647611 -1031433 -6373728 -10983639
40346 -10983639 -9834070 -4062885 -1555056 -6783634 -13983373 -14781724 -9738479 -6563670
40338 -6563670 -7878744 -7379940 -130558 8948416 11238137 5985470 721171 906868
40330 906868 3896043 4446359 2350798 1377118 2471220 2096045 -1971741 -6593294 -7516577
40321g516577J866895J5468l133965k604243J62700k21125l860494m964039j455386
40312b1710766J042387j757186n043673j671721O477657J0272696N673625j680066
40304h397047n059331m431048l298591k137098J076012N783963Q177202N773826
40296b512112M31738l824466m778578l183827o70786K257598N425169P062118
40288B06854M856326k87699l635404j758886K999366N359251L337852p24364m198200
40279F155096n999085n039100q44210L768087M583231J909592Q42634L638856
40271I015101N619432J838869n214020q591884n791948p48561K033998J483202
40263c55811j359800m617329n268493j530842L371918L555115j546445n025328
$$ plain form
40321 -7516577 -5649682 -5634214 -8768179 -11372422 -11209722 -11430847 -15291341 -20255380 -21710766
40312 -21710766 -20668379 -22425565 -27469238 -29140959 -22663302 -12390606 -6716981 -8397047
40304 -8397047 -13456378 -17887426 -21186017 -23323115 -22247103 -16463140 -8285938 -2512112
40296 -2512112 -2080374 -5904840 -10683418 -13867245 -14538031 -12280433 -6855264 206854
40288 206854 5063180 4775481 1140077 -618809 2380557 7739808 11077660 10353296 6155096
40279 6155096 156011 -4883089 -5727299 -1959212 2624019 4533611 5376245 9015101
40271 9015101 14634533 16473402 11259382 2667498 -3124450 -3873011 -1839013 -355811
40263 -355811 -1715611 -6332940 -11601433 -13132275 -9760357 -6205242 -7751687 -12777015
40255a2777015j286888N799974P715341K946844j180018O55948L841709M34945
40247F150840q860535j4302147r151275J905716Q469102N940375j235090o027554
40239a7110568n396683j045919L285824M665100L039529J035554P26729J309850
40231i490584J369842J657164K762334K047668k373231n871731k132144N682975
40223f347707O483075k743711j0486636o468506L196519N495014M6250k132411
40215a2958113K545468N166510K73200m734554j839465N016530O970298L433978
40207C873852N37153P72857J642375J640104P79266k332481p337531q604566k218253
40198a1247224N492227M781636k830500n777606N45867P262255N704852j032433
$$ plain form
40255 -12777015 -14063903 -8263929 -548588 2398256 1218238 1874186 5715895 6150840
40247 6150840 -2709695 -17011842 -26163117 -24257401 -15788299 -9847924 -11083014 -17110568
40239 -17110568 -22507251 -23553170 -20267346 -15602246 -12562717 -11527163 -10800434 -9490584
40231 -9490584 -8120742 -6463578 -3701244 -1653576 -4026807 -9898538 -12030682 -6347707
40223 -6347707 135368 -2608343 -13094979 -19563485 -16366966 -10871952 -10825702 -12958113
40215 -12958113 -10412645 -5246135 -4972935 -9707489 -11546954 -6530424 439874 3873852
40207 3873852 4411005 5183862 6826237 8466341 9245607 6913126 -424405 -9028971 -11247224
40198 -11247224 -5754997 -973361 -3803861 -9581467 -9035600 -1773345 3931507 2899074
40190B899074n287879n925572n528857k737896M260996J0349719Q356210J58437
40182F544232m820039k351311K167105K782562k7910l238210o163059q422146
40174a3528776p642268k805164L019157O160377O316073M976059K421991j469895
40166b552446n606000q795860j0429664q752504j636464Q706333J5062108J2590462
40158a414035M632594j817909m034368l647063j580637K239983N391795M265591
40150D035951p06341m996065n726655m327900l177410k738315k531390k166023
40142b2334148r93438Q62567J356646q43652l168299k066916J346538K723993
40134b3116709J443475J206748K928627K511887k077685o614515o773899m247691
$$ plain form
40190 2899074 -2388805 -8314377 -13843234 -16581130 -12320134 -1970415 6385795 6544232
40182 6544232 1724193 -627118 1539987 4322549 4294639 1056429 -5106630 -13528776
40174 -13528776 -21171044 -23976208 -20957051 -14796674 -8480601 -3504542 -1082551 -2552446
40166 -2552446 -8158446 -16954306 -27383970 -36136474 -37772938 -29066605 -14004497 -1414035
40158 -1414035 3218559 1400650 -2633718 -6280781 -7861418 -5621435 -229640 4035951
40150 4035951 3329610 -1666455 -7393110 -11721010 -14898420 -17636735 -20168125 -22334148
40142 -22334148 -23327586 -22465019 -21108373 -21952025 -25120324 -27187240 -25840702 -23116709
40134 -23116709 -21673234 -20466486 -17537859 -15025972 -17103657 -23718172 -30492071 -34739762
40126c4739762k969319k789615j001496K557739N895701Q173684R084950P228778
40118h559340K742334p88854r32280n25978k895100n488956l703132P80367J833121
40109a7537818j370603l027418j85996K709333J290471j986608k167363Q61084
40101b1414918L183543K758931J210695J022162L358274P549666J0833751R785009
40093A8287113L840686l399374p649202p768723n356244k313526l32607j026807
40085e718684m109203o182741l917659J224414L595102R273n491506n641126J115098
40076b5117032P894757P310293N57866m327214k687995K110680M921274N229585
40068d107786M856228L388728n718l077623l267616j913347j352631q7954L988535
$$ plain form
40126 -34739762 -37709081 -40498696 -41500192 -38942453 -33046752 -24873068 -15788118 -8559340
40118 -8559340 -5817006 -6605860 -7538140 -8064118 -10959218 -16448174 -20151306 -19370939 -17537818
40109 -17537818 -18908421 -21935839 -22121835 -19412502 -18122031 -20108639 -22276002 -21414918
40101 -21414918 -18231375 -15472444 -14261749 -13239587 -9881313 -2331647 8502104 18287113
40093 18287113 22127799 18728425 11079223 3310500 -2045744 -4359270 -4691877 -5718684
40085 -5718684 -9827887 -16010628 -19928287 -18703873 -15108771 -15099498 -20591004 -26232130 -25117032
40076 -25117032 -17222275 -9911982 -9354116 -13681330 -16369325 -14258645 -9337371 -4107786
40068 -4107786 748442 4137170 4131452 1053829 -2213787 -4127134 -5479765 -5567719 -1579184
40059a579184P549774N373020q61076m005270j938394J16057j207821k821990
40051F25116j868572l09189O2488Q69846K059928o7816n542833p695357k749861
40042a4616250L239277L255222R7027J043074N629256O937198L134810l23192
40034H396422J22090J730764J080003j558133m407171o131390n089177r53699
40026f810291K752003K094207j240100j889137J095282L056329J346710q85272
40018d80269j43011K525986M074016L381343R15877k337541m081580j991463K557926
40009D421284M893506K748504j009683k645831j838273l64873O06983J49663k832214
40000D129066p343117r513270o437864J5915M801745M698870J091454j682060
$$ plain form
40059 -1579184 5970590 11343610 10482534 6477264 4538870 4654927 3447106 625116
40051 625116 -1243456 -1552645 -1490157 -620311 1439617 1371801 -4171032 -11866389 -14616250
40042 -14616250 -11376973 -8121751 -8024724 -6981650 -1352394 5584804 8719614 8396422
40034 8396422 8518512 10249276 11329279 9771146 5363975 -767415 -5856592 -6810291
40026 -6810291 -4058288 -1964081 -3204181 -5093318 -3998036 -941707 405003 -480269
40018 -480269 -623280 1902706 5976722 9358065 10273942 7936401 3854821 1863358 4421284
40009 4421284 9314790 12063294 11053611 8407780 6569507 6204634 6811617 6961280 4129066
40000 4129066 -3214051 -12727321 -19165185 -19149270 -14347525 -9648655 -8557201 -10239261
39992a0239261n66827L142424N478395M954358M192111N019824M792118Q54537
39984A7627679l935102m990081l580041m656659p674519o633670o42165K895193
39976a1589365o47947n166090k482629N460447R508755O113934P86826j034578
39968I49353o66081j782136l559639j858963L835102P889846M626437m010982
39960E422937r366399n839015K254346O014891K797855j723743k041332O25573
39952a854887J623338m02438k428198j462664J523183K109040k579447q893707
39944a2365780r017863p22416P896022P700214M69772m015311j567810K582521
39936i040651L608092K945096K306450m55559n539951p834324m309720N19753
$$ plain form
39992 -10239261 -10806088 -7663664 -2185269 2769089 6961200 11981024 16773142 17627679
39984 17627679 13692577 8702496 5122455 465796 -7208723 -13842393 -14484558 -11589365
39976 -11589365 -12237312 -17403402 -19886031 -14425584 -4916829 1197105 1983931 949353
39968 949353 283272 -1498864 -5058503 -6917466 -3082364 4807482 9433919 5422937
39960 5422937 -3943462 -9782477 -7528131 -1513240 1284615 -439128 -2480460 -1854887
39952 -1854887 -231549 -633987 -3062185 -4524849 -3001666 -892626 -3472073 -12365780
39944 -12365780 -21383643 -22106059 -14210037 -6509823 -6040051 -10055362 -11623172 -9040651
39936 -9040651 -5432559 -2487463 -181013 -636572 -6176523 -14010847 -18320567 -17800814
39928a7800814J560888Q11908K672445N716273N118285N86968l562518m513108
39920i409673k926223o89196L6450k002579m294205k509201K246220L488426J05731
39911a5954250P6376P611913J3819920Q823078k590682p736351m472604j661294
39903b083894l368932m453279k014607J72015N36991K632575O423629O355769
39895D200267J579073j055145J689101L919557J336104r87907K237310O905101
39887A9823461O226638J403756j629804j815818k407382m122797n322700o426593
39879E728761q226878q029246l124293L632553O812767N371489K106405j564083
39871B707475n191660n926533j618537L817389M175790j66063k960297j871984
$$ plain form
39928 -17800814 -16239926 -15428018 -12755573 -7039300 -1921015 -1334047 -4896565 -9409673
39920 -9409673 -12335896 -13025092 -12988642 -14991221 -19285426 -21794627 -19548407 -16059981 -15954250
39911 -15954250 -15877874 -8265961 5553959 14377037 11786355 4050004 -422600 -2083894
39903 -2083894 -5452826 -9906105 -11920712 -11748697 -11211706 -8579131 -2155502 4200267
39895 4200267 5779340 4724195 6413296 10332853 11668957 10681050 12918360 19823461
39887 19823461 26050099 27453855 25824051 24008233 21600851 17478054 12155354 5728761
39879 5728761 -2498117 -10527363 -13651656 -10019103 -3206336 2165153 4271558 2707475
39871 2707475 -2484185 -8410718 -10029255 -6211866 -2036076 -2202139 -5162436 -7034420
39863g034420j385825m438322p163550n323533j341052l71594k031966j037897
39855c0128159M301549Q678100O621091n403m136998k246025K022769L564527
39847a1328549K280131J571205K347839K017597p55048l515795l246957m5587
39839a0675164L293447L951892J156560k912508m507362k288790P72840J447620
39831i761465P47787J385922K512205J453188n29963J99886K666350K112411j593777
39822h07456l178317j082523Q626j566619o21762M837371P475129J291716p678142
39813a321977r102751k521243L861910N292937L792360J667665r03924k964550
39805b199573l600731m363109n707108l822532K966380Q163971N111676j967192
$$ plain form
39863 -7034420 -8420245 -12858567 -20022117 -25345650 -26686702 -27058296 -29090262 -30128159
39855 -30128159 -25826610 -17148510 -10527419 -10532822 -14669820 -16915845 -14893076 -11328549
39847 -11328549 -9048418 -7477213 -5129374 -3111777 -3866825 -7382620 -10629577 -10675164
39839 -10675164 -7381717 -3429825 -2273265 -5185773 -9693135 -11981925 -11209085 -9761465
39831 -9761465 -9013678 -7627756 -5115551 -3662363 -4192326 -3992440 -1326090 786321 -807456
39822 -807456 -3985773 -5068296 -5059670 -6626289 -7248051 -2410680 5064449 6356165 -1321977
39813 -1321977 -10424728 -12945971 -9084061 -3791124 1236 1668901 764977 -2199573
39805 -2199573 -5800304 -10163413 -15870521 -19693053 -16726673 -8562702 -3451026 -5418218
39797e418218l667959J71920J564112j452345k683382k46630K19456k891057l514564
39788a7918667L82999K254257p24099j309033M929066J0105946O130512j867456
39780A983525m117855j562574j652258l710205o43842O820747R591257M393966
39772A1102761k113841n084963p282905j0102397q544918n87696O402879N556347
39764a0654733R48485N83450L226506J117776n853292q320026j845910N236634
39756a5561110L602733l309700m431627K937243J0111490J0007140N450889J999629
39748A0806687m10401l661301n160716k449944k02066m087695r395523n453585
39740b0014544P414192J5037473P773769o340790j2869422q958248k693230O59871
$$ plain form
39797 -5418218 -9086177 -8914257 -7350145 -8802490 -11485872 -11732502 -11513046 -14404103 -17918667
39788 -17918667 -17535668 -15281411 -16005510 -17314543 -12385477 -2279531 3850981 1983525
39780 1983525 -2134330 -3696904 -5349162 -9059367 -9703209 -2882462 6708795 11102761
39772 11102761 8988920 3903957 -3378948 -13481345 -22026263 -22613959 -16211080 -10654733
39764 -10654733 -9706248 -9122798 -5896292 -4778516 -10631808 -18951834 -20797744 -15561110
39756 -15561110 -11958377 -15268077 -19699704 -16762461 -6650971 3356169 8807058 10806687
39748 10806687 10396286 6734985 1574269 -875675 -1077741 -5165436 -14560959 -20014544
39740 -20014544 -12600352 2437121 10210890 3870100 -8999322 -17957570 -20650800 -19990929
39732a9990929K836890M868281M174164P50888o98365K189832M882379J833622
39724H46762n530835r688778n424663M066736R938388O886942q64605m582199
39716d352252j864764J115978m74623k837929k07180N225482O130011R10995m496781
39707h51063n389387l150145r28439K36427k8531j971319l534290j861472J928115
39698a5550104L604705K297481J562725K996886L830528K484802J240668J138861
39690C606552k57043k914481j881720M641511R831567O725668j396224n429513
39682A2926317k998181j43475j320340l952976l804118q38582J946442K390264
39674D205351O46005j163154m92212K681457M973604L398585j134104n965001
$$ plain form
39732 -19990929 -17154039 -12285758 -8111594 -7360706 -8059071 -5869239 -986860 846762
39724 846762 -4684073 -14372851 -19797514 -15730778 -5792390 1094552 229947 -4352252
39716 -4352252 -6217016 -5101038 -5575661 -8413590 -8620770 -3395288 2734723 3645718 -851063
39707 -851063 -6240450 -9390595 -10319034 -10082607 -10111138 -12082457 -15616747 -17478219 -15550104
39698 -15550104 -11945399 -9647918 -8085193 -5088307 -1257779 1227023 2467691 3606552
39690 3606552 3349509 435028 -1446692 3194819 13026386 19752054 18355830 12926317
39682 12926317 9928136 9784661 8464321 4511345 707227 -131355 1815087 4205351
39674 4205351 4851356 3688202 3195990 5877447 10851051 14249636 13115532 7150531
39666G150531j0060093j2395535r839612j342802P535281R599032M903032j44970
39658d595136j772935j705198j796747j850745k649568m764254m349173K431941
39650b1051815J0254375Q958843p10486n859079n91533M394606o71627p762588
39642a3039304l584302Q377684J2711642N551541j654347j738494n55095l151344
39634B917981m894450k238073n41621l528312m908511N99017O205739L154585
39626c233645m367401n375534P35013M225454O69058l905556l975909j367193
39618a6595713O77611K487567M537333N267620M619680M529033M418440J590543
39610A1532114k696804l683871j425368j956202p077903r695025m173547M244293
$$ plain form
39666 7150531 -2909562 -15305097 -25144709 -26487511 -18952230 -9353198 -4450166 -4595136
39658 -4595136 -6368071 -8073269 -9870016 -11720761 -14370329 -19134583 -23483756 -21051815
39650 -21051815 -10797440 -1838597 -2549083 -8408162 -8999695 -4605089 -5276716 -13039304
39642 -13039304 -16623606 -8245922 4465720 10017261 8362914 6624420 6069325 2917981
39634 2917981 -1976469 -4214542 -4756163 -8284475 -13192986 -12593969 -6388230 -3233645
39626 -3233645 -7601046 -12976580 -12241567 -8016113 -7347055 -11252611 -15228520 -16595713
39618 -16595713 -15918102 -13430535 -8893202 -3625582 994098 5523131 9941571 11532114
39610 11532114 8835310 5151439 3726071 1769869 -5308034 -15003059 -19176606 -14932313
39602a4932313O386102J586710l104842l616420k331969j855732j379711K9146
39594a9219029J315001K064481L759292O821749Q960816Q022783M751046J424385
39586A7900524q82068k367462k826255j602178O55261J659691J44102j891591
39578A0790024j573504K40448k85252l367492l663218J528862N846491J821963
39570A1338322o779365q633460j406315M221991N81713n436278l434748M466045
39562e082095P429501K244411l255958k512965K020033M613852L367331j49664
39554H674446l345713l208660J148383N415056L995780j913260m995414k184932
39546C585686Q85670j246399n478952n179618k47679L200918J825279j378579
$$ plain form
39602 -14932313 -8546211 -6959501 -10064343 -13680763 -16012732 -17868464 -19248175 -19219029
39594 -19219029 -17904028 -15839547 -12080255 -5258506 3702310 11725093 16476139 17900524
39586 17900524 17018456 14650994 11824739 10222561 10877822 12537513 12681615 10790024
39578 10790024 9216520 9456968 9171716 5804224 2141006 3669868 9516359 11338322
39570 11338322 4558957 -4074503 -5480818 -1258827 -677114 -6113392 -9548140 -5082095
39562 -5082095 2347406 4591817 1335859 -1177106 842927 5456779 8824110 8674446
39554 8674446 5328733 2120073 3268456 8683512 12679292 10766032 5770618 3585686
39546 3585686 4471356 3224957 -2253995 -7433613 -7681292 -4480374 -2655095 -4033674
39538d033674k786839k945476l793879m305702k040250K157320M376883L232801
39530a0138816K243975M303470O033954J824451o849412j1108416n680138M004529
39522a5366403Q966489P340035L684606P70262k228447m758594m329560j504279
39514g425891j43804j234035r76531L061401P696201Q258158M162661j398447
39506A1999713m785798l599582K025148P926661Q250630J553124o894586j0487921
39498E987389p820230k944152n04677j525235l143538k150617R83352K853727
39490h263981K580942L543532P133326Q470290L234875m193189n920559j992971
39482D592265Q15504N77240J649099M064251J657666o114154j0421540o349386
$$ plain form
39538 -4033674 -6820513 -9765989 -13559868 -17865570 -19905820 -17748500 -13371617 -10138816
39530 -10138816 -7894841 -3591371 2442583 4267034 -2582378 -13690794 -19370932 -15366403
39522 -15366403 -6399914 940121 4624727 5394989 3166542 -1592052 -5921612 -7425891
39514 -7425891 -7569695 -8803730 -9780261 -6718860 977341 9235499 13398160 11999713
39506 11999713 7213915 3614333 5639481 13566142 21816772 23369896 16475310 5987389
39498 5987389 -1832841 -4776993 -5281670 -6806905 -9950443 -12101060 -11117708 -8263981
39490 -8263981 -5683039 -2139507 4993819 13464109 16698984 12505795 6585236 4592265
39482 4592265 5407769 5985009 7634108 11698359 13356025 7241871 -3179669 -9529055
39474i529055q81313j012492k440133J394032O308388L852586l953341p095074
39466a3356402k455443L564672O057849O019832M217145l94166n354200n652611
39458g353324j246855K814868M124907M389139L658814N05791k264645l51091
39450D277604L175951Q12575o174737p473869J0550N692547P62779q791926j1944936
39441a9653462q116441m432612k830208R20365P887425J3749672J5024121J1565163
39433A4114023M273292m141838p969249m205023J732142K068439k351417l462669
39425E7700J788021P237713O781765J843378k616774m399544l680673q36461K040652
39416H215777J085440m155394q105162n563595J028768M641583K977717N15416
$$ plain form
39474 -9529055 -10410368 -11422860 -13862993 -12468961 -6160573 -2307987 -6261328 -13356402
39466 -13356402 -15811845 -12247173 -6189324 -169492 4047653 3653487 -1700713 -7353324
39458 -7353324 -8600179 -5785311 -1660404 2728735 6387549 6893340 4628695 4277604
39450 4277604 7453555 8266130 2091393 -5382476 -5371926 320621 1083400 -7708526 -19653462
39441 -19653462 -27769903 -32202515 -35032723 -34112358 -26224933 -12475261 2548860 14114023
39433 14114023 18387315 14245477 6276228 2071205 3803347 5871786 3520369 57700
39425 57700 1845721 9083434 15865199 17708577 15091803 10692259 7011586 6175125 8215777
39416 8215777 9301217 5145823 -2959339 -8522934 -7494166 -2852583 125134 640550
39408F40550R87548K218931P17382j940674j240655K989363N724557L917862P16250
39399A4731114L65135K048566K103798J19293j368087k116900m362708p581570
39391C938641p855826l896707M90377J901907J438591J075189n7492k575209l594764
39382i135293o14806L875609N603813M239472K094629o51035m812147p861973
39374g261731n928886L6890M568126M470567J642635q22788j640563n82350J427624
39365d090476J605018j377402l876478j796130J952906P12758m680946n390500
39357a6941250J941649Q765136O848809M33812r62683K860986L944437m33449
39349F457447m475936m160750k503242k500714k109508L03787J563217q73870
$$ plain form
39408 640550 1628098 3847029 4564411 2623737 1383082 4372445 10097002 14014864 14731114
39399 14731114 15096249 17144815 19248613 19367906 17999819 15882919 11520211 3938641
39391 3938641 -3917185 -7813892 -7323515 -5421608 -3983017 -2907828 -2965320 -5540529 -9135293
39382 -9135293 -9750099 -5874490 -270677 3968795 6063424 5412389 600242 -7261731
39374 -7261731 -13190617 -13153727 -8585601 -4115034 -2472399 -3295187 -4935750 -5518100 -4090476
39365 -4090476 -2485458 -3862860 -7739338 -9535468 -7582562 -6869804 -11550750 -16941250
39357 -16941250 -14999601 -6234465 614344 1048156 85473 2946459 6890896 6457447
39349 6457447 1981511 -2179239 -4682481 -7183195 -9292703 -8988916 -7425699 -8299569
39341h299569l741338k887850L52146K462672L995339O930179Q520560M586094
39333A1918233k053699l739507M87721K625874k206263p981719o872292j025270
39325h846922J169362k272476m943365k267146K556123M213618K074406q09745
39317i126145k087489j405717L07652J378737J104048J348966L771213N450433
39309G41698J553345o436203j0204151n399856J704170K893507n51843j096672
39301a6796005K954770N857187M524002K714979L224179K774394j301919m768548
39293h16961k413439L138534M593653M83412l410419l049488p26858P94757L042599
39284A635790P100216Q546442K759469o465419r580264l435782M152655M342801
$$ plain form
39341 -8299569 -12040907 -14928757 -14576611 -12113939 -8118600 -1188421 7332139 11918233
39333 11918233 9864534 6125027 6612748 9238622 7032359 -949360 -7821652 -8846922
39325 -8846922 -7677560 -9950036 -14893401 -17160547 -14604424 -10390806 -8316400 -9126145
39317 -9126145 -11213634 -12619351 -12311699 -10932962 -9828914 -8479948 -4708735 741698
39309 741698 2295043 -4141160 -14345311 -19745167 -18040997 -15147490 -15699333 -16796005
39301 -16796005 -13841235 -7984048 -3460046 -745067 2479112 5253506 3951587 -816961
39293 -816961 -3230400 -91866 4501787 4985199 1574780 -1474708 -2201566 -1406809 1635790
39284 1635790 8736006 17282448 20041917 13576498 3996234 560452 4713107 9055908
39276I055908j995144o783413n391252p73062J975461J216118j415459l638531
39268g749374l948580k418754p69025l08958k19866K57228q07840m896197p939357
39259b8800723l556858P141109J4139930J0278876N03002m682237j948373L206030
39251c719244N230375L698557N93540k417857l467518j416306J697134K358935
39243B557616M31170p31683M71865J883275J786924J663043K892377L573670J156422
39234A5684679l403393o444499n838876k782834K65729K173746L479980M664772
39226G799304M723748K437953r57226k396007j429225j588361m820833p000158
39218c230805l067640M778214R054998P001976L189051J150014j513690o521464
$$ plain form
39276 9055908 7060764 277351 -5113901 -5886963 -3911502 -2695384 -4110843 -7749374
39268 -7749374 -11697954 -14116708 -14885733 -15194691 -15414557 -15157329 -15965169 -20861366 -28800723
39259 -28800723 -32357581 -25216472 -11076542 -797666 -294664 -4976901 -6925274 -3719244
39251 -3719244 1511131 5209688 5803228 3385371 -82147 -1498453 198681 2557616
39243 2557616 2988786 2257103 2728968 4612243 6399167 8062210 10954587 14528257 15684679
39234 15684679 12281286 5836787 -2089 -2784923 -2519194 -345448 3134532 7799304
39226 7799304 12523052 14961005 14003779 11607772 10178547 8590186 3769353 -3230805
39218 -3230805 -6298445 -1520231 7534767 14536743 17725794 18875808 17362118 10840654
39210A0840654r034048m118657M014135N837419o94898p035076n424453J389538
39202d225386N220071L931115K703885M381876M482807r35430o884444n138331
39194C536163L001600O895136J266321o292099o649799j594027J266828N61191
39186A991314k00278j965266p761365j2702706q078293L320746P830102Q44802
39178a6720944n346779l03851Q569351Q384106Q17742k102634K534905N767888
39170A599784K262874k759307l470434j022928J302520L075470M001035K252203
39162G241217j684315m327539m588702n371972p804449q286845l802786L267006
39154b5358385P844604P103172J647951n241185q667730n727799P21770M615750
$$ plain form
39210 10840654 1806606 -2312051 1702084 7539503 6844605 -190471 -5614924 -4225386
39202 -4225386 994685 4925800 7629685 12011561 16494368 15558938 8674494 3536163
39194 3536163 6537763 13432899 14699220 8407121 1757322 163295 1430123 1991314
39186 1991314 1791036 -174230 -7935595 -20638301 -28716594 -25395848 -17565746 -16720944
39178 -16720944 -22067723 -22371574 -13802223 -5418117 -4600375 -6703009 -4168104 1599784
39170 1599784 3862658 1103351 -2367083 -3390011 -2087491 987979 4989014 7241217
39162 7241217 5556902 1229363 -3359339 -8731311 -16535760 -24822605 -28625391 -25358385
39154 -25358385 -17513781 -10410609 -8762658 -14003843 -22671573 -28399372 -27677602 -23061852
39146b3061852L573608N35925j139527n08001K612002P341851R557024N328557
39138D239587k394501n960583l384858p60706k126677l386899l14420L394842
$$ plain form
39146 -23061852 -19488244 -18952319 -20091846 -20599847 -17987845 -10645994 -1088970 4239587
39138 4239587 1845086 -4115497 -7500355 -8261061 -10387738 -13774637 -14089057 -10694215
$$ [...]
##END NTUPLES=NMR SPECTRUM
##END=
