##TITLE=31P_DE-80H_X3
 64 sc D2O
 26.2.2025
##JCAMPDX= 6.0         $$ Bruker NMR JCAMP-DX V2.0
##DATA TYPE= NMR FID
##DATA CLASS= NTUPLES
##ORIGIN= UXNMR, Bruker Analytische Messtechnik GmbH
##OWNER= root
$$ XWIN-NMR		Version 3.5
$$ Wed Feb 18 11:12:56 2026 Russian Standard Time (UT+4h)  Yarkov@DPX200
##.OBSERVE FREQUENCY= 81.013821
##.OBSERVE NUCLEUS= ^31P
##.DELAY= (6, 6)
##.ACQUISITION MODE= SIMULTANEOUS
##.ACQUISITION SCHEME= undefined
##.AVERAGES= 64
##.DIGITISER RES= 17
##SPECTROMETER/DATA SYSTEM= spect
##.PULSE SEQUENCE= zgpg30
##.SOLVENT NAME= CDCl3
##.SHIFT REFERENCE= (INTERNAL, CDCl3, 0, 243.863)
##AUDIT TRAIL= $$ (NUMBER, WHEN, WHO, WHERE, WHAT)
$$ ##TITLE= Audit trail, XWIN-NMR		Version 3.5
$$ ##JCAMPDX= 5.01
$$ ##ORIGIN= Bruker BioSpin GmbH
$$ ##OWNER= Yarkov
$$ C:/Bruker/XWIN-NMR/data/yarkov2/nmr/P31/2/audita.txt
$$ ##AUDIT TRAIL=  $$ (NUMBER, WHEN, WHO, WHERE, WHAT)
(   1,<2026-02-18 11:11:41.90 +0400>,<Yarkov>,<DPX200>,
      <created by zg, POWCHK disabled, PULCHK disabled
       configuration hash MD5:
       00 E9 B6 7A A2 85 ED C7 34 08 36 98 17 FE 4E 26
       data hash MD5: 32K
       60 77 97 C7 4F EF 93 94 DD C3 1D F5 6F C5 B0 F8>)
$$ ##END=
$$ 
$$ hash MD5
$$ A6 58 58 24 16 2D E0 07 E2 BE 6E 38 C5 D0 4F 7A
##$RELAX= 
##$RELAX= 
##$RELAX= 
##$RELAX= 
##$RELAX= 
##$RELAX= 
##$RELAX= 
##$RELAX= 
$$ Bruker specific parameters
$$ --------------------------
##$DU= <C:/Bruker/XWIN-NMR>
##$EXPNO= 2
##$NAME= <P31>
##$PROCNO= 1
##$TYPE= <nmr>
##$USER= <yarkov2>
##$AMP= (0..31)
100 100 100 100 100 100 100 100 100 100 100 100 100 100 100 100 100 100 
100 100 100 100 100 100 100 100 100 100 100 100 100 100 
##$AQSEQ= 0
##$AQ_mod= 1
##$AUNM= <au_zg>
##$AUTOPOS= <>
##$BF1= 81.014009
##$BF2= 200.13
##$BF3= 200.13
##$BF4= 200.13
##$BF5= 200.13
##$BF6= 200.13
##$BF7= 200.13
##$BF8= 200.13
##$BYTORDA= 1
##$CFDGTYP= 0
##$CFRGTYP= 5
##$CHEMSTR= <none>
##$CNST= (0..31)
1 1 145 1 1 1 1 1 1 1 1 1 1 1 1 1 1 1 1 1 1 1 1 1 1 1 1 1 1 1 1 1 
##$CPDPRG= <waltz16>
##$CPDPRG1= <>
##$CPDPRG2= <waltz16>
##$CPDPRG3= <>
##$CPDPRG4= <mlev>
##$CPDPRG5= <mlev>
##$CPDPRG6= <mlev>
##$CPDPRG7= <mlev>
##$CPDPRG8= <mlev>
##$CPDPRGB= <>
##$CPDPRGT= <>
##$D= (0..31)
0 1 0 0 0 0 0 0 0 0.06 0 0.03 2e-05 3e-06 0 0 0.0002 0 0 0 0 0 0 0 0 0 
0 0 0 0 0 0 
##$DATE= 1771398701
##$DBL= (0..7)
120 120 120 11 120 120 24 19 
##$DBP= (0..7)
150 150 150 150 150 150 150 150 
##$DBP07= 0
##$DBPNAM0= <>
##$DBPNAM1= <>
##$DBPNAM2= <>
##$DBPNAM3= <>
##$DBPNAM4= <>
##$DBPNAM5= <>
##$DBPNAM6= <>
##$DBPNAM7= <>
##$DBPOAL= (0..7)
0.5 0.5 0.5 0.5 0.5 0.5 0.5 0.5 
##$DBPOFFS= (0..7)
0 0 0 0 0 0 0 0 
##$DE= 6
##$DECBNUC= <off>
##$DECIM= 4
##$DECNUC= <off>
##$DECSTAT= 4
##$DIGMOD= 1
##$DIGTYP= 9
##$DL= (0..7)
0 0 52 120 120 21 21 25 
##$DP= (0..7)
150 150 150 150 150 150 150 150 
##$DP07= 0
##$DPNAME0= <>
##$DPNAME1= <>
##$DPNAME2= <>
##$DPNAME3= <>
##$DPNAME4= <>
##$DPNAME5= <>
##$DPNAME6= <>
##$DPNAME7= <>
##$DPOAL= (0..7)
0.5 0.5 0.5 0.5 0.5 0.5 0.5 0.5 
##$DPOFFS= (0..7)
0 0 0 0 0 0 0 0 
$$ [...]
##$SUBNAM1= <"">
##$SUBNAM2= <"">
##$SUBNAM3= <"">
##$SUBNAM4= <"">
##$SUBNAM5= <"">
##$SUBNAM6= <"">
##$SUBNAM7= <"">
##$SUBNAM8= <"">
##$SUBNAM9= <"">
##$SW= 400.765351723535
##$SWIBOX= (0..15)
0 1 3 0 0 0 0 0 0 0 0 0 0 0 0 0 
##$SW_h= 32467.5324675325
##$TD= 32768
##$TD0= 1
##$TE= 0
##$TE2= 300
##$TE3= 300
##$TEG= 300
##$TL= (0..7)
0 120 53 12 22 120 120 120 
##$TP= (0..7)
150 150 150 150 150 150 150 150 
##$TP07= 0
##$TPNAME0= <>
##$TPNAME1= <>
##$TPNAME2= <>
##$TPNAME3= <>
##$TPNAME4= <>
##$TPNAME5= <>
##$TPNAME6= <>
##$TPNAME7= <>
##$TPOAL= (0..7)
0.5 0.5 0.5 0.5 0.5 0.5 0.5 0.5 
##$TPOFFS= (0..7)
0 0 0 0 0 0 0 0 
##$TUNHIN= 0
##$TUNHOUT= 0
##$TUNXOUT= 0
##$USERA1= <user>
##$USERA2= <user>
##$USERA3= <user>
##$USERA4= <user>
##$USERA5= <user>
##$V9= 5
##$VALIST= <valist>
##$VCLIST= <CCCCCCCCCCCCCCC>
##$VD= 0
##$VDLIST= <DDDDDDDDDDDDDDD>
##$VPLIST= <PPPPPPPPPPPPPPP>
##$VTLIST= <TTTTTTTTTTTTTTT>
##$WBST= 1024
##$WBSW= 4
##$XGAIN= (0..3)
0 0 0 0 
##$XL= 0
##$YL= 0
##$YMAX_a= 2843
##$YMIN_a= -2832
##$ZGOPTNS= <>
##$ZL1= 120
##$ZL2= 120
##$ZL3= 120
##$ZL4= 120
##$ABSF1= 60
##$ABSF2= -190
##$ABSG= 5
##$ABSL= 3
##$ALPHA= 0
##$AQORDER= 0
##$ASSFAC= 0
##$ASSFACI= 0
##$ASSFACX= 0
##$ASSWID= 0
##$AUNMP= <proc_1d>
##$AZFE= 0.1
##$AZFW= 0.5
##$BCFW= 1
##$BC_mod= 2
##$BYTORDP= 1
##$COROFFS= 0
##$CY= 9.86611175537109
##$DATMOD= 1
##$DC= 1
##$DFILT= <>
##$DTYPP= 0
##$F1P= 182.462994727601
##$F2P= 168.069089081705
##$FCOR= 0.5
##$FTSIZE= 0
##$FT_mod= 0
##$GAMMA= 1
##$GB= 0
##$INTBC= 1
##$INTSCL= 1
##$ISEN= 30
##$LB= 1.5
##$LEV0= 0
##$LPBIN= 0
##$MAXI= 11.51145
##$MC2= 0
##$MEAN= 0
##$ME_mod= 0
##$MI= 1.244541
##$NCOEF= 0
##$NC_proc= 0
##$NLEV= 6
##$NOISF1= 0
##$NOISF2= 0
##$NSP= 1
##$NTH_PI= 0
##$NZP= 1
##$OFFSET= 243.8632
##$PC= 1.4
##$PHC0= 1706.409
##$PHC1= -1.240479
##$PH_mod= 0
##$PKNL= yes
##$PPARMOD= 0
##$PSCAL= 0
##$PSIGN= 0
##$REVERSE= no
##$SF= 81.0140731611343
##$SI= 65536
##$SIGF1= 0
##$SIGF2= 0
##$SINO= 80
##$SIOLD= 65536
##$SREGLST= <31P.CDCl3>
##$SSB= 0
##$STSI= 0
##$STSR= 0
##$SW_p= 25641.0256410257
##$SYMM= 0
##$S_DEV= 0
##$TDeff= 0
##$TDoff= 0
##$TI= <>
##$TILT= no
##$TM1= 0
##$TM2= 0
##$TOPLEV= 0
##$USERP1= <user>
##$USERP2= <user>
##$USERP3= <user>
##$USERP4= <user>
##$USERP5= <user>
##$WDW= 1
##$XDIM= 64
##$YMAX_p= 0
##$YMIN_p= 0
$$ End of Bruker specific parameters
$$ ---------------------------------
##NTUPLES= NMR FID
##VAR_NAME=  TIME,          FID/REAL,        FID/IMAG
##SYMBOL=    X,             R,               I
##VAR_TYPE=  INDEPENDENT,   DEPENDENT,       DEPENDENT
##VAR_FORM=  AFFN,          ASDF,            ASDF
##VAR_DIM=   16384,         16384,           16384
##UNITS=     SECONDS,       ARBITRARY UNITS, ARBITRARY UNITS
##FACTOR=    3.08e-05,      1,               1
##FIRST=     0,             0,               0
##LAST=      0.5045964,     0,               0
##MIN=       0,             -2832,           0
##MAX=       0.5045964,     2843,            0
$$ Real data points
##PAGE= N=1
##DATA TABLE= (X++(R..R)), XYDATA
$$ [...]
4744 224 289 386 350 363 396 310 351 270 248 279 253 308 328 358 403 374 375 366 346 310 285 215 223 251 227 225 232 276 267 306 264 240 172
4777 172 80 94 59 57 85 85 103 88 121 135 51 -8 -12 -22 -95 -150 -151 -127 -136 -102 -46 -83 -95 -106 -124 -190 -253 -262 -318 -281 -297 -214 -209
4810 -209 -203 -189 -221 -198 -279 -345 -334 -323 -341 -376 -323 -333 -238 -256 -289 -268 -284 -279 -314 -359 -339 -374 -346 -294 -275 -224 -176 -186 -138 -148 -215
4841 -215 -213 -156 -223 -226 -205 -157 -114 -79 -19 2 36 14 11 -40 -40 -22 -61 9 -14 92 150 148 195 165 230 163 154 118 145 152 124 188 249
4874 249 261 271 354 301 333 279 287 287 271 259 233 286 280 293 368 382 358 358 329 279 268 268 210 220 248 306 326 267 284 248 292 251
4906 251 203 245 134 129 150 160 165 151 149 170 79 145 50 48 32 -31 -63 -69 -55 -17 -44 -28 -13 -50 -74 -96 -163 -203 -214 -269 -192 -261
4938 -261 -138 -143 -142 -143 -183 -214 -235 -262 -360 -283 -344 -344 -287 -298 -250 -236 -244 -217 -261 -306 -333 -335 -374 -367 -351 -291 -221 -224 -203 -203 -186 -202 -200 -249
4972 -249 -287 -298 -268 -262 -205 -134 -118 -117 -40 -80 -61 -76 -111 -100 -112 -83 -48 -16 8 49 67 122 98 80 94 67 112 37 81 101 122
5003 122 148 206 222 251 264 271 233 196 215 144 250 195 243 316 272 374 308 333 274 282 246 184 293 213 228 227 292 334 314 326
5033 326 351 277 252 189 186 128 159 112 195 181 221 241 213 193 145 107 59 41 -18 -18 12 74 26 58 55 51 13 -60 -54 -101 -128 -145
5065 -145 -205 -178 -137 -141 -110 -70 -133 -146 -194 -202 -252 -310 -270 -321 -311 -249 -235 -227 -227 -150 -187 -250 -294 -318 -356 -311 -358 -336 -258 -232 -223 -186
5097 -186 -201 -238 -241 -228 -266 -286 -305 -247 -197 -193 -169 -156 -99 -135 -130 -71 -105 -112 -190 -134 -110 -68 -83 -24 58 31 96 63 15 15 -12 34
5129 34 -57 62 66 108 121 140 223 227 201 199 222 172 140 163 133 162 239 244 347 301 327 318 318 279 204 170 267 226 211 224 283 350
5161 350 366 313 329 262 202 223 191 155 181 171 190 232 238 261 219 268 180 150 78 82 115 73 98 115 53 159 112 32 65 12
5191 12 -17 -66 -78 -106 -99 -54 -83 -85 -63 -57 -25 -78 -112 -168 -218 -234 -295 -245 -265 -188 -182 -206 -138 -170 -178 -224 -278 -246 -293 -319 -286 -281 -272 -187
5225 -187 -263 -211 -221 -201 -241 -270 -269 -286 -314 -315 -232 -232 -213 -114 -87 -159 -146 -156 -168 -223 -199 -205 -156 -148 -85 -82 -53 16 -14 -16 -38 -58 -67 -79
5259 -79 -33 -28 17 46 71 116 175 158 121 135 90 135 54 98 111 143 225 231 261 241 285 255 274 229 200 171 176 209 214 227 277 262
5291 262 313 306 330 245 252 222 160 147 174 200 203 308 250 275 282 259 199 153 150 104 79 77 95 119 135 147 144 119 67 69 8 -15 -87
5324 -87 -109 -57 -50 -47 13 -39 -1 -46 -25 -46 -108 -152 -178 -208 -221 -200 -175 -139 -166 -145 -126 -145 -168 -202 -337 -324 -324 -297 -289 -244 -208 -209
5356 -209 -205 -171 -262 -233 -279 -314 -346 -311 -268 -267 -186 -177 -155 -173 -133 -182 -226 -191 -232 -199 -205 -185 -192 -194 -97 -85 -36 -66 -69 -67 -94 -111 -105 -88
5390 -88 -64 -25 -15 38 100 96 94 126 82 72 57 100 29 94 104 163 205 229 264 228 207 207 181 172 163 166 181 236 208 247 285 290 309 268
5424 268 283 252 196 157 162 192 205 231 288 302 293 303 243 210 189 181 148 128 136 158 195 210 179 192 212 137 77 58 50 8 -15 17
5456 17 33 71 54 32 34 22 -9 -18 -151 -118 -116 -163 -171 -150 -100 -120 -89 -62 -97 -147 -180 -207 -221 -244 -239 -222 -235 -180 -224 -166 -130 -147
5488 -147 -190 -213 -265 -328 -301 -327 -298 -236 -243 -189 -169 -161 -172 -193 -237 -210 -210 -286 -226 -136 -138 -133 -107 -76 -40 -71 -88 -84 -124 -161 -153 -104 -94
5521 -94 -33 -15 13 19 91 98 69 -3 30 -12 7 30 44 63 139 161 136 216 192 172 151 164 107 120 162 148 171 212 294 251 275
5552 275 310 256 231 208 188 156 181 149 266 271 282 312 303 272 268 241 197 138 156 146 181 183 194 187 228 235 232 175 138 134 91 36 39 46
5586 46 68 69 115 133 91 92 28 17 -55 -23 -76 -116 -65 -56 -39 -6 -51 -4 -44 -79 -130 -158 -193 -189 -185 -187 -157 -138 -83 -166 -86 -143 -162
5619 -162 -243 -243 -283 -256 -299 -256 -221 -214 -174 -120 -171 -155 -160 -181 -217 -243 -283 -195 -227 -154 -103 -142 -66 -68 -102 -107 -151 -139 -165 -196 -165 -188
5651 -188 -86 -63 6 6 4 -25 10 -41 -30 -59 -37 -13 37 61 50 129 136 130 93 118 117 99 101 105 69 120 140 199 253 235 255 222 219
5684 219 200 168 139 168 134 171 250 228 273 260 289 231 192 210 182 187 132 169 175 197 229 203 245 207 235 197 143 108 112 82 63
5715 63 73 100 125 175 114 151 75 60 9 -41 -26 -58 -7 -47 -36 49 -38 34 -22 -20 -81 -82 -138 -197 -169 -195 -130 -167 -140 -77 -116
5746 -116 -116 -126 -146 -206 -208 -215 -292 -246 -269 -172 -170 -158 -149 -144 -153 -219 -225 -267 -272 -255 -245 -219 -240 -149 -115 -135 -110 -169 -145 -185 -189 -212 -208 -187 -178 -59
5782 -59 -89 -79 -37 -72 -59 -78 -47 -91 -123 -66 -81 -8 1 43 99 100 102 78 48 69 24 48 45 71 138 110 177 142 170 177 133 120 173
5815 173 170 96 151 139 169 201 240 236 233 230 246 199 191 164 150 118 176 140 207 213 209 249 204 168 158 141 115 139 85 112 138 135 160 156
5849 156 177 156 87 102 45 14 8 -5 1 19 41 5 14 28 22 8 -66 -57 -160 -124 -91 -83 -84 -114 -46 -80 -45 -84 -99 -173 -164 -247 -274
5882 -274 -238 -187 -199 -144 -173 -110 -95 -202 -208 -160 -242 -241 -249 -294 -230 -204 -172 -170 -100 -141 -174 -121 -192 -191 -257 -239 -231 -147 -144 -140 -54 -25 -74
5915 -74 -79 -97 -95 -114 -131 -156 -142 -67 -34 -46 4 42 37 41 45 -11 17 43 -29 3 44 77 129 124 141 174 152 105 151 102 102 117 109 160
5949 160 184 198 216 253 227 158 224 135 158 116 115 120 164 205 224 230 243 304 245 192 222 145 114 89 117 81 130 187 178 210 142 148
5981 148 146 97 102 74 32 46 39 51 59 103 107 79 52 55 -62 -29 -31 -80 -53 -61 -68 -43 -3 -45 -27 -34 -35 -115 -130 -185 -216 -149 -183 -122 -153
6016 -153 -58 -97 -100 -157 -153 -190 -227 -245 -230 -199 -231 -180 -110 -154 -159 -116 -160 -176 -220 -214 -207 -206 -231 -177 -179 -109 -93 -81 -95 -114 -118 -127 -163 -149
6050 -149 -153 -124 -147 -72 -44 -1 -11 20 3 1 -16 -2 -61 -58 -43 1 25 94 84 78 129 115 71 43 77 49 32 70 91 136 167 203
6082 203 235 259 204 159 160 130 80 72 138 135 153 187 250 201 223 210 204 159 101 119 124 160 98 174 216 248 221 229 184 186 128 68 109
6115 109 66 31 45 70 84 164 154 161 61 38 50 11 -39 -18 -31 -74 -20 15 49 24 -31 -17 -41 -93 -121 -145 -149 -129 -139 -167
6145 -167 -107 -66 -85 -109 -71 -123 -179 -229 -192 -169 -190 -168 -175 -139 -134 -160 -98 -182 -172 -188 -175 -266 -242 -192 -173 -111 -193 -100 -94 -68 -150
6176 -150 -142 -161 -223 -198 -157 -165 -174 -82 -79 -34 -37 -16 -18 -65 -25 -83 -113 -80 -56 -31 -6 70 84 92 71 81 75 46 43 -34 -5 7 57 112
6210 112 108 169 164 157 160 131 143 105 145 102 120 131 163 224 260 219 240 216 142 162 114 112 98 151 184 139 178 235 234 216 185 155 132
6243 132 129 110 30 119 88 158 149 178 207 153 91 81 100 -34 -23 -10 5 2 62 51 88 58 50 14 -32 -43 -70 -87 -96 -70 -42 -78
6275 -78 -22 -62 -7 -41 -109 -97 -165 -147 -167 -136 -175 -149 -102 -123 -59 -108 -88 -134 -171 -204 -187 -221 -228 -182 -209 -120 -117 -107 -22 -106 -133
6306 -133 -169 -147 -165 -171 -201 -165 -150 -88 -45 -71 -46 -35 -90 -109 -117 -112 -129 -106 -69 -72 -17 37 34 55 64 11 27 23 -62 -15 13 24 54
6339 54 45 81 127 151 133 111 99 86 68 95 97 79 113 157 234 195 243 225 176 136 127 122 129 184 116 187 160 193 264 218 195 186 169
6372 169 139 126 99 56 77 111 128 184 190 195 166 121 105 38 22 33 2 29 44 47 94 96 122 31 26 15 -18 -97 -81 -37 -75 -16
6404 -16 -24 -15 3 -58 -1 -61 -70 -139 -143 -191 -180 -134 -116 -88 -71 -59 -99 -59 -131 -167 -170 -220 -207 -227 -169 -181 -134 -138 -108 -113 -149 -147 -148 -171 -157
6439 -157 -214 -212 -156 -164 -103 -117 -85 -55 -79 -77 -146 -128 -171 -121 -146 -71 -67 -61 -2 18 32 28 27 13 -59 -66 -73 -40 -26 32 79 47 65 125
6473 125 77 100 55 49 23 37 61 65 114 140 164 156 165 141 106 136 70 100 86 84 115 124 180 200 239 146 183 175 142 122 138 126 91
6506 91 95 100 162 166 172 153 142 171 104 46 99 37 -17 61 102 80 72 65 103 77 57 1 -12 -10 -27 -35 -19 17 26 42 -11 18 -52 -61 -76
6541 -76 -81 -137 -128 -131 -71 -146 -72 -86 -90 -9 -83 -138 -169 -169 -209 -168 -180 -151 -157 -128 -94 -105 -126 -168 -121 -138 -206 -233 -186 -232 -193 -108 -97
6574 -97 -95 -106 -82 -129 -138 -111 -156 -223 -155 -128 -128 -111 -92 -29 -18 -23 -21 1 -98 -34 -77 -97 -19 -73 -16 -8 80 98 17 72 27 14 -49
6607 -49 -16 -7 33 40 112 124 108 138 131 107 130 113 102 89 75 110 123 111 168 150 221 201 164 112 132 76 130 112 92 166 139 149
6639 149 193 152 159 196 153 61 65 134 50 53 112 95 134 96 175 139 87 32 50 -10 -60 -20 13 8 -6 11 58 42 57 -6 -56 -54
6671 -54 -73 -29 -101 -61 -62 -34 -69 -21 -20 -50 -22 -91 -105 -137 -160 -179 -133 -165 -122 -85 -99 -101 -88 -97 -175 -156 -157 -222 -168 -143 -146 -99 -127
6704 -127 -94 -55 -106 -75 -84 -158 -192 -180 -134 -115 -126 -79 -36 -36 16 -67 -76 -61 -119 -140 -72 -115 -45 -51 17 27 54 41 -21 40 8 -25
6736 -25 -14 -14 -11 6 26 33 123 86 165 104 65 56 68 83 31 52 100 83 128 137 168 145 177 155 171 136 91 106 67 111 116 156 137
6769 137 162 197 130 189 100 109 80 89 99 50 132 102 95 182 145 116 123 81 31 53 -9 -4 42 3 31 81 82 106 75 32 -10 -48 -69
6802 -69 -43 -72 -47 -28 -35 29 2 1 -56 -22 -70 -71 -127 -136 -82 -117 -108 -87 -68 -66 -83 -61 -93 -126 -161 -220 -196 -111 -146 -156 -73 -41 -120
6835 -120 -104 -78 -94 -106 -177 -184 -163 -162 -151 -116 -69 -81 -57 -47 -68 -75 -121 -131 -127 -95 -98 -80 -38 -55 -32 -23 -9 38 -13 -1 -65 -22 -58
6868 -58 -33 -36 0 47 58 80 30 103 108 76 29 -7 -5 -17 63 72 109 119 120 106 150 103 91 99 76 97 75 81 141 181 128 181 157 158
6902 158 127 115 94 47 60 21 78 106 116 152 126 182 122 120 89 74 55 66 4 33 87 49 113 123 84 53 96 -41 12 -74
6932 -74 -42 -25 -42 -22 3 17 43 35 -10 -17 -18 -90 -102 -130 -86 -80 -82 -35 -71 -32 -63 -75 -100 -93 -150 -176 -136 -125 -142 -128 -108 -55 -35
6965 -35 -67 -79 -139 -132 -147 -174 -170 -170 -141 -127 -77 -100 -78 -70 -96 -103 -99 -117 -148 -154 -179 -84 -61 -37 -39 32 16 -13 21 -40 -91 -7 -126 -64
6999 -64 -17 -20 24 41 62 66 81 -11 24 30 -13 4 14 56 51 85 107 97 177 114 97 114 74 106 69 42 74 112 147 187 148 168
7031 168 159 101 84 91 111 113 76 112 143 149 178 194 164 106 145 74 50 53 37 72 93 66 152 165 109 100 108 67 63 -2 -31 -13 17 -16
7065 -16 -2 95 30 64 51 38 -6 -40 -76 -125 -57 -63 -58 -31 -20 5 -31 -7 -19 -96 -96 -151 -138 -98 -132 -88 -91 -64 -88 -70 -87 -92 -104
7098 -104 -144 -133 -169 -192 -191 -90 -95 -118 -63 -49 -101 -79 -159 -70 -175 -132 -167 -156 -111 -98 -48 -53 -29 -62 -9 -68 -79 -80 -101 -101 -48
7129 -48 -50 -38 23 28 8 64 19 18 49 38 -34 -50 2 54 52 72 78 90 116 89 52 32 33 19 37 69 107 101 120 155 152 146 143 124 134
7164 134 72 73 64 65 72 154 107 148 147 113 145 132 84 70 58 54 57 83 138 107 163 78 147 98 87 61 -1 33 -27 -10 45 22 75
7197 75 72 101 9 53 10 -18 -84 -62 -28 -77 -22 -11 -15 0 -17 16 -58 -69 -73 -116 -114 -95 -104 -77 -51 -53 -38 -9 -90 -75 -75 -141 -197 -169
7231 -169 -139 -129 -147 -114 -72 -92 -106 -135 -86 -92 -167 -161 -182 -164 -168 -117 -120 -73 -73 -57 -16 -98 -90 -85 -152 -122 -109 -76 -63 -41 2 10 -11 22
7265 22 -9 -25 -30 -50 -97 -87 -8 11 -5 55 24 72 49 61 -13 61 12 7 -46 35 113 90 142 102 110 142 131 83 94 25 47 54
7297 54 87 68 152 152 172 139 116 104 68 60 61 34 38 102 84 123 153 93 189 125 88 50 10 -15 -14 31 22 47 46 127 130 88 58 64 56
7332 56 -62 -8 -46 -65 -1 -3 13 35 28 4 -29 -62 -61 -56 -76 -85 -66 -98 -56 -14 -49 -81 10 -31 -46 -98 -119 -129 -107 -128 -116 -81
7364 -81 -45 -25 -47 -35 -125 -76 -145 -147 -159 -181 -114 -124 -61 -107 -90 -57 -25 -40 -121 -74 -140 -111 -139 -178 -75 -85 -29 -7 13 -5
7394 -5 -40 -30 -78 -48 -109 -52 -13 -21 -5 -11 38 66 76 47 36 37 -2 -38 -30 15 20 33 112 118 132 78 70 72 76 55 13 70 69 74 136 104
7430 104 145 139 147 122 116 40 72 82 92 59 93 138 72 189 175 112 102 149 105 15 34 14 61 55 107 94 94 137 171 124 60 64
7462 64 4 7 -3 -10 -2 14 60 71 14 66 2 21 -61 -68 -49 -69 -77 -66 -56 -13 -8 -39 -4 -29 -23 -88 -111 -132 -126 -90 -92 -50 -40 -26 -13
7497 -13 -45 -89 -75 -128 -158 -123 -140 -125 -71 -93 -42 -69 -38 -47 -130 -59 -108 -106 -145 -154 -108 -71 -60 -14 -21 23 25 -10 -104 -19 -82 -82 -129
7530 -129 -77 -28 -5 6 1 33 -11 47 -26 -44 -22 -52 -24 26 12 59 64 91 129 117 72 -14 24 48 11 20 46 41 67 165 137 174
7562 174 124 97 39 69 65 40 68 78 70 95 130 181 135 163 114 122 72 15 19 21 65 68 102 114 103 91 120 75 64 14 -7 -11 8
7595 8 43 -18 39 67 38 52 60 25 0 -7 -32 -9 -60 -83 -59 27 44 -22 -20 -20 -42 -88 -115 -105 -84 -110 -90 -64 -64 -48 -31 13 -30
7628 -30 -77 -111 -120 -155 -92 -126 -109 -107 -51 -58 -55 -68 -28 -80 -97 -130 -126 -148 -132 -120 -105 -40 -21 -56 -38 -45 -88 -97 -101 -134 -56 -136 -94 -36
7662 -36 -13 -11 16 5 9 -4 -17 -96 -48 -78 -25 -32 5 -8 13 81 91 76 32 1 14 18 31 -32 29 84 52 143 65 130 117 124 50
7695 50 43 9 68 43 53 58 92 107 156 93 134 144 80 30 10 79 4 90 54 110 130 74 119 90 96 98 39 32 3 62 13 29 65
7728 65 77 74 87 70 15 9 -36 -24 19 -73 -17 21 -4 68 -20 50 -15 67 -48 -63 -30 -86 -71 -52 -54 -48 -19 -26 -31 20 -56 -54 -91
7761 -91 -125 -124 -173 -104 -105 -33 -37 -20 -51 -53 -51 -135 -78 -133 -139 -128 -96 -75 -59 -41 -9 -54 -48 -18 -69 -111 -100 -111 -82 -116 -31 -45 18 38
7795 38 6 3 -35 -7 -49 -59 -83 -16 -41 -51 12 39 53 41 29 19 12 -2 -29 7 4 32 42 40 87 139 128 60 79 46 19 45
7827 45 30 49 30 112 70 135 124 141 109 96 59 67 82 23 53 78 68 146 125 139 129 117 84 40 56 -15 64 9 48 74 122
7858 122 134 55 98 72 39 26 -11 -6 -7 44 -42 51 43 60 58 61 -27 13 -49 -42 -33 -145 -27 -18 -39 -36 9 -9 20 -11 -58 -100 -72
7891 -72 -120 -98 -129 -67 -17 -61 -49 -28 -50 -44 -81 -80 -101 -120 -113 -101 -101 -54 -65 -26 -84 -23 -102 -99 -63 -80 -95 -104 -128 -101 -58 -40 -6
7924 -6 -19 31 -33 -95 -45 -70 -111 -72 -50 -17 -58 25 47 34 67 26 30 -38 -9 -36 -17 17 25 69 4 42 108 74 49 30 -1 -14
7956 -14 13 1 70 54 66 86 56 100 123 56 81 79 42 38 40 58 79 81 103 82 123 120 126 86 18 38 -3 51 21 46 83 56 91
7989 91 107 86 50 51 -6 29 10 -23 43 25 113 28 63 84 106 37 16 -41 -76 -7 -57 -33 3 -17 18 -2 4 0 -27 -77 -49 -67
8021 -67 -110 -88 -78 -51 -54 -26 -83 -48 -42 -55 -91 -65 -111 -127 -128 -86 -77 -61 -55 -28 -26 4 -139 -121 -72 -123 -116 -109 -104 -59 -55 -27 -79 0 -37
8056 -37 -31 -77 -75 -53 -140 -100 -41 -43 -42 44 22 39 44 5 -69 -11 -45 -26 -19 -18 26 35 32 66 106 32 63 25 57 17 -24 -43 21 51 45
8091 45 115 76 171 58 70 11 73 52 13 68 18 53 58 153 160 98 113 87 121 91 39 41 -18 87 104 97 106 138 137 104 96 10 35
8124 35 23 52 8 54 71 26 46 9 24 80 62 22 -3 -29 -8 -9 5 -29 29 43 60 -9 -6 38 -60 -51 -77 -106 -91 -25 -23 -35
8156 -35 -18 -5 3 -27 15 -95 -119 -114 -86 -98 -47 -24 -30 -22 -68 -58 -8 -54 -111 -84 -101 -98 -81 -60 -69 -61 -22 1 -30 -43 -43 -17 -79 -99
8190 -99 -128 -69 -61 -48 4 -7 17 36 -3 14 -45 -51 -53 -60 -48 -32 -11 17 71 45 35 -8 -13 23 -13 -23 -23 1 22 57 70 83 97
8223 97 62 65 86 45 12 41 31 32 40 68 94 120 100 128 84 102 80 32 41 44 54 27 84 75 118 96 107 104 75 84 87 10 40 2 63
8258 63 78 63 74 62 54 63 54 19 -4 -41 -23 47 -13 7 53 40 60 23 75 -2 6 -60 -75 -45 -47 -25 -29 -7 20 25 25 4 -40 -66
8292 -66 -96 -123 -90 -58 -34 -39 -59 -32 11 14 -27 -83 -43 -104 -112 -87 -134 -94 -40 -33 -39 -61 -12 -32 -37 -51 -107 -73 -89 -100 -26 -94 -81
8325 -81 -49 -2 -2 -31 -46 -71 -70 -82 -106 -43 -28 -14 20 8 10 30 -34 6 -46 -39 -53 -75 -32 -3 40 42 98 51 96 80 47 -8 -8
8358 -8 9 40 19 69 82 93 136 92 83 66 38 -8 20 -3 -33 35 36 64 95 143 76 149 68 92 58 -25 12 1 77 31 86 77
8390 77 146 81 79 29 10 15 8 -35 48 -11 20 19 30 62 53 99 -14 35 -10 -10 -34 -56 -4 -43 31 28 53 35 7 -31 -21 -84 -46
8423 -46 -69 -77 -53 -32 -75 -32 -26 -23 -5 -36 -67 -111 -88 -81 -62 -98 -95 -30 -48 -37 -7 -63 -42 -60 -127 -112 -75 -123 -67 -53 -82 -43 3
8456 3 -3 -33 -39 -94 -71 -108 -42 -99 -30 -34 20 23 -8 50 -31 -25 -76 -76 -62 -57 -35 -78 -20 15 29 59 25 90 21 37 -1 -49 -20 -15 4
8491 4 2 43 66 69 83 45 76 61 68 56 6 26 25 74 70 77 83 98 115 72 50 10 26 11 24 26 31 47 81 134 100 100 61 44 12 38
8527 38 -1 22 -13 45 44 48 60 116 61 5 -19 -16 -12 -43 -22 -9 40 45 12 -14 -13 7 25 -46 -61 -85 -64 -66 -87 -47 -34 21 -32 -24
8561 -24 -4 10 -12 -77 -68 -87 -87 -56 -59 -15 8 -41 -28 -37 -12 -88 -56 -131 -97 -122 -80 -64 -23 -21 40 -20 -2 -19 -66 -72 -65 -66 -109 -63
8595 -63 9 -29 -4 -12 19 8 2 -60 -69 -98 -9 -98 -76 -10 33 66 10 31 46 15 16 4 -81 -41 26 -13 43 45 90 110 96 83 63
8628 63 27 -16 9 -14 17 35 73 52 135 102 118 65 72 30 36 41 2 43 67 94 54 94 128 96 70 100 31 24 -6 16 60 108
8660 108 61 76 75 73 86 65 64 -14 25 -34 -19 0 14 30 24 69 50 37 28 -26 -29 -55 -77 -80 -49 -59 -64 16 -12 14 -19 2 6 -62
8694 -62 -85 -87 -102 -97 -41 22 -19 6 -17 -9 -65 -63 -57 -125 -73 -105 -130 -88 -16 -42 -31 43 -73 -56 -63 -93 -48 -98 -86 -100 -82 -5 -7
8727 -7 -42 -5 3 -32 -41 -72 -53 -52 -91 1 -24 -23 -25 10 25 -1 14 48 -21 18 -29 -33 3 1 61 31 84 80 96 50 45 46 1 13 -11 23
8763 23 26 54 49 81 100 74 72 32 13 48 37 30 52 79 67 92 64 109 94 0 74 15 12 53 68 32 48 67 67 84 76 81 51 49 -22
8798 -22 -33 -27 3 -22 22 54 20 65 31 59 48 -66 -31 -77 -48 -34 -51 34 17 7 15 20 -21 -47 19 -83 -36 -95 -105 -84 -69
8829 -69 -18 -17 12 32 -15 -43 -45 -70 -103 -81 -51 -69 -52 -7 -24 -6 -8 10 -32 -70 -84 -121 -82 -63 -82 26 -14 8 0 -24 -39 -30
8861 -30 -73 -62 -51 -106 -33 -26 -9 13 39 10 5 -4 7 -12 -12 -99 -87 -48 -2 3 45 35 51 61 50 29 8 -4 -33 21 -7 42 55
8894 55 48 57 79 113 67 74 51 -5 10 2 16 27 39 70 98 104 83 75 106 52 1 -2 4 -17 -5 0 85 75 111 84 116 52 28 26 11
8929 11 34 16 62 78 39 61 57 82 95 32 39 0 -32 -19 -14 -40 58 61 6 76 30 50 44 -7 -51 -68 -81 -44 -56 13 6 -26 29
8962 29 41 -36 5 -44 -72 -109 -104 -65 -89 -1 -14 30 11 -30 24 -38 -40 -72 -137 -48 -79 -88 -31 -50 -16 12 27 -42 -2 -81 -79 -76 -111
8995 -111 -79 -44 -58 -39 6 2 -6 8 -3 -62 -17 -53 -69 -47 -11 -15 20 40 58 68 25 44 7 1 -43 -23 -7 26 71 23 54 33
9027 33 75 35 72 87 -3 -14 12 -9 27 58 117 75 84 107 63 58 3 30 -6 -3 13 60 55 60 88 104 120 72 49 47 41 12 -16 52
9061 52 18 9 9 97 69 87 0 58 7 8 1 -68 13 56 45 2 50 41 27 42 -11 5 -73 -43 -23 -50 7 4 17 -37 69 32 -16
9094 -16 2 -53 -58 -133 -1 -104 -62 -33 -29 -1 12 27 -52 -67 -17 -100 -76 -86 -105 -78 -53 -33 -35 -9 -53 -29 -71 -93 -108 -107 -88
9125 -88 -125 -60 -35 -12 36 -3 0 -15 -27 -35 -31 -54 -66 -47 -42 19 25 30 22 1 -1 -3 -47 -42 -43 -23 -31 -14 11 18 75 40 78 -2 27 1 24
9162 24 26 -35 -16 20 63 44 66 68 80 47 32 12 57 -28 25 22 49 40 42 37 51 139 55 27 -1 9 -2 -5 1 -1 91 91 78 47 75
9197 75 54 48 19 4 -16 -19 -18 -20 34 68 69 62 51 52 10 -17 -65 -52 -23 -52 -26 15 55 40 -3 8 -22 -24 -34 -40 -38 -67 -68 -74 -18 29
9233 29 -27 -28 -11 -29 -42 -105 -38 -80 -70 -85 -25 -77 -18 4 2 -28 -56 -46 -78 -110 -77 -68 -61 4 -25 -8 -5 -3 -55 -16 -34 -61 -77
9266 -77 -68 -104 -38 -9 23 -5 36 -35 -24 -52 -32 -21 -66 -16 -22 -65 -28 27 29 29 42 32 36 9 -43 -11 2 12 13 14 32 85 54 10
9300 10 89 45 54 2 22 26 21 37 56 37 84 82 116 96 79 44 18 21 35 20 9 69 37 62 101 115 60 103 66 6 9 26 -9
9333 -9 3 58 62 60 86 62 42 28 1 21 -22 -11 5 5 29 57 47 36 3 -2 31 -13 -31 -33 -11 -35 -30 -39 -1 34 3 14 -11 -19 -32
9368 -32 -61 -25 -78 -37 -39 -28 -25 5 -29 -1 29 -24 -71 -110 -68 -78 -67 -54 -85 33 -61 -35 31 -31 -20 -5 -53 -80 -26 -40 -75
9399 -75 -52 22 89 38 37 12 -25 8 -57 -33 -8 30 -39 -4 -9 32 26 26 69 -11 7 -26 -26 -14 -44 -10 44 48 78 37 81 92 53
9432 53 36 10 39 16 -10 -3 29 63 62 94 72 92 72 2 45 29 35 55 50 30 58 115 63 92 88 38 66 14 40 -29 18 31 105
9465 105 63 19 65 22 103 5 14 -23 -65 12 14 -19 -10 31 11 23 90 23 35 -2 -23 -11 -53 -62 -20 4 29 20 35 9 5 9 -62
9498 -62 -68 -78 -89 -70 -50 4 -3 -2 5 -25 -47 -53 -48 -47 -63 -96 -69 -68 -43 -49 15 -2 -15 -15 -14 -54 -24 -56 -93 -49 10 -22 2 5 -12 10
9534 10 -49 13 -37 -53 -39 -76 -36 -27 -34 7 25 55 15 -4 16 -44 -46 -23 -41 -49 34 -7 57 52 62 110 45 47 -29 -18 17 -36 6
9567 6 16 26 22 58 86 50 38 33 1 35 -3 19 12 0 36 73 86 74 81 49 24 -1 36 31 39 36 53 67 70 100 64 77 53 69 2
9602 2 16 7 -16 10 19 39 54 45 35 99 -12 38 -3 6 -30 8 -39 -3 -17 13 0 27 0 0 -30 -51 -55 -47 -55 -65 7 12 30 44 -1
9637 -1 -5 -46 -33 -15 -60 -105 -108 -108 -51 -55 -35 -3 -33 32 -29 -57 -38 -67 -112 -94 -81 -38 -17 41 19 6 26 -21 -44 -52 -57 -67 -73 -52
9671 -52 -20 31 16 -17 14 -12 -8 11 -33 -41 -1 -1 -3 6 26 -4 99 55 40 30 10 -32 -17 -11 -27 45 66 74 23 85 73 91 41
9704 41 19 38 21 25 -8 13 40 63 97 59 84 56 40 32 19 5 -2 47 27 66 106 104 59 53 87 35 -1 2 -9 -11 6 26 4 52
9738 52 71 42 40 33 57 -14 13 11 5 17 -27 8 50 51 48 55 -2 6 -23 -57 3 -72 4 -21 -25 -23 -10 30 1 0 -64 -21 -60 -86 -42 -128
9774 -128 -69 8 -37 -14 -29 -17 -9 -2 -25 -64 -74 -98 -34 -21 -69 -24 -18 -6 -40 -29 -8 -43 -77 -10 -69 -64 -37 -72 -15 6 12 -21
9806 -21 18 -25 -19 -22 -28 -48 -50 -45 -28 0 34 49 33 -20 -5 -28 11 -33 3 -20 -22 31 -23 61 115 24 52 79 25 37 -3 -28 -21 34
9840 34 8 49 109 72 61 50 44 38 8 12 16 32 70 36 63 20 48 95 2 48 -3 40 -12 -45 -6 25 31 13 37 73 45 44 10
9873 10 37 -59 -33 -2 -6 -29 21 19 42 59 33 3 7 -32 -24 -77 -61 -4 -20 15 3 44 33 29 -7 -9 -51 -66 -59 -76 -82 -8 -34 -44
9907 -44 15 10 34 -41 -33 -57 -78 -87 -77 -50 -78 -26 -40 31 -33 -1 -22 -82 -46 -58 -80 -98 -68 -37 -38 57 -16 -11 -20 -24 -32 -41 -28 -88 -93
9942 -93 -4 12 15 37 34 39 37 20 18 -40 -14 -3 -10 -13 21 -33 55 45 87 66 32 23 -26 -7 -8 -50 5 36 57 40 69 53 31 6 21
9977 21 -13 -15 0 -52 22 10 44 53 66 85 56 36 66 -4 -30 -32 16 31 48 22 66 72 16 59 47 50 17 -1 -8 -43 -35 -17 57 77
10011 77 37 115 25 52 29 1 -4 -24 8 -115 1 -19 37 40 -9 36 18 -2 -44 -28 -33 -48 -55 -27 -17 7 11 -31 11 -44 -38 -15
10043 -15 -70 -95 -44 -29 -34 -26 -14 -22 25 -14 -23 -54 -98 -84 -48 -58 -25 -11 -18 11 49 27 21 5 -45 -25 -102 -6 -40 -56 9 13 0
10076 0 39 6 54 37 5 -34 -12 8 -27 -1 -10 61 59 -3 42 20 60 -4 -24 -9 -5 31 -14 76 30 37 32 28 20 44 16 -1 11 5
10110 5 -4 15 24 80 63 79 37 95 87 53 19 -23 7 -9 10 49 26 109 63 95 55 55 25 28 -15 23 -29 57 61 50 63 69 81 52
10144 52 18 -21 -13 -10 -11 5 -35 11 8 25 56 12 68 10 -26 -9 -52 -35 -34 -9 -41 49 40 19 5 -22 29 -54 6 -56 -51 -128 -60
10177 -60 -16 -6 60 17 -10 32 -63 -45 -34 -88 -107 -66 -96 -37 34 -19 12 -1 1 -44 -51 -47 -82 -89 -62 -18 -35 -44 53 7 18 -3
10209 -3 -5 -16 -12 -29 -61 8 -42 51 20 13 27 -10 24 -15 -26 -50 -14 -33 -20 9 68 -34 53 89 68 61 -14 18 -5 -17 8 -14
10241 -14 0 -4 5 51 61 36 33 -5 -3 22 -42 -32 -5 5 78 49 54 49 39 -9 49 34 -21 3 -10 21 12 30 -2 85 41 4 72
10274 72 12 -3 -11 -22 -24 11 3 23 48 46 19 29 27 0 -39 -15 8 -37 -54 -6 -2 5 40 25 69 14 4 -50 -47 -21 -94 -68 -31 -22
10308 -22 -15 40 -28 4 8 -30 -44 -81 -73 -46 -55 -49 -32 10 4 6 20 -25 -16 -65 -41 -59 -25 -37 10 -11 -27 46 21 1 -35 13 -46 -56
10342 -56 -48 -32 -77 -20 26 21 19 41 50 23 13 -16 -36 -34 -29 -56 19 34 45 -10 64 70 29 -42 15 28 -57 6 -41 5 42 56 92
10375 92 80 68 52 6 2 -17 43 -56 40 31 42 74 15 60 2 66 6 19 1 -14 -11 26 69 24 104 38 59 61 52 48 -37 -34 8
10408 8 -8 1 -1 39 18 75 25 25 57 -9 -3 -79 -54 -47 -22 -47 29 -3 14 37 29 21 9 11 -6 -50 -24 -32 -22 16 21 -33 22 3 3 11
10444 11 -78 -36 -72 8 -36 -40 -35 25 5 18 59 -40 -25 -61 -87 -61 -44 -81 -17 0 -17 7 -3 -11 24 16 -18 -72 -64 -10 -73 22
10476 22 -31 59 31 5 43 -20 -7 -30 -29 -79 -43 -22 -14 44 4 28 62 25 10 27 -31 -50 -13 -67 23 -12 61 30 102 54 50
10507 50 62 21 -6 -9 -29 9 45 8 35 51 85 73 53 51 56 11 -1 -20 66 -12 94 65 88 55 62 18 26 14 -13 21 15 0
10539 0 -3 0 51 37 46 54 42 -25 -9 24 -14 -36 -64 -16 28 -26 13 20 47 27 14 -28 -3 -51 -44 -36 -65 -39 40 83 28 2 0 18
10573 18 -38 -43 -50 -30 -67 -35 -77 36 28 -18 28 17 4 -10 -27 -19 -76 -79 -64 -1 -28 -16 -18 45 -10 -51 -42 -45 -52 -48 -38 -5 32 37 16
10608 16 24 29 38 -21 -49 -11 -25 -65 -68 0 0 10 36 67 34 54 20 -25 -69 8 5 -23 -13 -37 28 75 79 83 49 -18 -4 24 -24 -13
10642 -13 -20 10 49 61 82 77 53 56 20 5 -68 17 -46 -21 51 -5 -16 32 116 40 13 56 22 7 -16 7 -5 -12 16 55 27 47
10674 47 77 32 -27 19 1 -11 -24 -7 -27 -11 -1 21 47 17 52 1 -26 -51 -59 -9 -52 -18 -21 32 -19 15 37 -5 -38 -9 -33
10705 -33 -69 -37 -71 -29 -56 21 19 54 19 -23 -14 -10 0 -42 -39 -30 -20 -7 -31 45 52 38 31 -42 -61 -57 -80 -70 -50 -22 -42 -5 12 32
10739 32 42 29 -24 -33 -11 -68 -65 -58 -55 6 5 12 95 1 9 65 -6 -9 6 -6 -3 8 103 39 58 91 56 32 58 5 -25 -34 9 2 48
10774 48 30 63 39 44 48 32 62 42 29 11 -16 11 8 26 46 36 76 36 26 48 26 5 8 0 -34 12 25 45 36 98 46 17 31
10807 31 21 -25 -26 -2 -2 50 49 35 37 42 43 54 41 -14 -14 6 -33 -52 -29 -25 20 18 21 82 -33 43 -31 -26 -49 -33 -54 18 31 -22 27
10842 27 26 65 -6 -33 -28 -43 -15 -58 -10 -36 -9 1 14 22 2 2 -51 -37 -37 -69 -63 -11 2 13 22 4 25 17 17 -29 2 -46 -100 -32
10876 -32 -40 -31 34 49 16 6 36 10 11 -10 -17 -39 -13 -5 -14 20 40 61 11 58 -24 8 -15 -10 -17 -39 18 9 25 86 29 47 76 32
10910 32 26 16 21 -8 -15 7 68 43 64 61 33 125 54 -27 -26 40 -8 51 36 -4 54 16 11 49 56 46 24 9 -36 -10 -33 -4 -1 23
10944 23 10 46 54 29 4 38 -5 -34 -18 56 -30 -28 67 -12 51 13 25 11 -38 -7 -40 -9 -45 -11 -4 -27 23 7 -10 -17 -26 -34 -7
10977 -7 -54 -75 -52 -19 -55 -36 19 -2 16 -28 -3 -15 -28 -41 -91 -19 -50 13 17 -17 -3 30 3 9 -41 -38 -29 -67 -83 24 -10 8
11009 8 -19 37 20 -31 17 -57 -47 -56 -48 12 -6 57 9 -27 35 22 -17 -40 -50 2 -45 -64 -29 2 10 -6 11 97 25 48 45 37 7
11042 7 -2 12 -17 -18 7 -6 5 45 9 20 67 7 25 -24 -37 49 5 30 39 44 96 48 21 8 -34 -24 -30 -25 -4 -32 34 -4 55
11075 55 8 32 14 12 38 24 -37 -35 29 -49 -26 81 38 22 5 27 14 -61 -40 -31 13 -11 -28 -36 33 72 18 -1 -16 14 -51
11106 -51 -25 -75 -25 -17 -23 -76 8 28 29 4 27 -27 -39 -93 -65 -43 -60 -20 -34 14 6 11 -4 -33 4 -29 -52 -60 -42 -34 -22 -1 -16
11139 -16 -4 -7 -14 6 -53 -7 -35 -14 -39 -49 -45 -32 25 30 38 31 9 -45 41 -31 -4 -55 -3 -7 18 16 32 43 34 15 -1 16 3 -32
11173 -32 -14 -53 34 9 14 40 28 57 -5 19 -30 -16 -11 -15 47 -57 64 20 96 38 53 37 19 49 -15 -29 16 -8 1 32 64
11204 64 28 54 17 16 42 -36 -9 -2 33 -31 52 -1 62 60 2 76 19 30 11 -45 -44 -16 -3 -36 30 17 19 31 70 0 -21 -43
11236 -43 -46 -45 -1 -55 -15 6 -14 24 42 47 33 -61 3 -57 -59 -4 -51 -69 -16 -23 7 20 26 26 -41 -32 -29 -76 -80 -27 -34 -56 26 28 -11 17
11272 17 -6 -11 -47 -94 3 -80 -8 -5 73 13 42 35 38 26 -44 -23 -29 -67 -58 5 26 17 57 56 26 54 15 -21 14 13 -41 -52 -3 -57
11306 -57 29 72 25 53 10 61 23 8 -29 -6 -14 -32 30 44 43 47 105 -23 -16 28 7 19 -21 -3 13 13 19 42 39 28 35 34 8 -8
11340 -8 -25 -20 -22 44 21 48 51 53 -1 23 7 13 -32 -48 17 -10 -1 40 45 21 30 29 -2 8 -28 -30 -3 -73 -14 0 -1 7 37 14 -23 5
11376 5 -32 -27 -39 -81 -82 -54 -58 -21 21 -23 3 -17 23 -54 -4 -10 -41 -15 -71 -44 -30 -54 12 15 29 -27 0 -15 -29 -16 -22 -31 -23 40
11410 40 -37 -23 -6 21 34 -2 -46 -20 3 -51 -30 -19 -16 61 6 -5 47 19 2 50 -3 3 -24 -66 25 13 15 9 9 -12 20 25 23
11443 23 -4 -4 18 14 15 39 28 71 21 99 27 11 18 35 35 -14 7 0 -9 15 -2 66 37 33 11 32 4 -15 -10 -38 25 -3 55 29
11477 29 18 33 47 17 -27 3 -21 -2 -22 -5 8 38 46 6 46 34 -37 -15 -7 -15 -63 -31 16 -20 -28 44 19 -16 24 -14 -8 -37
11509 -37 -39 -37 -69 -113 -36 19 14 8 23 -8 -4 -26 -13 -59 -23 -24 13 -50 -42 -19 5 8 12 30 -51 -28 -34 11 11 -17 -7 -15 58 -9 6 -3
11545 -3 0 20 -51 -85 9 -42 -24 -9 -29 18 74 -34 4 33 -31 -10 -57 -8 -44 -20 5 1 12 36 31 28 0 21 -4 -11 -16 -33 8
11578 8 26 25 74 69 14 30 20 -14 -7 10 3 -12 13 -3 35 65 45 65 27 12 12 -59 67 -9 35 68 -14 49 14 -4 24 51
11610 51 23 -16 -38 -26 25 7 14 31 15 38 22 14 41 11 -8 -21 14 19 11 32 11 54 43 18 82 24 -32 8 -29 -28 6 -10
11642 -10 -30 13 -21 -16 -2 11 -39 6 0 -44 -41 -61 -41 -34 16 -6 26 -29 28 27 -3 -19 -26 -35 -61 -42 -21 29 -16 47 5 6 17 22
11676 22 -16 -58 -32 -35 -49 -22 14 24 55 20 29 32 44 8 -18 -61 -16 19 2 4 53 42 60 68 5 1 11 27 -10 -18 10 18 -13 72
11710 72 58 63 -9 32 0 2 6 -41 2 -22 4 2 5 47 11 27 -9 -15 -9 11 -1 19 25 -43 46 13 57 48 56 -7 3 -10 -27 -12 6
11745 6 6 63 66 54 -5 66 67 12 -18 -25 -7 -33 -26 -19 7 51 25 16 0 20 -33 -9 -13 -53 4 22 -32 -28 -26 0 15 23 -7 -18 -45 15
11781 15 -5 -56 -36 -14 17 -57 -10 12 -13 -24 8 -31 -69 -50 -34 -75 -21 4 -75 42 -10 13 -6 -52 -3 -57 -50 -76 -33 -30
11811 -30 -26 0 13 3 -12 14 -32 -17 -19 -54 -38 -25 15 -21 30 20 -13 26 -12 21 -24 -17 18 -63 -62 -19 26 28 -5 -12 -19 -10 38 25
11845 25 23 -28 0 -20 -25 6 24 -5 53 25 -2 26 -60 -31 -20 -39 -4 6 29 34 40 54 35 25 37 -5 16 -28 -20 -6 32 10
11877 10 14 76 24 53 41 10 18 22 4 -1 -20 -39 33 22 37 29 2 62 -11 30 -19 -29 14 -9 -14 -33 25 8 24 30 12 42 -44
11910 -44 8 -23 -35 4 -29 -39 1 33 13 28 21 8 -2 -53 -39 -68 -17 3 12 -7 -3 44 -14 28 -22 -31 -33 -45 -8 35 12 32
11942 32 0 31 -10 34 -22 -1 -1 7 -9 -40 -53 -32 -39 12 19 21 31 20 -29 -28 14 -29 -33 -3 26 38 48 33 27 36 34 27 15 -1 -30
11977 -30 -21 11 -15 3 80 19 -9 26 32 25 -44 -15 -21 10 27 -10 -4 37 47 43 0 27 15 27 -4 -13 26 -6 7 65 25 7 34
12010 34 33 38 0 -22 -29 -7 -8 42 33 -17 25 60 37 42 7 21 -17 2 -21 -19 22 28 41 11 30 50 26 23 -26 -17 -20 -12 -13 1 -11 20
12046 20 33 39 32 12 20 15 -34 -27 -76 -19 -40 -40 9 30 34 30 -13 -29 -14 12 -53 -35 -50 25 10 -16 26 0 -40 37 20 12 -12 -25
12080 -25 -61 -41 12 -33 11 25 67 20 58 26 2 5 -16 -76 -21 -27 3 7 29 28 12 4 15 23 -22 -47 -24 6 -7 38 7 53 52
12113 52 17 27 38 -34 10 -13 -62 -20 17 -6 62 22 50 39 -7 48 11 -10 13 -25 -34 -9 18 57 54 33 70 2 -30 52 18
12144 18 -6 4 -9 71 -23 0 28 19 36 -33 22 -19 -52 -2 -39 24 -27 -10 24 19 38 33 19 -4 -6 -2 -28 -16 -3 -4 21 -41 -15
12177 -15 23 67 30 -30 -11 -32 -54 -38 -31 1 14 -9 47 20 -7 4 -36 -8 -15 -14 -23 -7 -12 10 -33 -26 3 -13 8 -18 -50 4 -51
12210 -51 -26 -50 -48 12 -12 -31 -15 21 -13 16 -13 -24 -15 -53 18 -12 -36 -15 16 22 -16 -4 22 -32 -34 -46 -50 26 -14 4 0 50 14
12243 14 49 71 1 12 -2 -53 -30 -20 -22 33 60 78 18 98 18 32 -12 29 2 -11 7 2 0 18 24 38 45 24 -23 5 0 -4 7
12276 7 9 -4 20 58 7 40 51 61 -25 20 -49 -17 -33 2 -27 22 23 4 2 23 24 -7 -18 -21 -28 -12 -25 -16 -11 29 70 51 36 30 40
12311 40 12 -14 -72 -36 -3 8 3 -24 35 24 -6 5 -21 -10 -29 -10 -4 -34 -58 51 3 40 -3 -10 -9 -26 7 -78 -32 -15 -16 10
12343 10 50 -17 -14 29 16 6 -10 0 -11 -16 -14 7 -15 -3 24 15 28 27 -7 -12 12 -29 -17 -35 -54 7 34 10 -7 -4 21 65 -13
12376 -13 -49 9 -46 -48 34 12 41 53 22 47 1 32 -22 36 -25 -39 -28 -41 28 35 13 14 47 24 14 -4 -28 17 -19 -27 -21 17
12408 17 40 10 55 15 83 3 20 -23 1 28 33 28 8 55 -1 28 15 -7 0 26 -37 -22 -24 -14 -23 -27 19 57 19 12 22 15 25 -16
12442 -16 -24 -13 -9 -14 -21 -11 55 24 14 24 -56 -24 -62 -23 -47 -6 2 -30 31 -55 25 -6 8 23 -7 -37 -54 -46 -64 21 -25 24 54
12475 54 7 5 -5 -3 -41 -34 10 -99 -16 -22 50 -11 30 21 30 13 20 17 -53 -29 -5 -36 -29 30 -11 21 -20 13 45 18 -14 -38 -14 -74
12509 -74 -46 -17 -19 -24 63 45 64 48 32 -22 17 -55 15 -39 -22 -12 18 35 39 -2 -6 1 38 6 -6 -47 -44 -6 -37 79 16 8 27
12542 27 56 20 7 23 -18 -10 -23 20 -10 2 36 -26 22 16 21 -5 5 -86 -5 -34 -62 0 13 -23 16 11 -1 9 -24 -26 -14 -63
12574 -63 -57 -28 19 -30 6 20 -6 12 -4 -3 -27 -5 -45 -13 -19 33 -59 52 -4 13 18 -14 -22 -5 -56 5 -28 -16 -58 -42 -12 -30
12606 -30 24 -50 -24 19 -33 -27 -40 -27 -12 0 23 27 42 1 41 4 -22 0 0 -28 -26 -7 -25 -4 -4 -5 -18 16 -5 -46 -69 -49 -47
12639 -47 -17 15 -17 9 24 16 48 38 67 12 -2 3 -35 2 15 30 -14 15 23 37 25 16 -21 14 -10 17 30 -9 27 27 6 25
12671 25 20 47 25 19 14 -60 29 -41 24 5 29 82 55 31 -4 14 -23 0 -2 8 -5 10 53 30 63 2 35 12 -8 51 -26 -43
12703 -43 -33 21 22 19 74 31 12 20 41 7 -3 -19 6 -25 -31 -9 -20 47 27 -5 80 -16 14 -8 10 -24 14 -24 -24 10 40 55
12735 55 34 52 74 23 -18 -42 -56 -15 -17 -11 17 6 -16 76 4 52 27 -13 9 -13 -23 -30 0 1 8 15 16 50 1 -3 -30 -30 24 -12
12769 -12 -8 47 28 3 32 19 15 -2 33 37 -2 -19 15 46 16 68 50 33 40 17 57 27 -1 -17 -3 25 -17 23 33 53 22 -8
12801 -8 23 2 16 -3 -35 -53 -6 14 5 54 31 48 68 70 36 13 6 -30 -40 -23 -21 -51 -9 16 32 47 34 -16 -10 -12 -10 -61 -16 -51
12835 -51 6 15 -2 35 25 20 -13 -28 -30 27 -20 -31 -28 -14 -5 20 3 7 27 5 -18 -36 -50 -48 -63 -47 -41 -8 -10 20 56 43 20 -21
12869 -21 -36 -58 -23 -17 -19 -30 13 5 19 29 19 21 -30 3 -16 -79 -30 -42 -39 -3 -50 -21 30 -35 31 3 3 -34 -22 -28 -15 -37 18
12902 18 -21 68 76 19 52 -34 -3 -7 -34 -19 19 48 32 20 14 -29 -10 -11 35 37 5 -11 -41 -22 -29 -19 30 25 32 7 45 5 54 -4
12936 -4 -35 13 33 31 17 24 47 -3 -12 19 2 17 -34 -41 -25 9 -9 57 22 24 31 38 5 6 11 -45 -31 -10 40 9 40 -25 47 7 63
12971 63 1 6 -31 -51 -38 -48 -9 -3 -14 -30 -2 -22 -19 11 -26 6 -25 -59 -66 -28 1 2 31 -22 -32 0 -3 1 -22 0 -42 -6 -25
13004 -25 -73 -5 -27 34 16 14 -6 -46 2 -35 -32 -18 -67 49 3 16 3 13 3 8 -5 -38 -41 -57 -2 -25 40 33 -61 41 31
13035 31 32 13 -8 -29 -31 -10 -37 -5 -19 4 41 -10 -38 24 2 7 -51 -6 -56 2 -23 7 16 16 7 22 28 -9 -7 -43 -37 24 -13 -36
13069 -36 13 -1 14 23 30 33 3 -17 -15 -17 -25 -26 36 -6 35 46 -38 -31 56 9 -6 2 18 -7 -18 19 -16 27 -23 53 28 28 -4 -1 47
13104 47 -8 -10 -2 -16 0 -6 26 26 -5 43 18 0 28 -25 -6 13 -2 36 53 3 80 0 57 -12 -12 -20 -60 5 -3 -10 3 13 -19 12
13138 12 20 14 -40 0 9 -21 -36 -30 -42 1 19 -10 1 57 -50 -17 19 -15 -19 -28 31 -24 21 7 43 16 6 43 -31 21 -66 -18
13170 -18 -14 -4 40 -21 44 9 -5 15 18 45 -20 0 -19 3 -68 -23 11 -25 43 2 46 45 17 38 -1 -16 2 -35 -11 22 -15
13201 -15 36 62 59 38 -11 0 -10 -14 23 -12 -13 15 9 66 31 38 47 9 34 -6 -1 -49 3 -2 49 4 24 31 -45 56 -8 -7 77 -23
13235 -23 -27 -29 5 51 -1 17 -10 18 6 0 -23 -10 19 -47 -21 -48 52 -2 -7 3 -15 47 -18 -19 -21 -34 -77 -21 -45 -15 19 23 24
13268 24 26 -20 13 -42 -20 -29 -5 -51 0 13 -1 2 24 41 39 3 -47 -46 -13 -58 -40 -24 -25 19 29 60 14 -5 -40 -9 -19 -47 -13
13301 -13 -64 -38 23 37 22 34 25 32 2 -48 -14 -30 -27 -7 28 -5 15 47 16 5 31 3 11 -32 -22 -46 -4 16 8 28 44 36 4
13334 4 36 -22 -17 -44 -12 2 -8 4 4 39 36 62 26 -13 34 -12 -19 -53 20 11 16 30 7 -6 -2 -4 -26 10 -43 1 5 -10 1 16 24
13369 24 21 26 64 27 4 -24 -5 -10 -45 1 30 -12 7 10 5 38 38 -27 26 -24 -46 -9 -17 -12 4 5 -9 -10 1 20 8 -24 45 -14 -18
13404 -18 -12 17 13 28 53 30 63 -33 -3 -20 12 -41 -22 -36 30 8 16 -2 9 20 -19 50 -16 -35 -46 -46 -5 8 -13 31 6 38
13436 38 3 20 7 38 17 -4 12 -44 22 2 70 6 21 0 43 -7 15 -19 -8 -24 32 -18 10 20 49 29 12 28 3 10
13466 10 10 29 -7 15 16 15 22 40 42 33 38 31 -9 36 2 -10 19 -23 25 10 35 36 58 22 43 -10 49 25 6 -11 3 54 46 19 18
13501 18 40 14 -16 -23 7 -8 -20 -31 57 40 2 1 9 19 31 13 29 -13 -66 -38 -35 1 -4 61 -13 44 3 9 2 23 0 -60 -10
13534 -10 1 -19 -35 28 26 16 20 30 32 -22 -38 -50 -14 -39 -6 27 -5 -6 29 51 37 30 -9 13 -33 -10 4 2 3 5 -2 -2 45 -12 20
13569 20 -3 -3 -48 -20 -21 -24 -23 51 68 -6 34 7 -10 4 35 -50 -31 4 2 23 -10 18 -4 26 6 -47 -1 -38 -34 -32 -14 11 -11
13602 -11 20 8 19 47 16 22 8 2 -22 6 -5 35 6 11 23 -15 34 -11 -4 -34 -5 6 -53 -3 -31 12 12 20 20 37 -18 -29 27
13635 27 -16 -36 -39 -9 15 23 18 5 35 21 -12 -3 -6 20 -18 -7 12 -5 -47 15 23 9 11 20 -12 12 -58 -32 -19 12 21 -31 31 45
13669 45 -6 -8 20 -79 -21 -66 -78 -78 -37 -30 13 -2 4 6 22 -41 -13 -13 -70 -53 -19 -22 -21 14 -27 55 20 25 32 -27 -26 -49 -37 -26 -3
13704 -3 -11 15 19 86 10 17 9 -7 9 -62 -30 -2 -19 56 -24 54 -14 74 -24 18 39 -14 23 3 19 -12 0 -3 14 43 42 -8 -5 8
13738 8 -37 -6 -35 -54 34 -2 10 50 33 -10 -48 -2 0 -35 -40 -53 2 -22 -5 27 -3 28 -51 48 -14 16 25 -35 -13 -15 -2 49
13770 49 15 -3 -18 21 -5 49 27 -24 -7 -14 -7 11 -5 18 34 14 -11 27 15 17 10 -18 -5 -15 -16 -10 -11 33 -20 33 44 14 -23
13803 -23 27 -3 -72 -10 14 20 9 27 31 -7 51 -28 -2 -27 -63 -29 -11 -14 -44 18 19 -6 -11 19 25 8 11 -35 -52 -50 -5 -8 59 36
13837 36 33 42 -36 52 -5 -15 -19 8 -31 -9 23 47 1 45 22 -8 -7 7 -2 -34 -5 40 -13 53 4 39 29 37 33 28 39 -61 -4
13870 -4 -53 -25 -20 9 23 60 83 -1 23 -2 -13 17 -33 -24 -15 15 58 23 26 43 46 11 10 37 30 -15 -14 -36 35 58 13 18 18 19 -3 -12
13906 -12 -27 47 -10 9 -39 -23 3 -26 -12 60 43 7 -6 -9 10 -30 13 -40 20 -19 -8 66 16 58 36 10 -11 12 9 20 -29
13937 -29 -46 -4 21 27 0 27 44 -30 -50 -11 -128 -66 -19 -44 12 16 31 60 30 -6 -6 3 -37 2 -17 -36 -5 30 7 1 17 13
13969 13 19 -23 -18 -63 17 -56 0 4 15 27 28 46 20 27 5 -32 -6 -15 -29 -3 8 10 2 20 13 22 27 31 -42 2 20 15 23 0 30 -35 25
14006 25 20 33 42 1 -15 -36 11 -37 6 -9 -19 80 44 45 19 30 19 20 44 -28 -6 6 38 20 -3 21 15 70 66 -19 15 -30 19
14039 19 -11 -23 -29 0 -11 50 0 11 13 -11 16 -43 -36 -40 -14 11 46 5 37 47 48 9 -62 -15 -44 30 -6 -26 -26 -30 0 -7 6 32
14073 32 11 20 -35 -60 -23 -43 -8 -8 1 25 11 -4 -3 -31 -16 -7 -85 44 -6 27 19 1 0 0 64 9 15 -13 -17 -28 -7 0 11 44 30
14108 30 -16 -13 42 41 -19 -7 -37 -5 -85 -5 -11 -17 12 45 11 41 34 -28 -6 -16 -25 -37 -10 -4 3 55 10 24 6 41 20 12 -7 6
14142 6 38 -31 8 -19 17 66 72 46 -11 17 -61 15 -34 -43 2 -3 -11 35 -6 36 23 29 1 31 17 -49 4 -19 2 -14 20 3 9
14175 9 4 15 -3 19 -11 -16 -23 -4 -18 -8 13 52 17 -19 42 7 16 -5 -51 -39 29 -3 -6 19 -21 9 -3 19 66 -1 -16 -31 -17
14208 -17 -48 1 -7 8 25 44 4 -26 -6 -6 -29 -27 -22 34 13 70 10 12 32 6 51 23 -14 13 -10 -18 -27 -12 29 51 63 14 27
14241 27 52 -1 -28 14 43 35 -13 -2 10 54 49 75 24 8 -24 -1 9 0 20 -12 -21 7 -5 40 -22 27 38 28 6 -40 30 -22
14273 -22 25 18 17 4 34 0 -16 79 17 -2 -1 -24 7 -34 20 32 76 24 25 25 38 2 -19 24 -34 -18 -3 12 56 30 42 -4
14305 -4 13 46 22 -10 -10 5 -21 -24 5 2 10 -7 -5 -1 14 14 -4 -13 -35 8 -2 -1 -3 39 16 42 -9 -34 17 31 -4 -31 -16 -56 12
14340 12 -39 -27 9 43 10 -7 4 22 19 -1 -38 2 -28 7 14 -22 -9 -13 -39 -19 48 -14 10 6 19 -16 12 45 17 56 71 24
14372 24 -12 39 -2 -34 -31 26 -48 56 -35 13 11 46 -21 -37 -6 -26 -31 -50 -42 19 -4 -3 17 23 55 -3 31 7 -30 -27 20 -38 34
14405 34 -26 38 6 24 10 33 14 2 -6 24 -13 -25 25 13 27 41 42 -6 -21 40 -38 -39 -25 -46 -24 -59 -10 -12 37 16 9 12 -21
14438 -21 21 -23 -37 14 -24 19 17 5 -12 30 13 40 -9 -2 -37 -26 -22 -63 -20 -28 0 31 -43 -8 -11 -25 -37 -7 -74 -36 6 -4
14470 -4 1 -8 -22 39 -4 19 13 2 -18 -22 -29 8 18 -9 32 52 -4 -21 12 -33 -38 -8 -49 -24 2 3 42 30 28 -11 -60 5 7 -42 15
14505 15 -59 -26 0 23 15 -25 -8 2 46 36 6 -19 10 -32 1 -5 36 41 77 27 41 35 -25 22 32 -18 -48 13 11 -23 -22 29 12
14538 12 33 18 22 40 33 33 16 9 58 2 22 39 15 45 8 7 -21 47 -4 -26 2 -16 3 43 -24 4 37 54 3 17 -28 -5
14570 -5 -1 -48 -16 -23 56 40 3 -17 17 30 -10 -16 -34 -1 -4 -22 13 9 25 9 11 52 -8 -22 -15 -51 28 1 -5 13 31 58 39 43 29
14605 29 56 -86 24 -13 -12 -9 -40 46 0 33 31 11 54 36 -10 5 -31 -66 -14 -33 13 45 -40 87 10 16 -14 -11 25 9 -22
14636 -22 -68 5 -12 21 33 39 -1 -20 10 -19 3 -44 -51 -12 -6 14 26 42 59 28 96 42 24 -2 39 -17 0 21 59 29 39
14667 39 34 43 72 19 -5 -10 -25 39 -2 9 -6 53 15 20 11 6 53 15 16 -27 -67 -11 -16 18 19 8 64 9 -19 26 12 -29 -17 2
14701 2 -3 -6 11 -33 30 55 -14 5 -23 -39 -12 -22 -20 -14 -25 18 -19 -26 27 22 10 7 -54 -7 10 0 -35 -18 39 -3 -4 -1 4 -11 -20 -18
14737 -18 -34 -9 -49 -35 -8 -10 9 -2 41 3 8 0 -48 -26 -47 1 -38 5 37 12 -2 10 2 -20 -6 -18 -35 -27 -17 15 -6 -3 13
14770 13 20 6 38 31 13 -47 59 -11 -25 3 -28 16 -14 26 34 56 20 -13 -19 0 -9 -8 -6 -7 20 37 -3 17 6 46 -4 -11 41 -12
14804 -12 3 24 -7 -9 24 17 20 40 6 -20 -33 -32 -14 -12 0 -46 2 13 -4 5 23 -14 8 -1 5 6 -7 12 2 -18 0 1 -25 0 33
14839 33 -3 -4 7 -5 24 -25 -23 33 -1 33 -2 -20 46 32 -52 1 -73 -26 -4 5 28 28 -2 -2 1 5 43 -23 -22 -33 -13 28 -34 -40
14873 -40 -12 -28 6 16 38 -34 -1 -28 -32 -32 -38 11 0 20 19 13 0 10 13 1 -36 -69 -7 -7 -53 57 25 1 -16 -14 -6 -7 -3 -10 -5 -35
14909 -35 -14 3 10 23 -31 42 50 -13 23 -54 -13 -29 -45 -3 -6 -5 1 28 15 -26 -8 -17 -3 -10 -2 -7 -2 32 7 -39 -14 14 47 62 14
14944 14 -8 -50 -38 -28 -1 -19 67 19 26 36 -8 18 -29 -51 6 -9 6 -29 66 38 39 56 24 -16 -8 -25 -16 -31 -73 -19 -23 -6
14976 -6 48 7 27 49 21 -2 -25 5 -26 3 -32 18 49 2 -4 -35 23 -9 55 5 -5 19 -83 37 -50 21 -16 17 66 55
15006 55 83 -7 -20 -3 -47 -2 -16 -8 -19 11 21 6 17 26 18 16 -54 -30 -44 -51 41 -31 19 15 22 59 12 16 -2 -36 -25 -7 -27 40
15040 40 29 25 51 -27 22 -25 -20 56 18 20 19 -26 4 10 3 -20 33 26 19 4 -3 -4 24 -14 -26 3 14 12 -7 19 45 24 3 -28 3
15075 3 22 -41 28 3 -5 -15 11 26 31 5 27 26 12 17 -5 -43 17 6 -8 3 0 -6 17 26 -12 9 7 -9 14 31 15 6 3 -13 33
15110 33 3 34 -5 0 -19 -10 -1 -6 42 24 53 36 21 28 -14 11 -59 -18 -3 -4 10 -6 29 25 18 18 -1 15 7 -31 -17 25 -27 0 17
15145 17 30 32 8 -26 -18 23 -3 -2 -9 -40 -45 -27 -6 -30 51 3 11 -13 -50 -2 -15 -15 -23 -19 -18 36 -13 35 29 0 34 -2 -10 3 -9 -16
15181 -16 -55 -25 -7 7 44 -4 62 14 -24 12 6 -46 -11 19 19 5 26 29 24 -6 24 6 -35 17 19 -12 -35 23 28 12 -30 -7 19
15214 19 7 -6 -49 19 -24 -43 -3 -5 -32 37 28 19 54 -1 16 -18 -42 -49 -46 26 18 -8 19 30 65 53 50 11 -3 -37 29 -18 2
15247 2 -3 -10 37 18 42 6 -12 9 -51 12 -15 -48 -38 28 38 3 11 -4 62 -4 18 -53 3 -61 -19 -5 -8 9 6 28 29 19 33
15280 33 24 -7 -34 19 36 6 -31 22 -5 40 32 73 -11 16 24 -8 8 23 10 8 19 39 13 43 40 36 -46 -24 -2 -16 15 15 76
15313 76 19 56 -3 40 -34 -9 -32 0 -34 -6 -53 -1 12 16 -22 31 39 21 26 16 12 -29 35 -19 34 9 -1 42 8 68 29 47
15345 47 -4 13 4 -64 -11 15 40 22 42 11 -1 46 -47 27 39 -21 1 -3 56 8 34 41 79 14 3 52 0 17 -8 -10 46 5
15377 5 22 21 73 35 26 -12 24 30 -32 12 -19 8 4 34 29 25 1 21 -9 19 -19 37 -27 -2 -12 -30 -24 6 10 9 23 32 30 12 12 -58
15413 -58 -47 -25 6 9 -10 -14 -24 26 -8 -21 -10 -7 -20 -17 -17 -45 1 -3 -46 14 39 15 -8 2 -16 -14 -15 -26 -20 -18 -5 37 38 55 15
15448 15 -7 4 11 4 -42 -27 -27 10 -48 7 25 59 19 -2 -11 -26 -8 3 -14 17 -56 37 26 12 18 9 8 -31 13 -22 -12 -15 9 -6
15482 -6 22 -4 23 21 7 39 13 -10 -23 7 -27 16 -43 7 3 15 46 17 -11 -43 29 -3 20 -11 -13 20 -17 11 23 -11 -10 19
15514 19 16 -29 16 -41 -3 -2 42 26 -2 37 27 0 -3 -18 6 10 -5 -47 27 -4 29 -3 13 34 0 -41 -16 -10 1 -39 12 -22
15546 -22 -44 4 13 28 -30 19 21 -18 -22 7 6 -27 2 29 41 8 7 3 22 1 -12 -5 -17 -38 -12 -11 43 -5 9 -12 23 -22 9 -14
15580 -14 -38 -37 -30 -12 20 8 -11 7 7 52 12 -23 8 -1 -1 -1 -13 -1 27 11 64 56 -8 2 7 10 49 -53 -16 -52 14 20 -4 38
15614 38 -58 10 3 -14 23 -27 -21 3 12 -38 1 54 28 -5 -1 16 8 -14 -11 12 -36 -36 6 58 30 -4 22 39 -15 -4 -27 0 -34
15647 -34 -6 -14 -17 7 15 24 29 46 -1 -48 4 -25 4 -54 -16 9 -20 -2 -39 58 7 -33 -14 -12 5 -18 -63 -14 18 6 -32 22 6
15680 6 -4 1 -5 -12 -7 -56 -47 -16 -22 -6 27 -21 33 76 37 13 -11 -1 -36 -15 -49 -9 -26 -68 9 7 -4 -32 -24 4 4 20 -44 8 -30
15715 -30 0 7 8 64 27 9 -1 -50 10 -63 3 14 6 40 17 11 -7 51 13 13 17 5 -32 -32 -23 21 24 -9 36 18 -13 -27 -15 15
15749 15 -28 1 5 -8 15 12 1 22 -24 1 13 29 -8 15 -55 -9 -65 38 9 63 -7 66 52 69 5 -37 -41 -18 -45 -6 7
15780 7 18 -12 -17 9 46 20 -12 -18 -63 -8 -36 6 -22 13 44 35 27 19 15 -3 -24 27 32 -7 -44 -24 5 -34 37 9 1 -9 -7 -8 -18
15815 -18 -36 -47 16 12 21 25 14 2 15 -7 -13 19 -18 -48 17 -14 34 -2 -1 27 33 -9 -45 -3 -19 -24 -24 -10 23 20 23 -1 -7 -10 -23 8
15851 8 -8 -13 -42 -30 4 20 21 -12 13 50 45 -5 4 49 2 6 -17 -37 -3 2 -4 32 41 19 0 36 -69 -15 -48 -8 -19 24 38 -17
15885 -17 32 -46 3 43 13 32 -29 7 -5 11 -14 -6 -16 1 -15 16 19 27 -21 7 -39 1 -26 -70 42 30 32 35 36 -7 22 -34
15917 -34 23 -53 -41 26 -26 -7 -10 20 -9 40 18 30 1 27 -24 -4 10 -18 11 37 66 -12 -15 -2 -27 34 -14 3 -3 -11 16 -24
15949 -24 2 51 21 10 6 13 3 -47 -25 -5 -20 -24 -23 -32 42 -29 6 -16 -19 30 -16 -8 -50 -37 20 24 -3 44 7 14 24 4 18 9 -27
15984 -27 30 -29 -46 15 38 62 -12 19 12 10 -3 4 26 -13 -44 -5 -2 17 16 37 13 -5 14 14 -42 -11 16 -32 23 19 6 33 44
16017 44 6 -1 26 -31 8 -8 7 4 -63 -15 -9 39 57 -3 -35 -4 29 -5 -20 -10 -15 14 17 27 51 -8 32 33 -7 7 -19 -31 5
16050 5 -29 22 -3 -22 5 26 -35 23 -21 3 -13 12 -7 27 52 20 37 0 0 -14 -9 19 -51 5 -7 7 14 24 9 -16 3 41
16082 41 39 37 19 29 -13 -19 -33 12 -9 31 42 -15 17 -26 38 -31 19 0 -6 15 -3 21 -13 -31 7 55 -16 -12 20 -35 -11 -21
16114 -21 -22 -7 14 25 7 -14 7 -7 26 -26 -61 6 2 -16 -47 -22 -16 1 -10 -22 58 19 17 -14 -19 -24 -22 23 16 31 30 34 35 -15 14
16149 14 5 11 -42 0 -14 3 27 17 19 41 20 -2 -4 9 -4 33 -10 -24 -4 -36 41 -27 4 30 37 15 18 36 -11 -11 -50 0 24
16182 24 17 38 12 41 40 13 -11 12 -33 -11 -21 9 33 25 5 24 68 -38 7 -6 -44 -14 -12 -25 -9 7 39 11 -16 3 3 -32
16214 -32 -5 -6 -21 -18 -77 3 -12 13 -13 0 -14 4 -28 -17 -54 -31 -28 9 -16 24 -2 10 -9 17 20 -18 13 -15 12 -26 -23 43
16246 43 -32 -8 -3 24 16 5 23 9 9 -30 38 4 -14 11 20 38 -5 0 -11 -11 14 -20 -23 19 -30 -35 -11 -1 -16 -10 24 63 -28 -46
16280 -46 -40 -47 -52 -55 3 -55 36 29 23 -33 37 6 -17 -9 31 -13 -24 -16 9 -20 -21 17 -17 38 -48 26 -14 9 -20 -18 -22 24 43 14 -36
16315 -36 -12 32 -18 45 -16 42 -22 12 25 8 15 -1 52 -7 -1 -35 -66 -11 -47 -46 -13 9 -54 28 60 38 10 -21 12 -53 29
16346 29 -58 -55 -12 -41 26 16 36 31 6 31 -16 -15 -9 -8 -46 -17 -34 40 56 -9 65 11 10 -29 10 -39 -39 -33 4 -1 -1 13 17 4 68
16381 68 49 30
16383C0
$$ Imaginary data points
##PAGE= N=2
##DATA TABLE= (X++(I..I)), XYDATA
0 0 0 0 0 0 0 0 0 0 0 0 0 0 0 0 0 0 0 0 0 0 0 0 0 0 0 0 0 0 0 0 0 0 0 0 0 0 0 0 0 0 0 0 0 0 0 0 0 0 0 0 0 0 0 0 0 -1 2 -1 5 -11 10 -12
62 -12 16 -24 34 -68 1317 1168 1241 1423 1426 1537 1488 1538 1599 1639 1729 1920 2063 2208 2365 2500 2535 2600 2514 2493 2449 2424
88 2424 2403 2468 2542 2573 2688 2766 2843 2789 2761 2609 2533 2394 2359 2267 2195 2222 2265 2261 2237 2188 2109 2006 1823 1692 1521 1368 1206
115 1206 1164 1073 1089 1033 1002 898 799 641 410 266 23 -172 -303 -380 -438 -490 -507 -609 -632 -826 -901 -1065 -1314 -1470
139 -1470 -1611 -1781 -1852 -1906 -1849 -1876 -1871 -1913 -1978 -2048 -2258 -2369 -2499 -2572 -2591 -2632 -2583 -2570 -2485 -2416 -2386 -2411 -2470 -2497 -2567 -2563 -2661 -2607
167 -2607 -2538 -2399 -2301 -2160 -2003 -1979 -1867 -1858 -1878 -1835 -1801 -1794 -1708 -1602 -1506 -1281 -1072 -926 -774 -667 -604 -526 -548 -467 -425 -323
193 -323 -155 50 232 440 573 746 845 903 964 987 1037 1093 1168 1290 1483 1630 1782 1876 2048 2101 2164 2176 2087 2126 2136
218 2136 2146 2213 2308 2441 2515 2608 2666 2657 2563 2532 2479 2361 2388 2279 2340 2269 2325 2362 2334 2399 2257 2199 2030 1909 1781 1629
244 1629 1585 1474 1477 1382 1406 1385 1256 1192 1014 916 674 489 328 209 142 65 21 -72 -75 -149 -306 -443 -595 -742 -992
269 -992 -1118 -1246 -1327 -1345 -1387 -1433 -1477 -1458 -1633 -1766 -1811 -2017 -2157 -2230 -2272 -2319 -2333 -2290 -2255 -2232 -2251 -2288 -2324 -2374 -2495 -2509 -2542
296 -2542 -2545 -2492 -2408 -2320 -2254 -2151 -2104 -2080 -2041 -1992 -2067 -2035 -2027 -1955 -1850 -1697 -1552 -1402 -1292 -1128 -1107 -1034 -1049 -956 -887 -785 -732
323 -732 -588 -401 -266 -57 93 185 299 367 463 421 492 595 683 847 978 1170 1308 1482 1543 1637 1678 1686 1727 1742 1765
348 1765 1797 1923 2063 2127 2253 2289 2407 2382 2340 2356 2280 2273 2250 2217 2263 2305 2336 2393 2461 2411 2332 2276 2138 2077 1904 1832 1759
375 1759 1777 1721 1748 1695 1667 1581 1439 1364 1204 1054 934 824 665 575 574 499 450 425 278 134 -13 -193 -319 -503
399 -503 -628 -754 -773 -831 -890 -921 -996 -1084 -1201 -1307 -1464 -1565 -1718 -1844 -1876 -1910 -1920 -1934 -1957 -1954 -1996 -2054 -2138 -2196 -2352 -2368
425 -2368 -2378 -2377 -2317 -2312 -2243 -2169 -2199 -2119 -2139 -2175 -2173 -2172 -2183 -2125 -2062 -2026 -1820 -1751 -1593 -1541 -1451 -1372 -1389 -1333 -1316 -1252 -1170 -1047 -909 -801
455 -801 -625 -497 -349 -216 -98 -29 -129 -51 -1 150 231 388 538 710 870 1020 1093 1151 1244 1206 1265 1277 1396 1436
479 1436 1592 1685 1869 1982 2001 2065 2090 2097 2083 2034 2029 2038 2098 2132 2245 2308 2356 2348 2330 2342 2227 2119 2000 1970 1917 1880 1903 1865
507 1865 1966 1901 1890 1792 1719 1629 1435 1321 1113 1096 996 994 969 910 888 804 655 548 345 226 87 -66 -190 -289
531 -289 -321 -353 -359 -398 -471 -570 -719 -898 -1085 -1221 -1308 -1382 -1482 -1496 -1498 -1570 -1492 -1549 -1628 -1777 -1858 -2016 -2086 -2160 -2167 -2217 -2201 -2082
559 -2082 -2090 -2044 -1988 -2043 -2080 -2108 -2187 -2219 -2216 -2164 -2121 -2055 -1904 -1821 -1718 -1681 -1600 -1633 -1627 -1580 -1598 -1548 -1475 -1327 -1224 -1101 -956 -835
587 -835 -688 -608 -550 -503 -554 -456 -392 -269 -161 4 173 332 450 557 639 686 736 734 807 879 974 1102 1198 1389 1519
612 1519 1593 1661 1723 1789 1763 1758 1749 1798 1802 1862 1985 2081 2163 2189 2229 2199 2150 2131 1990 1990 1959 1957 1964 1968 2025 2042 2020 2016 1951 1886 1775 1593
644 1593 1475 1366 1310 1283 1273 1235 1203 1239 1113 1057 857 730 551 442 357 230 136 134 113 39 -18 -22 -152 -311 -500
669 -500 -642 -832 -899 -1002 -1055 -1040 -1111 -1122 -1217 -1217 -1328 -1466 -1527 -1685 -1789 -1853 -1924 -1903 -1869 -1845 -1850 -1802 -1858 -1884 -1940 -2039 -2065 -2112
697 -2112 -2106 -2152 -2140 -2049 -1971 -1806 -1814 -1745 -1769 -1805 -1773 -1760 -1785 -1774 -1676 -1629 -1413 -1323 -1216 -1088 -1029 -941 -864 -884 -911 -881 -760 -667
725 -667 -514 -375 -231 -53 104 117 227 251 297 387 389 423 528 624 807 921 1063 1215 1269 1367 1334 1393 1395 1386 1457 1521
751 1521 1587 1706 1835 1901 2005 2032 1965 1969 1944 1889 1882 1838 1866 1847 1935 2049 2022 2062 2042 2037 1868 1766 1687 1618 1491 1487 1495 1432 1479
780 1479 1484 1477 1438 1308 1146 1013 896 767 619 574 511 548 472 431 410 307 175 35 -103 -260 -411 -533 -604 -603 -614
805 -614 -685 -725 -767 -814 -912 -1090 -1188 -1362 -1486 -1509 -1581 -1620 -1623 -1608 -1559 -1557 -1625 -1684 -1740 -1859 -1957 -2029 -2066 -1996 -1993 -1906 -1855 -1766 -1801 -1761
835 -1761 -1759 -1824 -1833 -1898 -1885 -1854 -1729 -1701 -1599 -1458 -1333 -1283 -1224 -1138 -1160 -1168 -1152 -1145 -1090 -988 -826 -719 -494 -409 -267 -224 -130
862 -130 -118 -100 -68 -69 50 157 289 396 569 695 852 913 938 1005 984 960 1054 1082 1189 1283 1403 1538 1577 1733 1726 1790
888 1790 1732 1732 1711 1670 1674 1673 1764 1826 1893 2005 1977 1985 1932 1908 1767 1733 1668 1542 1591 1598 1578 1631 1666 1640 1576 1482 1330 1233 1080 960
918 960 927 872 800 818 797 769 727 675 524 404 251 13 -40 -134 -188 -249 -334 -285 -317 -394 -444 -592 -701 -852 -970 -1096
944 -1096 -1167 -1224 -1279 -1241 -1256 -1223 -1288 -1291 -1427 -1539 -1664 -1736 -1792 -1816 -1829 -1816 -1770 -1682 -1680 -1667 -1667 -1665 -1764 -1783 -1882 -1919 -1889 -1825 -1703 -1673
974 -1673 -1542 -1467 -1380 -1308 -1379 -1370 -1382 -1299 -1354 -1294 -1230 -1073 -947 -843 -720 -577 -522 -510 -443 -470 -397 -367 -240 -204 -3 96
1000 96 237 349 461 523 568 640 598 637 685 759 854 912 1063 1250 1288 1405 1475 1500 1456 1387 1406 1463 1461 1514 1587 1678 1756 1848
1028 1848 1904 1857 1805 1783 1731 1673 1680 1596 1587 1587 1725 1696 1703 1712 1657 1583 1437 1347 1261 1188 1136 1091 1100 1041 1092 1005 985 878 845 678
1058 678 517 384 267 190 168 124 102 62 25 -30 -122 -287 -335 -495 -614 -714 -811 -845 -904 -924 -894 -917 -1016 -1109 -1117 -1220
1084 -1220 -1356 -1464 -1529 -1587 -1572 -1531 -1611 -1577 -1495 -1591 -1544 -1601 -1684 -1752 -1783 -1811 -1806 -1759 -1685 -1655 -1579 -1544 -1459 -1452 -1461 -1464 -1508 -1485 -1492 -1402 -1360
1115 -1360 -1226 -1163 -1015 -940 -816 -809 -772 -742 -759 -739 -652 -579 -454 -353 -235 -117 -17 126 176 183 231 246 265 366 412
1140 412 543 632 768 883 1023 1099 1111 1148 1137 1122 1135 1157 1262 1292 1376 1444 1558 1656 1719 1641 1630 1579 1580 1571 1532 1550 1602 1591
1168 1591 1646 1718 1758 1752 1712 1596 1501 1390 1370 1322 1262 1287 1197 1281 1258 1252 1175 1098 976 885 751 643 605 510 446 447 472 453
1196 453 347 255 202 8 -16 -212 -314 -361 -456 -492 -592 -523 -572 -608 -648 -746 -850 -949 -1046 -1175 -1241 -1297 -1319 -1268 -1347 -1289
1222 -1289 -1300 -1330 -1347 -1484 -1561 -1657 -1668 -1653 -1697 -1657 -1621 -1512 -1534 -1498 -1465 -1435 -1486 -1526 -1532 -1566 -1550 -1514 -1431 -1345 -1206 -1153 -1083 -992
1250 -992 -996 -1008 -981 -952 -935 -912 -802 -714 -637 -476 -347 -239 -182 -129 -133 -107 -89 -70 28 112 233 313 440 543 669 731 810
1277 810 795 832 862 830 933 984 1058 1191 1227 1354 1410 1400 1453 1429 1413 1346 1385 1431 1450 1498 1500 1611 1660 1624 1679 1589 1561 1497
1305 1497 1437 1371 1380 1313 1342 1374 1412 1408 1370 1323 1240 1146 1034 929 833 787 738 692 682 700 701 642 580 443 333 213 69 16
1333 16 -124 -143 -178 -145 -171 -215 -333 -379 -462 -575 -675 -783 -902 -947 -1023 -950 -1069 -989 -1012 -1009 -1105 -1128 -1259 -1380 -1433 -1467
1359 -1467 -1486 -1476 -1486 -1461 -1390 -1379 -1349 -1436 -1434 -1454 -1509 -1568 -1623 -1570 -1553 -1485 -1358 -1279 -1217 -1150 -1149 -1184 -1108 -1189 -1133 -1095 -1104 -1052 -942 -791
1389 -791 -630 -597 -554 -491 -389 -434 -392 -407 -365 -289 -198 -57 46 205 303 370 377 437 470 446 470 516 608 671 756 914 969
1416 969 1110 1127 1236 1199 1155 1185 1132 1148 1184 1235 1331 1385 1510 1483 1532 1583 1562 1453 1420 1346 1365 1294 1304 1375 1351 1487 1429
1443 1429 1496 1408 1283 1207 1123 1029 967 954 944 950 972 939 900 833 754 669 556 428 335 186 199 134 113 133 132 103 34 -61
1471 -61 -166 -291 -391 -522 -607 -669 -638 -711 -686 -713 -749 -744 -838 -934 -1026 -1130 -1184 -1289 -1311 -1349 -1282 -1266 -1253 -1170 -1250 -1264 -1355 -1421
1499 -1421 -1502 -1522 -1529 -1568 -1500 -1430 -1368 -1338 -1233 -1177 -1195 -1245 -1298 -1271 -1266 -1272 -1238 -1209 -1056 -962 -859 -774 -720 -668 -691 -629 -661 -640 -573
1528 -573 -493 -433 -322 -208 -96 23 48 100 165 100 150 116 235 300 383 548 570 740 828 854 947 956 936 900 887 924 1014
1555 1014 1006 1125 1247 1329 1414 1398 1386 1375 1337 1296 1265 1166 1261 1261 1371 1350 1458 1443 1440 1425 1367 1283 1182 1077 1066 1025 995 1037
1583 1037 1054 1075 1026 1052 958 900 763 618 522 487 368 414 358 360 436 361 335 256 131 10 -129 -266 -332 -400 -489 -484 -452
1610 -452 -378 -458 -472 -583 -709 -745 -927 -1015 -1055 -1113 -1080 -1061 -1056 -1042 -1034 -1050 -1101 -1184 -1261 -1352 -1423 -1373 -1420 -1379 -1310 -1296 -1251 -1166 -1186
1639 -1186 -1188 -1237 -1280 -1318 -1312 -1305 -1320 -1196 -1108 -1053 -996 -896 -818 -818 -838 -860 -858 -820 -796 -748 -679 -549 -396 -328 -253 -169 -93 -155 -88 -128
1669 -128 -107 -62 26 147 242 364 465 554 659 672 659 650 690 629 696 798 837 989 989 1120 1183 1215 1210 1210 1185 1127 1131 1176 1142
1698 1142 1267 1227 1346 1352 1405 1466 1350 1353 1224 1168 1137 1138 1092 1134 1141 1181 1188 1136 1174 1108 1020 888 772 734 686 591 593 580 631
1727 631 613 584 538 448 343 210 100 0 -59 -151 -102 -183 -152 -186 -164 -249 -302 -399 -507 -616 -768 -758 -853 -819 -855 -835
1753 -835 -824 -838 -863 -952 -971 -1106 -1139 -1227 -1246 -1278 -1235 -1204 -1190 -1166 -1163 -1179 -1184 -1210 -1242 -1315 -1366 -1295 -1258 -1236 -1173 -1104 -1086 -987 -965 -932
1783 -932 -938 -1008 -991 -988 -919 -883 -798 -675 -628 -515 -423 -398 -384 -387 -344 -348 -323 -263 -161 -62 -9 96 165 279 328 381 381 373 357 378
1813 378 430 460 625 701 820 915 886 925 964 953 950 960 945 972 1041 1088 1117 1230 1262 1246 1316 1290 1231 1186 1134 1099 1087 1113 1064
1842 1064 1225 1172 1236 1172 1165 1113 1048 952 905 842 789 813 773 764 791 763 687 657 583 474 415 332 197 158 119 143 117 99 48
1871 48 4 30 -122 -191 -315 -428 -506 -517 -495 -589 -537 -576 -588 -592 -671 -785 -813 -851 -978 -1027 -1087 -1065 -1025 -1042 -1017 -1022 -1001 -1045 -1112
1900 -1112 -1152 -1204 -1223 -1273 -1250 -1277 -1189 -1128 -1124 -1045 -1008 -1019 -1056 -1074 -1039 -1062 -1050 -1056 -986 -859 -821 -739 -674 -622 -558 -562 -552 -573 -564 -511 -465
1931 -465 -342 -262 -186 -128 -40 19 61 99 84 103 118 177 238 305 375 476 551 667 725 757 718 785 758 752 750 782 851 947 1020
1960 1020 1028 1100 1110 1155 1158 1100 1048 1069 1043 1046 1069 1127 1173 1157 1217 1232 1200 1097 1017 1021 937 877 936 839 919 895 901 894 882 831 733 644
1992 644 557 459 383 352 317 338 356 353 331 299 173 76 27 -99 -155 -242 -294 -335 -359 -360 -329 -357 -386 -448 -544 -619 -736 -787 -859
2021 -859 -856 -887 -880 -890 -833 -882 -857 -941 -927 -1053 -1136 -1196 -1206 -1181 -1165 -1096 -1048 -1035 -1015 -1053 -1042 -1113 -1080 -1112 -1175 -1135 -1069 -985 -950 -883
2051 -883 -804 -745 -730 -762 -715 -737 -701 -733 -720 -587 -563 -414 -369 -227 -219 -145 -145 -124 -152 -95 -59 -25 -5 132 237 302 363 483
2079 483 535 514 566 530 500 497 597 593 695 772 846 891 970 992 1007 952 985 927 910 942 941 1008 1021 1097 1147 1191 1194 1133 1071 1051 966
2110 966 946 932 908 976 985 1026 1029 1007 954 890 819 775 651 612 579 544 525 496 567 538 497 479 369 303 157 131 2 -45 -54
2139 -54 -63 -89 -96 -37 -123 -165 -215 -359 -389 -559 -612 -639 -657 -643 -638 -658 -666 -702 -710 -766 -805 -946 -1003 -1023 -1054 -1079 -1050 -966 -944 -929 -956
2170 -956 -949 -1036 -1036 -1087 -1083 -1105 -1141 -1124 -1086 -903 -878 -875 -821 -757 -785 -846 -848 -872 -843 -858 -733 -664 -562 -513 -427 -359 -368 -323 -334 -350 -327
2201 -327 -298 -261 -184 -55 9 108 167 268 278 278 313 317 253 294 340 364 513 509 675 773 799 773 774 790 757 731 721 759 863
2230 863 873 992 998 1072 1097 1076 1048 964 973 911 890 888 910 942 998 1083 1049 1016 1021 946 845 808 721 671 666 638 665 661 657 666 631 607 530
2263 530 387 280 222 215 172 67 157 135 138 159 58 31 -77 -161 -244 -351 -430 -439 -447 -466 -464 -449 -419 -438 -468 -652 -703 -778 -803
2292 -803 -912 -883 -910 -917 -872 -805 -798 -837 -848 -881 -920 -1025 -1040 -1089 -1051 -1020 -979 -923 -885 -802 -844 -818 -893 -886 -935 -985 -928 -930 -860 -755
2322 -755 -692 -573 -558 -516 -455 -492 -457 -474 -460 -493 -437 -388 -263 -167 -73 22 47 90 105 49 113 67 111 134 239 279 420 473
2350 473 532 610 574 646 580 570 543 579 656 663 753 810 851 932 984 966 972 911 880 845 816 836 859 931 942 1018 1028 1045 994 985 879
2381 879 777 782 730 729 741 750 776 820 824 757 703 591 596 436 356 338 306 301 293 311 318 301 285 187 91 2 -57 -120 -204 -221 -248 -253 -280
2414 -280 -222 -287 -333 -319 -433 -538 -558 -688 -711 -736 -724 -701 -640 -672 -642 -723 -712 -735 -853 -898 -953 -983 -1000 -983 -923 -882 -859 -817
2442 -817 -813 -850 -866 -883 -968 -945 -989 -893 -873 -832 -779 -657 -594 -572 -594 -570 -632 -661 -653 -585 -546 -512 -416 -335 -269 -208 -147 -108 -140 -162
2472 -162 -141 -120 -46 -38 49 103 218 312 347 414 416 416 447 390 415 429 497 503 582 658 737 817 816 834 816 826 736 793 750 768 818 865
2504 865 949 922 1041 974 956 916 835 808 753 758 756 753 830 818 900 848 846 747 728 669 575 482 424 473 422 467 488 457 467 389 339
2535 339 262 183 126 63 -46 -38 -48 -92 -44 -63 -53 -152 -147 -256 -361 -425 -512 -537 -523 -544 -549 -529 -558 -481 -568 -574 -650 -777 -783 -835
2565 -835 -869 -899 -830 -797 -805 -759 -756 -779 -821 -807 -876 -929 -918 -972 -923 -948 -847 -759 -756 -621 -675 -626 -661 -705 -706 -728 -713 -646 -595 -538 -442
2596 -442 -390 -306 -262 -290 -235 -287 -282 -292 -226 -174 -121 -40 29 119 135 229 259 242 231 191 216 265 305 402 404 498 591 626 673 675 651
2627 651 651 624 608 620 640 720 794 826 852 893 880 858 811 791 732 761 732 748 746 827 887 840 861 864 832 798 678 661 545 563
2657 563 529 530 580 583 603 525 489 460 373 327 201 149 118 95 127 29 139 73 110 18 -7 -36 -172 -239 -340 -363 -367 -389 -378
2686 -378 -369 -358 -404 -393 -489 -544 -621 -667 -685 -759 -754 -750 -713 -715 -698 -686 -701 -712 -782 -888 -876 -908 -942 -876 -844 -800 -730 -733 -706 -698 -716 -734
2718 -734 -748 -786 -784 -750 -728 -659 -606 -524 -472 -450 -419 -415 -434 -440 -442 -416 -361 -314 -267 -158 -92 -60 29 65 53 28 3 31 84 124 166
2749 166 230 285 347 446 468 455 459 536 462 435 500 523 519 581 673 746 815 775 804 751 728 707 683 710 704 759 757 875 831 865 879
2780 879 840 812 769 690 625 613 597 625 605 681 676 680 645 666 535 433 433 329 255 232 276 251 266 257 271 263 168 83 25 -61 -100
2811 -100 -101 -211 -215 -193 -167 -154 -188 -222 -287 -337 -372 -445 -530 -593 -600 -591 -598 -498 -559 -537 -565 -630 -644 -706 -762 -775 -848 -824 -818 -757 -730 -658
2843 -658 -661 -674 -706 -739 -726 -792 -824 -842 -750 -754 -676 -608 -598 -500 -519 -519 -509 -553 -497 -575 -524 -517 -446 -358 -273 -228 -132 -114 -159 -125 -138 -129
2875 -129 -91 -69 -69 17 98 200 226 339 330 334 292 316 328 267 333 386 421 502 611 648 638 666 653 650 638 582 552 575 622 665
2905 665 717 738 807 825 796 786 728 728 671 645 606 627 651 707 716 758 724 698 652 583 494 461 414 376 376 377 403 393 408 385 319 292
2937 292 220 147 100 -23 9 -42 -16 -20 -26 13 -63 -99 -131 -193 -345 -279 -384 -422 -415 -415 -416 -451 -400 -462 -439 -537 -572 -615 -666 -711 -759
2968 -759 -726 -722 -717 -595 -626 -622 -621 -677 -698 -818 -775 -787 -822 -779 -763 -664 -650 -541 -515 -526 -597 -591 -572 -618 -689 -615 -554 -484 -416 -349 -297
2999 -297 -292 -259 -251 -248 -268 -243 -243 -225 -226 -91 -20 47 79 138 163 158 176 116 165 169 148 232 262 355 430 465 554 529 524 500 493 497 481 511
3033 511 519 583 644 694 767 709 758 723 706 660 620 616 583 673 669 650 732 718 795 702 684 639 581 521 451 429 449 483 508 504 480 458
3065 458 482 360 370 217 188 106 97 116 103 86 83 132 119 66 -67 -95 -178 -192 -294 -324 -344 -305 -279 -291 -298 -295 -353 -409 -464 -483
3095 -483 -562 -577 -622 -655 -592 -558 -523 -552 -498 -548 -631 -668 -725 -747 -777 -791 -800 -705 -668 -625 -548 -559 -554 -628 -592 -648 -690 -665 -662 -585 -564
3126 -564 -486 -432 -393 -386 -398 -382 -347 -380 -368 -343 -317 -278 -219 -179 -77 -15 61 9 11 65 -25 30 15 63 94 120 288 309 341 409
3156 409 411 394 334 394 333 359 408 463 493 535 620 639 699 653 686 625 596 567 550 548 537 630 678 719 742 698 776 672 650 590
3186 590 554 499 480 500 486 539 603 577 561 558 466 445 332 336 221 203 246 244 244 259 284 201 195 136 57 15 -135 -94 -114 -177 -156
3217 -156 -114 -106 -191 -158 -209 -287 -313 -377 -446 -466 -510 -535 -486 -432 -455 -381 -448 -463 -546 -605 -625 -665 -724 -734 -682 -682 -632 -561 -586 -531 -572
3248 -572 -604 -619 -674 -677 -692 -634 -643 -553 -549 -457 -459 -411 -388 -412 -468 -469 -460 -425 -444 -353 -361 -214 -215 -125 -129 -105 -122 -123 -129 -159 -114 -81 -6 44 137
3283 137 156 222 257 240 264 229 237 223 261 283 336 377 461 493 542 634 506 590 509 493 465 529 539 517 540 623 677 657 707 690
3313 690 617 610 546 515 556 521 544 533 566 579 620 614 518 513 446 415 378 316 317 330 380 313 369 293 340 303 198 147 70 94 -50
3344 -50 -3 13 -21 -17 -45 -27 -96 -103 -163 -243 -265 -343 -380 -310 -421 -345 -335 -347 -305 -342 -395 -440 -471 -557 -611 -598 -649 -628 -586 -549 -558
3375 -558 -487 -498 -535 -551 -644 -621 -676 -675 -670 -637 -566 -512 -530 -529 -466 -523 -470 -513 -616 -533 -558 -511 -403 -355 -304 -289 -213 -212 -258 -201 -254
3406 -254 -232 -260 -176 -233 -124 -31 5 93 95 113 118 175 100 140 75 108 185 243 286 392 407 436 443 460 413 404 416 386 381 434 544
3437 544 505 582 593 606 648 606 552 532 552 493 514 517 525 562 602 595 613 611 573 538 476 438 390 387 344 427 398 417 458 353 378 354
3469 354 264 207 168 137 86 128 56 149 137 95 139 26 -4 -53 -112 -166 -216 -208 -281 -244 -199 -221 -213 -238 -239 -330 -376 -453 -488 -506 -529
3500 -529 -536 -539 -455 -430 -428 -449 -453 -536 -543 -591 -597 -631 -618 -613 -598 -539 -484 -489 -448 -472 -504 -515 -546 -580 -602 -526 -530 -466 -416 -398 -324 -298 -283 -310
3534 -310 -326 -347 -354 -303 -327 -249 -245 -87 -72 -56 -13 35 8 -25 -32 -23 6 -5 95 133 215 261 319 316 333 317 304 347 246 282 295
3565 295 395 386 506 562 540 555 537 519 511 472 486 463 445 469 532 583 601 666 654 652 540 527 452 423 400 390 429 487 490 564
3595 564 440 481 429 429 322 279 251 183 246 164 201 199 203 246 207 187 92 86 16 -92 -124 -112 -77 -99 -66 -49 -61 -95 -138 -259
3625 -259 -269 -323 -368 -418 -430 -402 -381 -329 -325 -335 -342 -380 -467 -511 -494 -567 -535 -606 -529 -528 -508 -458 -388 -451 -458 -458 -531 -583 -609 -587 -556 -514
3657 -514 -504 -420 -373 -345 -300 -340 -390 -381 -405 -429 -379 -408 -312 -282 -147 -150 -138 -57 -100 -30 -144 -114 -147 -127 -39 -37 57 101 170 193
3687 193 235 240 172 184 167 187 172 189 282 322 388 429 436 463 438 447 391 408 384 413 414 443 504 592 573 604 592 562 506 483 451 402
3719 402 415 436 445 457 517 517 506 480 446 433 344 340 285 294 248 257 315 250 358 338 289 256 197 154 16 13 -27 -17 -15 -21 25 29 30 -45
3753 -45 -66 -125 -211 -219 -296 -302 -330 -315 -281 -308 -241 -233 -234 -294 -357 -453 -501 -500 -572 -497 -529 -430 -428 -438 -368 -402 -433 -483 -536 -593 -584 -592 -597 -521 -465
3788 -465 -385 -374 -398 -349 -389 -377 -431 -474 -478 -429 -413 -406 -345 -264 -206 -163 -214 -142 -191 -233 -217 -147 -224 -164 -138 -59 36 43 84 102 116
3819 116 100 89 72 90 110 129 161 289 324 308 397 365 384 349 285 309 339 357 326 381 436 505 541 538 534 488 520 447 428 385
3849 385 373 434 432 460 492 571 570 529 506 407 396 355 317 341 342 379 359 382 413 376 384 298 242 178 161 84 118 67 72 106 70 154
3881 154 84 88 46 -44 -56 -136 -186 -201 -230 -200 -144 -124 -169 -144 -192 -200 -311 -372 -395 -448 -423 -413 -408 -337 -354 -354 -317 -342 -401 -394 -491 -529
3913 -529 -559 -514 -546 -500 -469 -416 -391 -335 -376 -358 -420 -470 -447 -477 -501 -479 -450 -376 -327 -260 -251 -239 -264 -294 -267 -303 -334 -257 -253 -175 -72
3944 -72 -88 -11 14 16 37 8 -6 14 -45 11 85 91 139 140 264 259 282 280 283 228 255 243 280 299 258 428 452 428 453 474 488 397
3976 397 398 410 383 398 453 449 479 527 543 572 522 466 450 374 374 351 344 329 366 441 428 443 442 380 340 294 262 230 159 148 178 153
4008 153 204 181 195 200 163 99 43 28 -51 -51 -83 -83 -90 -99 -58 -67 -88 -85 -176 -195 -245 -318 -330 -319 -376 -313 -339 -283 -292 -340 -289 -368 -369 -438
4042 -438 -473 -535 -501 -418 -502 -399 -386 -385 -343 -420 -384 -447 -502 -494 -524 -464 -514 -408 -372 -309 -314 -293 -297 -306 -321 -341 -410 -377 -317 -269 -221
4073 -221 -169 -150 -106 -91 -73 -38 -102 -63 -190 -109 -48 -34 49 70 161 192 158 170 206 156 124 150 161 162 198 276 318 340 371 409
4103 409 366 376 330 348 292 319 315 396 410 425 467 464 505 493 462 407 380 319 334 374 351 383 386 400 462 420 403 358 321 310 232
4134 232 240 219 230 260 249 276 259 245 233 196 119 77 16 -23 13 -25 6 -22 37 21 5 -31 -127 -88 -210 -248 -285 -251 -241 -234
4164 -234 -197 -221 -200 -237 -261 -297 -336 -380 -354 -411 -483 -429 -399 -368 -372 -332 -359 -355 -398 -455 -489 -454 -499 -475 -454 -401 -376 -323 -338 -307 -301
4195 -301 -364 -387 -426 -437 -395 -380 -338 -249 -226 -207 -146 -141 -154 -179 -165 -231 -178 -185 -161 -90 -89 23 45 95 81 100 136 35 40 64 57
4226 57 181 159 225 228 295 280 264 286 273 258 313 279 264 313 308 360 383 433 459 483 474 408 402 387 292 320 326 368 392 445 431 466
4258 466 472 435 343 327 300 251 301 254 281 317 335 269 308 325 220 245 183 134 100 59 127 68 75 111 78 126 5 19 -40 -76
4288 -76 -119 -170 -154 -146 -121 -124 -129 -139 -110 -175 -166 -251 -281 -343 -348 -331 -397 -341 -294 -270 -266 -253 -309 -292 -349 -406 -482 -441 -493 -448 -414 -387 -334
4321 -334 -353 -266 -380 -330 -352 -398 -445 -415 -441 -431 -362 -285 -246 -222 -179 -193 -210 -206 -267 -261 -266 -243 -199 -156 -117 -48 7 17 -18 -45 -49
4352 -49 -45 -16 -7 -10 35 90 105 163 237 202 250 229 227 157 153 147 177 242 302 337 397 383 434 378 412 305 313 358 325 335 334 374 382 464
4386 464 457 438 462 388 385 354 307 302 296 328 280 333 362 396 346 386 328 228 226 158 135 124 179 138 163 175 167 137 106 101 5 -21 -67
4419 -67 -69 -67 -49 -66 -44 -14 2 -48 -111 -127 -153 -182 -294 -269 -254 -259 -258 -213 -215 -248 -176 -287 -318 -340 -353 -354 -351 -426 -392 -363 -372 -278 -299
4452 -299 -267 -322 -338 -396 -393 -443 -430 -368 -418 -340 -358 -227 -223 -215 -248 -271 -267 -307 -299 -267 -266 -257 -221 -155 -115 -53 -85 -65 -89 -114 -55 -71 -108
4485 -108 -90 32 -2 52 88 159 165 151 139 81 112 66 102 182 154 237 271 306 358 318 343 298 299 270 242 297 245 337 253 323
4515 323 401 397 435 394 389 335 326 261 276 287 292 358 341 400 398 385 346 351 278 241 196 207 177 181 231 226 228 210 262 201 137 153 43 0
4549 0 21 -6 15 41 61 48 36 28 -14 -88 -105 -153 -188 -198 -194 -183 -159 -179 -206 -229 -139 -188 -245 -320 -311 -348 -367 -388 -365 -302 -295 -241 -261
4582 -261 -274 -306 -347 -379 -391 -406 -459 -416 -371 -327 -293 -293 -230 -259 -242 -259 -347 -349 -389 -358 -296 -262 -257 -199 -135 -97 -117 -133 -117 -161 -186
4613 -186 -209 -189 -125 -85 -34 66 40 72 122 132 68 32 64 36 48 60 90 124 170 246 323 217 260 192 216 202 134 145 197
4642 197 275 310 351 374 384 408 324 373 312 234 253 309 291 261 318 360 410 424 428 383 362 321 219 246 167 237 201 276 308 250
4672 250 296 250 272 150 108 114 71 118 69 58 89 86 131 86 100 44 -39 -15 -133 -149 -179 -117 -116 -139 -113 -82 -106 -109 -114 -193 -228
4703 -228 -286 -277 -293 -247 -260 -276 -248 -204 -181 -200 -307 -255 -333 -380 -434 -431 -354 -380 -342 -318 -236 -276 -252 -316 -311 -337 -386 -367 -352 -319 -284
4734 -284 -214 -195 -148 -179 -118 -165 -208 -199 -219 -234 -247 -182 -158 -51 -37 -33 0 1 15 -63 -17 -4 -56 -1 -3 93 70 152 180 206 240
4765 240 202 191 139 93 103 149 173 230 289 264 365 354 267 327 284 244 236 206 239 268 290 354 390 374 376 333 347 276 240 210
4795 210 253 237 235 255 225 291 313 361 339 253 215 189 122 74 76 129 68 137 218 158 118 100 98 30 -23 -66 -106 -64 -56 -54 -41 -51
4827 -51 -9 18 -71 -116 -121 -207 -242 -206 -279 -248 -224 -227 -174 -163 -197 -221 -234 -306 -314 -350 -375 -337 -313 -307 -312 -314 -279 -270 -248 -323 -294 -323 -388 -356
4861 -356 -358 -329 -279 -241 -225 -215 -173 -206 -195 -286 -226 -269 -275 -283 -186 -173 -161 -115 -55 -103 -83 -92 -72 -114 -53 -104 -103 -31 21 78 110 118 96
4894 96 94 96 120 112 86 92 87 140 179 204 240 253 282 321 252 248 228 216 197 251 229 273 337 296 336 359 359 341 269 247 222 193 237 217
4928 217 287 330 296 315 288 302 241 235 199 143 180 146 171 164 220 202 213 222 164 124 88 54 38 -20 11 46 1 43 100 -20 17
4959 17 -26 -36 -120 -130 -100 -200 -205 -167 -182 -141 -145 -96 -135 -163 -183 -235 -232 -310 -315 -259 -262 -231 -239 -222 -202 -208 -306 -273 -332 -391 -339 -369 -383
4992 -383 -322 -297 -257 -227 -229 -176 -223 -233 -319 -260 -325 -277 -252 -196 -183 -134 -135 -138 -76 -145 -157 -156 -149 -169 -144 -125 -87 -64 -24 43 18 69
5024 69 102 22 36 32 -26 51 2 75 137 163 243 182 236 192 198 202 140 120 141 204 189 247 308 324 319 334 328 235 223 279 216 262 207
5057 207 252 265 302 303 321 319 268 240 182 224 199 154 180 185 232 252 246 264 207 249 135 107 96 83 52 84 86 80 79 107 101 70 87
5090 87 -37 -72 -68 -86 -148 -111 -57 -59 -27 -63 -80 -37 -97 -127 -143 -206 -317 -249 -213 -204 -206 -189 -176 -156 -225 -242 -274 -282 -323 -328 -326 -269 -309
5123 -309 -258 -207 -189 -221 -253 -274 -291 -301 -398 -340 -285 -277 -229 -190 -174 -124 -138 -130 -181 -160 -171 -154 -251 -149 -156 -129 -59 -93 13 19 10
5154 10 -20 -50 -18 -87 -43 -17 1 59 81 125 140 177 186 124 160 92 40 48 93 102 207 236 265 274 264 274 293 240 202 199 203 224 163
5187 163 257 265 339 360 315 328 294 232 184 187 188 195 164 210 264 291 301 296 248 206 173 165 97 100 51 141 85 153 183 89 190 101 106
5220 106 31 -24 15 -105 -60 -36 -53 -54 -30 15 -66 -42 -52 -120 -144 -157 -219 -227 -176 -158 -131 -119 -151 -169 -155 -190 -221 -289 -285 -319 -302
5251 -302 -333 -291 -241 -208 -181 -195 -207 -271 -299 -297 -316 -305 -307 -265 -281 -223 -186 -215 -133 -224 -165 -182 -224 -240 -239 -193 -207 -149 -94 -84 -101
5282 -101 -45 -11 -79 -55 -126 -80 -107 -119 -45 -4 20 48 88 96 96 97 37 19 52 66 76 57 120 144 210 221 248 238 195 228 134
5313 134 205 187 193 241 191 306 280 266 321 339 247 210 212 145 197 211 204 248 262 309 283 268 270 208 208 126 124 154 102 141 188 193 223
5346 223 144 177 136 139 41 53 1 -74 0 38 -15 -5 53 54 51 42 -7 -69 -134 -132 -169 -165 -153 -115 -112 -80 -63 -112 -142 -159 -176 -220 -286
5379 -286 -282 -263 -254 -223 -212 -159 -207 -196 -224 -186 -300 -297 -262 -323 -273 -327 -256 -181 -223 -178 -137 -218 -223 -243 -254 -278 -261 -269 -210 -147 -148 -92
5411 -92 -117 -105 -107 -114 -136 -73 -161 -153 -164 -164 -30 -22 39 10 73 82 35 23 16 16 -22 29 48 135 126 220 146 186 172 192 118 110 68 69 130
5446 130 158 216 233 293 305 282 245 213 209 189 181 170 152 214 241 249 283 293 281 230 234 185 187 142 131 116 171 199 197 199 201 165 168 114
5480 114 122 54 34 43 45 93 49 128 85 124 84 64 1 -71 -41 -112 -80 -148 -86 -54 -84 -33 3 -59 -80 -132 -157 -215 -177 -237 -217
5511 -217 -190 -192 -142 -166 -98 -140 -157 -209 -238 -295 -289 -299 -229 -287 -259 -196 -185 -162 -152 -191 -227 -233 -253 -278 -312 -235 -224 -186 -96 -128 -131 -107
5543 -107 -165 -143 -173 -174 -191 -154 -121 -117 -69 -54 -19 -36 -3 24 -44 -6 -59 -59 -66 -2 -23 59 67 84 161 117 116 114 116 69 65 121 109 105 164
5578 164 183 288 203 223 231 202 163 159 172 164 181 146 241 234 287 301 211 280 251 176 152 139 172 153 214 172 217 242 244 241 151 138
5610 138 80 82 58 25 56 28 87 91 115 148 91 78 54 -24 -42 -68 -83 -34 -38 -28 -32 -3 5 -8 -59 -74 -144 -210 -180 -189 -143 -147 -124
5643 -124 -105 -116 -127 -185 -146 -201 -204 -224 -284 -268 -230 -232 -234 -184 -173 -169 -165 -212 -232 -280 -279 -280 -291 -224 -220 -166 -125 -88 -138 -130 -196 -176 -207 -185
5677 -185 -198 -198 -206 -160 -106 -72 -69 -45 -48 -54 -105 -94 -103 -114 -57 -78 -17 27 -8 84 103 71 74 33 -20 25 30 45 71 101 142 150 141 144 158
5712 158 158 141 122 65 90 107 127 157 199 221 252 288 251 184 264 209 158 147 134 212 218 183 221 237 229 195 213 151 150 123 112 111
5744 111 86 155 169 171 198 177 105 84 83 18 3 -15 -18 8 45 38 36 30 39 -18 -19 -96 -108 -108 -118 -162 -131 -71 -119 -78 -55 -68 -112 -124
5778 -124 -181 -165 -171 -187 -231 -180 -206 -144 -129 -175 -142 -185 -164 -225 -243 -295 -283 -248 -214 -242 -173 -148 -166 -159 -163 -222 -229 -214 -169 -238 -200 -176
5810 -176 -181 -135 -87 -41 -74 -90 -107 -120 -169 -108 -157 -100 -85 20 -8 11 2 79 62 16 -7 -62 -7 25 -3 1 56 150 145 172 163 144
5842 144 120 86 159 91 62 135 127 195 195 276 240 219 224 215 199 109 179 110 158 144 224 276 252 293 238 227 194 172 135 135 90 152
5874 152 150 198 187 228 239 175 151 99 83 39 43 27 45 50 91 53 129 91 45 26 -12 -17 -75 -99 -90 -66 -43 -13 -52 2 -5 2 -62
5907 -62 -139 -180 -194 -170 -224 -189 -189 -146 -145 -90 -95 -120 -111 -208 -210 -236 -260 -255 -250 -229 -211 -139 -158 -132 -161 -207 -192 -243 -246 -217 -236 -223 -150 -162
5941 -162 -126 -62 -72 -87 -144 -123 -146 -175 -157 -144 -139 -81 -100 -41 -1 -9 -16 -36 -26 -38 -88 -35 -34 -3 55 38 77 107 120 94 91 108
5973 108 113 81 21 72 57 109 114 159 173 253 183 182 157 174 156 125 98 135 159 203 233 217 252 223 235 138 178 190 127 122 82 168
6005 168 149 177 214 175 179 155 125 130 76 22 49 90 57 104 111 135 149 84 95 24 -9 -68 -41 -20 -27 -46 -21 -1 -18 27 9 -60
6037 -60 -48 -144 -161 -176 -133 -153 -163 -119 -89 -74 -81 -119 -117 -170 -199 -234 -256 -270 -175 -189 -144 -135 -130 -125 -142 -193 -223 -178 -241 -239 -261 -203 -219
6070 -219 -137 -131 -107 -99 -128 -124 -182 -239 -228 -183 -182 -128 -135 -97 -63 -69 -11 -35 -41 -63 -113 -82 -87 -121 -102 -17 11 49 59 41 76 -5 41 30
6104 30 -25 28 -7 44 66 117 141 178 233 177 142 85 79 93 87 84 117 149 145 210 214 216 234 178 159 166 123 109 147 155 190 175 223 250
6138 250 206 186 186 100 144 92 85 76 104 67 108 162 152 146 143 69 68 23 2 -55 0 41 -5 17 43 53 29 33 7 -25 -65 -85 -113
6171 -113 -113 -53 -72 -51 -64 -24 -56 -76 -52 -116 -182 -193 -218 -211 -194 -155 -111 -107 -125 -128 -128 -147 -185 -183 -242 -221 -226 -222 -125 -150 -175 -89 -84 -115
6205 -115 -174 -141 -232 -195 -209 -133 -133 -154 -110 -128 -50 -70 -82 -96 -76 -65 -134 -67 -88 -37 -30 -41 20 41 77 24 22 3 38 4 -58
6236 -58 11 40 37 82 161 158 182 139 120 95 104 117 101 107 134 195 204 188 217 196 178 218 193 147 107 88 158 164 162 207 223 232 225 188 171
6271 171 167 105 79 111 133 121 130 168 199 130 219 143 102 101 12 37 -11 61 33 45 47 99 82 73 57 9 6 -4 -122 -89 -79 -31
6303 -31 -16 -26 4 6 41 -65 -68 -103 -155 -167 -165 -162 -138 -137 -111 -113 -41 -143 -126 -175 -179 -205 -205 -198 -191 -151 -189 -107 -130 -124 -104 -158 -123 -206 -156
6338 -156 -211 -213 -188 -172 -146 -107 -81 -125 -105 -39 -84 -151 -124 -154 -158 -129 -126 -76 -59 17 0 11 -3 -6 -127 -119 -60 -28 9 -24 73 45
6370 45 68 90 76 86 67 95 3 -20 49 45 119 100 174 177 181 181 114 144 89 79 108 75 111 143 166 139 190 182 207 164 119 95 67
6403 67 104 116 103 122 133 140 132 191 152 155 108 64 88 51 45 20 70 50 102 84 117 92 87 47 -7 -29 -27 -68 -49 -38 -14 34 41 -3
6437 -3 -19 -54 -56 -109 -102 -129 -157 -121 -124 -162 -95 -48 -70 -136 -160 -142 -163 -176 -203 -235 -222 -159 -117 -112 -123 -96 -78 -118 -169 -199 -217 -244 -220
6470 -220 -215 -138 -121 -90 -94 -156 -81 -130 -56 -162 -145 -142 -164 -120 -138 -17 -32 -37 44 -15 -24 -68 -98 -140 -102 -83 -43 19 12 39 50 83
6502 83 45 65 37 0 9 -14 48 58 66 90 109 127 202 161 166 115 48 52 64 96 71 88 115 145 203 168 182 180 111 135 86 87 129
6535 129 133 174 152 133 168 218 143 157 96 24 70 15 101 60 78 97 124 173 77 132 83 56 18 -35 33 21 28 -12 -3 52 46 52
6567 52 -3 21 -85 -85 -112 -123 -91 -80 -65 -78 26 -87 -54 -57 -113 -70 -173 -122 -172 -120 -154 -109 -116 -92 -51 -89 -136 -120 -189 -179
6597 -179 -232 -191 -185 -174 -203 -109 -118 -81 -118 -122 -115 -184 -138 -199 -164 -129 -135 -171 -63 -47 -60 -28 -62 -112 -75 -108 -111 -103 -80 -108 -29 -18 28
6630 28 34 -5 41 -2 2 -79 -50 -36 -16 -9 53 95 131 104 91 118 118 100 34 8 31 40 55 113 131 178 208 154 152 175 79 40 47 62
6664 62 128 93 117 168 225 200 246 215 105 113 67 93 109 65 129 125 140 120 114 138 132 97 73 26 -15 0 11 48 34 71 52 65
6696 65 49 -8 3 -39 -36 -67 -41 -56 -21 -31 26 17 -5 -23 -49 -51 -111 -121 -127 -160 -162 -155 -98 -96 -70 -88 -90 -71 -107 -176 -176 -163 -217 -187 -171
6731 -171 -156 -122 -135 -99 -102 -144 -115 -207 -192 -179 -148 -156 -127 -140 -124 -56 -22 -80 -122 -126 -121 -164 -123 -108 -102 -44 -95 12 -21 -25 -22 -28 -27 -50
6765 -50 -52 -87 -46 -42 7 -6 55 82 106 51 80 65 21 8 29 55 47 71 88 100 168 150 172 130 111 69 51 54 53 89 145 154 144
6798 144 183 190 170 164 123 120 79 62 36 72 62 128 160 133 166 165 122 58 68 69 17 30 54 74 71 112 117 98 112 55 12 19 -39 -47
6832 -47 -25 -21 27 28 4 -1 73 -12 -27 -75 -79 -99 -105 -84 -143 -86 -71 -15 -72 -70 -52 -98 -119 -182 -179 -174 -205 -148 -143 -101 -104 -81 -39 -59 -75
6867 -75 -121 -139 -195 -191 -185 -164 -117 -115 -81 -65 -60 -72 -54 -116 -124 -108 -170 -164 -155 -98 -53 -48 8 30 -27 -78 -66 -81 -89 -83 -93 -56 -38 21 67
6902 67 57 47 83 84 9 -5 -5 -5 -30 44 109 97 116 126 130 122 146 53 78 1 78 42 71 132 126 217 143 214 131 176 171 114 124 92
6936 92 53 129 123 136 148 153 162 160 160 120 103 24 31 41 118 82 83 139 143 149 105 123 56 46 3 -9 -16 33 30 41 66 55 25 13 7 26
6972 26 -57 -93 -102 -88 -71 -62 -43 -18 -32 -22 -68 -57 -97 -130 -126 -148 -115 -162 -103 -76 -117 -75 -76 -59 -100 -122 -146 -179 -162 -143 -165 -110
7004 -110 -91 -109 -109 -92 -103 -58 -113 -155 -118 -174 -164 -144 -116 -68 -55 -13 4 1 -95 -68 -46 -106 -111 -69 -75 -61 -7 -8 25 49 34 19
7036 19 9 9 -5 3 -5 0 59 81 73 98 106 124 43 53 49 61 32 12 110 104 147 130 195 137 158 97 87 107 107 79 83 135 136 148 176 172
7072 172 118 174 145 105 95 82 58 12 67 99 113 114 115 111 109 107 53 62 33 -39 11 -8 25 38 91 83 26 62 2 -1 -40 -47 -61 -76
7106 -76 -46 -53 19 -22 44 -18 -1 -48 -45 -113 -109 -106 -99 -104 -88 -89 -3 -52 -46 -67 -108 -91 -178 -178 -140 -118 -134 -120 -123 -84 -52 -89 -81 -101 -119 -149
7142 -149 -166 -141 -189 -138 -111 -92 -16 -49 -21 -61 -59 -98 -123 -113 -164 -132 -54 -90 15 5 16 28 11 -32 -46 -40 -42 -60 -64 -64 26 30
7174 30 72 97 20 66 96 -4 -9 32 -27 44 30 71 109 119 184 108 106 104 61 57 47 76 61 67 100 132 163 92 141 137 117 102 76
7207 76 85 63 81 47 104 139 135 139 137 146 25 49 22 -14 62 9 32 47 100 87 97 94 65 33 2 -1 -28 -35 -10 -6 -13 39 16 11 -14
7242 -14 1 3 -63 -71 -109 -102 -68 -87 -128 -65 -19 -58 -55 -61 -91 -93 -105 -141 -174 -126 -113 -93 -86 -42 -17 -68 -74 -144 -79 -204 -117 -166 -148 -122
7276 -122 -94 -54 -80 -99 -50 -72 -58 -157 -95 -109 -152 -53 -89 -34 -17 -29 -60 -27 33 -84 -83 -119 -83 -52 -44 -8 10 36 50 29
7306 29 39 5 13 50 -19 36 47 38 73 84 83 120 103 74 75 91 60 7 104 74 59 120 138 171 154 155 121 114 129 75 83 35 39 102
7340 102 77 82 180 176 130 132 103 76 115 -5 77 40 55 50 100 129 87 124 58 56 24 44 -7 -2 -43 -1 12 50 12 59 -23 56
7372 56 15 -52 -82 -78 -96 -103 -80 -43 -54 -38 10 -20 -66 -83 -91 -138 -118 -154 -137 -147 -75 -42 -68 -28 -67 -59 -106 -136 -133 -150 -144 -171 -129
7405 -129 -116 -64 -50 -61 -51 -95 -97 -192 -130 -145 -155 -168 -114 -108 -53 -81 -31 -43 -52 -47 -86 -88 -93 -96 -68 -82 -60 -1 22 23 21 53 10 -81
7439 -81 -65 -9 13 -20 3 67 7 46 109 69 56 59 49 6 -3 15 17 62 54 88 93 98 141 117 115 73 72 50 32 75 75 96 153 138 133
7474 133 140 127 35 118 58 49 -15 72 51 93 117 119 115 67 84 79 45 43 -31 16 1 -11 81 65 103 22 74 28 26 -38 -15 -52 -55 -92
7508 -92 -4 -25 -62 -6 11 -38 -44 -36 -61 -57 -121 -78 -105 -87 -78 -49 21 -45 -77 -14 -99 -84 -114 -135 -130 -105 -131 -77 -56 -53 -15 -29 -110
7541 -110 -89 -156 -91 -181 -121 -131 -108 -35 -84 -32 -40 -27 -83 -101 -118 -78 -101 -131 -51 -107 -37 -24 -11 22 28 25 -28 -72 -63 -75 -27 -44
7573 -44 -53 16 31 79 51 106 11 60 14 -27 -6 -1 -2 32 106 116 101 99 107 148 65 54 35 12 58 17 79 100 105 127 109 147 114
7606 114 103 72 8 50 45 24 108 98 101 96 98 76 63 59 39 26 -10 9 23 28 46 69 105 46 56 8 21 -31 -42 -44 -50 -45 -31 -4
7640 -4 -17 13 6 8 -22 -67 -25 -88 -87 -119 -127 -61 -71 -8 -32 -16 -55 -36 -43 -81 -126 -156 -124 -112 -126 -51 -54 -38 -49 -70 -86 -135 -120 -137
7674 -137 -117 -159 -93 -114 -100 -38 -127 -64 -63 -65 -65 -86 -106 -145 -112 -135 -74 -60 -38 -31 56 8 -11 -40 -23 -75 -77 -63 -108 -11 9 0 62
7707 62 42 39 52 15 -14 20 -69 -5 36 80 87 89 84 56 116 94 68 96 33 42 46 9 74 156 108 86 141 131 170 59 93 49 18
7740 18 56 101 105 97 136 156 113 117 89 130 39 15 80 31 46 103 81 111 79 53 71 102 21 40 -26 -19 -4 -7 37 18 27 32 47 23
7774 23 13 11 -43 -39 -85 -54 -89 -66 -38 2 20 5 -20 -68 -48 -59 -98 -90 -95 -144 -88 -44 -33 -25 -48 -61 -121 -54 -139 -152 -123 -123 -89
7807 -89 -129 -44 -54 -74 -30 -45 -34 -133 -132 -122 -129 -106 -94 -87 -41 -8 -18 -44 -6 -57 -40 -96 -160 -128 -39 -33 -53 -42 27 44 26 13
7839 13 1 -33 -34 -91 -39 -30 -1 52 55 58 78 66 64 97 40 2 17 17 42 3 59 61 80 125 92 101 101 55 34 45 78 42 88 66 104
7874 104 103 112 166 105 92 72 66 24 17 35 64 61 91 102 88 60 110 97 24 25 34 9 40 9 -13 -7 88 83 78 10 34 -38 -32 -62 -50
7909 -50 -49 -44 -8 -12 -28 36 14 -54 -81 -16 -65 -133 -59 -121 -91 -76 -53 -42 -51 -53 -35 -58 -113 -75 -76 -117 -110 -155 -89 -73 -40 -19 -54 -77
7943 -77 -96 -94 -126 -116 -130 -139 -95 -93 -41 -53 -9 -57 -97 -62 -80 -155 -92 -56 -43 -77 14 -36 -12 42 28 2 -113 -29 -57 -60 -23 -42
7975 -42 -2 11 23 51 67 75 44 48 -30 -14 5 -13 0 -7 55 93 67 108 96 78 57 34 11 49 16 46 83 62 112 113 128 142
8007 142 72 32 47 49 -41 8 36 15 102 89 99 90 92 80 78 29 28 -2 -23 54 27 30 45 73 82 62 37 27 -27 -14 -56 -73 -8
8040 -8 -2 7 14 13 38 28 -13 5 -82 -100 -103 -71 -50 -95 -77 -17 -21 -29 -13 -48 -88 -53 -124 -113 -85 -54 -84 -66 -81 -40 -21 -31 -57 -100
8074 -100 -91 -131 -94 -126 -110 -109 -39 -35 -18 -16 -28 -37 -91 -135 -115 -152 -118 -79 -76 6 -63 -19 -14 37 -48 -16 -16 -51 -37 -60 -23 41 -12 48
8108 48 51 38 18 41 -30 17 -2 -36 6 -14 25 61 96 73 105 108 21 78 12 15 24 57 16 36 67 106 142 160 101 80 35 63
8140 63 4 31 35 83 93 111 83 139 117 110 94 71 53 18 59 21 50 24 52 100 72 59 72 83 -9 10 -19 -13 -24 -17 29 16
8172 16 36 42 39 46 -32 10 -55 -56 -66 -75 -117 -54 -4 5 -35 -16 -35 -55 -102 -83 -141 -99 -83 -63 -87 -69 33 -52 -13 -99 -94 -74 -137
8205 -137 -106 -149 -91 -73 -71 -23 -50 -22 -29 -42 -81 -51 -97 -126 -122 -136 -100 -48 -56 -17 -32 -10 -37 -21 -43 -82 -23 -78 -70 -49 -28 -16
8237 -16 18 9 28 21 11 1 -19 -77 -40 -28 3 11 51 49 92 50 28 41 23 9 -43 20 3 -1 100 81 75 109 130 89 10 17 58
8270 58 18 30 30 74 68 98 86 107 100 68 77 42 -6 -43 15 54 15 63 78 65 85 59 71 -11 52 -8 -30 -28 -41 11 33 43 -1
8303 -1 27 68 10 -35 -19 -6 -50 -101 -27 -74 -5 -2 -4 -16 -34 -10 -75 -37 -91 -47 -94 -112 -70 -83 -42 -8 -45 -45 -58 -55 -86 -110 -103
8336 -103 -103 -112 -83 -33 -87 2 -47 -9 -17 -88 -94 -119 -81 -116 -74 -52 -52 -25 -57 -54 -34 -7 -47 -138 -83 -76 -156 -84 -80 35 -36 -9 -8 47
8370 47 -11 -32 -49 -88 -12 -83 -40 39 19 26 39 82 57 8 -15 28 21 -27 20 -29 4 25 27 60 60 136 58 40 -14 30 76 33
8402 33 45 69 106 94 104 104 51 97 33 72 13 -16 7 23 25 42 106 115 97 117 84 67 36 -16 20 -4 10 51 2 68 75 72 1
8435 1 56 30 22 -60 20 -24 -3 -41 9 12 1 53 20 64 -11 -57 -87 -24 -92 -31 -52 -36 -3 14 -13 -20 -58 -70 -87 -92 -99 -68 -118
8468 -118 -77 -48 0 -63 -44 -2 -3 -55 -98 -71 -68 -76 -74 -71 17 -66 -37 -7 -20 -37 -47 -117 -127 -75 -96 -100 -60 -42 -17 18 -28 0 -26
8501 -26 -25 -56 -74 -37 -115 -52 -10 8 -3 53 74 47 52 -9 -1 32 -1 -36 -42 19 43 58 142 73 60 52 52 49 33 -4 -9 22 24 77 73
8536 73 106 84 114 72 50 14 7 8 7 46 59 20 95 89 94 72 32 21 7 21 -9 13 5 49 84 84 104 44 45 55 -1 -13 -22 -29 2
8571 2 21 -30 21 89 24 60 37 27 5 -42 -58 -85 -65 -82 -45 -8 -40 6 8 -33 -51 -71 -96 -112 -70 -163 -97 -96 -55 -6 -43 -35
8603 -35 -24 -45 -71 -119 -60 -114 -96 -75 -68 -76 -51 -92 -34 -66 -91 -79 -55 -140 -107 -93 -59 -35 -6 -44 -13 4 -29 -74 -81 -35 -106 -94
8635 -94 -48 -86 12 -35 -7 27 46 16 -1 -3 -40 -2 -3 -53 -15 15 61 7 32 29 31 44 9 -25 -4 -3 13 -17 79 4 71 82 88
8668 88 57 23 38 -18 26 25 -10 4 37 79 60 132 159 103 68 23 -21 38 25 -11 56 86 70 87 77 68 74 21 16 13 -13 -1 -38
8701 -38 34 55 51 43 79 21 30 26 5 -34 -24 -57 -54 -85 -21 -50 -15 32 1 22 -49 -47 -38 -104 -110 -83 -47 -71 27 -20 1 -16 -47 4
8735 4 -89 -110 -129 -101 -82 -65 -76 -66 -51 1 -11 -42 -45 -91 -111 -75 -119 -106 -112 -95 -5 -56 3 -9 -12 -33 -98 -31 -96 -100 -79 -41 -3
8768 -3 8 -16 16 13 2 -22 -35 -7 -29 -54 -28 -23 -18 44 70 53 48 31 37 24 -15 -18 38 14 53 75 93 91 55 65 62 39 51 -2 10
8803 10 8 50 62 62 86 83 129 116 78 25 44 -2 0 -11 -17 78 70 17 111 97 33 39 58 77 18 -8 32 30 31 35 48 45 108 53 38 20
8839 20 -29 -66 -16 -22 -21 -21 23 20 13 51 -3 -1 7 -74 -69 -93 -20 -55 -41 -19 -36 16 12 25 -59 -36 -53 -65 -53 -86 -50 -45 -14 -49 -30
8874 -30 32 -3 -40 -47 -80 -81 -110 -54 -82 -88 -43 -25 -20 28 -7 -15 -84 -62 -97 -71 -43 -65 -1 6 -27 -15 24 24 -5 -34 -48 -37 -55 -39
8908 -39 0 8 47 -9 47 47 17 -2 -22 -7 -41 -3 13 -1 27 55 40 22 102 67 40 28 13 48 -28 -10 30 66 63 31 103 91
8940 91 35 106 48 60 34 12 11 51 76 67 62 87 169 42 46 77 -4 -8 -41 36 -9 67 55 68 85 90 98 2 4 -17 -82 -34 -53 39
8974 39 -23 14 65 54 46 15 22 -18 -78 -17 -95 -39 -41 -3 -49 -38 34 -62 -9 1 -37 -77 -74 -66 -68 -74 -42 -45 -8 -39 -8 -69 -17 -34
9008 -34 -88 -95 -133 -70 -73 -84 -8 16 16 -19 -41 -23 -49 -109 -62 -117 -79 -64 -36 -8 -36 -7 17 -30 -47 -9 -59 -90 -74 -49 -54 -4
9040 -4 -10 4 72 37 4 -10 7 -35 -2 -47 -7 -23 37 70 47 92 58 53 52 41 63 -4 4 -19 14 32 44 101 129 83 40 68 44
9073 44 -13 1 12 -22 15 26 65 70 120 94 79 69 23 13 20 -8 5 58 44 60 77 51 88 72 72 27 -26 7 -21 0 18 14
9105 14 75 -10 41 58 -14 -10 -41 -28 -61 -59 -77 -61 -12 12 20 13 40 7 7 -92 -69 -11 -105 -88 -62 7 -38 -6 4 -18 -11 -40 -43 -75
9139 -75 -63 -72 -53 -36 -65 -30 -47 1 -18 -48 -24 -95 -58 -107 -82 -85 -65 -60 -44 -13 -34 -12 2 -5 -58 -80 -40 -88 -69 -41 -10 0
9171 0 35 57 41 4 -41 -27 -60 -18 -100 12 -25 -2 13 15 69 49 62 20 -22 -1 -7 3 5 78 -1 64 61 57 79 80 82 3 35 9
9205 9 26 42 71 73 69 85 107 75 89 32 21 8 28 -4 4 58 60 79 60 83 125 72 -10 51 4 -63 5 11 20 45 68 56 80 98
9239 98 26 -24 46 33 -24 -57 14 -6 -37 40 27 44 48 -26 27 -26 -33 -17 -35 -54 -53 -7 -40 21 -33 19 39 -31 -45 -58 -103 -68
9271 -68 -15 -37 -63 -9 -23 -22 21 -38 -25 -64 -79 -70 -73 -47 -72 -81 -13 15 -24 -43 -15 -44 -43 -95 -91 -82 -47 -40 19 9 20 46 17 29
9305 29 -34 16 -28 -38 -60 -45 -37 8 -5 55 -5 40 50 -10 -41 -65 42 -3 -4 21 47 52 -5 35 45 25 -4 -12 -14 -26 32 -21
9337 -21 32 64 53 68 69 65 27 23 6 -16 1 11 36 30 62 77 75 86 60 62 -2 9 50 -25 14 -7 39 80 71 56 47 90 9 3 -2
9372 -2 -10 -59 -34 -25 -34 -11 61 30 29 17 28 -6 -42 -41 -26 -9 -37 29 -43 29 6 10 -38 7 -46 -95 -32 -43 -79 -88 -68 -1 -6 30 7
9407 7 8 -21 -44 -105 -96 -80 -78 -55 -39 -40 34 9 10 -77 -63 -18 -37 -49 -124 -72 -69 -80 -13 -20 55 7 -33 -4 -47 -50 -94 -59 -56 -67 -49
9442 -49 31 32 33 -2 41 12 4 -30 -8 -6 -39 -39 4 28 24 66 67 -8 43 -1 41 4 20 21 49 54 41 73 82 80 52 38 18 27 18 -34 -23
9479 -23 27 42 82 51 88 69 72 55 38 5 -1 8 -2 26 20 60 43 33 88 3 7 45 44 2 -25 -20 -12 45 45 73 71 33 15 34 -20
9514 -20 6 -34 -41 -41 -30 24 2 19 1 32 27 -55 -45 -85 -105 -69 -54 -34 -25 -53 -17 33 1 6 -54 -71 -75 -88 -67 -50 -84 -47 -55 -61
9548 -61 -16 -2 -7 -33 -32 -105 -86 -91 -64 -78 4 -9 -17 17 15 31 -19 -47 -30 -35 -41 -59 -13 -46 38 -13 49 -12 -13 -25 -43 -49 -30 -31 -47
9583 -47 -2 -7 47 80 33 19 7 14 -9 -43 -19 -65 11 30 34 44 73 94 89 92 43 -6 5 47 46 11 14 38 40 79 60 69 59 3 4
9618 4 -12 10 4 48 48 39 73 48 81 52 51 41 1 12 12 -6 25 -41 41 -31 36 87 20 38 14 4 -43 -1 -39 -24 -6 17 92
9651 92 -9 57 52 60 21 -32 -34 -57 -38 -119 -16 10 48 16 18 49 -53 8 -67 -25 -33 -75 -42 -55 -8 -13 39 16 -26 -26 -44 -50 -83
9684 -83 -66 -53 -78 -53 -8 -21 16 28 10 4 -20 -61 -45 -85 -13 -31 -63 5 -23 -25 24 -66 33 27 -53 -28 -80 -45 -38 8 36 32 58
9717 58 -7 50 -24 5 28 -28 17 -40 -2 -11 24 16 58 41 66 44 18 3 -45 -7 -5 -12 73 22 54 83 62 118 53 48 12 2 1
9750 1 -31 26 46 56 55 74 107 48 16 46 19 17 -8 -5 -15 2 0 73 88 52 96 44 52 14 -7 -24 -47 -12 41 8 25 12 6 41
9784 41 40 -39 -42 -60 -26 -32 -12 5 -6 1 55 16 24 -34 -13 -67 -58 -40 -40 -30 -42 16 -32 8 8 -10 -4 -34 -73 -121 -67 -79 -58 -44 -67
9819 -67 16 -34 15 45 -51 -51 -107 -82 -89 -87 -53 -60 6 -28 21 -25 35 -30 -63 -78 -75 -62 -67 -24 -21 12 -4 0 3 -4 20 -42 -30 -42 -96
9854 -96 1 15 -4 13 66 45 9 53 28 1 -5 -18 -7 -23 46 41 68 82 86 51 59 10 4 -20 -37 -35 6 62 61 55 70 109 57 71
9888 71 11 43 37 -31 -6 7 -19 71 82 78 35 96 38 48 19 -6 20 -28 -37 -9 41 35 21 81 9 54 8 4 5 8 4 -95 4 -5 17
9923 17 -8 -20 10 22 19 -39 -56 -81 -40 -38 -12 -1 -15 -22 15 0 17 4 -33 -53 -39 -50 -33 -53 -70 -10 -29 -28 -29 -36 -26 -42 -68
9956 -68 -87 -37 -61 -43 -23 3 3 20 9 -14 -31 6 -76 -83 -56 -45 -86 -32 8 -20 6 40 0 -17 24 -67 -63 -66 -33 -45 25 -31
9988 -31 -2 18 35 -2 38 8 -72 -5 -24 -44 -41 0 20 48 81 33 79 75 20 20 -40 -10 -5 12 28 37 95 105 25 13 26 -47 -54
10021 -54 18 -25 -40 6 50 69 86 55 83 66 -24 41 58 -50 14 13 15 27 49 78 58 39 18 -36 -28 -21 -50 -48 -26 7 14 54
10053 54 25 50 0 -45 -25 -23 -13 -52 -62 -12 -29 -12 -27 6 -1 14 -12 -40 -50 -39 -47 -55 -7 -63 1 -16 -35 -2 -5 35 -42 -44 -38
10086 -38 -30 -56 -14 0 -6 11 -34 8 34 -24 -7 -69 -68 -110 -86 -42 -32 7 -1 20 -24 17 0 -56 -64 -19 -19 -37 -27 25 1 24 56
10119 56 29 19 59 4 -7 -11 -32 -36 38 -23 21 42 26 29 61 61 -4 27 12 7 5 -11 10 33 42 83 52 114 65 13 -10 -25 11
10152 11 -24 44 9 19 42 90 45 23 30 7 22 -12 6 -3 12 -26 52 54 39 34 33 53 10 -10 5 -40 -10 -27 -46 6 12 35 52
10185 52 21 -30 -7 -41 -32 -11 -45 3 39 24 -27 -18 9 -41 -13 -44 -33 -30 -105 -9 -60 -13 -42 -29 38 0 -29 -23 -44 -37 -63 -32
10217 -32 -111 -36 -60 -39 -6 -6 -5 -17 -37 -6 -38 -57 -68 -36 -93 -49 -30 37 15 -40 -21 25 -37 -80 -49 -73 -83 -35 -17 -47 25
10248 25 33 79 30 -21 -33 -27 -28 -26 -18 9 30 -17 31 60 -5 28 1 -19 -35 -30 14 -71 -3 19 16 24 22 51 58 25 -7 27 -8 7 -4
10283 -4 -22 71 59 60 30 48 61 -35 49 -13 23 -24 -9 17 4 76 30 80 57 58 15 -9 10 -3 -49 25 27 3 12 41 71 89
10315 89 14 -2 29 -26 -76 -1 -46 -33 -10 -15 12 24 59 -1 -5 -8 -29 -58 -54 -46 -75 22 -13 -16 25 24 12 -38 -52 -96 -51 -32 -46
10348 -46 -42 -89 -32 -20 4 -9 1 -21 -2 -1 -21 -43 -45 -24 -51 -16 -6 12 35 2 -46 -11 -48 -31 -56 5 -41 -18 18 34 4
10379 4 -25 22 -3 -45 -51 -28 -56 -69 35 0 42 -6 45 68 36 34 -38 -40 -53 -18 0 8 -2 48 53 63 71 72 60 16 46 -11 11
10412 11 -28 -11 27 27 61 83 72 20 56 8 -4 -2 -23 22 -5 75 17 62 72 40 59 30 -23 -18 -24 -6 -22 63 26 42 55 63
10444 63 49 37 32 6 -25 -20 -31 -3 -11 -24 -17 1 11 22 17 -22 -20 -63 -9 -59 -40 -8 -42 74 -1 0 -1 -11 -39 -62 -55 -64 -54 -74
10478 -74 -35 0 32 0 20 -16 -3 -46 -60 -84 -88 -84 -38 -33 -16 2 -50 -9 -19 -45 3 -42 -68 -71 -36 -35 -33 -30 6 26 14 -6 -27
10511 -27 3 -34 -64 -61 -91 -24 -12 0 -7 -13 -4 33 -7 -10 -25 -56 -9 -8 -3 5 52 15 65 35 35 30 -48 40 -36 -12 -26 -2 10 26 93
10546 93 56 60 15 62 36 -55 -28 -35 4 -15 9 52 64 72 47 55 30 68 -5 -6 22 -2 20 22 41 51 53 21 43 41 9 -20 -22 -20 31
10581 31 3 12 8 33 7 34 6 -4 -35 -26 -40 -7 -23 4 24 38 8 -26 38 -13 33 39 -38 -99 -87 -59 -68 -32 1 -9 -11 -19 -9
10614 -9 -39 -31 -76 -47 -52 -44 -22 -6 -13 -14 -19 -30 -34 -43 13 -45 -38 -18 -44 -64 -27 -84 1 -2 4 9 -24 -27 -67 -63 -99 -18 -3 -40 5 22 1
10651 1 24 18 -3 -26 -33 -49 -64 -15 -39 -11 24 33 33 39 26 28 19 -12 -43 -31 13 -4 -7 7 43 65 44 78 20 10 -13 -32 11 28
10685 28 9 47 -30 24 25 91 40 23 -26 -10 12 -3 4 39 29 33 50 68 78 47 19 -14 24 -18 -35 35 -16 51 32 100 44
10716 44 51 33 59 2 -31 -54 -38 3 -26 -37 19 -8 28 29 42 9 -32 3 -11 -56 -34 -2 -51 -1 1 11 -35 12 -1 -3 -69 -33
10748 -33 -50 -45 5 -42 -30 27 -22 -29 23 1 -16 10 -35 -52 -36 -25 -25 -24 29 24 34 -13 -41 -47 -51 15 -64 -24 -38 -46 26 31 30 -6 13
10783 13 20 -26 -27 -31 0 -21 -16 -23 50 44 45 42 28 40 -16 -12 -4 -23 -9 16 35 27 27 59 2 65 14 -9 -27 -14 -23 31 22 65 39 42 23
10820 23 72 29 61 7 -12 -22 38 -27 -7 81 15 27 31 57 43 -4 54 10 12 -29 8 31 -17 29 -23 65 37 39 3 -42 -32
10851 -32 -20 -4 10 -33 -1 -16 20 39 9 -18 10 -24 -13 -41 -18 8 -14 1 4 18 11 -5 26 -26 -79 -22 -88 -17 -49 -49 -23
10882 -23 11 26 -2 12 15 19 -48 -50 -38 -90 -64 -32 -3 -31 -28 11 3 -20 -11 -72 -26 -66 -55 -50 2 5 -32 51 -3 45 -9 2 -17 -17
10916 -17 -27 -66 -25 -25 -15 44 16 40 28 70 8 1 -25 -26 55 -12 6 -9 35 7 48 55 60 11 -21 -7 -2 -5 -10 5 29 53 24 49
10950 49 27 36 -12 -30 -27 -32 18 28 54 35 52 46 47 15 11 -14 39 31 -24 -30 42 39 24 25 23 90 37 20 2 -25 -4 -20 -36 -16 -33
10985 -33 19 -16 22 7 16 3 44 21 -5 -47 -39 -19 -29 60 21 -3 26 25 2 -29 -23 -80 -56 8 -25 10 -32 33 42 38 11 46 -3
11018 -3 -48 -8 -51 -76 -29 -10 22 -21 -14 12 2 -2 -30 -40 -80 -43 -53 -48 5 -24 45 24 31 10 4 -42 -20 4 -15 -63 -53 34 -38
11051 -38 6 50 10 -16 -11 43 -54 -46 -13 -60 -15 9 21 28 -2 25 48 16 25 5 21 4 -27 6 14 36 62 22 25 22 27 -45 -17 -40
11085 -40 -27 -25 -1 7 51 64 84 66 60 13 27 14 2 -36 -10 -4 -13 66 50 80 43 47 21 8 -8 -24 16 -28 -47 9 55 16 89
11118 89 69 46 -11 -14 10 -43 -74 -47 -31 45 13 50 39 53 44 -12 -19 10 -56 -57 -56 -40 -30 -65 50 62 52 -12 -14 -5 -72 -42 -50
11151 -50 -45 -51 -40 -1 -2 26 8 59 -10 -41 -3 -41 -36 -70 34 28 -10 50 7 51 -11 -22 -22 -19 -20 -37 24 4 -34 21 -1 29 -33
11184 -33 26 -20 -20 -60 -45 -60 -17 17 -4 22 43 15 -20 17 15 20 -31 -12 -30 -6 20 35 19 45 33 55 -2 33 -13 -49 -16
11215 -16 -19 -37 39 42 35 51 49 65 48 35 22 6 1 23 -25 31 36 32 73 66 24 73 48 -9 -7 -7 -25 11 6 -8 71 38 67 51 -2
11250 -2 -19 -4 -29 -13 -17 -12 21 -6 17 -22 -8 -4 -22 28 -6 -47 -73 -33 -27 -30 -12 -1 33 38 -17 15 19 -25 -8 -100 -53 -46 -62 -20
11284 -20 -37 25 -13 -8 -18 -6 -46 -60 -75 -94 -57 -36 16 27 -3 10 -54 -1 -41 -31 -75 -48 -18 -2 -3 -34 4 -58 -27 -4 -31
11315 -31 -58 -11 -85 -37 -22 -53 -58 9 10 -10 6 -2 26 -8 -8 24 -60 -51 18 -8 16 22 36 9 29 4 23 -28 4 -27 9 13 1
11348 1 6 1 32 67 69 34 -17 8 -17 -17 6 -33 31 -4 38 31 32 40 -32 -3 -16 11 -51 -20 32 -18 40 -7 29 45 14 32 28 50
11382 50 -39 8 -22 -43 44 -22 -1 5 63 28 28 -60 -44 -26 -20 -13 13 -37 19 58 6 -23 6 -51 -35 -20 -27 -19 -32 -17 -41 -29 6
11415 6 21 -5 -27 -24 -26 -35 -8 -24 -7 -65 7 55 2 34 24 -5 22 -15 -46 -23 -46 -50 -25 -48 -51 -15 7 53 15 -6 -38 -76 -14
11448 -14 -49 -53 -6 -24 40 -2 41 -20 24 8 31 -29 -56 0 -64 1 34 -1 32 28 17 20 10 -72 -6 -27 -20 -37 2 40 -29 45
11480 45 70 39 73 4 28 11 -40 4 -20 -15 36 53 39 65 49 59 39 18 -9 -24 -19 -7 -2 35 6 47 52 59 37 4 -16 -5
11512 -5 4 -6 -25 -24 43 67 25 60 29 32 20 22 14 -49 -29 -7 -2 4 47 28 48 10 50 -27 -1 -20 -7 -32 -42 -17 -80 2 5 34
11546 34 49 25 -42 -70 -43 -7 -23 -44 -27 -5 -4 -14 -4 53 45 -22 9 -59 -42 -66 -53 -35 -19 19 8 20 -7 24 -3 -55 -1
11577 -1 -62 -51 -26 -65 2 -3 14 21 24 12 -21 -1 -54 -81 -31 -22 -7 -3 -3 36 48 66 -12 25 -42 -23 -46 -25 7 5 46 12 87 56
$$ [...]
16383G
##END NTUPLES=NMR FID
##END=
