##TITLE=1H_DE-80H_X3
 200.13MHz, d2o
 8 sc
 
 19ns.26.2.2025
##JCAMPDX= 6.0         $$ Bruker NMR JCAMP-DX V2.0
##DATA TYPE= NMR FID
##DATA CLASS= NTUPLES
##ORIGIN= UXNMR, Bruker Analytische Messtechnik GmbH
##OWNER= pz
$$ XWIN-NMR		Version 3.5
$$ Tue Apr  1 10:36:48 2025 Russian Standard Time (UT+4h)  Yarkov@DPX200
##.OBSERVE FREQUENCY= 200.1313
##.OBSERVE NUCLEUS= ^1H
##.DELAY= (6, 6)
##.ACQUISITION MODE= SIMULTANEOUS
##.ACQUISITION SCHEME= undefined
##.AVERAGES= 8
##.DIGITISER RES= 18
##SPECTROMETER/DATA SYSTEM= spect
##.PULSE SEQUENCE= zg30
##.SOLVENT NAME= CDCl3
##.SHIFT REFERENCE= (INTERNAL, CDCl3, 0, 14.3821)
##AUDIT TRAIL= $$ (NUMBER, WHEN, WHO, WHERE, WHAT)
$$ ##TITLE= Audit trail, XWIN-NMR		Version 3.5
$$ ##JCAMPDX= 5.01
$$ ##ORIGIN= Bruker BioSpin GmbH
$$ ##OWNER= Yarkov
$$ C:/Bruker/XWIN-NMR/data/yarkov2/nmr/H-C/1/audita.txt
$$ ##AUDIT TRAIL=  $$ (NUMBER, WHEN, WHO, WHERE, WHAT)
(   1,<2025-04-01 10:34:53.57 +0400>,<Yarkov>,<DPX200>,
      <created by zg, POWCHK disabled, PULCHK disabled
       configuration hash MD5:
       00 E9 B6 7A A2 85 ED C7 34 08 36 98 17 FE 4E 26
       data hash MD5: 16K
       EE 92 5D 0E 05 D0 B3 29 C4 62 25 5E 52 F9 37 F7>)
$$ ##END=
$$ 
$$ hash MD5
$$ 3B 05 45 72 38 95 CA F5 D7 C2 44 4C 29 1D 6C 39
##$RELAX= 
##$RELAX= 
##$RELAX= 
##$RELAX= 
##$RELAX= 
##$RELAX= 
$$ Bruker specific parameters
$$ --------------------------
##$DU= <C:/Bruker/XWIN-NMR>
##$EXPNO= 1
##$NAME= <H-C>
##$PROCNO= 1
##$TYPE= <nmr>
##$USER= <yarkov2>
##$AMP= (0..31)
100 100 100 100 100 100 100 100 100 100 100 100 100 100 100 100 100 100 
100 100 100 100 100 100 100 100 100 100 100 100 100 100 
##$AQSEQ= 0
##$AQ_mod= 1
##$AUNM= <au_zg>
##$AUTOPOS= <>
##$BF1= 200.13
##$BF2= 200.13
##$BF3= 200.13
##$BF4= 200.13
##$BF5= 200.13
##$BF6= 200.13
##$BF7= 200.13
##$BF8= 200.13
##$BYTORDA= 1
##$CFDGTYP= 0
##$CFRGTYP= 5
##$CHEMSTR= <none>
##$CNST= (0..31)
1 1 145 1 1 1 1 1 1 1 1 1 1 1 1 1 1 1 1 1 1 1 1 1 1 1 1 1 1 1 1 1 
##$CPDPRG= <>
##$CPDPRG1= <>
##$CPDPRG2= <>
##$CPDPRG3= <>
##$CPDPRG4= <mlev>
##$CPDPRG5= <mlev>
##$CPDPRG6= <mlev>
##$CPDPRG7= <mlev>
##$CPDPRG8= <mlev>
##$CPDPRGB= <>
##$CPDPRGT= <>
##$D= (0..31)
0 0.7 0 0 0 0 0 0 0 0 0 0.03 0 0 0 0 0 0 0 0 0 0 0 0 0 0 0 0 0 0 0 0 
##$DATE= 1743489293
##$DBL= (0..7)
120 120 120 120 120 120 120 120 
##$DBP= (0..7)
150 150 150 150 150 150 150 150 
##$DBP07= 0
##$DBPNAM0= <>
##$DBPNAM1= <>
##$DBPNAM2= <>
##$DBPNAM3= <>
##$DBPNAM4= <>
##$DBPNAM5= <>
##$DBPNAM6= <>
##$DBPNAM7= <>
##$DBPOAL= (0..7)
0.5 0.5 0.5 0.5 0.5 0.5 0.5 0.5 
##$DBPOFFS= (0..7)
0 0 0 0 0 0 0 0 
##$DE= 6
##$DECBNUC= <off>
##$DECIM= 32
##$DECNUC= <off>
##$DECSTAT= 4
##$DIGMOD= 1
##$DIGTYP= 9
##$DL= (0..7)
0 120 120 120 120 120 120 120 
##$DP= (0..7)
150 150 150 150 150 150 150 150 
##$DP07= 0
##$DPNAME0= <>
##$DPNAME1= <>
##$DPNAME2= <>
##$DPNAME3= <>
##$DPNAME4= <>
##$DPNAME5= <>
##$DPNAME6= <>
##$DPNAME7= <>
##$DPOAL= (0..7)
0.5 0.5 0.5 0.5 0.5 0.5 0.5 0.5 
##$DPOFFS= (0..7)
0 0 0 0 0 0 0 0 
##$DQDMODE= 0
##$DR= 18
##$DS= 0
$$ [...]
##$SUBNAM2= <"">
##$SUBNAM3= <"">
##$SUBNAM4= <"">
##$SUBNAM5= <"">
##$SUBNAM6= <"">
##$SUBNAM7= <"">
##$SUBNAM8= <"">
##$SUBNAM9= <"">
##$SW= 18.0517328524113
##$SWIBOX= (0..15)
0 0 2 0 0 0 0 0 0 0 0 0 0 0 0 0 
##$SW_h= 3612.71676300578
##$TD= 16384
##$TD0= 1
##$TE= 0
##$TE2= 300
##$TE3= 300
##$TEG= 300
##$TL= (0..7)
0 120 120 120 120 120 120 120 
##$TP= (0..7)
150 150 150 150 150 150 150 150 
##$TP07= 0
##$TPNAME0= <>
##$TPNAME1= <>
##$TPNAME2= <>
##$TPNAME3= <>
##$TPNAME4= <>
##$TPNAME5= <>
##$TPNAME6= <>
##$TPNAME7= <>
##$TPOAL= (0..7)
0.5 0.5 0.5 0.5 0.5 0.5 0.5 0.5 
##$TPOFFS= (0..7)
0 0 0 0 0 0 0 0 
##$TUNHIN= 0
##$TUNHOUT= 0
##$TUNXOUT= 0
##$USERA1= <user>
##$USERA2= <user>
##$USERA3= <user>
##$USERA4= <user>
##$USERA5= <user>
##$V9= 5
##$VALIST= <valist>
##$VCLIST= <CCCCCCCCCCCCCCC>
##$VD= 0
##$VDLIST= <DDDDDDDDDDDDDDD>
##$VPLIST= <PPPPPPPPPPPPPPP>
##$VTLIST= <TTTTTTTTTTTTTTT>
##$WBST= 1024
##$WBSW= 4
##$XGAIN= (0..3)
0 0 0 0 
##$XL= 0
##$YL= 0
##$YMAX_a= 142739
##$YMIN_a= -143082
##$ZGOPTNS= <>
##$ZL1= 120
##$ZL2= 120
##$ZL3= 120
##$ZL4= 120
##$ABSF1= 10
##$ABSF2= 0
##$ABSG= 5
##$ABSL= 3
##$ALPHA= 0
##$AQORDER= 0
##$ASSFAC= 0
##$ASSFACI= 0
##$ASSFACX= 0
##$ASSWID= 0
##$AUNMP= <proc_1d>
##$AZFE= 0.1
##$AZFW= 0.1
##$BCFW= 1
##$BC_mod= 2
##$BYTORDP= 1
##$COROFFS= 0
##$CY= 83.5205535888672
##$DATMOD= 1
##$DC= 2
##$DFILT= <>
##$DTYPP= 0
##$F1P= 10.8118882576601
##$F2P= -7.23987719738617
##$FCOR= 0.5
##$FTSIZE= 0
##$FT_mod= 4
##$GAMMA= 1
##$GB= 0.15
##$INTBC= 1
##$INTSCL= 1
##$ISEN= 128
##$LB= 0.25
##$LEV0= 0
##$LPBIN= 0
##$MAXI= 10000
##$MC2= 0
##$MEAN= 0
##$ME_mod= 0
##$MI= 1.114404
##$NCOEF= 0
##$NC_proc= 0
##$NLEV= 6
##$NOISF1= 3.799351
##$NOISF2= 2.8
##$NSP= 1
##$NTH_PI= 0
##$NZP= 0
##$OFFSET= 14.38212
##$PC= 1
##$PHC0= -1345.929
##$PHC1= 12.19224
##$PH_mod= 1
##$PKNL= yes
##$PPARMOD= 0
##$PSCAL= 0
##$PSIGN= 0
##$REVERSE= no
##$SF= 200.129724274929
##$SI= 16384
##$SIGF1= 3
##$SIGF2= 2
##$SINO= 400
##$SIOLD= 16384
##$SREGLST= <1H.CDCl3>
##$SSB= 0
##$STSI= 0
##$STSR= 0
##$SW_p= 3205.1282051282
##$SYMM= 0
##$S_DEV= 0
##$TDeff= 0
##$TDoff= 0
##$TI= <>
##$TILT= no
##$TM1= 0
##$TM2= 0
##$TOPLEV= 0
##$USERP1= <user>
##$USERP2= <user>
##$USERP3= <user>
##$USERP4= <user>
##$USERP5= <user>
##$WDW= 1
##$XDIM= 8192
##$YMAX_p= 0
##$YMIN_p= 0
$$ End of Bruker specific parameters
$$ ---------------------------------
##NTUPLES= NMR FID
##VAR_NAME=  TIME,          FID/REAL,        FID/IMAG
##SYMBOL=    X,             R,               I
##VAR_TYPE=  INDEPENDENT,   DEPENDENT,       DEPENDENT
##VAR_FORM=  AFFN,          ASDF,            ASDF
##VAR_DIM=   8192,          8192,            8192
##UNITS=     SECONDS,       ARBITRARY UNITS, ARBITRARY UNITS
##FACTOR=    0.0002768,     1,               1
##FIRST=     0,             0,               0
##LAST=      2.2672688,     0,               0
##MIN=       0,             -143082,         0
##MAX=       2.2672688,     142739,          0
$$ Real data points
##PAGE= N=1
##DATA TABLE= (X++(R..R)), XYDATA
0@%%%%%%%%%%%%%%%%%%%%Kj0J6j6J6j6J6k2L0l2L5m2M7n3O1o9P9q8R9j10J21j36
42g2J52j68J84k06K29k52K78l04L35l70M08m50M96n47O06o74P48q36R41j065J218
63F51j410J656j990K475l252M761j3479L1791m1915q3903J5340P839m0508J2295
77a09649J04755N2366m1610p148N3917L661j2826N0923M8350m7326q6318j8065
89h970K1701l5183l3544L6537L003q2362l9399N8205N0855q077K4664O5757j3985
102C9202n8461M2814Q2686p023l4931J3725j1925q0380m0987N0849J8424o1139
114d7146k4822K0670k5240l1953M8053P9981R684l7135J3991L8694j3249l849
126B7679N8489K5158o0605n4625Q828j48m2360L971M4980l3863p5947J1677N5057
$$ plain form
0 0 0 0 0 0 0 0 0 0 0 0 0 0 0 0 0 0 0 0 0 0 2 -8 8 -8 8 -8 8 -14 16 -16 19 -23 24 -29 32 -37 42 -46 53 -57 64 -72
42 -72 80 -88 96 -110 119 -133 145 -159 176 -194 214 -236 260 -287 319 -355 393 -443 498 -567 651
63 651 -759 897 -1093 1382 -1870 2891 -10588 21203 -20712 -104615 -89275 -81436 -121944 -109649
77 -109649 -4894 47472 5862 -1286 52631 56292 43466 94389 142739 95413 9095 -8970
89 -8970 12731 -22452 -55996 -19459 -16456 -98818 -138217 -80012 -29157 -37234 -12570 53187 39202
102 39202 -19259 23555 106241 99218 64287 78012 66087 -14293 -55280 -4431 13993 -47146
114 -47146 -71968 -51298 -76538 -108491 -60438 19543 29227 -7908 6083 44777 31528 27679
126 27679 86168 111326 50721 -3904 4924 4776 -37584 -33613 11367 -22496 -98443 -86766 -31709
139c1709J049l953N1993L3090m5006k4724N6690L6461k4153j731J6978l6729o0965
152c2709o4M0977p656m1691K937J1044l7529j4680N9544N1597j7957k0475K9401
165B2739J0056l2531J8341O0917r908o0733j2055J4052k7761k5343L5200K3406
177A6380n0793l7018L0672K0109j0868K3906M7216m145m3640K437M3910M996j8990
190B4172J6047Q215m7965m2864K0273K9861k0219k0024K0749o401m3593J1436
202e0313O0695J5582k3745R397K3623k3536k3119M1813L5713l4720l4295P377
214D472p881l2005M023L8900j046m3766q664K4999q42k516L7810L1462k2840l2090
228i984J7348K7025j3423n112K7602j1001n5125j6194L0374O568k2004P354J8899
$$ plain form
139 -31709 -30660 -34613 17380 50470 5464 -19260 37430 73891 49738 48007 64985 28256 -32709
152 -32709 -32773 8204 548 -41143 -38206 -27162 -64691 -79371 -19827 31770 13813 -6662 22739
165 22739 32795 264 18605 79522 69614 8881 -3174 10878 -16883 -42226 -7026 16380
177 16380 -34413 -71431 -40759 -20650 -31518 -7612 39604 35459 -8181 -5744 38166 43162 24172
190 24172 40219 48434 469 -42395 -22122 7739 -12480 -32504 -11755 -18156 -61749 -50313
202 -50313 10382 25964 2219 11616 35239 11703 -11416 30397 66110 31390 -2905 4472
214 4472 -3409 -35414 -31391 7509 6463 -37303 -45967 -20968 -21810 -24326 13484 44946 22106 -9984
228 -9984 7364 34389 20966 15854 43456 32455 -22670 -38864 -8490 -1922 -23926 -16572 2327
241B327k9417k9672L5286M0992o967n844K0411j429l1013J320M2601Q448l4323
254A2720j1044M375k4320k1467K2055K9084j5822l1043Q234J5324j3325R106M4074
267B7951J0998l2182j2019K2070N637j5158J5337K1435l3131m2209Q672J8052
279d547j0935m375K0287n5l6121p760L9417J9376r588R683J4242j8491k2375J6940
293E698L1510p413k4018L065n153l2971m851L2820J1520k5085j3233J4421j105
306a4795j3134K6246L6967j0961k5722N736J1325q601n80K4730L223l9138k1269
319b5973J6056J908j1752J1471J5749j6971k8219J0111L1906L063l720J9368K456
332B5453k8684q198K7306J6283j5554j0166N963j7903k7734J3497K7683o622j8492
$$ plain form
241 2327 -27090 -56762 -21476 19516 12549 6705 27116 25687 -5326 -4006 38595 47043 12720
254 12720 1676 6051 -18269 -39736 -17681 11403 -4419 -35462 -27228 -11904 -25229 -16123 27951
267 27951 38949 6767 -5252 16818 22455 7297 22634 44069 10938 -31271 -22599 -4547
279 -4547 -15482 -19857 430 375 -35746 -43506 -4089 15287 5699 15382 29624 11133 -11242 5698
293 5698 37208 29795 5777 8842 3689 -29282 -34133 -1313 10207 -14878 -28111 -13690 -14795
306 -14795 -27929 -1683 35284 24323 -1399 4337 15662 7061 6481 31211 34434 -4704 -25973
319 -25973 -9917 -8009 -19761 -8290 7459 -9512 -37731 -27620 4286 7349 3629 22997 25453
332 25453 -3231 -11429 15877 32160 16606 6440 12403 -5500 -33234 -19737 7946 1324 -17168
345a7168K204M204j3233J440L5541J8807k1971j1558J2831j229j0154J2662K1172
358C3548j2413l3561m904J2276q012l141J9948K488k6796j2784K0367J6704m274
371e54Q225J9366j2975k5940R168K4620J39j2021J782j695k5709j3240K3283J4522
385H971j5077p712O527p058j2497J5416L1248Q98j9270K312P982j1509j222K3244
399B2253Q556k4274k0237O171K448j1466P939J8712j0718k4418J252J7627M784
412a371O9J5654P964k1314j2313J8845J3009q528k259P230j2499k6212J816K3501
426C592J93j4544L301K958j5294l805K3790J8363r534q415Q483k901j1810J1315
440E692K1183n423k2411o983M940o840o161J6113J0162j8894j5399R694J0074
$$ plain form
345 -17168 -14964 -10760 -23993 -22553 12988 31795 9824 -1734 11097 9868 -286 12376 33548
358 33548 21135 -12426 -17330 -5054 -13066 -16207 3741 6229 -20567 -33351 -12984 3720 -554
371 -554 7671 27037 14062 -11878 -2710 21910 22049 10028 11810 10115 -15594 -28834 -5551 8971
385 8971 -6106 -13818 -7291 -14349 -26846 -11430 19818 20716 1446 3758 11740 231 -991 22253
399 22253 30809 6535 -13702 -7531 -5083 -16549 -8610 10102 -616 -25034 -23782 -6155 -1371
412 -1371 -1302 14352 22316 1002 -11311 7534 20543 12015 9756 16986 4487 -21725 -19909 3592
426 3592 3785 -10759 -7458 -4500 -19794 -23599 191 18554 9020 605 9088 6187 -5623 5692
440 5692 26875 21452 -959 -7942 -3002 -9842 -16003 110 10272 -8622 -24021 -14327 -4253
453d253j867O908J8039l139k2086Q04J9105N15o755Q153J249k1987j6041J3136
467h219J2800r729m535Q497p435j5676P886K2895O679q735O36N679r615o130J7266
482A2264J3151j2380j4572J04j748j2067J852J9279j027k1805l085J2073j45n74
496h680J6595J2815j3210j4696J0431J0379o176K958J0414j0050k2233m274J2033
509c694K126p880L874N056j4200r855J5063J7464K68l671N758M04j2993J191K0538
524A9449K916j6148n311Q63j1168r342J2413J3682j1849j5142O387M697o152R453
538e252K0006K586j3934m295R491J923l980Q861N461j6899j6803J838P349k684
552f332l138P207j456j7751j465K0324R743l306M188O558q498j0950J1206J6637
$$ plain form
453 -4253 -6120 788 18827 15688 -6398 -5594 13511 14026 7271 15424 16673 -5314 -21355 -8219
467 -8219 4581 -5148 -9683 -1186 -8621 -24297 -16411 6484 13163 4428 5064 10743 1128 -5002 12264
482 12264 25415 13035 -1537 -1433 -3181 -15248 -13396 5883 4856 -16949 -20034 -7961 -8106 -8680
496 -8680 7915 20730 7520 -7176 3255 13634 7458 10416 20830 10780 -11453 -15727 -3694
509 -3694 -1568 -9448 -5574 -518 -14718 -24573 -9510 7954 8222 4551 10309 10713 -2280 -1089 19449
524 19449 22365 6217 906 1769 -9399 -18741 -6328 7354 -4495 -19637 -13250 -8553 -14705 -5252
538 -5252 14754 17340 3406 -889 8602 10525 6545 15406 20867 3968 -12835 -10997 -3648 -6332
552 -6332 -9470 -2263 -3719 -21470 -22935 -2611 7132 3826 8014 14572 6074 -4876 6330 22967
566B2967o762j1554J490o573j5640O81J4419L183j2432n280N681k777k242J6240
580A401J5295m909j0228J582O804j626m06J1020m78k0550j1071O345J487m935
594a0269M098P166j0223j4959Q623J6990K60R60J1071o78j3541j336J4693O883
608A9738q743m245j91j2199j1098P402J0512k894r289j178K292m492K682J8486
622F783R088r682n128N846J302m613O307J1281r016j9180j243M888n844r48R693
637d66p1j4117m939J1606Q045m84P280P627p963r486N607J1132Q85o044o42l175
653D795j3887o239J0168O791o596n471K738j821o014Q757J7930K97r477K338L864
668H173n638m0J2242L436j4327j0599K916j685n604N907P478o267j1078P35R120
$$ plain form
566 22967 16205 4651 6141 -432 -16072 -15391 -972 2211 -10221 -15501 -9820 -12597 -14839 1401
580 1401 16696 11787 1559 3141 9945 8319 7913 18933 18455 -2095 -13166 -6821 -5334 -10269
594 -10269 -6171 995 -9228 -24187 -15564 1426 1686 2646 13717 13039 -502 -1838 12855 19738
608 19738 10995 6750 6559 -5640 -16738 -9336 1176 -1718 -11007 -12185 -9893 -14385 -11703 6783
622 6783 15871 6189 1061 6907 8209 3596 9903 21184 12168 -7012 -8255 -3367 -9211 -10159 -466
637 -466 -537 -14654 -19593 -7987 58 -426 6854 14481 6518 -2968 2639 13771 14656 8612 7970 4795
653 4795 -9092 -15331 -5163 1628 -4968 -10439 -7701 -9522 -15536 -6779 11151 11448 1971 4309 8173
668 8173 2535 2495 14737 18173 3846 -6753 -3837 -5522 -11126 -5219 2259 -4008 -15086 -14351 -5231
683e231L805J896Q960L437r789n659P692P164k708k690K182p080j4757J107J1642
698b9p18p021J478J365p727j361J4477J0596m928l219M222k887m796O357R550
713A5359l116j1446m786O39m402j621Q092L635q938p519M063O658N86M347J0282
728A1833j675j1700M10R366Q82k919K694n3j2242r412P004O156m780q20L016m744
744f984o838M945J2324M246l949Q94K130n415j604Q514N607n689q857j779q28
759c283n727J603R748j450j0527j706N488J277Q25Q749P172p529p565N879M765
774G719k654J967L693n854j1476k522O235J295l225K219O16p203l124P466Q898
789D050J017k088K665r5o806J672J0195J002p449m006m89m666m648O288O963o368
$$ plain form
683 -5231 -1426 470 9430 12867 3078 -2581 5111 12275 9567 6877 9059 1979 -12778 -11671 -29
698 -29 -747 -7768 -6290 -4925 -12652 -14013 464 11060 6132 2913 7135 4248 -548 5809 15359
713 15359 12243 797 -3989 -3350 -7752 -9373 -1281 2354 -6584 -14103 -10040 -3382 -2796 1551 11833
728 11833 10158 -1542 -1132 8234 9116 6197 8891 8838 -3404 -12816 -5812 344 -4436 -5256 -2240 -6984
744 -6984 -13822 -8877 3447 7693 3744 4638 6768 1353 -251 8263 13870 8181 -676 -2455 -3283
759 -3283 -9010 -7407 2341 891 -9636 -11342 -5854 -4577 -3752 4997 12169 4640 -2925 2954 7719
774 7719 5065 7032 10725 4871 -6605 -9127 -2892 -1597 -4822 -2603 -1987 -9190 -12314 -4848 4050
789 4050 5067 2979 5644 5549 -1257 415 10610 11612 4163 157 -332 -4998 -9646 -3358 3605 -2763
805b763p033L103J481j378N281R170Q47p737k036N308P18j265M944J209q454q202
821f807M75M444p51j458L548j585q373M41Q862M733p76J250K638m378n371O260
837C152P962l783n144O1l166o527N4P543K112o716k581K427j554N4Q030O217k638
854E503n522N97L347j402P90N931j568r648m300K786J499j701J767L182n125o878
870a0742M353P333Q99J030L268j043o328r87P516L413m455j675j18o037m573L794
886d352N985j166n233J5J099k872K127Q757L061m476k663J676N59j694L739M736
902I298n311q013j97K022j555J69M434K33p128l131N972M081o8L027K510l608
918B735m748K116N713J84k982M77k205p116j489N926K850l250k479J547j398k841
$$ plain form
805 -2763 -9796 -6693 -5212 -6590 -1309 7861 8708 971 -1065 4243 4961 3696 8640 9849 1395 -6807
821 -6807 -6332 -1888 -2639 -4097 -549 -2134 -10507 -10066 -1204 3529 2753 4003 6641 2263 -3108 3152
837 3152 11114 7331 2187 2248 -918 -7445 -7391 152 2264 -4452 -7033 -4606 -6160 -6106 1924 8141 5503
854 5503 -19 578 3925 2523 3313 9244 7676 -1972 -6272 -3486 -1987 -3688 -1921 1261 -3864 -10742
870 -10742 -6389 944 1843 2873 6141 5098 -1230 -2217 5299 8712 4257 2582 2464 -3573 -8146 -4352
886 -4352 1633 467 -4766 -4751 -3652 -6524 -4397 4360 7421 2945 282 1958 2517 823 4562 9298
902 9298 3987 -4026 -4223 -2201 -3756 -3587 847 1080 -6048 -9179 -3207 874 806 3833 6343 2735
918 2735 -2013 103 5816 6000 3018 3495 1290 -5826 -7315 -1389 1461 -1789 -4268 -2721 -4119 -6960
934f960N143P767k85m103pR21j688L19N375J505p002m674J215n76j747K886L677
951A766k769o099M62N410Q69R31M793P61n530k439M044L425j479p46Q87m764o286
968f764J697M657J18k289Q8Ql517m48P252M980k643j685J310q27k092K379N207
985G431j101o541k246N83k477j12M608J227m607l628K414K899k66L318N212k274
1001D440n277M53L497J263n91O95m47n954m352L361K700j456n03N77j905l330
1017f829J721P374K330k875O61P98l280l84M858L269l394m678m04j213l296K476
1033b866M693j731m487j223J629J343J171M557K903m028l217K244K335j6N04J482
1049E293k148o552j964M223P91j906J130J60l966j931M188N310k28q80K148j563
$$ plain form
934 -6960 -1817 5950 5665 1562 1555 2476 788 1107 6482 7987 985 -3689 -2474 -3050 -4797 -1911 1766
951 1766 -1003 -7102 -6640 -1230 -361 570 5363 6124 594 -1845 2199 5624 4145 3399 4286 -478 -6764
968 -6764 -5067 -410 -292 -2581 -2493 -2485 -6002 -6450 802 5782 3139 1454 2764 1937 -155 2224 7431
985 7431 6330 -211 -2457 -1874 -4351 -4463 145 1372 -3235 -6863 -4449 -1550 -1816 1502 6714 4440
1001 4440 -837 -384 3113 4376 3785 4480 4033 -1921 -6273 -2912 -212 -1668 -2171 -1594 -3499 -6829
1017 -6829 -5108 2266 4596 1721 2382 3180 -100 -484 4374 7643 4249 -429 -833 -2046 -5342 -2866
1033 -2866 1827 96 -4391 -5614 -3985 -2642 -1471 3086 5989 1961 -1256 988 3323 3307 3811 5293
1049 5293 3145 -3407 -5371 -1148 -357 -2263 -1133 -973 -4939 -6870 -2682 2628 2400 1520 3668 2105
1065B105l732K366N005J90l400k418q14k329j676L527K946l141l062p0R38O99
1081b866K407M644J068m677j607L168M95n22K507P18m503n236P46L188j202l66
1097b038K416j883m502R12M595K483j39P69P90k719k061L534L319j328k489j517
1113A42j361k677l77M255J537l830j782J328k01r9M095M117j464l839P10J882
1129B436j318R09L297j714n165k105J369O81p91J607J402l376k728K194L575J467
1145A740M98R51o4l110j136L787K053k092j386o29k617l028J867M104j081l054
1161c197Q74N20j919J579M997J766k505j568J083l72p69K427J835k778l928j009
1177b964O49l2J46K143M10l478j657K918K477O12J194J705j563l563R05L906m93
$$ plain form
1065 2105 -1627 739 5744 5934 2534 116 -698 -3027 -4703 -1176 1770 -1371 -4433 -4503 -3565 -2866
1081 -2866 -459 4185 5253 576 -1031 2137 2632 2110 4617 5335 832 -4404 -3658 -470 -1672 -2038
1097 -2038 378 -1505 -6007 -5095 -500 1983 1844 2613 3403 684 -1377 2157 5476 4148 1659 142
1113 142 -1219 -3896 -4273 -18 1519 -2311 -4093 -2765 -2966 -3065 1030 5147 3683 -156 554 2436
1129 2436 1118 2027 5324 3610 -1555 -3660 -2291 -1610 -2401 -794 608 -2768 -5496 -3302 273 1740
1145 1740 2238 3189 3125 15 -1121 2666 4719 2627 1241 612 -2005 -5033 -3166 938 -143 -3197
1161 -3197 -2323 -1803 -3722 -2143 2854 4620 2115 547 1630 1258 489 2916 4751 1973 -1955 -2964
1177 -2964 -2315 -2347 -2201 -58 352 -3126 -4783 -1865 612 1224 2418 4123 2560 -1003 -98 3808 3315
1194C315j823M28j464m199r30L004K066j644q92P25j550r18L636L833p5j484n37
1211A491k7q11j13K734J081l412l149o52M59n64R34K580j024l734N37L165N44
1228C9R55K825N44l174k024K489J758j283j73L50l345l412Q67K255N66n87m07
1245a757J24j547O3L906K789l80j100k72l65j108P54L055o06m264j191J37j611
1262c373j35K647J532k495k295J795J742J79K485K305j365k406n2J359N95n02
1278B016L75o67l741k201J343J744J84p46K39j94j776Q17M273J433r99J97M9j556
1296G90p82K329J970k349k883J02j225j790J664K418m64k104p58J095P82R15K737
1313B447J465j970j622K56J165L25j98M93j074l742j189K091N94m51N88L11j829
$$ plain form
1194 3315 1492 1920 456 -3743 -4673 -1669 397 -1247 -2139 -1414 -2964 -3882 -246 3587 3512 2028 1491
1211 1491 1464 653 540 3274 4355 943 -2206 -2858 -2399 -2963 -2029 551 -473 -4207 -3670 -505 39
1228 39 994 3819 4363 1189 -835 1654 3412 2129 1956 2306 -1039 -4451 -3584 -1329 -763 -1350 -1757
1245 -1757 -1633 -3180 -3117 789 3578 3198 2098 1826 1461 353 1107 4162 3556 -708 -1899 -1762 -3373
1262 -3373 -3508 -861 671 -1824 -4119 -2324 -582 -403 2082 4387 3022 616 564 1923 2518 2016
1278 2016 2391 1724 -2017 -4218 -2875 -1131 -947 -1693 -1454 -1648 -3424 -2607 1666 3099 2100 2297 2346 790
1296 790 8 2337 4307 1958 -925 -823 -2048 -3838 -2174 244 -220 -2324 -3082 -1987 -1205 -290 2447
1313 2447 3912 1942 320 576 1741 2066 1868 2361 1287 -2455 -3644 -1553 -959 -1410 -822 -511 -2340
1330b340j372K482L363k1n55J174j201j954Q55K190M50j739j702n14j670o72K243
1347i83J466j024j587j78P98L78J135K857O87k594j072J018L53kQ26M49k365l233
1365c071O18J604n83M55J405j160k190K14K700J576P5L74J83j815j007J560J341
1382B279j50j500r89p15j699J49K495Q19j612q44L60K04Q2K083K405r86k383K88
1400B86N87l30M53J406p62k839j536J029M81k07J302O66j726j336R94J985J006
1417A459R1N88k59k156l94J937R15q70j035n30j196j619J168K487n93j162J93
1434i76R9p09R45K499J174j739j065O33l91m42J237Q90j447k107p13O10j3K94
1452a221J398K08k116l90J477J297M09M64Q47j072k106N44J730o5q54O0r66j628
$$ plain form
1330 -2340 -3712 -1230 2133 2112 1557 2731 1530 -424 431 2621 3071 1332 -370 -884 -2554 -3226 -983
1347 -983 483 -541 -2128 -2306 -1508 -1130 5 2862 3549 955 -117 901 1254 1252 2078 2527 162 -3071
1365 -3071 -2453 -849 -1432 -977 428 -732 -2922 -2708 -8 1568 1643 2017 2200 385 -622 938 2279
1382 2279 2129 629 -360 -1075 -2774 -2625 -130 689 -923 -1767 -1407 -1203 -1121 962 3367 2381 -2 286
1400 286 873 543 996 2402 1640 -1199 -2735 -1706 -1225 -1432 -130 536 -1190 -2526 -1532 453 1459
1417 1459 1550 2138 1879 -277 -671 1266 2181 1311 276 -254 -1450 -3069 -1901 586 -7 -1169 -976
1434 -976 -877 -1586 -641 1858 3032 1293 228 861 470 28 1265 2155 708 -1399 -2112 -1502 -1515 -1221
1452 -1221 177 385 -1731 -2121 -644 653 1062 1526 2373 1301 -805 -261 1469 1404 550 610 -356 -1984
1470a984o62J688J313q86l11N78j028l56J736J887K59j313l51J22o67l3J598K35
1488A825j750j410k38K62k73Q44J540o83j818J53J249M27O60J039L77j744j270
1505h10R74J091n68J27P8j508j689J95J667P55p89J65P3j216Q2K089J084l63n97
1524H40j19l34q84O35J653n41j710n78j25n18L41J135J199j211j348P82O48%J406
1543A271R02p41j457p52J335L39n23O49k43k020j032Q41J065L72l28L90n28j238
1561a698Q10K210L45m48j93l21r91m77J365J317j183j455k55n15l66P67J494L27
1579G33j437n80Q76J96K67J650O88j419j239J9P22j61J39P05j011k096o7J016
1597i99M65K12L82J69r26o81J227J594J66l45r3o78j106J80J346M10j324p99J1
$$ plain form
1470 -1984 -2646 -958 355 -531 -842 -264 -1292 -1648 88 1975 2234 921 570 692 25 -8 1590 1825
1488 1825 75 -1335 -1573 -1311 -1584 -740 800 117 -1701 -1548 -299 128 788 1827 2204 460 -810
1505 -810 164 1255 687 814 892 -616 -2305 -2110 -443 312 -477 -312 -239 -1455 -1373 716 1800 1437 840
1524 840 721 387 -497 138 1791 1250 -460 -1038 -1163 -1681 -1340 -205 994 -217 -1565 -783 -135 -135 1271
1543 1271 2173 1432 -25 -777 558 897 374 1023 780 -1240 -2272 -1431 -366 6 -322 68 -460 -1698
1561 -1698 -888 1322 1667 1219 1026 705 -286 -763 602 1919 736 -719 -974 -1489 -1855 -1088 406 733
1579 733 -704 -1284 -408 -212 55 1705 2393 974 -265 -246 476 315 454 1159 148 -1948 -2015 -999
1597 -999 -534 -322 60 229 -697 -1378 -151 1443 1609 1264 1171 493 -613 -433 913 1323 -1 -800 -789
1616g89q54k74J444J203m31j082J21M65j44R28J535k03j464n28J76m7O5O96J15
1635I32j311j591L98O72K51N53N28l71r74j12J426J056l28L11m2j090j057O89
1653f0J119k83j125m4n26j159M58J718M38p07m53K56j31J68J360J201q54j096
1671B80k47r2O6J15N08J02j662j000O00M43J86P41N63o84j024M08J639K32j61
1690A013O86n08j640k48J066M17n23m29k07r39o22R45J094k4j55j65j24m0M44
1709D1J210Q39q31j026O1k85k57M47N76o61j551k32Q06k79L32J328J02j109l09
1728g98P92Q18J33L85L39q84j377N38M19n0j77k97n09q75m12J187R96k41j97J29
1748h1j68q8N94J473K36j339j08n0q58K9R80N4j006r52J60J44l21R46J229p13
$$ plain form
1616 -789 -1643 -1917 -473 730 299 -783 -662 -197 -341 587 2122 1919 455 -73 103 56 121 817 932
1635 932 -379 -1970 -1572 -900 -649 -96 432 61 -913 -1025 401 1457 1129 1440 1398 308 -749 -60
1653 -60 1059 776 -349 -393 -919 -2078 -1620 98 536 -171 -624 -368 -499 -331 1029 2230 1376 280
1671 280 33 -59 7 122 630 732 -930 -1930 -1330 -887 -701 40 603 -81 -1105 -697 942 1174 1013
1690 1013 1699 1191 -449 -697 369 786 263 -166 -373 -1312 -1934 -989 105 81 -74 -239 -363 -403 41
1709 41 1251 2090 1259 233 294 9 -248 199 775 114 -1437 -1669 -863 -1142 -810 518 620 -489 -798
1728 -798 -6 812 945 1330 1669 785 -592 -54 365 315 138 -159 -668 -1543 -1955 -768 228 -13 -210 -81
1748 -81 -249 -337 257 1730 1966 627 519 469 -389 -360 620 674 -332 -1284 -1124 -980 -1301 -355 874 161
1768A61q03K55N63M77L94L60J28j080j007M69L78j85j2j45o76q75N6J369M12n54
1788c15M80K15r63J50J076Q30k65o17J9m68q23N67P59l72o89n32j44q4L33Q20
1808b3O84o00n59L27K13M93K36O35j60j217o79O65L88n44N04j42j185n53N96O88
1828b33J12JP46o61q80P45R59L35m5l43l28o39l21O73M29l15o00l67l12LM39Q03
1850B01L68o75l74M95O6J14P78M67p35j033J81L66l23K64M87o10j247Q5M48L32
1870c45L88K74M2o96m70Q70O74k8J78k24l63o61r6Q17L81p70m40j8m59j14P44
1891c16R18j39q64J42K95l10M13J083j86r05k78L6j1j28N15K37q40o65J44K38
1911f21L49M30J63q9o16k33P41N58p5Q7j33n69n80M61P50k19p31K49l51o26M13
$$ plain form
1768 161 -642 -387 176 653 1047 1407 1535 455 -552 -83 295 110 98 -47 -723 -1598 -1542 -173 239 -315
1788 -315 165 380 -583 -433 643 1473 1208 591 610 142 -681 -114 645 273 -416 -948 -1092 -1176 -843 -23
1808 -23 661 61 -498 -171 42 535 771 1406 1246 29 -650 15 403 -141 363 221 -964 -1517 -921 -233
1828 -233 -121 -120 626 -35 -915 -170 789 1124 1079 736 408 -231 -552 121 550 235 -365 -732 -1044 -1041 -602 201
1850 201 569 -106 -480 15 81 195 973 1440 705 -328 -147 219 -104 160 647 37 -1210 -1125 -677 -345
1870 -345 43 317 359 -337 -807 63 737 709 887 663 300 -361 -457 360 741 -29 -469 -487 -946 -1060 -316
1891 -316 602 463 -401 -259 36 -274 139 1222 1036 131 -147 -111 -122 -250 265 502 -338 -1003 -859 -621
1911 -621 -272 158 321 232 -384 -617 124 682 607 694 561 -8 -588 -127 623 404 -327 -78 -429 -1055 -642
1932f42O38L31k50l35J44j74j10R46N15n07m37j89o8J11L1N49J73r84n82L04K39
1953b97J15L56K65l25o99R9P42L8P3L42m72n89j43O62M09l33k11K72p70l60N93
1974b33N85j4j70k61k23m8N7P10K54l64l67j37j39J01L57N80l11p25j43L74j51
1995b68P8O00k0n94m90M37K86j39K91M41p45m07K06L46L29N4q3m2p37j45O87L32
2017D17k04J4k09k86k97J94P15P9m85j00oj84Q6O51J97l68m40P4K01k88L18N32
2039F11m04n00p7LL22m6K48K55p06l54L37M51R6M8L0j90n45M4P48K2k25J71k84
2062E5m33p8M61K65j21m12K60k68k97L81N33J00l11k35j12J66j02N14K09m35m22
2083b82J33N8O0Q4L85k55n49j1J68J24J41K38q7l66k85K69M96j71M5J20k97m59
$$ plain form
1932 -642 -4 327 77 -258 -114 -288 -398 548 1063 556 119 -70 -138 -27 4 553 726 -258 -840 -536 -297
1953 -297 -182 174 439 114 -585 -486 256 294 367 709 237 -352 -495 167 576 243 32 304 -466 -826 -233
1974 -233 352 338 168 -93 -316 -364 -307 403 657 293 -74 -211 -350 -249 108 688 377 -348 -491 -117 -268
1995 -268 -190 410 390 -204 -694 -257 29 -110 181 622 -123 -530 -324 22 351 405 322 280 -457 -602 85 417
2017 417 213 227 18 -268 -565 -371 344 423 -62 -162 -168 -352 -266 385 582 214 -226 -152 49 -239 79 611
2039 611 207 -293 -370 -367 -45 -91 157 412 -294 -648 -311 140 236 284 314 124 -421 -377 371 393 168 339 55
2062 55 -378 -456 5 270 149 -263 -3 -271 -568 -187 346 446 135 -100 -212 -46 -148 366 575 140 -282
2083 -282 -149 -91 -31 53 438 183 -366 -377 -209 -85 56 294 207 -159 -444 -175 321 150 195 315 18 -441
2105d41J22M83J15j40j73J77n99j9O28K28j39j11j76j66K7P7M93J1m18j57J11
2126f7r6J79L05J20k58n25J51J42j94L78K40k26n67o1L68L36k92L06J68n37l54
2147d84M46K94RkJj98m51K1O01n5k86J32k01k80J24J63N12n2m58Q7N0p1K40L41
2171D83N2m29l96J65J8p2L80R0m91k65M6K88l5J53K20m1m43J82K03J98K8J59k84
2194B09j98l16J81M54k47m4j32k25k13L5M96K36l14L5J60j99j07N70K02j73l32
2215G8j72L7q4N3M44m01l83k8K3K7J80L45J34j01m03J32L75Q7J16l2k00l84l7
2238a94J80K00j86o8qk99k64L80K92J69k50M5Q3k59J42M71J38k18j41j51j80m
2260a22J72K41k97l10j5r3R5L46J86q2j82k05L20K12j53K22J11k67k05p9L94n8
$$ plain form
2105 -441 -319 164 279 139 -34 143 -456 -475 153 381 242 131 -45 -211 -184 -107 386 397 -21 -178 -67
2126 -67 -163 16 321 441 183 -342 -191 -49 -243 135 375 149 -418 -479 -111 225 -67 239 407 -130 -484
2147 -484 -38 256 265 263 264 66 -385 -364 237 182 -104 28 -173 -453 -329 -166 346 294 -164 -77 -27 -98 142 483
2171 483 535 106 -290 -125 -107 -179 201 291 -200 -465 -419 -131 -166 -13 207 166 -277 -95 108 306 334 493 209
2194 209 11 -305 -124 330 83 39 -93 -318 -531 -496 0 236 -78 -43 117 -82 -189 381 583 410 78
2215 78 -94 -57 -141 -88 356 -45 -428 -456 -433 -406 -226 119 253 152 -251 -119 256 343 459 427 227 -157 -194
2238 -194 -14 186 0 -68 -76 -375 -639 -259 33 202 -48 -3 80 -179 -37 434 572 354 213 62 -118 -122
2260 -122 50 291 -6 -316 -331 -424 -329 17 203 121 -61 -266 54 266 113 335 446 179 -26 -105 289 231
2282B31k86J75j48n78J48L90K3R3l1L8k46j72M42L58k21m2j2q8j88N2J61J93k74
2305A8l22J3P3p9L66K0M3k82q2K49j4R0M33j10m99pJ44J23j66M8N0j89l67J17
2329c30K69K1J66o5q1j04q7L19J50n7j40P9k36q5K37J09J52l13j24P3j26o8L97
2352A56J5j88m0r3J31O4oL71p3n03J83j21J2J70J27l4l00l33K58L41j17l8J08
2375I0j86j43J76N1L84l01q2J45m11J43J97K12l23J07p3o2j36J53K78k15j39L2
2397a03k4N5J21O6Oq8j74lO5J55k3N2J6k12j55J89R4k8O8p8m6j28J51J72jk21
2423g4J70j26k83J98J66pm8l1r3j1N9K3L23k19n2l1j20K19l1J68M9l79j57K64
2447b3p7K3J43P4r6j90K5P4O9m5L39r6m22K56J7M6m6L2L0k35j85J87J80j89J65
$$ plain form
2282 231 -55 120 -28 -606 -458 -68 -45 48 17 55 -191 -363 79 437 216 174 162 74 -114 -62 99 292 18
2305 18 -304 -291 -218 -297 69 89 132 -150 -232 17 3 93 526 416 -83 -90 54 177 11 59 109 -80 -447 -330
2329 -330 -61 -40 126 61 -20 -124 -211 108 258 201 61 140 -96 -181 56 165 317 4 -120 -47 -173 -241 156
2352 156 171 -17 -57 -150 -19 45 39 410 337 -166 17 -104 -92 78 205 171 -129 -462 -204 137 20 -18 90
2375 90 -96 -239 -63 -12 372 71 -11 134 -277 -134 63 275 -48 59 -14 -76 -212 -59 219 4 -135 -103
2397 -103 -127 -72 49 115 121 33 -141 -144 -79 76 53 105 121 -91 -246 -57 37 9 77 -1 -47 -175 -24 148 147 -74
2423 -74 96 -30 -313 -115 51 44 -4 -35 -128 -139 -80 -57 266 47 -5 -36 -156 63 32 200 249 -130 -287 -23
2447 -23 -100 -77 66 140 44 -146 -121 -47 22 -23 316 220 -202 54 71 117 71 103 133 -102 -287 -100 80 -109 56
2472E6Kk57R8p5K41J60j68J9J03k51N3O8P1Qk41LJ32k25O5L64p6l15J06k8L3N2
2498bK23kj82J4J2o5J6j0J05j73n9j37J88J31LlJ4j61l4O8J24P7n5N1q6r2O6J33
2526A64m8N4j99l2j25L8K47jj57J33j40K5O3L8K15j15o2j73O9o5J31k0Q9k57q8
2551b16J83L8N2j26K13j57j91J62P8J11P4j09j07Rj77K21Q6j14O9n1k12NQ2K01
2575A24L4j37j34J37o2O4J11p5Oq5m9O7O4q1J58l8j69j8RO9j1J4R4k02J3O8N7
2602B8J37k2j12N0k06p9K33L1j8j6j03jj12K30j3M6n2Qj6p6J12R8L0j14j89J22
2628dq2N0Q6P1j40q6M1l3J75O4m4L5k25n8K11k3J08j20J00j67rm5J93j4r3P5q3
2655a7n3m5M9J76Kk79N0koK51J33k59K7l5Q9k11N3J89l5j30k9l7K3L7N6K0o9q9
$$ plain form
2472 56 58 -199 -101 -176 65 225 57 76 179 -72 -19 49 120 128 -113 -110 22 -203 -138 226 150 -165 -59 -87 -54 -2
2498 -2 221 219 37 51 63 -2 14 4 109 -64 -123 -260 -72 59 62 59 73 -88 -122 -54 70 147 92 143 57 -35 31 164
2526 164 116 170 -29 -61 -186 -148 99 98 -59 74 -66 -41 22 60 275 160 98 -75 -6 -71 60 40 129 -128 -216
2551 -216 -33 5 57 -69 144 -13 -204 -42 36 147 221 112 5 14 -163 58 144 30 99 48 -164 -159 -77 124
2575 124 158 21 -113 24 -38 26 137 62 68 -17 -66 1 65 -16 142 104 -65 -83 -74 -5 -16 -2 92 -110 -97 -29 28
2602 28 165 143 31 81 -125 -204 29 60 42 26 -77 -78 -190 40 27 73 21 29 13 -63 49 147 177 63 -126 -4
2628 -4 -86 -36 50 121 -19 -105 -64 -97 78 142 98 133 -92 -150 61 38 146 26 126 -41 -50 -95 98 84 -9 66 -17
2655 -17 -70 -115 -66 110 112 -167 -117 -119 -125 126 259 0 27 -8 81 -130 -77 112 77 -53 -82 -119 -96 -59 -3 17 -52 -141
2683a41n2J83K0J9rL4j01j21J89N8k5m9J7j25nL6J7J13r7R3j6k37R6J95J2m6N8
2710A16j80J23j4J8K3M2j54n6Q2o9M2L0J11r6j16L5K29j67R3O0j87Q1r9J96m4
2735I9k6M8r5q5j32R4P6J09j75Q9j13J0L1J03O6j24K5j5k5J46k6N6k18K6R7j88
2761a47N2K34j00l3m7j57J90O3kQ1O5j14r7K1m1R8j22J26n7n0o2J54p7j16K96
2786A58j78%o6J08O9n5m8J17j19kK4P1N0L0j66K8j43J1N4O9n5j10n8K06k7M8J88
2813B04j10k07k0R9K6P5k2M4j46LK4O8j1N9q4L0j00M3K9J12l2o6J13j55r7J75
2839E4n8M9J2n3o7j3P7RN9j35P8j48J06j8J02P5j02j62J72n6l4K26j38k9n3n0
2865i7P2Q3j8N5J2k15J08K0J1j53NJ68J2j93J15NMJ5O4j47J3N4mP8jl0m8j19R1
$$ plain form
2683 -141 -193 -10 10 29 20 54 -47 -168 21 79 54 5 22 -103 -108 -72 -55 58 -39 54 38 -199 -103 92 104 58 116
2710 116 -64 59 45 63 86 128 -26 -82 0 -69 -27 3 114 18 -98 -63 166 -1 92 152 -35 46 -53 143 99
2735 99 73 121 26 -59 -191 -97 -21 88 -87 2 -111 -101 -70 33 99 -25 0 -15 -40 106 80 136 -82 -56 41 -147
2761 -147 -95 139 39 6 -41 -198 -8 55 53 134 199 85 -12 9 -32 66 -56 70 13 -37 -99 55 -22 -138 158
2786 158 -20 -20 -86 22 91 36 -12 105 -14 -16 8 79 129 159 -7 21 -122 -111 -57 12 -43 -153 -211 -5 -32 16 204
2813 204 94 -113 -133 -34 -8 67 45 89 -57 -54 -30 38 27 86 2 32 -68 -25 4 116 84 18 131 -24 -121 54
2839 54 -4 45 57 4 -63 -76 1 10 69 -66 12 -136 -30 -48 54 129 27 -135 37 -19 -53 173 35 6 -47 -97
2865 -97 -25 58 40 95 107 -108 0 20 31 -122 -117 51 63 -130 -15 -10 -6 9 73 -74 -61 -7 -11 67 66 36 -12 -131 -40
2894d0J17k9k4o6o4J06L4r8K50j22n7m3RJ0J7j5R3O2j64l1Q4J10j28m0n1n5JJ71
2922C7j6p0M9K3k7r6K70j43j9KO5p5l8M7L5J5j4n9nol7n5J56k8q6J07o6lj7M8
2952fJ0J2j08R1jj4J25p6J7q7K3L1J3l7j2k3n5L2J0R9j2p3k7n8J82j75J66l4O
2981A9J0Q9j05rj18K69j58L4rp3j6O0N1k5q2O2M6q2K7Q3r8L2q2j3J62J2o2k8K9
3010B5j04P7N5K0n0k9Q6p5o2Q3n0J02j05Q8Pj57J45n3O7Q7n8j61o5K7M5O2Nj16
3038a04l4K80j19lO3p6l3m2J4J23j44k9J12Np4K8M8lk1O6p8l8k2N0M7m2J09j49
3066f6P0K6n9J32j1j43J06JJ6q0q1J06J5n8l4q6J23P5j1q0M6Jm0M3n3J29Q4j87
3094a6j4K3m9P4n5l0j06J05J5J34j59O7Q8j34K1J20l0M5j28J32j79J07j23P2J08
$$ plain form
2894 -40 77 48 24 -42 -106 0 34 -64 186 64 7 -36 -27 -17 0 -15 78 140 -24 -55 29 139 11 -29 -80 -135 -134 37
2922 37 21 -49 0 23 -4 -100 170 27 8 10 75 0 -38 9 44 59 45 -14 -19 -25 -62 -117 39 11 -75 32 -34 -37 -54 -6
2952 -6 4 16 -92 -1 -2 -16 109 33 50 -37 -14 17 30 -7 -19 -42 -97 -65 -55 44 32 -41 -68 -126 56 -119 47 13 19
2981 19 29 118 13 4 -114 155 -3 31 22 -51 -67 -7 44 19 -63 -1 45 -37 -10 73 -25 7 -75 -88 74 86 24 -4 25
3010 25 -79 -2 53 73 23 -6 80 5 -57 26 -24 78 -27 61 68 -89 56 3 70 157 99 -62 -127 -100 -55 7 12 -104
3038 -104 -138 142 23 20 83 7 -26 -68 -54 69 -75 -104 8 13 -61 -33 15 12 -9 57 -21 -59 -81 -31 16 -26 83 -66
3066 -66 4 30 -29 103 92 -51 55 56 72 -8 -89 17 32 -26 -60 -146 -23 52 41 -39 7 8 -32 11 -42 87 171 -16
3094 -16 -30 -7 -56 18 -37 -67 -173 -68 -53 81 -78 -11 77 -57 -36 84 54 99 -29 103 -76 31 -92 -20 88
3119H8j39k8M0l7QO7rJ69k85M1J15o6O6P8j58j1N4K9l5o0M1j6NM3l9N3Mp0j9J36
3149F5j31N6O1K2j4q6J3n7n3jJ32J5L2p4j04M5M0M9J1l7P4j27LJ1R7j4oJ0o8r
3179d5J73m3n0j13L8J1m2P7M9o4Kjm4Q6O8j19J00L0j36J57k11J02j4qk2N3o2k7
3207e5j14K40j4qp0K9q8LJ9J60l7j2o0o6M4J11m2j6j33P5r3J18l4K1P6N2j86K2
3235e8Q8qKq0J4O6Oo4L8J7n4J16j62k8J22J03j3j64L4K2M1q5K5j0J4J9j17P5J7
3264b4p8L7J29n3K2KPp5J55k3j49L7k5Q8n8k1O0Pj31O1J2j4j4j04J61r7k2J73
3292F3Q8q8p8L5mm0l6K28k16k1j2l4P3r0K3k3J44k1j07J35OJ8Q7j39j0m3M6J78
3320A62j21L0l8j01p3K56k61J62Pl1M8j66L7N1J17l0K8Oj06K6LJ52k55J0J50j02
$$ plain form
3119 88 -51 -79 -39 -76 -68 -1 -10 159 -126 -85 30 -36 30 108 -50 -61 -7 22 -13 -73 -32 -48 -43 0 -39 14 18 -52 -71 65
3149 65 -66 -10 51 73 59 -27 -14 -71 -124 -125 7 22 54 -20 -124 -79 -39 10 21 -16 58 -69 -66 -55 42 28 22 32 -36 -45
3179 -45 128 85 35 -78 -40 -29 -71 6 55 -9 -7 -8 -52 34 102 -17 83 113 -23 134 -77 25 11 3 -19 34 -28 -55
3207 -55 -169 71 57 49 -21 8 -80 -77 -58 102 65 53 -7 -73 -29 82 40 24 -109 -34 -127 -9 -43 -22 54 106 -80 -58
3235 -58 30 22 24 -56 -42 24 30 -34 4 21 -33 83 -79 -107 15 118 105 -59 -25 -3 38 -47 -22 -32 -18 1 -116 -41 -24
3264 -24 -102 -65 64 11 33 35 42 -33 122 99 -50 -13 -38 50 -8 -29 31 38 -93 -32 -20 -34 -48 -152 9 -88 -110 63
3292 63 151 63 -15 20 16 -24 -60 168 -48 -69 -81 -115 -42 -132 -109 -132 12 -9 -116 19 25 43 130 -9 -19 -62 -16 162
3320 162 41 71 33 -68 -141 115 -146 16 23 -8 40 -126 -89 -38 79 49 77 83 -23 3 6 158 -97 -87 63 -39
3346c9M8j28K9J12n6o2P1K1p4n4K25l2KL2j53P3o4k8J34k02P2M7m8Q7n7O0n9l2
3374g5J65k5r4ON4Mo3K8r2J26Mm3oj23lJ98j55j2J07k4M5k4J9Q1k2o6L8n8O6j0
3404D6q7R3Kk19R1lk9R2N6J2p3jj04OO3P5rQ6M8k16J02O4j31K3M5O6j87j7J33
3433B7L2k2n7m4N7q2J85j8k9j5p0L5L8J7q7j7R0j5q7Q8m2L1j53J84q9O6n3k3J48
3462I5j3j49JJ89p4m6N0j04J74k17R4J32q4n4J2j9jJ08q3M0l3m1O7q7m2P8J01
3489I4n7j26J5L9j7J1M8K2J5L7j04L0Lj16J91j98KJ8J35j22J45o7k0O8k07Q9k0
3516i2J05K5J0m1j38J66L2k2j37M5J14j28MJ35n0r2Q1j36P2J21o1OK7ql8J00l8
3543F2r1Q4l5n7m9N2r5J05J40r4j1N3j55J08J3r8k4J73p5o4ol2J44j00j3M7J18
$$ plain form
3346 -39 9 -119 -90 22 -34 -96 -25 -4 -78 -132 93 61 63 95 -58 15 -49 -77 57 -145 -73 -26 -74 13 -44 16 -43 -75
3374 -75 90 65 -29 -23 31 35 -28 0 -92 34 38 -5 -11 -134 -137 61 -94 -106 1 -23 22 -2 17 98 76 10 48 -10 56 46
3404 46 -41 52 54 -165 -74 -77 -106 -14 42 54 -19 -20 -124 -118 -55 20 11 97 145 -71 31 95 -36 -13 32 98 -89 -106 27
3433 27 59 37 -20 -64 -7 -89 96 78 49 34 -36 -1 37 54 -33 -50 40 25 -62 26 -16 15 -138 46 -43 23 -30 -53 95
3462 95 82 -67 -66 123 49 3 53 -51 123 -94 0 132 48 -6 6 -13 -14 94 11 51 18 -23 44 -43 -85 -7 94
3489 94 37 -89 -74 -35 -52 -41 7 29 44 81 -23 7 10 -106 85 -113 -111 -93 42 -80 65 -2 -22 46 -161 -72 -92
3516 -92 13 38 48 7 -131 35 67 45 -92 -47 67 -61 -57 78 28 -64 17 -119 -47 74 13 19 46 38 0 100 62
3543 62 -29 55 20 -37 -86 -34 -129 -24 116 22 11 64 -91 17 30 -68 -92 81 6 -58 -64 -96 48 -52 -65 -18 100
3570A00Nj37k9J12m5K8r7P3j28K86j26m4n3J05J4m1M6j01On8Q9N5j8j52J5J78
3596H3k12l8J55l0N3M6qj12Q1m1qP8o9lQ0o7j5K0O0k3j0Kj57O7K22k81R2%J55
3625A20j14PJ2Rq7J19j01J8M4Lm1J3K4o0O5mJ2n2L1K6o1k8J55n6j53Q9j9K4k6
3654c1k3L4n8R5j02R4r8J42r6K4M8pQ5j66J2M6N6J3m0K7pr8N9M9k1O4l6m6o5l9
3684h5J32j47L8M6Q9j04m5O8R6j67j9K40k43M8P9L7j02r1J82k3L4o6%l0nM8M6
3711E6L0j29j3K23j61l6L8m3N8n4N2n1k0O0j04J54k9q5R8k8j03O0k0m5N1m0J2
3738f9M0K7L6n0Q2j01QM6j31O7J52j07j45J21%rK7p8J54j93J75O2q1l8j05J47
3764C7l5j2J56j36P3p6q0J69n7j13Q6k6O5j44Q6K1k2l9N5Jj6J13r8nR8m4j04O0
$$ plain form
3570 100 105 -32 -61 51 6 34 -63 10 -118 168 42 -2 -55 50 64 23 69 -32 -26 -84 5 60 42 -110 -95 83
3596 83 -129 -167 -12 -42 11 57 49 -63 18 -23 -31 47 -22 -25 55 -12 -27 -7 53 30 20 22 -135 -68 154 -127 -35 -35 120
3625 120 6 13 25 34 -53 66 -35 -17 27 30 -11 2 26 -34 31 27 39 -13 18 44 -17 -45 110 54 -99 -10 -29 -5 -31
3654 -31 -54 -20 -78 17 -85 9 -89 53 -43 -19 29 22 107 -59 -47 -1 55 68 28 55 48 -50 9 58 37 101 65 19 -46 -85
3684 -85 47 -100 -62 -16 73 -31 -76 -8 88 -79 -98 142 -101 -53 26 63 -39 -130 52 29 63 -3 -3 -33 -38 10 56
3711 56 86 -43 -56 167 6 -30 8 -35 23 -31 21 -30 -50 10 -94 60 31 -54 44 16 -87 -27 -47 -92 -41 -81 -69
3738 -69 -29 -2 34 -16 66 -35 -27 19 -112 -45 107 0 -145 -24 -24 -33 -6 -84 70 -123 52 114 33 -5 -110 37
3764 37 2 -10 146 10 83 7 -73 96 39 -74 12 -14 51 -93 -7 14 -8 -47 8 9 -7 106 8 3 101 57 -47 13
3792A3j34R6J03j92J19l2O2M0k00J38q6L1Q7o7J64j29R7k26J23q1J11r4k9L1k9
3817h4P3M6J1j30J15mr2L4N4m8P9L9m2n0k7P4K5j43J22n7k3J52o1J0j26J12k7
3844C2m7j2N7M4J0j31pJ97j00m0P5j8o0M1l6L2j35m3K23m1j01J4l9P1n9L8J0R
3872a6M5k7j37P3p7J70M1j18J55j99L1N6p8J14k5m3K9RPj15J15qO1N2Qj49l7J39
3900G6n8mk5M3m4J24m3j65R0r4J69j00nO7K0n7l1P3Qq6j10J53j5k8N8j32Q3Op4
3929a01R0J1J4n7q9K57j26k7L6n1N3L1r8J20k3k2Q1m4r8J26Nq0K1k0m2%O2k01
3957a72J75M6m0j07Q5J4N6k3P5j04m2J71k54J95n7p1K0O2j18J19j19m1R2M2n1
3982d7J11n8L5rj4O2m7K2mn5M7o6M2p8K5N9j08R8j0l0K2L0l9J28rr0P6m8Pr8l4
$$ plain form
3792 13 -121 -25 78 -114 5 -27 35 75 -125 13 -73 -42 45 -22 142 13 110 -116 7 -74 37 -57 -86 -55 -84
3817 -84 -11 35 46 -84 31 27 -65 -31 23 -25 54 93 51 1 -26 48 73 -70 52 -5 -28 124 63 73 -53 59 32
3844 32 -15 -27 30 74 84 -47 -54 143 43 3 78 60 0 41 5 37 -98 -141 82 41 -60 -46 -85 -14 -73 -35 -25 -16
3872 -16 29 2 -135 -62 -139 31 72 -46 109 -90 -59 -3 -81 33 8 -35 -6 3 10 -105 10 2 63 115 123 -26 -63 76
3900 76 18 14 -11 32 -12 112 69 -96 -6 -100 69 -31 -36 31 51 -6 -37 36 44 -42 -152 1 -14 -42 16 -116 -33 -27 -101
3929 -101 -11 0 14 -43 -132 125 -1 -28 8 -43 10 41 -57 63 40 18 99 55 -43 83 88 8 29 9 -33 -33 29 -172
3957 -172 3 49 9 -98 -13 1 57 34 109 5 -37 134 -120 75 18 -53 -33 29 -89 30 -89 -130 -38 4 -47
3982 -47 64 6 41 32 18 80 33 55 51 -4 43 -23 19 -59 -34 25 -83 15 5 -25 -3 27 -12 116 107 17 93 45 52 -46 -80
4013h0O6j02R6K5j1j0n8%qJ09J4p1J46n6K3j47J15j37l2J35L1q1K8P8q0j68J70
4040ej07j10K29KJ16mp4m2L6M1Rj16R3j27O7ro5K2R6p5j07J22j3mN5M9j27N8N3
4069F3rk6J7L2j56R1N7j13J15j06j6j9N8r2J29l7M6L1r9P1J24p5k04J64j1P1j39
4096c3N2L6j17j5J24q2J03j08j27J85J56j80j5q7J73l0j14J41m5j0n1N1j28J46
4120B5n9K9Q7j16J38r0m9J14j08k1l7J24j4J8j22P6J9L7k61L53k37L7J19n8P1
4145G5j24K8L6r2L8Q7m6J4j09M3J14l1m6O7l2K9J5J5o9O7j47J25j10J33k27J69
4171B2J3J5k1r1Q9j06N2Q4ok1j7M3k5p4P6o5O8m5l4J09m8o3J43q4o0L8l4J12n9
4200A1J05j97Ok1N1J23j24Q8r6NK0P7l8O3j04J02r3M9j3k5K7q2N5r7J10o0M7k1
$$ plain form
4013 -80 -14 -116 -20 5 -6 -16 -74 -74 -82 27 41 -30 116 60 83 -64 51 -86 -118 17 48 -33 -5 73 -7 -175 -5
4040 -5 -112 -222 7 9 125 121 47 5 41 82 91 -25 68 -59 8 -1 -66 -44 52 -23 -130 -8 -21 -25 30 79 -48 10 63
4069 63 54 28 45 77 -79 12 69 -44 71 -35 -51 -70 -12 -104 25 -12 34 65 -34 37 161 86 -118 46 35 106 -33
4096 -33 19 55 -62 -77 47 -35 68 -40 -167 18 174 -6 -21 -108 65 35 -79 62 17 7 -44 7 -121 25
4120 25 -34 -5 82 -34 104 14 -35 79 -29 -50 -87 37 23 41 -81 -5 14 51 -210 143 -94 -57 62 4 75
4145 75 -49 -21 15 -77 -39 48 2 16 -93 -50 64 33 -13 54 22 51 66 81 12 79 -68 57 -53 80 -147 22
4171 22 35 50 29 -62 27 -79 -27 57 51 30 13 56 31 -43 33 -32 36 -9 -43 66 18 -45 98 14 -46 -8 -42 70 11
4200 11 116 -81 -75 -96 -45 78 -46 42 -54 -49 -29 48 10 73 -31 71 -22 27 14 -11 16 -66 -11 -108 2 -58 -11 -32
4228c2O9P2n9J1Qo2K3o5R9p6Lj6P1m1j74J04l7J10j79J54L4O1q2K1n3JJ22j1n
4257G1l0j21J28p8l4J54j12K3J16j06q6J61l3l9rp5RL2R6q4P2n2mRpL3%j48L8
4286g6N1l6J39j01N0l3n3R0L7q9L3k0j07J25L3q6J0R0r4r9J39L3r0J51p6P2j80
4313h7L1o3J31k2k0J5O6k5p0K2L9q0O5o3j9J11o9j3Q1j0q8%J10j4r6k7J03rkn6
4343e9kJ41k2L7j00R2K5k67J78l6r5K40k51R5k3PL8J2oJ6k1K0Q3j56J21n3O6O
4371H6q3N7n4q5J8J49l3j11P3NJ1j34J14l3k1q3J26N2K1K4k00J58j26kO7n1m7
4398a02Q9RL3P4p2LK0j8P4j10%j06J73j4p9J15p8N9m4p9R5j44J69l8j50K7J38
4425D4K2j0o4M4l3K1j24J50N0l0p5O0o7k9K9J15o3k4m3J68j34Q4n1n0oL7O1m0
$$ plain form
4228 -32 37 109 50 61 69 7 30 -35 64 -12 -9 -25 46 5 -169 -65 -102 8 -171 -17 17 78 -4 17 -36 -35 87 76 71
4257 71 41 -80 48 -30 -64 90 -22 1 117 11 -75 86 53 14 5 -70 -61 -29 67 -17 55 3 -1 8 1 34 34 -114 -76
4286 -76 -25 -61 78 -23 27 -6 -59 31 68 -21 12 -8 -115 10 43 -43 -33 57 -37 -136 3 36 -54 97 21 93 -87
4313 -87 -56 -119 12 -10 -30 -15 51 26 -44 -22 17 -63 2 -61 -80 31 -38 -51 30 20 -68 -68 42 28 -68 -95 8 -1 -3 -59
4343 -59 -61 80 58 95 -5 87 112 -155 23 -13 -108 132 -119 -24 -47 -40 -2 10 4 20 -1 19 102 -54 67 14 80 86
4371 86 3 60 6 -79 -61 88 55 -56 17 22 33 -101 13 -20 -41 -124 2 54 75 99 -101 57 -69 -71 -4 -55 -102
4398 -102 -13 -4 29 103 31 34 54 36 110 0 0 -106 67 53 -26 89 11 70 26 -53 42 -102 67 29 -121 -94 44
4425 44 66 56 -8 36 3 24 -100 50 100 70 -5 55 -12 -41 -12 103 40 16 -27 141 7 91 40 -10 -16 21 82 42
4453D2ojq8J36K7q1rp3J20k5o6n0j4J13j2m2J06p5p5J0kj7k5P4P3j04K1j0Q0j14
4483h7Q7N3n3J3MP1j78N7M2j8j1kQ2k0m0p4K2LM9JP1j8n2k0L7rj7qJ39p4J6n3
4515A3K2p2r2L4J60p1j1L4n8n8J25n1J08p0N7j0j06R1p4J31q0k7J2r1J43m8l2
4542b1M6j22P9Q3rq6L6k5m1J15Om8J0n1O2K0k8J0p3j1L5j6Kl7M4K1n3k2J62r5
4572gM1o5o5KP0J9J13n0j11M4m4l9P7n9O6L5P3j72J48q8L9l5l7L9r0J60q3o4J22
4601C9n4J60r4pl9J4j59J31l2Q8Lp6P0r1J91k17J89j46P5j01k7K8M4N8j8J50k16
4628c7k7P2rO5r3k8l9J14M4k5n1J04r0o4K2j1M5qo0R5O0k4j8k0M3j22J23Jp0o5
4658g3Q6L7k9Q9o4j05Q9l2J4K0r7rP7J80j62j24J01M7o1lP0n7J4L6r2J43r2m5
$$ plain form
4453 42 36 35 -53 83 110 29 20 -53 67 42 -24 -74 -88 25 13 -29 77 2 -73 -63 -65 -82 -107 -33 40 -64 -43 -53 27 -87
4483 -87 0 53 0 13 17 88 -90 -33 9 -9 -20 -22 60 40 0 -74 -52 -49 0 1 72 54 2 -18 19 10 -7 -15 124 50 66 13
4515 13 35 -37 -129 -95 65 -6 -17 17 -41 -99 26 -25 83 13 70 60 -46 45 -29 102 22 -5 7 -84 59 11 -21
4542 -21 25 -97 -18 65 56 -30 6 -19 -60 55 61 13 23 -28 34 54 26 36 -37 -48 -13 -29 -27 -64 -20 1 -52 -74 88 -7
4572 -7 34 -31 -96 -94 -24 -5 108 58 -53 -9 -53 -92 -15 -74 -8 27 100 -72 76 -12 27 -8 -45 -6 -96 64 -19 -83 39
4601 39 -15 145 51 44 5 19 -140 -9 -41 47 50 -26 44 -47 144 -73 116 -30 45 -56 -83 -55 -11 47 29 179 -37
4628 -37 -64 8 -1 64 -29 -57 -96 18 62 37 -14 90 0 -64 -42 -53 -8 -16 -76 19 79 55 37 17 60 -62 61 62 -8 -73
4658 -73 13 50 21 110 46 -59 30 -2 12 32 -65 -74 3 183 21 -103 -2 45 -16 -19 51 -6 8 44 -48 95 3 -42
4686d2P7q8N2K5jP2p6k3j42K53j9n2l0Ll1L2N9j21nM4lJ16j04n0O3lM1j58Q6r0
4716a15K81j25k2m0O8n4q1J22m8N3j02RP6Jr0J31J2q7l8P6n0m0Q3P5j79Q2P5r2
4744a9k1l4J29l5o5o6J20M1j9n8P1p5J22j21R2o5J2J09j42J1L6N3j50l5N1j9R3
4771A6j41M9J06o1J20n5q3K9O8j3O3l9k17K20l9m9M5J0Jj28J20r5P9J9J3lm3p9
4799h7kJ9J48Oj50M3RM9p6K4m2l1J58KMQ7q2q7P1j63K16q1l2o5J85j44R0q9J09
4828H9k33J07P0l4M3q3L6P5o2R8n5kj25J30l7l9p0L2K4N8J2n2j38J74K8J29j95
4855b0j5l7O8k6o6J44nL2j07P8m8J31j80O0N2j94J45N0q0M8j01Q2rJ2N3o7n8N9
4883AK9O3j60J0K7rr4J42q1L5L7P0o3j9k0L2n0O4n4J27r5L5q8L9n4J98j5k33N9
$$ plain form
4686 -42 35 -53 -1 24 23 95 19 -4 -146 107 88 36 6 9 -22 10 69 -52 -57 -13 -16 100 -4 -54 9 6 47 -111 -25 -115
4716 -115 166 41 19 -21 47 -7 -88 34 -14 39 -63 -54 22 23 -67 64 76 -11 -49 27 -23 -63 20 95 -84 -2 73 -19
4744 -19 -40 -74 55 20 -45 -111 9 50 31 -27 44 -31 91 -30 62 -3 9 118 -24 -13 23 76 -74 -109 -58 -77 16
4771 16 -125 -76 30 -31 89 34 -49 -20 48 35 98 59 -158 62 23 -26 19 29 30 -98 22 -73 6 25 38 35 -8 -87
4799 -87 -89 -70 78 84 -66 -23 -14 35 -41 -17 -59 -90 68 70 74 161 79 -8 63 -100 116 35 3 -62 123 -21 69 -20 89
4828 89 -144 -37 33 -1 42 -41 -5 70 8 106 51 49 -76 54 17 -22 -92 -60 -36 22 34 -18 -156 18 46 175 -20
4855 -20 -35 -72 -4 -30 -96 48 43 75 -32 46 -2 129 -51 9 61 -133 12 62 -18 30 -71 11 2 14 67 0 -58 1
4883 1 30 93 -67 -57 -30 -39 -133 9 -72 -37 0 70 7 -12 -32 0 -50 14 -40 87 -8 27 -61 -22 -76 122 107 -126 -67
4912f7R6k0J21j45Jln9M3P4j29J26N1k47J87R1j30J85j60N9r7K2Q9q9J46j32m1
4938b8Jk4P5J8O4q3o8J42L4k28J23j03L3pJ4K5O6pq6lK9o8J6J14m2J7N0L1j13
4967hR5k7r0R4o1qMn6O6KJ5j8N3j04Q3j6Mj62R6P8q5P5J6r8J20j95J79p8P8j45
4997i3J4R2l3oJ0jL7q0k3Q8p7L7K9L5j07n2J60q8K4NJ21k0k2q8j8O8r1N5L1%p
5028@nj23J19l7J14kl6j7QN2o2k7n2L7k3pQ0N6LMj20R8N4j02m4L8or2N2O7l6Q3
5060G4k11K5R5j02O6J63j30p7J83j19M9K6k9L5J7kJj41N1JNO5m8j5kJ8J00p0P6
5089A04m5o5j3j5n4J28j6n1K3N2kr1K07k11rn2R4P1m7O3r2j17Q9j1MO9P1o6jl8
5119b1M0j45M4J51n5J1m4P2j65P9o3M1J5L6j9J09q2J14j46j20K04Ml9mn2oJ07
$$ plain form
4912 -67 29 9 130 -15 -14 -17 -76 -33 41 -88 38 89 -158 29 120 -10 175 15 74 -23 -1 88 -1 145 13 -28
4938 -28 -27 -51 24 42 106 23 -45 97 131 -97 26 -77 -44 -51 -37 -12 54 47 -39 -42 -13 -81 -65 49 7 24 74 105 -8
4967 -8 87 60 -30 64 3 -5 -1 -57 9 11 26 8 61 -43 40 24 28 -134 -38 40 -45 30 46 -52 68 -127 52 -26 52 -93
4997 -93 -79 13 -20 -26 -16 -17 20 -60 -83 5 -72 -35 -6 29 -78 -130 30 -58 -34 -29 92 72 50 -38 -56 12 -79 -24 7 7 0
5028 0 -5 -128 -9 -46 68 66 30 13 21 73 11 -16 -68 -31 -54 -61 19 75 78 82 -38 60 114 12 -32 6 0 -92 -40 27 -9 74
5060 74 -137 -112 -17 -119 -53 110 -20 -97 86 -33 16 42 13 48 65 63 64 -77 -26 -25 -20 45 -3 -18 -20 -2 98 28 104
5089 104 59 -6 -19 -34 -88 40 24 -27 -4 48 46 -45 162 -49 -58 -110 -16 55 8 71 -21 -138 -49 -60 -56 13 84 18 17 -21
5119 -21 19 -126 -82 69 14 25 -19 53 -112 -33 -96 -55 -40 -4 -23 86 4 118 -28 -148 56 60 21 17 -35 -41 66
5146F6j08L4Q7r9R3k3p1K9j0J2kM4J0j07M6M8j2Ol4j77J55m0L5J05Lj76J11%j7
5175HR1n7q0Q5j11Q5k4k5nj28J16R5m7O0N9j01Rr4P3%K8o2L7L2j32J12j03Q9M1
5204E1n5J99k11R8p2j6J7M6p1K0j9K2J3q8O0N0K9l6l8N0o1j28J46P0N6j36N8p7
5232b3P7M5j14N1n8P6L8k0j35OL3K6l7R8j59N9M3n5P1N4m3l2j00l3J37j7L4J8
5260D0l1O5p2M4k5j03P8JQ0j11M0l0j8O1j38J58j37M4Q1l3pm4J31j31j9N1R7k7
5288D5Q2r4n2m4R4J9q9M7n4O2k1L9L9j22R2j30J82j34O7m1N6m2r0J16n0P8p9L
5316b1J45j65L5k2R9r0L7m6O7K7m3mrk3j6J0Q8k02J36P7j25J17m1M3j36L0N6n8
5344c4N6q1J12j8r9J17j18P9m6Q8j34O6J01p4J18j05j08N7J6k1M5J8k6Ll8R9m4
$$ plain form
5146 66 -42 -8 79 -20 73 50 -21 8 -2 10 8 52 62 -45 1 49 37 43 9 -168 -13 -53 -18 87 90 -86 25 25 8
5175 8 99 42 -38 47 -64 21 -3 -28 -33 -161 -45 50 3 63 122 21 30 -64 9 9 37 -25 12 44 -88 24 -79 10 51
5204 51 -4 195 -16 82 10 -6 11 57 -14 6 -13 9 22 -66 -6 44 73 37 -1 49 -12 -140 6 76 132 -4 54 -23
5232 -23 54 99 -15 36 -22 54 92 72 -63 -57 -24 2 -35 63 -96 -37 6 -49 22 76 33 1 -99 -132 5 -12 22 40
5260 40 9 74 2 46 21 -82 -4 -3 77 -34 6 -24 -42 19 -119 39 -98 -54 27 -6 -13 -57 74 -57 -76 -25 72 45
5288 45 127 33 -19 -63 31 50 -39 8 -46 16 -5 34 73 -49 43 -87 95 -39 28 -13 43 1 -89 27 -23 55 -24 -21
5316 -21 124 -41 -6 -28 71 -19 18 -28 39 66 23 19 10 -13 -29 -19 69 -133 3 80 -45 72 31 74 -62 -32 24 -34
5344 -34 22 -59 53 35 -64 53 -65 14 -32 56 -78 -12 89 15 133 28 -80 -23 -7 -28 17 35 9 12 -26 73 29
5371B9O5j95M2J10j35L1MJ4L1Qnm5M0J82p0p8l3n7%LO2o6l2J3J13o6J11j49K10
5400A37o6q2o6Q0N2j9k4J0J8j7p4N9O5j17M7J51j42R9k7j17P1l7L2K3j08n0O2
5427d0J3K3q7Q3qK3J0Q0o2j42J34n2J07o8l0rN2o7j6ONJ16j5j37j8J8L4M0P0J5
5457G8j04N7Kr2K9P7q0O0Rj54J05Nk7l4J61l3j23O0l1Q3Qj22l2JJ61j9j9M7M2
5486A15j10M4j17oN2k7Q0j0Nq4P1l9J30j63J86j23M5j85J50nL1m4p2J66k24J56
5512B2k8L1Q1m8j19L4P3O8k41J52K2j42kQ8O9j29N3r2J14ML9j53J06N9m4O2J9
5539I8j22RKJ6LP5j23N6J7m0j8K9j3O8q1J5N2N6j37M0J8j0J04j49J3K6Q8m4J6
5568F4r6j22J24L7M1J0o1K6Rn4m3L8l5N3p0oP5n2Q5k4j4L0n1M5p9O5l2J35j38
$$ plain form
5371 29 94 -101 -59 51 -84 -53 -49 -35 -4 4 -1 -46 -6 176 106 28 -5 -62 -62 -59 3 -63 -95 -82 31 -35 76 -73 137
5400 137 71 -11 -77 3 55 36 12 22 40 23 -51 8 73 -44 3 154 12 111 84 -33 38 1 33 56 -52 -102 -40
5427 -40 -27 -4 -91 -8 -16 7 17 97 35 -107 27 -25 82 14 -16 -25 27 -40 -56 -50 -45 71 56 -81 -99 -81 -47 -7 63 78
5457 78 -26 31 33 -59 -30 47 -33 27 36 -118 -13 -8 -35 -69 92 59 -64 -4 -35 48 56 -66 -98 -97 64 45 26 73 115
5486 115 5 49 -68 -74 -22 -49 31 21 26 -58 13 -26 104 -59 127 4 49 -136 14 9 40 -4 -76 90 -134 22
5512 22 -6 25 106 58 -61 -27 46 114 -127 25 47 -95 -97 -9 60 -69 -16 -108 6 10 49 -104 2 61 17 79 98
5539 98 -24 -15 -13 3 6 81 -42 14 31 -9 -27 2 -11 57 -24 -9 43 99 -38 2 20 10 114 -35 -22 4 92 48 64
5568 64 -32 -154 -30 7 48 58 -3 23 32 -22 -65 -27 -62 -9 -79 -85 -10 -62 23 -1 -15 15 -36 9 -70 -5 -37 98 -40
5597d0k2Q4j2N2Rj35J18r8l0J7Pq3J13K2r0K2M1M9O4r2n1L8Q1q0P8k7m7N4q4M2
5627@n7j1J56l6l9n0n8L9j6J1M2O1JN8L5j63N7M2j30Q8J7k6P3j08l4J36q0L7r5
5656e0NQ3n9L8MJ1m6J39p9oQ4j00P8n7p4K1Lm3R4J7r3L6Pj1j0p5jM7R2m4M5l7
5688A9n2M5R2j50M3M4p0m9L8%l7R1m0j0K3j9K7J5L4k3j33K65j46l9Q7j7n0k0m
5717c6PL5j06L5K4jJ13Nn9O5q5n5J03j01Q6m9p2J28O8n2k7p5K3P4p9m2J05r4J02
5746D0k9q6N2P2Q0j63kp%M5N3l4J2j40J86q4N4j07R1K3l2Jm9L9Ko6P7k4J35m0
5776I9k00J06m9J33k5r0j5J1m5j5J02k3O6r7Rq8J12j8Q4L3j76O2m1J3l2L3k0l2
5804a03J25q5LJ46j27J19Mj23Kj9M3l5J55p8J44j10j20J8n1J27J5p0J54n1j37
$$ plain form
5597 -40 -62 22 10 62 71 -64 54 -44 -74 -57 -50 -133 -20 2 -88 -66 -25 24 88 -4 -55 -17 64 -16 62 35 -12 42 -42 0
5627 0 -57 -68 88 52 13 -37 -95 -56 -72 -61 -19 42 43 101 136 -27 30 72 -58 30 47 21 94 -14 -48 88 8 45 -50
5656 -50 -45 38 -21 17 21 32 -14 125 46 40 124 24 102 45 -29 -8 -5 -48 46 63 -30 6 13 2 -8 -83 -84 -37 55 11 56 19
5688 19 -33 12 104 -46 -3 41 -29 -78 -40 -40 -77 14 -26 -36 -13 -32 -5 10 44 21 -112 153 7 -32 55 38 -12 -32 -36
5717 -36 -29 6 -100 -65 -41 -42 71 76 17 82 -3 -58 45 -56 30 -19 -91 37 105 53 26 -49 -26 48 -31 -73 32 -62 40
5746 40 11 -75 -23 49 129 -34 -36 -43 -43 2 55 21 33 -107 79 -5 49 -58 33 56 24 25 -24 15 17 -49 28 4 139 99
5776 99 -101 5 -44 89 64 -26 -41 -30 -75 -90 12 -11 55 -42 -33 -121 -9 -27 57 90 -86 -24 -65 -52 -84 -51 -71 -103
5804 -103 22 -63 -60 86 -41 78 82 -41 -39 -58 -15 -50 105 27 171 61 -59 -41 -92 35 50 -20 134 83 -54
5829e4m2N5M5j47J66j5n1J7n2N4K9p2J28p3j02K23m2K9k9%n9qj03L8M5M1N1k0
5857E2m0k5o5K7K5K3N9q4Q7Jj00j1j3J11k9o6k3R2%P1r4r7J92r2ml7j4J00o3o6
5887h3Q6j19J97j12L2L2l7KQ6K4j94J88j69L9M1j3J27j6k00J10O2r5rJ29m3J2
5913G7k6pm9l7R6L7m3j38M8J31n9j2o6K6K8L1K5j08r9K07j17L5J0lPj3k6P0r0
5942f5J04j27M8R8j81J08K0o2m0J73j20M0J10q1K9n9m5J0k4Q4j03J26p9J52j37
5967b1m4J31q5P3n2Lo5J69k09J07oJ13j56Q0k1j39K75j08m1o1N3K9p1P2K1L8q9
5994dO1Qj09J42n1j53K5L4J9M0k5q5J22J1n9lJ3q6J40K1k08J99o9J02j02J17j37
6021c7J4P7o6O6nl1oO9j34j00J52Nj17K22r2J01j46Km0M5PJ9Ll5NQ6j07M2o0N1
$$ plain form
5829 -54 -96 -41 4 -143 23 8 -43 -26 -78 -24 5 -67 61 -12 -114 109 67 96 67 67 8 0 -103 -65 -20 21 72 52
5857 52 12 -13 -78 -51 -26 -3 56 -28 59 60 -40 -51 -64 47 18 -48 -71 21 21 92 -2 -99 93 1 -3 -40 -54 46 -17 -83
5887 -83 3 -116 81 -31 1 33 -4 -2 84 108 -86 102 -67 -28 13 0 127 111 -89 21 83 -12 -21 108 65 77
5913 77 51 44 -5 -42 54 91 48 -90 -42 89 30 18 -48 -22 6 37 62 -46 -145 62 -55 -20 -10 -13 -6 -19 -45 25 -65
5942 -65 39 -88 -40 58 -123 -15 5 -57 -97 76 -44 -4 106 25 54 -5 -50 -40 -64 20 -83 43 -36 116 -21
5967 -21 -65 66 -19 54 2 5 -60 109 -100 7 1 114 -42 38 17 -122 153 45 4 -57 -4 25 -46 26 47 85 -4
5994 -4 57 65 -44 98 47 -106 -81 -47 -28 12 -13 -98 24 35 -24 -27 -14 -100 40 61 -147 52 -17 85 -17 100 -37
6021 -37 -23 54 -12 54 49 18 12 81 -53 -153 -1 4 -113 109 17 118 -28 -26 -66 -21 -14 5 8 -27 -22 64 -43 -1 -61 -10
6051a0Q2p5M8k3j1m5J6J19j40nN0n3P1M7J4q5K2j21J67j46J33j04lm5l5J45J7
6078C0j39J76r8KK6M0j34J87l3j51N4M0nL6j9L8M8j6J7r7n6P9l6J3L5L9L4lj01
6107Fk4k7L7n3O4n1PQ0o3J1L4j69J43j01N0L3L6j3M6L0q3J65j58K1j42o7J46O8
6135B6j07oJ46j06K6Q7j01%J15o2P6k54J40J0n5oK7J07j64Q1rP3m0m7j15J56j3
6162a5K2k0l7J24j02K8J9k2Oml8L9Q7j93nJ55n9j0n1M8j0J33j36L4k6k2L4j7L7
6191am3N0M8n0o8J14j5kRK3j81J99k57J09J30l5m7L6L1p3J8J0j0K8j00K1O4O9
6219G7k6j40R2l3L9p6J43j56J07j5qM3M9k09J80p7O7r5J01rr3q5J97p8k2J2rL1
6247GR4q9P5j38R2M5m1J8j7j17P1Rn6k7K4J13k9m2jQ6l1j13N5L7o1P5j14q0K06
$$ plain form
6051 -10 72 -3 45 22 11 -34 -18 101 -39 -44 6 -47 24 71 85 0 22 -99 68 -78 55 -49 -52 -97 -132 13 30
6078 30 -109 67 -31 -29 -3 37 -97 90 57 -94 -40 0 -5 31 12 50 98 82 99 2 -54 25 -11 2 37 76 110 107 6
6107 6 -18 -45 -8 -61 3 -48 -41 39 -24 -13 21 -148 -5 -106 -56 -23 13 0 46 76 -7 158 0 21 -121 -188 -42 26
6135 26 -81 -87 59 -47 -21 66 -35 -35 80 18 94 -160 -20 -10 -65 -71 -44 63 -101 -20 -29 44 4 -43 -158 -2 -15
6162 -15 7 -13 -50 74 -28 0 19 -3 3 -1 -39 0 87 -106 -111 44 -15 -25 -76 -28 -38 95 -41 -7 -33 -55 -21 -38 -1
6191 -1 -44 6 54 4 -64 50 35 33 42 65 -116 83 -174 -65 65 30 -17 19 50 -23 -5 5 -5 23 -77 -56 8 77
6219 77 51 -89 3 -30 9 -67 76 -80 27 12 4 47 96 -113 67 -10 57 -38 63 54 -39 -124 73 -5 -27 -15 -24 7
6247 7 101 12 87 -51 41 86 45 63 46 -71 0 9 -47 -74 -50 63 34 -8 -9 77 46 -67 -12 25 -36 39 -75 -155 51
6276E1k2M9j1k3M2J3j95K9J06n1l0O0n4J21j28J07l1j3o5J10m2n6P2n5q4J31j30
6303i9qK0J08j30l6J94oj27M6l7P2R0j07R2n6k5j57J14J19m1lMo2M5L7N6j63J13
6331E3q3l8J01L8%N3j38k8J07j04j9m7J46n2J57j06l6p0K4J11j82J08j0N9Rmo6
6358a7J0K9M1p7J02n9j00J21j08J33j24J66J3o0Q5j34j6J0p5N3O1k9k7Oq3oJ20
6385C5j12J51q2j46L7J40n1J35j48O3ko5RJ01j08J48k10J7O3k5j8J0RM0M0P2j7
6412H6qj56N5J55k41O7R9o0om6J45n0rk8R0j15Pq1J88j12pMoP9o1P6j39P3N9n8
6442@m2J95k30J9J24m3J15k47P5N0p8J19o7J00n1m1n2J02j8n8lK5R0j64N3R4j23
6469e6O3m2o7J19P7k1p9K4j14K19p3L7k14K42j47M4j17R1O1L2l7q5L8J3m9l0R9
$$ plain form
6276 51 29 78 67 44 86 99 -96 -67 39 -12 -42 18 -36 85 -43 64 33 20 -45 65 23 -33 39 -16 -100 31 -99
6303 -99 -107 -87 21 -109 -145 49 43 -84 -38 -75 -3 87 -20 72 16 -9 -166 -52 67 26 23 27 -35 10 47 103 -60 53
6331 53 -30 -68 33 71 71 124 -14 -42 65 -39 -58 -105 41 -11 146 40 4 -66 -42 69 -113 -5 -15 44 53 49 -17
6358 -17 -7 22 63 -14 88 29 -71 50 -58 75 -49 117 130 70 155 21 5 15 -60 -7 54 25 -2 4 -79 -85 35
6385 35 -77 74 -8 -154 -117 23 -28 107 -41 22 20 -45 -36 65 -43 105 -105 -88 -25 -50 -68 -58 -49 -9 31 103 86
6412 86 78 -78 -23 132 -109 -42 57 -3 -9 -55 90 40 31 3 93 -22 -15 -96 92 -20 -27 -23 -29 50 -11 65 -74 -1 58 0
6442 0 -42 153 -77 -58 66 23 138 -109 -34 16 -62 57 -10 90 39 -2 -54 48 30 -28 -31 -6 84 -80 -27 67 -56
6469 -56 7 -35 -102 17 94 73 -6 18 -96 123 50 87 -127 115 -32 12 -105 -14 47 79 42 -43 -5 8 -41 -71 28
6496B8Pj0p1R1o1j0r6J20Q4m9k1k7j60K25p8n4O2l6K6J5o7P9m5K0NN4j50OJ11
6525bl0M4p0J4J60j24N8K6r1j16M2J69l8k6m8n0M4o8N1ql0J18k0N9j49J81j24
6552b8n8J3J09j07J5pj9L4K2j9L9k9MP4m6l3j4O8q8J27m0m7L9Rj04O8k0P2m3N7
6582D8oj32M9JlL1J2o1P4ln6R3o9Q1jq2M9j17K8kP7k9J14k8m7o2Pm1J1p3%K00
6614F3J09n6p9M3j5j24O1p8M5M2K8m2oj0oQ0J8n4n9K9N9j04J19q7j1J26m4j33
6642h6K4L5J08j65P1P7m7l1Jn9N1J04m3K1N2j22J67j04po6j18J94J2o9O3r4N6
6669B5M8Rn6L3n0qk5Q2n7l6K2r7N3P8k8J3L8r3Q4j21J56q1R8j22r8J32P7j10m9
6698h3k4P9J18j55N2n9l3J83o0Pm8O7M9j72LJ43n5Q2j14P0rn2L6k6Jprq3J03P1
$$ plain form
6496 28 35 25 -46 45 -16 -26 -122 -2 82 33 12 -15 -175 50 -28 -82 -20 -56 -30 -15 -82 -3 -48 -28 -23 31 -119 -113 -2
6525 -2 -32 12 -58 -44 116 -8 50 76 -15 -131 -89 80 42 16 -32 -82 -38 -106 -55 -63 -93 25 5 64 -85 96 -28
6552 -28 -86 -73 36 -71 -56 -63 -82 -48 -26 -45 -6 -35 -31 43 -3 -36 -50 18 -70 57 17 -30 9 18 -86 -18 -38 34 -9 48
6582 48 42 -90 -41 -40 -43 -12 0 -61 13 10 -46 47 -22 59 58 -24 25 -92 -64 -66 11 -18 96 68 21 -41 -34 -75 -64 -137 -137 63
6614 63 172 116 37 80 65 -59 2 -76 -31 11 39 -3 -9 -19 -25 55 73 19 -40 -11 48 -56 63 -24 -35 91 47 -86
6642 -86 -62 -27 81 -84 -13 64 17 -14 -13 -72 -21 83 40 61 113 -9 158 54 47 -19 -137 57 69 0 63 -31 25
6669 25 73 82 26 59 9 1 -24 58 1 -35 -13 -110 -57 21 -7 6 44 -49 35 -86 70 -11 87 -35 -133 -1 76 -34 -83
6698 -83 -107 -28 90 -65 -13 -72 -105 78 18 25 -23 44 93 -79 -76 67 12 94 -20 50 41 -11 25 -1 0 -7 -16 -99 4 75
6728G5Q9j03j53K9J08l0J2l0k2R1L3j49N6R5o5k8m6k1J17m1P4n1p7J43o4k6n9
6755d3J05k0o7l8R1K1o6m8J06p5N2M0M5m3Mm1p2O9l5pK9K1O4p3L5n6Q0l4j42J82
6785H4n2j6J5j08N8K8J9J2j1Nj6j6J07n4q1M6O4j51J22J3oj2j08j5M6K3J03j89
6813i0J21j01J15K4j41J13jK5r0o1M5O2j6Q3N2k36j1K33k24J80p1NJ14j34l7J29
6839H8j04lj6K5J02l7J14j06j3O2k24R4n1J4N3NQ5m4m5K7k6K2J01k47J43n0J02
6866G1k9l9p9O7q0J39j31N2mP8o8M1l5j14K10m8mk9O2l1n4O0M3q9qJ3l2L1k0q9
6896a16J6L2R9o0Q8m7p3Q4J6l4P5q1J21J2m8kj30l5N9P3j7K1Lk7J01r9k7p2OM1
6926b1p6R8j4K1j1N7L6n5p7MJ60j80O7Nm5K4K7j0P0k01J54p9K2N5m9K0q5N9l3
$$ plain form
6728 75 164 61 -92 -63 45 15 27 -3 -25 66 99 -50 6 101 36 8 -38 -59 58 17 91 40 -37 106 42 16 -43
6755 -43 62 42 -25 -63 28 49 -17 -65 41 -34 18 58 103 60 64 23 -49 20 -15 -22 7 28 92 19 54 -2 78 44 -98 84
6785 84 32 16 31 -77 -19 9 28 40 29 34 18 2 109 55 -26 20 84 -67 55 68 62 50 -58 -73 -27 -4 99 -90
6813 -90 31 -70 45 69 -72 41 40 65 -25 -86 -41 21 5 88 140 -96 -107 126 -98 82 11 16 130 -4 -41 88
6839 88 -16 -19 -35 -10 92 55 169 63 50 112 -112 -18 -69 -55 -2 3 88 44 -1 26 0 22 123 -124 19 -31 71
6866 71 42 3 -76 -9 -89 50 -81 -29 -33 45 -23 18 -17 -131 79 31 27 -2 60 29 -25 35 78 -11 -19 -6 -38 -7 -27 -116
6896 -116 -100 -68 31 -29 59 12 -61 23 39 5 80 -1 120 132 84 82 -48 -83 -24 49 32 53 56 29 130 31 4 -68 -62 -21
6926 -21 -97 1 -13 8 -3 54 90 35 -42 -38 122 -58 9 14 -31 -7 20 10 80 -121 33 -46 -24 31 -18 2 -83 -24 -57
6955e7J3Q1jj39R9K9o5Q8Jo2M4J28j95jJ62j00j7p9q0K61j07N3M0m6q0Ol9O4P5
6984G6l5n3m8L5rq9N0J26j55J47n0nO1j4ON6p9j8J2K7k2m3oO5kr8N9O7j07kj0
7015e8J71p6%j06M9n9O4rN1r7M9m7P4J6n6N3l7O1o5Q8j02J55j89Q2%Q5p4p9J9
7044c7O5r1J33m3m2Q2l6k0n2J00j83J91J6q5M8J2r6J62k00K4n6J16N6r8O1JP3
7071A01p5o3KK4L1O6j58O9o7M3J14j58pQ1k0K2Q2n7r5P2kj44K10k2k2m1m6J19
7099E9K3j60J48K1q9L3Nj3p0K2j14J20J9J7L4Mj07M9J56j49nK2p5J88j49o1J5
7126e7M2j9k8J22j27J5J11j00J69l4j80J79j13J31r7Kp3R0L6o4L2m2N0j62J14
7151ckm5o7J8J03j5L4n1p4M0K3J2n7M9Mn2Q3M5P6j19r9J26N4j45M2N6j44K5O6
$$ plain form
6955 -57 -44 37 36 -103 -4 25 -40 48 49 -13 31 159 -36 -37 125 25 8 -71 -151 110 3 56 96 50 -30 -24 -63 1 76
6984 76 41 -12 -60 -25 -34 -123 -73 53 -102 45 -5 -10 51 37 43 99 20 2 14 41 19 -24 -30 35 33 -65 -6 61 -46 -48 -58
7015 -58 113 37 37 -69 -20 -79 -15 -24 27 -70 -21 -68 6 22 -34 19 -18 43 -22 66 -36 119 -70 12 12 97 23 -56 -37
7044 -37 28 -63 70 27 -15 67 31 11 -41 59 -124 67 83 -2 46 58 -38 124 -76 -52 -108 8 64 -34 27 28 101
7071 101 26 -37 -35 -11 20 86 -72 -3 -70 -27 87 -71 -78 3 -17 5 87 30 -65 7 5 -139 71 49 27 -14 -60 59
7099 59 82 -78 70 91 2 35 40 27 -43 -21 -135 -15 4 21 55 59 -48 1 157 8 3 25 -50 138 -11 -72 -57
7126 -57 -15 -34 -62 60 -67 -52 59 -41 128 94 -86 93 -20 111 14 16 -57 33 69 5 37 -5 45 -117 -3
7151 -3 -5 -50 -117 -99 4 -11 23 -28 -102 -62 -39 -27 -84 -35 -31 -83 0 45 121 2 -97 29 83 -62 -20 36 -108 -83 -17
7180a7L1p9J61j23L2j3L7j06P4j5L9o4J16j19M6J12o3o3O4j5j6k6n6O9K8Kq2M2
7208dn6M9J44q5r3K5N3k9q1J71o6n9p5qK02k08K9J96q8p9RK9J05Mk9p7l4N7k6
7237b4K8nn6J61q3n2P9k9J91j82l0l9M0k1ON0NK2r6J7l3K1J43k10P7j6Q3n4J32
7266A25o1o8O1k20J43o4K3QK0o1J54p2k0J3Q5M4j23jR6k5M8o1r1J05o8J5o1J22
7294F6k7k22K82nj42J31j9r5P9n1J6L8j39O5J22j26N6J7M9l3j15J49j71m0OJ74
7320F5j36R4Mj09Q0o2P6Rk8J01m9q5j1J9L7r7J01N8j48J64j37J56j98J41p7R3
7346F1m4n7Qp4J20p0O5r7K4P4j2L1p1O0l2p6J69j24M7J4j0p7J30J5j87Q1L1oR0
7375H3q1l6Q1N9j05R0l7j21K02j44m3K9Q8J1o8M6o2k2J04Qj17O2L9r2qM4m3j6
$$ plain form
7180 -17 14 -65 96 -27 5 -8 29 -77 -3 -18 21 -43 73 -46 0 112 49 -14 50 35 19 -7 -63 6 34 36 -46 -4
7208 -4 -60 -11 133 48 -45 -20 33 4 -77 94 28 -31 -106 -114 88 -120 -91 105 17 -62 -53 -24 81 85 56 -21 -55 2 -24
7237 -24 4 -1 -57 104 21 -31 48 19 210 28 -2 -41 -1 -22 -16 34 39 61 -35 -18 -51 -30 113 -97 -20 -36 47 -7 125
7266 125 64 -4 57 -163 -20 -84 -61 -53 -33 -94 60 -12 -32 -19 66 110 -13 -14 82 57 105 44 -47 58 -10 5 -56 66
7294 66 39 -183 99 94 -48 83 64 -31 48 -3 13 51 -88 -23 99 -27 29 46 95 62 -53 96 -75 -115 -109 65
7320 65 -71 23 27 -82 -2 -64 12 21 -7 94 45 -40 -51 -32 5 -92 9 67 -81 83 -54 102 -96 45 -32 61
7346 61 17 -40 -32 -106 14 -56 9 -88 -64 10 -2 29 -42 18 -14 -90 79 -45 2 16 6 -71 59 74 -113 -32 -1 -7 83
7375 83 2 -34 47 106 1 91 54 -67 135 -9 -52 -23 65 76 8 54 -8 -30 74 82 -35 27 66 -26 -34 10 -33 -49
7403d9P7m5N6o3KK3J8j26M9m2J23K1j25P8o2OO7j42Q9K0l8Q1J24j04j2q5J54K0
7431A15j04J5l9r2J87j99J28o8P8%m7M5j8p3R0j09R8jj11J68q1P5j23L7M8o9O0
7458A0POM7j43K1Q5n%j1q3J8o6R5L4j3R0j40O8o6L8K06k32Ql7J30o2o9Q6r2NJ18
7489E3r7P7L0j26P6m2N5j4J4k4o2r7J56m4j0J14o7P3q1O3j30M6J42j47PR9j05
7516d1N6nj1o9OO7L6Pn4k9j16M9J86Jj26J6JK7NJ14j31N0q6N7l4j7n6J36j42J7
7546h6Q4J04j46n2L8j1O1J60j14o5M3k0J3l9pJ9K4RmM8m4p3M6j8J12j7j2j51L2
7575f6J01N6K0k27RJ30K2K7j45N3M1P9r6j23JJ76%m9QJ42j63N6M2j8l2r8J04l5
7603A5L7k6L9O6j01Mj26K10j19k2ok2P5o3K8M2j71K9J04%R1mj65L0qkN5o1O6P
$$ plain form
7403 -49 28 -17 39 -24 -22 1 19 -107 -58 -100 23 44 -81 -3 -65 -59 8 -134 -45 -25 -63 18 142 38 26 -59 95 115
7431 115 11 26 -13 -105 82 -117 11 -57 21 21 -26 19 1 -72 18 -91 7 6 -105 63 -18 57 -66 -29 19 -50 10
7458 10 17 23 70 -73 -52 33 28 28 17 -66 -48 -114 -19 15 2 92 -48 20 -46 -8 198 -34 -26 -63 67 5 -64 22 -70 -65 53
7489 53 -44 33 63 -63 13 -29 26 12 26 2 -60 -157 -1 -45 -55 59 -8 65 -16 47 -83 -37 105 -42 -35 64 -41
7516 -41 15 10 -1 -70 -64 3 39 46 -8 -37 -153 -104 82 83 -43 -27 -26 1 6 120 -11 39 -47 10 -24 -41 -97 39 -103 -86
7546 -86 -2 102 -44 -96 -58 -69 -8 152 38 -27 16 -4 9 -30 -37 -18 6 15 11 59 15 -58 -12 -30 82 65 53 -98 -66
7575 -66 35 91 111 -116 -107 23 45 72 -73 -20 21 100 4 -119 -118 58 58 9 17 159 -4 52 94 76 44 -54 50 15
7603 15 52 26 65 131 30 34 -92 118 -1 -23 -29 -51 24 -39 -11 31 -140 -111 -7 -7 84 80 -85 -55 -63 -65 -10 -71 -5 2
7633Bk2q3J78j80K01j45O8m1O6k5Jkj6O2j13k5P0J03m7K6l6r7Q2q4L6m2L9Q5j43
7662h2O7J3q2N7O5k30J47J8n2J5jM4J63k48P8L0j8r9K13o2j11J02m3N4R4r1j04
7689f3O4n3Oj7J21j59N3K6J52j21p3J9K0j2R4k6k4o1N7l6J1J2J3J20r3M0j19K3
7717b6l6m4J72n4n2N1k6j28J48j8N3j9P8j61J28k6p6K1P9j25%J20J6j1qr7J22
7744H1n2l3nQ1o6o8J00q7K9N9j18J37p8J10j49J21j84J12J31j96m5M0J06n7m4
7769g5j4R0Q4j15J0J02n7m8L3JM5l6k3M7j5J0r2N1n8L9O5l2Nj23J33J4j20J14
7797C5j00N2J9j5L2O0n0r7Q5o0k0O4l0J9J7OlN2j59M7J63j62K2L2p5M3N5q5K0
7826c3K0q2P3O1j14L3LJ3K7L4m6K3l0K4j75M5J04N1j00O3q4Q2j4J7j8J82j95J0
$$ plain form
7633 2 -20 -103 75 -105 96 -49 19 -22 44 19 20 18 2 64 -49 -74 -4 99 52 78 42 -55 27 -57 -21 -63 -24 61 -82
7662 -82 -15 -2 -84 -27 38 -192 -45 -27 -79 -64 -65 -21 142 -106 -28 2 -16 -115 98 36 -75 27 -16 38 132 41 -63
7689 -63 1 -52 -46 -63 58 -101 -48 -22 130 9 -64 -45 -25 -37 57 31 7 -54 3 -33 -22 -10 3 123 30 70 -49 -26
7717 -26 -62 -106 66 12 -40 11 -15 -143 5 -13 40 21 99 -62 66 40 -36 -15 64 -61 -61 59 75 64 56 -41 81
7744 81 29 -4 -9 72 6 -62 38 -49 -20 39 -79 58 -20 90 -59 62 -122 -10 121 -75 -120 -80 26 -31 -75
7769 -75 -89 1 85 -30 -20 82 25 -23 10 11 56 20 -3 44 29 39 -53 -2 -60 -21 44 12 17 -106 27 41 -79 35
7797 35 -65 -13 6 -9 23 83 33 -64 21 -39 -59 5 -25 -6 11 17 14 66 -93 -46 117 -45 -23 9 -66 -23 32 -53 -33
7826 -33 -13 -95 -22 39 -75 -42 -39 -26 1 35 -11 12 -18 6 -169 -124 -20 31 -69 -6 -90 -8 -22 -5 -23 159 -36 -26
7854b6q3J03nQ5j8n9L0R9q1j9j53J64o0L8kr5J45Pj52J22No6PR2k0l4m9O0o1o7
7884i3K00m5j05n2J51j08Q2l7L4Pl4j6N6l4j57M3R6j0r2J38K4l4n9J46o8j1J12
7911A34j09j32J41q6PN5mPr7J00j09M8R8k5j37j9O5J23Qj06J22j54M1p8J06l5
7937c6J0J54m0l9r9J17j05Q3q4J45k6r0N5l7M3k3k07J56QmO6r5M2lj1K0l2O1j99
7966a70J65l1k2J14j43J13m5p3jJ44r5k3kQ2n2P8j11J33K6j10r4R0j2J9K9N1o0
7993@o3J32q1J5q5J01k1n1J16j1r0O2O6j44j6M1mJj00J71m3L4NN4r9j34J45Pj9
8022a1Q7j07R1K4N6k70k3R8J01j11P5k5k2J25p7l2n7J88j03k5K6qP6p9R5k9j07
8049d4J04j4N4q3l9K7P4m5no9J08j4OMj05M9k5J01o1K2j52j7J73j35J02k6k9k0
$$ plain form
7854 -26 -109 -6 -11 74 56 -3 27 126 45 26 -127 37 -23 15 13 -82 63 70 -82 40 45 -21 -14 78 58 24 -25 35 -26 -93
7884 -93 107 62 -43 -95 56 -52 30 -7 27 34 0 -16 40 6 -151 -108 -12 -22 -114 24 48 14 -45 101 33 22 134
7911 134 25 -107 34 -52 -45 10 6 13 -84 16 -93 -45 53 28 -109 -128 -63 60 68 -38 84 -70 -29 -107 -1 -36
7937 -36 -26 128 88 49 -50 67 -38 45 -39 106 80 -10 45 8 51 28 -179 -23 -15 -19 47 -48 -6 -9 -20 0 -32 29 -170
7966 -170 -5 -36 -58 56 -87 26 -19 -92 -93 51 -44 -67 -69 13 -39 39 -72 61 87 -23 -117 -27 -39 -20 9 60 0
7993 0 -63 69 -12 3 -82 19 -2 -53 63 52 -38 24 90 -54 -70 -29 -33 -32 -132 39 -4 30 35 89 -10 -144 1 8 -11
8022 -11 76 -31 60 84 140 -130 -153 -55 46 -65 10 -15 -37 88 11 -21 -78 110 7 -18 8 0 76 -3 92 63 -44
8049 -44 60 46 100 17 -22 5 79 34 29 -40 68 54 60 64 -41 8 -17 84 23 45 -107 -124 49 -86 16 -10 -39 -59
8077e9O9k0k4J12M0k18J74q1J12m2n3Q4k2j75P1N3Pj9rJ1l9j07J94j23j7J7J14
8104E0j32R9j66Q2P8L2M1k06P7Pj40K00o4j2J04J2m0pp6R6pJ6K4j28j0M6K9k16
8132b11L01k7p4P3j66J21Q7o4j17J41q9j0N6M2j06L0LP0K9j56Q0O8j10L9kO3j11
8159d0N4O2p1m4N0n7J09n7j6N5jL2o2q9K38j02Ro2jRo6N4pM7j04R6o6nM3j8k3
$$ plain form
8077 -59 10 -10 -34 78 118 -100 74 -7 105 63 10 94 72 -103 -32 21 28 9 0 11 -28 -135 59 -64 -81 -64 50
8104 50 -82 17 -149 -67 11 43 84 -122 -45 -38 -178 22 -42 -54 50 62 22 15 -61 35 28 44 68 -60 -70 -24 5 -211
8132 -211 90 63 -11 62 -104 17 104 40 -77 64 -25 -35 21 63 -43 -13 -10 60 89 -67 13 81 -29 10 8 71 -40
8159 -40 14 76 5 -39 11 -46 63 6 -10 45 44 76 14 -75 163 61 70 8 7 16 -50 4 -3 44 -60 36 -30 -35 8 -10 -33
8190c3Q
8191b5
$$ Imaginary data points
##PAGE= N=2
##DATA TABLE= (X++(I..I)), XYDATA
0@%%%%%%%%%%%%%Qj6J6j6J6k1K9l2M0m8N6o5P3q8J04j20J36j54J78k02K27k58
35a37K91l27L67m12M61n11N67o30O98p74Q56r45J042j148J266j395J537j694J868
54I80k064K284k531K814l144L532l994M556n258O162p379R118j1818J6625k7794
69a7911J04261N1532j33177J2230l391m9214l0488N5698n796q5528m1298N9122
81h3960K2883R1N5670O2807k5785m1897L3394P4558K564k7473K1135n715r1626
94c354m9551M3771K3418n4070l2930K0592k4596n6780M8839R9241M022l2011L3484
107B0075L0322k7755J525P5489K9274p0225m5166J4263k7242m8554J8304L7862
119H172l5076p0628k078M6701N018K830O1126L5278m2867k4504M8715M0781j7486
$$ plain form
0 0 0 0 0 0 0 0 0 0 0 0 0 0 0 8 -8 8 -8 8 -13 16 -16 24 -24 32 -33 40 -48 56 -64 72 -82 96 -106 121 -137
35 -137 154 -173 194 -218 243 -268 299 -331 367 -407 449 -496 546 -602 664 -731 806 -888 980
54 980 -1084 1200 -1331 1483 -1661 1871 -2123 2433 -2825 3337 -4042 5076 -6742 9883 -17911
69 -17911 86350 137882 4705 16935 13544 -35670 -66158 -10460 -16256 -101784 -143082 -83960
81 -83960 -61077 -60986 -5316 57491 31706 -10191 23203 97761 100325 72852 93987 88272 -3354
94 -3354 -52905 -9134 14284 -39786 -72716 -52124 -76720 -133500 -84661 14580 18602 -13409 20075
107 20075 50397 22642 24167 99656 128930 58705 13539 27802 560 -47994 -29690 8172
119 8172 -26904 -97532 -99610 -52909 -47891 -45061 16065 51343 8476 -16028 32687 73468 55982
132E5982j25L2552l8447q4241K294M8355k0417m2708J2715R209n0676k2542O6930
145c1119N1181k0803j738L4570n963k6860K8383N5842o322n3601j2811P454l7435
158a9222k5884L8712K3414m7697m3144K2459K2682j7095K1488O4395q19n1030
170a1741P805M5332q92j6718K7643J4135n8916m6710K7900J8615k8788m606K1973
183d968j9308m4859J0438N7451J7629j7151J6394K0932k6830j9783L8435L7901
195F6281k4210l5965O338p055m4000J315M7341k783m6782n686K5452q635j1326
208c9715M6771M2101l0566k9874K5424J7066j6445O795L0623j2490n5152j7329
220c2791K4985k277j7406J6730J3800l1736k9088K7462M1559k322o086K7967R02
$$ plain form
132 55982 55857 88409 49962 -34279 -31985 16370 -4047 -46755 -34040 -24831 -75507 -98049 -31119
145 -31119 20062 -741 -2479 32091 26128 -732 27651 83493 77171 23570 10759 18213 -19222
158 -19222 -45106 -6394 17020 -30677 -73821 -51362 -28680 -45775 -24287 40108 39289 -11741
170 -11741 -3936 41396 40504 23786 51429 65564 6648 -40062 -12162 6453 -22335 -26941 -4968
183 -4968 -24276 -69135 -58697 -1246 16383 -768 15626 36558 9728 -10055 28380 66281
195 66281 42071 6106 12444 5389 -38611 -37296 10045 7262 -39520 -45206 -19754 -28389 -39715
208 -39715 7056 49157 18591 -11283 14141 31207 14762 21557 52180 39690 -15462 -32791
220 -32791 -7806 -10083 -27489 -10759 3041 -28695 -57783 -30321 11238 8916 2830 30797 31699
233C1699l9065N73M4775J0791l1160j0179P998k9628l3203K8446L3335k3491k5355
246c4464J3067M520j7932J2276M8612J3476l3054o607K1419n351j1322K2234J9957
259D6831k8276m1882J392J6802j4751m967K7593j071l8525q168L4676J9819p731
272A742J2718K3331k2635l1403K2752L0964j1046j5946O633q246l7568j0073L5430
285c347J2345k6040n933J1876j1248j0635K7322L6789m848k4454O559J0476j7128
298A734J300L2122K924l7195k2382J1227J381j6375J2993K4729k0401l1223J1626
311b7540K5138K008K892K2600N406l1292j1790K9496J2184j5507J13N471k3120
324c941k9118R237K8872l617j9388P061L003k1660J588L6447K0221j5396j1234
$$ plain form
233 31699 -7366 -6793 37982 48773 17613 7434 15432 -14196 -47399 -18953 14382 -9109 -34464
246 -34464 -21397 -16877 -34809 -22533 26079 39555 6501 -106 21313 15962 4640 26874 46831
259 46831 18555 -23327 -21935 -5133 -19884 -24851 2742 1671 -36854 -45022 -10346 9473 1742
272 1742 14460 37791 15156 -16247 6505 37469 26423 10477 17110 8864 -28704 -38777 -3347
285 -3347 8998 -17042 -22975 -11099 -22347 -32982 -5660 31129 26281 1827 8386 18862 1734
298 1734 3034 35156 38080 885 -21497 -10270 -8889 -25264 -12271 12458 -7943 -39166 -27540
311 -27540 -2402 -394 2498 25098 30504 -788 -12578 16918 29102 13595 13708 19179 -3941
324 -3941 -33059 -23822 5050 1433 -17955 -10894 -7891 -29551 -27963 8484 28705 13309 2075
337B075J1494k992j5997J6632K6434j5175l0608l576M892j0907k539K3669P953
350A1355l0640j5327K0928J1154l462J4326K0337j0406k6868M173K4375r18r216
363I811R695m426l0746j3137K0351J3767j2811n653J0770j0581j9782J7283L2506
376A7047J930j4358K255N601j2454m549K5558J2832k4289j7810M009m998j1778
389b1004J0701K1175q218k6733O99J6979j702K135K3245P907k2333j3662J6299
402E488J3339q101Q40J0899j5913k7864J660J8899J322r428L810K701j8393p426
416b8167K5657J8961q713m480R150m604j5247Q464K5904k460k3627m106L213j3278
430a3333n149J8863R997j8176j4816R400O006n237J3112K1375o033k0828k34J4822
$$ plain form
337 2075 13569 10577 -5420 11212 37646 22471 -8137 -11713 -6821 -17728 -20267 3402 11355
350 11355 -19285 -34612 -13684 -2530 -5992 8334 28671 18265 -8603 -4430 19945 19027 9811
363 9811 19506 15080 -15666 -28803 -8452 5315 -7496 -13149 -2379 -12960 -32742 -15459 17047
376 17047 18977 4619 6874 12475 21 -4528 21030 33862 9573 -8237 -4228 -9226 -21004
389 -21004 -10303 10872 2654 -24079 -23380 -6401 -8103 -5968 17277 25184 2851 -10811 5488
402 5488 18827 10726 11566 22465 6552 -21312 -19652 -753 569 -8859 -5049 -2348 -20741 -28167
416 -28167 -2510 16451 7738 3258 12408 7804 -7443 1021 26925 24465 838 -3268 -55 -13333
430 -13333 -18482 381 10378 -7798 -22614 -13214 -7208 -12445 667 22042 16009 -4819 -5053 9769
444I769J869m908R892M256k3119j8014J0793J0722o562k654Q257n966j9792N024
458b0433K5818N288q808O492N116j4297p013J9135J4968j3185j3163L951o675
471b806j5735O247J8180j801j7046m366Q013j908j163J9179J3828j2563j2123
484d064O934P769m473J901J3784n762k6307n851J3655k57p451P150N079j5833
498a3726j3124J5179J8031l004P53J1225n380j5176M324J7922L445j2156l990
511D323R63j4023j0896J2952J2392q658j1925J816L607n753N730K2635N138j5845
525B456k597R432j606l912J1372R114j6974k0458M106O458q457J424J1788m959
539b813j7252k011J5667Q904j268P963P736j1671r683J0745J2941k778q103n62
$$ plain form
444 9769 11638 6730 16622 20878 -2241 -20255 -9462 1260 -5302 -7956 301 -5665 -25457 -20433
458 -20433 5385 10673 1865 8357 13473 -824 -7837 11298 26266 13081 -82 3869 -2806
471 -2806 -18541 -12294 5886 4085 -12961 -17327 -9314 -11222 -12385 6794 20622 8059 -4064
484 -4064 2870 10639 6166 8067 21851 16089 -10218 -16069 -2414 -2671 -10122 -2972 2107 -13726
498 -13726 -26850 -11671 6360 3356 4109 15334 9954 -5222 -898 17024 20469 8313 4323
511 4323 5286 -8737 -19633 -6681 5711 -2947 -14872 -13056 -9449 -15202 -9472 13163 18301 2456
525 2456 -141 9291 7685 3773 15145 24259 7285 -13173 -9067 -2609 -11066 -9642 2146 -2813
539 -2813 -20065 -22076 -6409 2495 1227 9190 16926 5255 -4428 6317 19258 16480 8377 7815
553G815m917j7707l619J7436M253j3077l720M500m404m558J5167J9770m835j1500
567F04N725L618p380M626J4119k017j8526j0232L873j718o059Q384P587j1862
581i258j2603N228J2877M307J716J0369K805j4542m174J4922O733o696k143P38
595A0279j2477j6126O189J4513n775r102M642q78j0001M378J9372R429p985l457
609C001N618k821m289J0477R579q628j4779m822J459m359j673J0487K110j4994
623a3634o963J0318P621K22P168J1502n670j4310N119J3309k336m281M736m700
637H101j6901o658J0328N335p465j225L463p421o001J1109J5235K123n250O73
651E446K535n566p85J2394N220j1971j0865j16j634o505L970J1292n205j4467
$$ plain form
553 7815 2898 -14809 -18428 -992 3261 -9816 -13536 -9036 -13440 -17998 -2831 16939 12104 604
567 604 6329 9947 2567 7193 21312 19295 769 -9463 -5590 -7308 -13367 -4983 2604 -9258
581 -9258 -21861 -16633 -3756 551 2267 12636 15441 899 -3275 11647 18380 11684 9541 10279
595 10279 -2198 -18324 -12135 2378 -3397 -12499 -7857 -8735 -18736 -14358 5014 14443 6458 3001
609 3001 8619 5798 1509 11986 21565 12937 -1842 -6664 -5205 -9564 -11237 -750 1360 -13634
623 -13634 -20597 -10279 -2658 -2436 4732 16234 10564 -3746 1373 14682 12346 8065 12801 8101
637 8101 -8800 -15458 -5130 205 -7260 -8485 -5022 -12443 -18444 -7335 7900 10023 4773 5446
651 5446 7981 2415 1630 14024 19244 7273 -3592 -3708 -5342 -11847 -7877 3415 -1790 -16257
665a6257J679R070o7L037J2924M416j1659o270R486N069m278K564L252j0816j3274
680a1124K46Q207M91m323J692L29q766k178J2630J0880j473k425L749j484p817
695a366M532J3340k427j2570k988K2p422k926J0128N567j0498p672N731K407r70
710g112R031J0469k818r380m24P064Q94j396M861n75j2628r059L624N694k148
725c903j879M180l093j0560L525J4173L881l092K794K393o824m100J0329P587
739A5411p617o553K34n567p132L868Q720p88q897j991L926r62J536J0718O292
754A1198n476o444K538M814j346P11O378m407j3778l270N952K30k713L066K581
769C4q419o737R223R575j058J130M515l247o846K206R372K000o656k179j303p806
$$ plain form
665 -16257 -14578 -5508 -5575 -2538 10386 14802 3143 -3127 6359 11428 7150 9714 12966 2150 -11124
680 -11124 -10878 -2671 -2180 -6503 -4811 -4482 -13248 -15426 -2796 8084 6611 4186 7935 6451 -1366
695 -1366 3166 16506 14079 1509 -1479 -1457 -8879 -11805 -1677 3890 -6608 -14280 -8549 -6142 -7112
710 -7112 1919 12388 9570 190 -234 6830 7724 6328 11189 10614 -2014 -11073 -7449 -1755 -3903
725 -3903 -5782 -1602 -4695 -15255 -11730 2443 6324 3232 6026 8419 1595 -2505 7824 15411
739 15411 7794 1241 1475 -4092 -11224 -7356 1364 576 -8321 -10312 -6386 -7348 -5812 4906 11198
754 11198 5722 -722 1816 6630 5284 5995 12373 7966 -5812 -9082 -3130 -2900 -5613 -2547 34
769 34 -8385 -15122 -5899 3676 2618 3748 8263 5016 -1830 376 9748 11748 5092 2913 1610 -6196
785f196l865O427N391l578o296O37K157k716L960J1693J802p647j806M278K31
800D472j662N112M549r085j0346K375K391l149J561M503k795q438o36Q714M339
815A905p43M310K453o185m121N034O568p43m530m48k829q579l41P991J673n220
831c805k423J476j736k092Q101R471l243n538K387J187k637K072O415l30r479
846a74n244K643p30j853M611K522n941n775K471O487J493J117N367l66p667j256
862b295O908L284k575j646J78n837o873L809O743k143l689Q86r78l809J993R357
878C313M314m740j726K305j972j789N150M727m126p632j800J625k327K66N576
893A164J90o848k831M089L502M82L539M402m124o390L029N279n00j347J311k010
$$ plain form
785 -6196 -10061 -3634 1757 -1821 -8117 -7480 -5323 -8039 -4079 7614 9416 1769 -37 4241 4472
800 4472 2810 7922 12471 3386 -6960 -4585 -2194 -5343 -3782 721 -2074 -10512 -11148 -2434 1905
815 1905 1162 5472 7925 1740 -2381 2653 9221 8478 3948 3500 671 -7908 -8249 -258 1415 -3805
831 -3805 -6228 -4752 -6488 -8580 -479 8992 5749 211 2598 3785 1148 3220 9635 9305 -174
846 -174 -5418 -2775 -3505 -5358 -747 1775 -4166 -9941 -7470 -983 510 1627 6994 6628 -1039 -2295
862 -2295 4613 7897 5322 3676 3854 -1983 -8856 -5047 1696 -447 -4136 -3250 -4228 -8037 -6044 3313
878 3313 7627 2887 1161 3466 1494 -295 4855 9582 5456 -2176 -3976 -2351 -4678 -4412 1164
893 1164 1354 -5494 -8325 -4236 -734 -252 3287 7689 3565 -2825 204 5483 4983 3636 4947 2937
909B937p824l326N924L546l306p82R79l077k619M501P517Q09l304N35M50l499
925e39Q57O542J435o068m766J94o57k852L069N460l291o017L77L498J163J685
941I0N083J773n889l165M447K233j451J208J065m723o799L24N178ok521J873n11
958a791m778j92O457M789j051j349J600j688l514L569N414j498m764k127q00k933
974d656q68N156K690n328l430K386J329J71L596N040q81n536n32M251jn07L090
991E970j125o615m000K275K753j563K3K512l167m934K593O125K311m07L03P24
1007C778l324j739N148L413l128l003r74k457k940J186N228l9n582r31K137q61
1023d088J125N992L000l189l631J715K183j084J710L477l808o428j248J984O96
$$ plain form
909 2937 -4887 -8213 -2289 1257 -2049 -2831 -1852 -4929 -7548 -3047 4470 5279 1975 2510 2960 -539
925 -539 318 6860 8295 2227 -2539 -2345 -3002 -5854 -2785 2675 -616 -6633 -6256 -2758 -1595 90
941 90 5173 6946 1057 -2108 2339 4572 3121 4329 5394 671 -6128 -5804 -626 -632 -3153 -1280 -1791
958 -1791 -6569 -6761 -304 4485 3434 2085 3685 1997 -1517 2052 7466 5968 1204 -923 -1723 -4656
974 -4656 -5524 -368 2322 -3006 -6436 -4050 -2721 -2550 1046 6086 5205 -331 -863 3388 3387 2880 5970
991 5970 4845 -1770 -5770 -3495 -742 -2305 -2282 230 -2937 -7871 -5278 847 3158 2751 3054 3778
1007 3778 454 -1285 3863 7276 4148 1145 171 -2286 -5226 -4040 1188 1149 -4433 -5364 -3227 -4088
1023 -4088 -2963 3029 6029 2840 -791 924 3107 2023 3733 7210 3402 -3026 -4274 -2290 -1594
1038a594m74J125O91m523k773M300M481O48M91J239q87l649K42N908J377l928
1054B674j263o27m225j897L573L483k503l590Q57J37j822L822O177k32l586q88
1070I0J484N76k14K821J514m788m729J89J003NO67J550j027m723r65N261K561
1087A275k01K053J199l328k792K979M514j179k642N01k693m718Q91M057O49k369
1103a804j462M24j009k35M687M100j431k301nN15l06P89L074J10n492l196J476
1120b066Rq58J980J922k864l962J731M165L11R29L289j220m013l0L471J419j394
1137B819m73m39l801l230K337K841m00j547m11j19j442O94N016K671k206j301
1153A009P90o30j128K348L068k312n044m66R49k180O85L505k5l824j328K408J862
$$ plain form
1038 -1594 -2068 -943 -252 -4775 -7548 -3248 1233 1881 2372 3611 2724 -925 -683 5225 6602 2674
1054 2674 1411 784 -3441 -5338 -1765 1718 -785 -4375 -3518 -3381 -5203 -1381 4796 4564 978 90
1070 90 1574 2150 1936 4757 6271 1483 -3246 -3057 -2054 -2049 -1382 168 -859 -5582 -6547 -1286 1275
1087 1275 1074 3127 4326 998 -1794 1185 5699 4520 1878 2379 -314 -5032 -4141 -84 565 -1804
1103 -1804 -3266 -2842 -3851 -4086 601 4701 3270 969 964 1479 1173 1962 5036 5146 -346 -3542 -2066
1120 -2066 -2057 -2915 -935 987 -1877 -5839 -4108 57 368 1297 4586 3366 -647 -677 2794 4213 2819
1137 2819 2346 1907 -1894 -5124 -2787 54 -346 -1893 -2304 -2423 -3865 -3171 1845 4516 2310 1009
1153 1009 1799 1169 41 2389 5457 3145 -1899 -2365 -1416 -3596 -2911 594 569 -3255 -4583 -2175 -313
1170c13L89K673K038k659k821J077K007N73m65j56j271m050j796K648K030j035
1186a131p71N82j162j710K277N281N18k459O49J46k305L07L367J002l377k865
1202a651J08j308j241K605K398j816k478J33J446J317J042K835J237k933k326
1217f32J622J580K7l71K06k041m490j50L176M5j041J162m0k691l57M065L404q76
1235B598m67J003j672j964K099K346p75k412k098o41j451l48K820J472j966j831
1251c287L56J352J034J708L093j95l657k33K139l27m33J343k36l899l138J299
1267c081J955r52O02J214j860j737J492L070J700Q8J96J53k187j010K650J495
1283C788j184k371j323p68j712J52L297L95k814m86J103q4J062L085K247j852
$$ plain form
1170 -313 76 2749 4787 2128 -693 384 2391 2964 2499 2343 1072 -2978 -4774 -2126 -96 -1131
1186 -1131 -1902 -1320 -2482 -4192 -1915 3366 3884 1425 2074 2220 -85 222 3589 4591 1214 -1651
1202 -1651 -1543 -2851 -4092 -1487 911 -905 -3383 -3250 -1804 -487 555 3390 4627 1694 -632
1217 -632 990 2570 2597 2226 2432 391 -4099 -4249 -1073 -1028 -2069 -907 -947 -3638 -3995 70 3474 2598
1235 2598 2131 3134 1462 -502 1597 3943 3168 756 -1342 -1983 -3434 -3782 -962 510 -1456 -3287
1251 -3287 -2931 -1579 -545 1163 4256 4061 404 171 2310 1983 1550 2893 2657 -1242 -4380 -3081
1267 -3081 -1126 -2078 -1476 -262 -2122 -3859 -2367 703 2403 2491 2687 2840 653 -357 2293 3788
1283 3788 2604 233 -1090 -1858 -3570 -3418 -121 274 -2540 -3026 -1923 -2007 -945 2140 4387 2535
1299B535k410R92R67j020R28J592k307l186j359J029O10j42R96N39k435j117K201
1316a587K415J270n3N41k62k442j48K957O53k080q69o51k212j233J845K554j312
1333f14j849P46J05r10K280L034L97j636r86N40j90k16J956L89k781k444l22O59
1351a842N11R9J218j36k579m28K568J672L52P82M93j845j953J543K422r19j227
1368G31L28j822k384L54K291Q32j239o02K62o39JK650K016l62j425n03K50l48
1386C91L29J867j44l093j556M12K86o9J076J289j375k449J232K171M79N30J424
1403B800p98k202o68J950J021q61j87m85k323j432J415J526K42p45k63J36r43
1420a817N65K802J284j118q63q4l91n17J106J491j145k553m15J73m62N91J676
$$ plain form
1299 2535 125 1117 2084 1064 1992 3584 1277 -1909 -3268 -2239 -1629 -1771 -775 -236 -2671 -3788 -1587
1316 -1587 828 2098 2045 2586 2324 -118 -266 2691 3344 1264 395 -256 -2468 -3701 -1856 698 -614
1333 -614 -2463 -1717 -1612 -2522 -242 2792 3189 1553 567 1107 917 701 2657 3046 265 -2179 -2501 -1842
1351 -1842 -1331 -1232 -14 -150 -2729 -3157 -589 1083 1435 2217 2710 865 -1088 455 2877 1958 731
1368 731 1059 -763 -3147 -2793 -502 330 -909 -1511 -1249 -1888 -1887 763 2779 2417 992 489 739 391
1386 391 720 2587 2443 -650 -2206 -1794 -1508 -1577 -501 788 -587 -3036 -1804 367 846 1376 2800
1403 2800 2002 -200 -868 1082 2103 1242 1055 570 -1753 -3185 -1770 -244 -2 -747 -1010 -874 -1817
1420 -1817 -1252 1550 2834 1716 853 769 378 -139 967 2458 1313 -1240 -1655 -1482 -1944 -1353 323
1437C23J74j820j054J533J059J68J485Q10j322j651P5J267N11o53O6q22k175p02
1455b728J548J078l38l50K87m51j121J528K636Pj095J65k89q57k11J567P09j682
1473D03j536K11p96m13J409J339n57j455k35J217L34M75J821R6j761r70O35P47
1491I64q3p2M88j333k388L75J397K27QL91l33r54m93J855J791m35j73N8j018r90
1511g18R09J427m8j661q75M2j017N8J837P37r81q63N5O51R4J031J744o17j873
1530f8k4N67p1J85M82K0j860j673Q12J080r8N83M87q85j158L87J995Q38m85J74
1550A288j8j593n72J381J001n75j093m33n45j017O75J945N0j035k06O0J55M35
1568i7J350J195j012j746K27M24k23O11N15p04j921q36J022P07k64R54M04j387
$$ plain form
1437 323 497 -1323 -2377 -844 215 383 1868 2678 1356 -295 -220 1047 1558 905 971 149 -2026 -2728
1455 -2728 -1180 -102 -440 -790 -503 -954 -2075 -547 2089 2096 1001 1166 877 20 -191 1376 2085 403
1473 403 -1133 -922 -1718 -2131 -722 617 60 -1395 -1630 -413 -79 396 2217 2313 552 -418 217 964
1491 964 881 809 1297 -36 -2424 -2049 -652 -425 -417 -26 -359 -1313 -1806 49 1840 1405 1232 1290 272 -718
1511 -718 191 1618 1570 -91 -966 -924 -1941 -1883 -46 691 -290 -1153 -1098 -447 -353 678 2422 1805 -68
1530 -68 -92 475 404 589 1071 1091 -769 -2442 -1630 -550 -648 -65 422 -463 -1621 -1234 761 1599 1114 1288
1550 1288 1270 -323 -895 486 1487 912 -181 -614 -1159 -2176 -1501 444 494 -541 -747 -687 -532 -97
1568 -97 1253 2448 1436 -310 -83 341 118 729 1244 540 -1381 -2217 -1195 -488 -752 202 606 -781
1586g81p38J174J283M76k02L78n87j829K54J612p5n92n61l73j090n87J288J612
1604F62m59q58J38j02J08Q94J520L82j457q96M76l69k00R86M53j485j441j19Q64
1623i03J7L84J195m27j571M29J135N61L74L78j08j097j284P60J007j24m56m88
1641b18p04j035J78J327J070q06k78L26l92k26J391J413k85j295m29L10o92L20
1659b5J271n04j630n51O7K31K23J025N89p57j136O40Q80M62N18K91l90j251p67
1678h14Q86P43n61j23j37j141q98O45J404L33o36K95l2q82N55J841K70o44n53
1697E51l2o30m77Q68Q02j045q93l68j81K17M51R34M66r83o05R55M55K42O72L08
1717A707n93j494j88J075j27n89M38m89j430k68J017Q83n9J73K48o22n40J336
$$ plain form
1586 -781 -1519 -345 938 1414 1212 1590 1003 -826 -572 1040 965 373 -188 -561 -1651 -2238 -950 662
1604 662 203 -655 -517 -619 -511 383 1903 2285 828 -68 408 39 -161 825 1278 -207 -1648 -1767 -903
1623 -903 -886 -502 693 266 -1305 -876 259 820 1194 1572 1464 367 -917 -157 850 726 270 -218
1641 -218 -922 -1957 -1779 -452 618 -188 -466 -140 -532 -758 633 2046 1761 466 37 347 -345 -25
1659 -25 1246 742 -888 -1439 -1372 -1141 -918 107 696 -61 -1197 -557 323 785 1303 1594 1204 -47 -814
1678 -814 72 815 254 131 -6 -1147 -2045 -1400 4 337 -299 -4 -36 -918 -363 1478 1748 1104 551
1697 551 519 -111 -588 280 1082 37 -856 -1224 -1405 -1188 -737 197 663 -320 -925 30 485 727 1399 1707
1717 1707 1114 -380 -568 507 380 -209 229 -260 -1690 -1958 -941 -58 -117 56 304 -318 -858 478
1735D78Q92J94m39m20m60n32k00Q42N29j157n69l11k61J37O69J056R5j071j25
1754f53J007J2K69J126oj285p78K85K83l48Q6N52j208j127L66O74L92L01J47O3
1774A58m02k73R68R40j84j60m73n00n51J08J003P7j250l95K35p74J80J332O66
1793G05n94o05L77L82k95R91R05p89q90k60j4Q5Q8K00Q0j205q33O10N51L26K25
1814D0K50j53p48lJ288N88l64K6p3j148l08O21O18m17p56J37m14p91P60J117j6
1835B54l94m1k4J07J25R20N16p40p62j42j9J05K82K32k26j063n20P46J90k4O93
1856B15K49o09n72M68R32J17j49M98o55j002J07O47j9l1k57k82o08l26Q25P89
1876C37m6l53j44O7m6J81R36L92r01m45J9j64RN12L53q34q84%N25k04M70P92l62
$$ plain form
1735 478 1370 1564 1125 705 245 -287 -487 355 884 -273 -842 -1153 -1414 -1277 -608 448 543 -528 -653
1754 -653 354 366 635 1761 1755 470 -308 -23 260 -88 -2 550 -658 -1785 -1419 -745 -353 -52 95 158
1774 158 -244 -517 451 1391 1207 1047 574 74 -477 -369 634 711 -539 -934 -699 -1473 -1293 39 705
1793 705 111 -494 -117 265 -30 961 1866 1077 187 -73 -87 -2 86 286 366 -839 -1672 -1062 -511 -185 40
1814 40 290 137 -611 -614 674 1262 898 924 851 -297 -605 16 634 217 -539 -402 -816 -1607 -847 270 254
1835 254 -140 -181 -205 -98 27 947 1463 723 -39 -181 -200 -95 187 419 193 -870 -1390 -644 -454 -478 215
1856 215 464 -145 -717 -249 683 800 651 1149 494 -508 -401 246 227 196 -61 -343 -951 -1277 -452 337
1876 337 291 -62 -206 -139 -185 -4 932 1324 423 -22 -3 -167 -158 354 707 -127 -1011 -1011 -486 -690 -220 572 210
1899B10p26m1O83L11L1N04k02o18o56L34N03kj23l29k14n36k2O99M95j55j90l3
1921g7k39j52P44R43m18p40J14j54m75K02Q39m2p64m17K3J79q9O90M13o02m99
1942e21J72K94M13M7L55l9r05k60N12K69q7N9j95l95n85O0J012kl39K34k70m57
1964f28K18P53M62m93k09j3l27k80O21N82l79m52l02R2J07k6O27J18o28l40K19
1985b78J27K42K25K96k03r33L3O51l2k2M50l51n65k63M30N93k14r6R2n37k94M58
2007a91M74Kj48j44m4k91k9O76L02m91n6j70o9n9K19N61p8p86j88M10q5L2M31
2030B78J14n88l58J82N06j16K13M21m88n83J06L51K19l2J05j64n94l22P22L05
2050B77j84N2k88j16k78K89O86J20n10Rj07k86J52M41L35l67n60J89J5k68M77
$$ plain form
1899 210 -516 -557 126 437 468 972 770 152 -504 -170 333 331 208 -121 -335 -871 -893 -194 301 146 -44 -77
1921 -77 -316 -468 276 1219 801 61 175 21 -454 -252 587 545 -219 -636 -613 -434 -523 167 580 -22 -521
1942 -521 -349 -55 358 405 760 721 -184 -444 68 337 250 309 114 -281 -866 -806 206 204 -135 99 -171 -628
1964 -628 -410 343 805 312 103 90 -237 -517 104 686 307 -145 -447 -355 -248 -274 353 471 -157 -497 -278
1985 -278 -151 91 316 612 409 -524 -491 160 128 106 556 205 -360 -623 -193 400 186 90 182 -355 -649 -191
2007 -191 283 285 137 -7 -51 -342 -371 305 607 116 60 -110 -179 -238 -19 542 464 -322 -510 -100 -185 -153 278
2030 278 392 -196 -554 -372 134 18 231 652 164 -419 -313 38 257 225 330 166 -428 -750 -28 277
2050 277 93 145 -143 -259 -537 -248 438 558 48 57 -50 -336 -184 257 592 225 -335 -146 -131 -399 78
2071G8L66l64m07q1R9L82k1K56J69m95m32L02L01j5J43M0k09n70K3O79L6k24J08
2094A64k26k70j76L65M83j70k42P2p3l59M08M13N0l53k19J11j15j40N91J21n10
2115g5j71k5J47K2J29K82Q6o82OK03j3J54L33j01l30k89K14K48O7K0O3l87l94
2138d93K43K52L40m33K6J6k51k59N10L44j75Q3k64j2q4M8N09j1l73j34R6j90k9
2161b41L60J41j65m95J2J32J17R8L45j24k27j96K37M34j73J03J29m90l82J27M19
2182A61P6l29J58k98m31K01O04O7j47J00j10k14j2M52L55k94k04M1k42j33J09
2203i0K57L2l79k52P4j6l8M59L20l20l09J82L44J45k72K63l5n62J9J41N5J04%
2226A22j57l47k95K92N40r7P1j29j13k9J3K94N29k27m33R2l30l9K73K27r9m78
$$ plain form
2071 78 444 80 -327 -408 -309 73 52 308 477 -18 -450 -148 153 138 281 321 112 -458 -435 244 280 56 164
2094 164 -62 -332 -508 -143 340 170 -72 0 -73 -432 -24 389 439 86 -133 -22 -137 -277 314 435 -75
2115 -75 -246 -271 -124 -102 27 309 395 -287 -281 -78 -91 63 396 295 -35 -324 -110 138 205 225 288 -99 -493
2138 -493 -250 2 342 -91 -65 -49 -300 -559 -49 295 120 203 -61 -73 -157 -109 400 389 16 -118 -22 -212 -241
2161 -241 119 260 95 -400 -388 -256 -139 -41 304 180 -47 -243 -6 428 255 358 487 -3 -385 -258 161
2182 161 237 -92 66 -232 -663 -462 142 209 62 162 52 -162 -174 278 633 339 135 176 -66 -199 -90
2203 -90 167 199 -180 -432 -358 -374 -412 47 367 47 -262 -80 264 409 137 400 365 -197 -178 -37 18 122 122
2226 122 -35 -382 -677 -385 155 58 129 0 -113 -142 -129 165 694 467 34 126 -204 -243 30 257 158 -320
2248c20o2J01q1P1N11J6m11P4J54J18Q0L3K71l99k92N7J9N5K86j92k35l25n7K38
2272b90K96n5M3J56k67j18K06L16J81k69j3Q1n79J16M35qk01j92O0j59j28J89
2294b00M07j80k56J39l1O4J84L02kk65m61L09J32p0Q4L2k43k95j23L24Q3n7J73
2317E0R8m34L2L55J80q2K3L9j16m44L25K04j49j36O0k75J3K8K51Q3j05j33L5n7
2341a55K2K87J90m7l34k53L02J36j74J70rk24j44K3K47l9nJ25j81l21K62K29j23
2364a6J97Q7k82j26qK20Q9R2l53R1j16r5J28J32J95k83j28J78j09K1L19J68l27
2387G4j10N3qj62K40J51j94l20J23K6OJ60N1K4k52j62K22R9N9J01o7j58j46j28
2411c18L42J69j03j33L3k67J1K64J71j8j20k9rj30N2L39j82j21o4J9q8L1K87j6
$$ plain form
2248 -320 -382 -281 -362 -291 220 236 -175 -101 53 171 251 284 555 156 -136 -79 -60 -5 281 89 -146 -471 -528 -290
2272 -290 6 -49 -6 150 -117 -235 -29 287 468 199 186 267 -312 -196 239 231 30 -162 -102 -261 -389 -200
2294 -200 207 27 -229 -90 -121 -57 127 429 427 162 -299 10 142 72 156 188 -55 -350 -473 -149 -66 -123 50
2317 50 148 -286 -254 101 281 199 222 261 145 -299 26 230 81 -55 5 -270 -257 -229 22 105 0 -133 -98 -155
2341 -155 -133 154 344 297 -37 -290 12 148 -26 144 135 -89 -233 -210 37 -2 -7 118 -63 -384 -122 107 -16
2364 -16 181 268 -14 -140 -148 72 161 253 -100 -9 -125 -220 -92 40 235 -48 -176 2 -107 -86 233 401 74
2387 74 -36 17 9 -153 87 238 44 -276 -153 -127 -121 39 90 114 -138 -300 -78 21 80 181 114 -44 -190 -318
2411 -318 24 193 90 -43 -10 -277 -266 -2 169 151 31 2 -7 -137 -85 254 72 -49 -113 -94 -182 -151 136 120
2435A20j61j26J15J3L1J07m1R6j75k36J30K55j88N7L7j11r4N8K35j54NJ8jl11
2459c21J80K71p0j2l8Q2j05l0O6J40J3j77q9l8k1L9J67M0j88j54K17j23J88J14
2483A51j00M7j72L7J22n1q7L11j64k98jM9R0R7j03J58j42o8K14p9K20q9l6j78
2507g2J02o7K00M2j55q0J08k01l4J32J8Q8l08L8K20k00J48J90P0k08l2K6m4K4
2531ER7P8k81k5p4J25J05J3p4Q0k64O4J52J87j49J37j07j00m8R3N9Q0k42J18j46
2556a17j84J39J86J37m4j29o9q9lK90K36l83L7q7o5pJ74J43p7k28l0J18Rj7J95
2581A35j66M7j63jK43n6l7N7j42j25K48l0J17j68J58ok92l8J67J76l5j61J32n9
2605Ao3m5J39J75k44j6J28k57R7J32O2j30j02n9J94l3k8J73n9o5j96K81j7o4J2
$$ plain form
2435 120 -41 -167 -52 -39 -8 99 58 154 -21 -257 -127 128 -60 -3 34 -77 -171 -113 122 -32 -27 -9 -10 -321
2459 -321 -141 130 60 48 10 92 -13 -43 23 163 176 -1 -90 -128 -149 -110 57 97 -91 -245 -28 -151 37 151
2483 151 51 98 -74 -37 85 34 -53 258 94 -204 -205 -156 -66 31 -72 86 -56 -124 90 11 231 142 106 -72
2507 -72 30 -37 163 205 50 -30 78 -123 -157 -25 -7 81 -227 -189 31 -169 -21 169 239 31 -1 25 -19 5
2531 5 102 180 -101 -126 -200 -75 30 43 -31 49 -215 -151 1 188 39 176 69 -31 -79 14 73 153 -89 29 -117
2556 -117 -301 -162 24 161 117 -12 -81 -170 -173 117 353 -30 7 -80 -145 -152 22 165 88 -140 -170 -52 -43 -60 135
2581 135 -31 16 -147 -148 95 39 2 59 -83 -208 40 10 127 -41 117 111 -181 -219 -52 124 89 -72 60 1
2605 1 -62 -107 32 207 -37 -53 75 -182 -85 47 109 -21 -123 -182 12 -21 -49 124 65 0 -196 85 68 4 16
2630A6J67l11n0J11J88J10j32r2j13p8o2K78J3M1q2O4p4j2J4P6j9k5J5o1l5J40
2656H7p5J19k33R7o2L1o2J16lo4R3q6p9J52N7KK2n0j55MJ61Jj69J13p0j20Q9K4
2684f0J52k08J96j99O4m6K66m3q2j19J04j39R8M5J03Lj23n2oo8j5J30n1J0P1q1
2710e0Q4k8n2K31j26j68O3R8m3mJ37j51j47J0J86Q5j25K9M2j53p6O3O7Q6n1N8
2736F5Mj11q0L09j25J1j15m2o2J42j18J85p2j53J99j16J4P9L3O7k29R3p6R5m6
2761d9J01q0P3m3j03OK20j15L0q9j18R0OR3Jo6R7q2o4J43OO5q4M5k06N1r7K43
2789G4L9k05J2O7K6l5N2N0p9Rp1J44Q3k45J19K9j16o9l3K14p4m5J1J11j45j2J08
2816A9L2j28J27n9LO9L8K2r5KJ52k67QJ42l5O6j06k7K5l7ON1J84j60k5n6J6RO4
$$ plain form
2630 16 183 -128 -178 -67 121 231 99 7 -106 -184 -246 32 45 86 4 68 -6 -18 -4 72 53 28 43 -18 -53 87
2656 87 12 131 -102 -5 -67 -36 -98 18 15 -49 44 -42 -121 31 88 90 112 62 -93 -89 72 73 -96 17 -53 -173 -84 -60
2684 -60 92 -116 80 -119 -55 -101 165 122 40 -79 25 -114 -16 29 132 135 12 -40 -46 -114 -129 1 -50 -40 31 -50
2710 -50 34 6 -46 185 59 -109 -46 52 9 5 142 -9 -156 -146 40 125 0 29 71 -82 -158 -95 -28 58 7 65
2736 65 69 -42 -122 187 62 73 -42 -84 -146 -4 -122 63 -9 -162 37 -79 -65 14 47 114 -115 -22 -98 -3 -49
2761 -49 52 -28 45 2 -101 -95 125 10 40 -49 -167 -77 -71 22 23 -43 54 -28 -92 51 57 122 38 83 -123 -72 -169 74
2789 74 113 -92 -80 -13 13 -22 30 80 1 10 -61 83 166 -79 40 69 -47 -116 -149 65 -9 -54 -43 68 -77 -89 19
2816 19 51 -77 50 -9 -6 63 101 123 28 30 182 -85 -77 65 30 96 -10 -37 -12 -49 -43 8 192 32 7 -49 -33 -24 40
2845D0J16Ql90R0J13J4L1p0Q2m1q3O7lRQ3p1n8l3R6o8J98n2jq6r6O3Q0O7qNj67
2876f5J00j28p4K94o6q2N0m2q8J05L7N3m7j70J37kj36K58j15q6J24j33nJ58r1
2901a4R8m6n0j30J19J7M0j20m6J76k72J81J15mr8o3J17n0k1L3O5j29J74j35Pr
2927d5J66m0k3j53O7M1j46J16J8R8K7o5j16O4Ln1J10r7l1Q2k5K7K2l7k3m1n4J03
2955cL6%Kp6lp2K4K4J87k51R5M1m2O2M2K1j10j02J01J00j79Q8J36n8p6K2O7k9
2983D7J7jJ04k10j55K28k9n2J11m0m6l0j2R3N9p3R6q6j32J08j7Q1J9j47OO5m7
3010d3o1K35q8L2j32Jk6m3K15Mk0j45j5R1k6P6P7j36ok7R4n1N3m9l3n2j5O8o5
3039h7N1L1J7J3k1k7k2O7k5j24K39j4j66P0L1o6O6Rj18J04n7K7k2j6N5L5j16j24
$$ plain form
2845 40 156 164 -226 -136 -23 -9 22 -48 34 -7 -90 -23 -26 -17 66 -5 -63 -96 0 -68 130 78 77 -9 -105 -42 38 105 97 102 -65
2876 -65 35 -93 -167 127 61 -21 29 -13 -101 4 41 94 47 -123 14 12 -124 134 19 -67 57 -76 -81 77 -14
2901 -14 84 38 -12 -142 -23 -6 34 -86 -132 44 -228 -47 68 64 -34 -97 20 -30 -51 -18 47 -82 92 -43 -36 -45
2927 -45 121 81 58 -95 -28 13 -133 -17 1 99 126 61 -55 9 12 -39 71 -26 -57 25 0 27 49 12 -11 -52 -106 -3
2955 -3 33 33 35 -41 -44 -116 -92 -68 119 -132 -37 4 -38 24 66 87 -23 -125 -24 76 -103 -15 121 63 -13 9 76 47
2983 47 64 63 167 -43 -198 30 1 -51 60 20 -26 -56 -68 25 84 11 107 21 -111 -3 -20 61 80 -67 -61 4 -43
3010 -43 -104 131 43 75 -57 -56 -82 -125 90 94 74 -71 -86 5 -21 55 132 -4 -10 -37 57 6 59 10 -23 -75 -90 -22 -87
3039 -87 -36 -5 12 25 4 -23 -45 22 -3 -127 112 98 -68 2 33 -33 33 42 -76 28 -29 -2 -24 -40 15 50 -66 -190
3067a90R7J03lo5PL6M4oJN9m0p7l3J4Q9l8l8K9K0q2J41o5m6mk3K0r3J64j7j6l4
3098d6P1r0Q4q1L7L8j3rj7rN0J6lK8o9jq3J02J50r1k7j74L9J19K1n8J7mp4Q4q3
3129g6o9J76N0j71J49m2J6K9O5q8J2j05r0J41j9Q4j21LL2P2j28Q7Q3n6o6m1k4
3156i7L7K34j91M9o0j3n2J19r3R9oJ7j20M4j01J19j5M4r2k6L0KJ07n7J26p6K1
3183D9l7N5o1O3r7Q1K4j27l3QJ16L6r0Lp2j17K16p0O4q6O4j9Ln4R6K3P0o5k76
3212b33K55n3l1J47k5q8L3J4K3O0j18J22q5j12J14m0j3J09j75J95j07j6J05o2
3236A9L3o2q3J08j4l7L6J1m6l1O1j97J84j8J2j8j08J23K2q1J19l6o3P5L2N1K3
3263A15j45L7J9o4j36J00p2P5L7N7L4p4p6J86j10K6O6j5r1J53j92J04m6j11J10
$$ plain form
3067 -190 -93 10 7 -58 -51 -15 29 23 24 83 43 -34 -67 -53 36 -2 -40 -11 9 -73 68 3 -43 -47 -70 -50 -143 21 4 -12 -46
3098 -46 25 -65 19 -62 -25 13 0 -9 -26 -35 15 31 28 56 -13 -14 -97 5 155 64 37 -137 -98 21 42 -16 1 -3 -77 7 -76
3129 -76 -145 31 81 -90 59 17 33 62 127 39 51 -54 -144 -3 -22 62 -59 -56 -24 48 -80 7 90 34 -32 -73 -97
3156 -97 -60 174 -17 32 -28 -41 -93 26 -67 32 26 43 -77 -33 -134 -15 -30 14 -78 -104 -74 -72 35 -22 104 28 49
3183 49 12 67 6 69 -28 53 77 -50 -83 -75 41 77 -13 -10 -82 -199 17 -53 11 -75 -11 -30 -27 -81 15 38 108 43 -233
3212 -233 22 -31 -62 85 60 -28 5 19 42 102 -16 106 21 -91 23 -17 -30 79 -96 99 -8 -24 81 19
3236 19 52 -10 -93 15 1 -36 0 11 -35 -66 -5 -202 -18 -36 -24 -42 -150 -27 -5 -86 33 -3 -66 9 41 92 115
3263 115 -30 7 26 -38 -174 -74 -146 -71 -34 23 57 -17 -93 93 -17 9 75 60 -31 122 -70 34 -12 -123 -13
3288a3p3l0J40n3m7l4MJ05Nk5k7J44j33n0J79q2P2k4m2N5j73J06R7r5k2q8P3L5
3316DP4o0M1p1k4J41m6r7M7j40R4P1o4mR9j80J11j19PP1L5Qp2J72K4j06j02J19
3344C3q4j1L9J08o2L1q0m8M0n6J59j0r0lM6l3J09o1p0J79r4n5M7Kq3k2L4L8k4
3373b1o9Q2l5L2l4L4M2j1L8L4q4M4qlj4o2R8p1n1L1r4J70q8l7o2J07J9o3K04l4
3403I4J1n2O1o5j00J48j50N6O8l3m4p8K1K0k3N9J2Qj37J60k4r3J29J9l9K3o3Q2
3431G0m7l2r3P3Nj14r1J85J86k58J67j14L7PQJ19m0n9Q1j46m1J85o6q0oj0%Lm1
3460a12J26p4P2l4L0k5N1o7k0Q2j07N6J81o3j00j08J09ML5j19P3K3Lj34J19r2
3486i1M4R0k7k4k5m1M0PQ0J4r6K2r3K8J13p0j4pn5J50j1%k0kK8j6p1K0j9kK7M4
$$ plain form
3288 -13 -86 -116 24 -29 -76 -110 -106 -1 4 -21 -48 96 -37 -87 92 10 82 58 16 71 -102 4 101 6 -16 -104 -31 4
3316 4 78 18 59 -12 -36 105 59 -38 9 -131 -37 34 -30 -34 65 -115 -4 -123 -116 -45 -10 -2 -74 98 122 16 -86 33
3344 33 -51 -62 -23 85 23 54 -26 -74 -34 -90 69 59 -31 -34 12 -21 88 27 -43 136 42 -13 34 36 -47 -69 -35 3 -21
3373 -21 -90 -8 -43 -11 -45 -11 31 20 58 92 8 52 44 41 27 -35 63 -8 -59 -28 -122 48 -40 -77 -139 -32 -13 -76 128 94
3403 94 105 53 114 49 -51 97 -53 3 71 38 -6 -84 -63 -43 -66 -7 5 13 -124 36 12 -81 48 67 28 51 -12 70
3431 70 23 -9 -102 -29 -24 -138 -229 -44 142 -116 51 -63 -26 -19 -11 108 68 9 90 -56 -97 88 22 -58 -64 -74 -74 -71 -112
3460 -112 14 -60 12 -22 8 -17 34 -33 -53 29 -78 -22 159 96 -4 -112 -3 1 36 -83 -10 13 16 -118 1 -91
3486 -91 -47 43 16 -8 -33 -74 -34 -27 53 67 -29 -7 -100 -72 41 -29 -43 -50 -105 45 34 34 14 12 40 24 -47 -27 -46 -48 -21 23
3518B3j49J27N1M8j18n5J09k1k9R1N3j14N7o2RN0j0l8J12j87M7K2n3o3J22nmL9
3546E2j66O6P1J2q7JK9j1Q0j84K58j03j37l9J02l8oJ93j95Q3R6j17M3N0K0L5j17
3573il2k5Q7jn9J4PJ27p9j19J09j5N2n4r6R0q4P0J5%p4N9J3L8MQk1k3m3P4l1M3
3605D5Ll5J18j59J06n2M7j6j26p6J24N4j32K17j93M2J6kO5o7N3J3o9l1N9M2j9
3632B7m5R1k4l8k4m8R5j02n8j1J59j05J7R3j1o6J82k39K09k1k61J32N5L2m2J6
3658A3Nj1J72k31J03n1J8j07J19l6m2P7pq4OK11k40L1K6n1J13k8j7n4R1NQ5j26
3686a0n7oO7J21j24Q8k17J37R9j56P1j08M3ML1L4O2n9o0P8j05K1J03n5n8N7n3
3713e2L9o9n5J30o5M2J8o4N1J12j79R2M1j34J04M2nl0J9K2l2j52%O0J12N4j32
$$ plain form
3518 23 -126 1 52 100 -18 -73 36 15 -14 77 130 16 73 11 20 70 60 22 134 -53 -6 16 -37 -100 22 17 13 52
3546 52 -114 -48 23 35 -52 -51 -22 -33 47 -137 121 18 -119 -158 -56 -94 -100 93 -102 -19 77 -40 3 53 73 108 -9
3573 -9 -41 -66 21 20 -39 -25 -18 109 30 -89 20 5 57 3 -93 -3 -87 -17 -2 -2 -76 -17 -4 34 38 46 25 2 -41 33 2 45
3605 45 48 13 131 -28 78 26 73 57 -69 -145 -21 33 -99 118 -75 -33 -17 -19 46 -21 32 45 -24 -55 4 46 27
3632 27 -18 73 49 11 -13 -61 34 -68 -126 -137 22 -83 -66 27 16 -50 132 -107 102 81 -180 -48 7 39 -3 13
3658 13 18 7 179 -52 51 0 18 -89 30 -6 -48 29 22 -62 -56 155 -85 -54 -28 -79 34 6 -11 -65 26 31 116 -10
3686 -10 -67 -73 -6 115 -9 79 -138 -1 98 -58 13 -95 -52 -48 -17 17 79 20 -40 38 -67 -46 57 2 -56 1 -52
3713 -52 -13 -82 -137 -7 -72 -30 -12 -76 -25 87 -92 0 41 -93 11 53 48 18 37 59 27 -125 -125 -65 47 101 -31
3740c1q2K8m7N8J48q1Q9j06K0oP5m8p9N6P2j12J35p0o9k6L4m0K6R8m5nJ92k14
3768c0R5m4J6n1q2j4nJ19p6J46j21M4PPj00R7K6J6j6o3Q9j15J28j07K9j74K95
3795A16j33l2l7M7pJ9R7l0l7j7%Ok4k9J72j38P4ll3n6K2m6Q2pK1l1j10J62m8Q
3825Hj26N3R6j16N1J11p9j23R5NR0Lj20J37m7l5K6K2J02j06m3N3Lj49J34r5k8
3852g8J02N3mj45O0K2m2p9J93p3j00J00N6o8%l4J56j27N8m7k2P1k58J95M5J3j01
3879e4L5j17J09K8lJ1N2J8r8NR6j16M1L7j30J64mp9j7Q1j14J35k7r7P4j09jJ66
3907H6q7Q3k48K25l0o6L0J24j81K7J8N5j10l9Q1nN3k4rN1j4J3k1l7LM9l4J7p3
3936f3J36j70P4L3o5R6l6J1m7Q7n2R7j42Q4j95J12L3JJ16j71L1Q9j14J67k14J09
$$ plain form
3740 -31 -113 -85 -132 -74 74 -7 82 -24 -4 -10 65 17 -62 -6 66 -46 89 19 -50 -76 -42 -82 -56 42 -3 -8 184 -30
3768 -30 65 21 37 -14 -96 -110 -115 4 -72 74 -47 -3 4 11 -89 8 34 50 34 -29 60 -55 73 -34 -5 -179 116
3795 116 -17 -49 -86 -39 -46 -27 70 40 3 -14 -14 -8 -32 -61 111 -27 47 44 11 -45 -23 -69 13 6 27 -4 -114 48 0 8
3825 8 -118 -65 31 -85 -34 77 -2 -125 -30 -25 65 68 -52 85 38 3 29 51 153 47 4 57 60 -89 45 -50 -78
3852 -78 24 77 73 -72 -12 10 -32 -111 82 9 -91 9 65 -3 -3 -37 119 -8 50 3 -19 52 -206 -11 34 47 -54
3879 -54 -19 -136 -27 1 -2 9 61 79 -19 -14 82 -34 7 44 -86 78 74 -5 -22 59 -55 80 53 -44 30 -79 -80 86
3907 86 -1 82 -166 59 29 -37 -7 117 -64 -37 -19 36 -74 -113 -32 -37 16 -8 -17 34 20 33 12 -25 -22 27 -7 10 -63
3936 -63 73 -97 -23 10 -55 41 5 16 -31 56 4 101 -41 43 -152 -40 -7 -6 110 -61 -30 59 -55 112 -102 7
3962GM6j08K9J0L5l0P9n0l2L5j04nJ31qn6L6j5k1kQ8p0p2M9qL0LL1M2pL4l9m4
3994A4J8LKL9n1q5mP4o9k1R1L2j01J03q5Q6o9K4l1J33j57k6J56Jj09P2j43R4L7
4023B8r7N2m8J16q5N1l0P0j68J22M1o1J6Rj9k4MP5j0r3J33j36nkK5N8L3j6n3N9
4053D5M3n2N5j94L8J11p3k7J55j39O7q4M1L9q8m9J52k7l2Q8q0l8P0r4J75j6o2
4080B4Nqk7l8j7l5P1K6r5Q8OM3M5n0q2J2O5J7K4q6kq3Q1n8J02k5k0Rq8J16N8j06
4112b8kJ6P9m9k6L5J8j55J05m0O4R5p9k6p3J39l2k8M1n6L1o6j21J98n3N1o1J04
4140H1j21K9J01k16J01nk2Q8K4J7n8k3M4j34J48p0n2K6L9L4N5k3q3o3N4J1l6j06
$$ plain form
3962 7 53 -55 -26 -16 19 -11 68 18 -14 21 -83 -88 43 35 -21 15 0 -21 -23 65 -5 -77 -28 -36 -6 -3 28 70 63 97 58 14
3994 14 32 35 37 76 25 -60 -64 10 -59 -80 11 43 -58 45 -40 46 -23 1 -30 103 -54 -80 76 77 -32 40 -103 -9 28
4023 28 -69 -17 -65 51 -34 17 -13 57 -111 11 52 -9 7 16 -3 -27 -23 52 42 -51 82 -54 -59 -61 -36 22 55 39 -14 45
4053 45 88 36 91 -103 -65 46 -27 -54 101 -38 29 -55 -14 25 -63 -112 40 13 -19 69 -11 -49 21 -73 102 86 24
4080 24 29 21 -6 -44 -61 -96 -25 1 -94 -6 0 43 88 38 -44 -32 33 50 74 -12 -14 -97 -16 -74 28 3 -17 -8 -96 20 78 -28
4112 -28 -30 -14 65 16 -10 25 43 -112 -7 -47 17 112 33 7 -66 73 41 13 54 -2 29 -37 -158 40 -13 38 -23 81
4140 81 -40 -11 90 -126 -25 -30 -52 36 60 77 19 -4 40 -94 54 -16 -68 -42 -3 31 86 63 -20 -83 -29 -18 -54 -160
$$ [...]
8191B8
##END NTUPLES=NMR FID
##END=
