##TITLE=1H_DE-80H_X3
 200.13MHz, d2o
 8 sc
 
 19ns.26.2.2025
##JCAMPDX= 6.0         $$ Bruker NMR JCAMP-DX V2.0
##DATA TYPE= NMR FID
##DATA CLASS= NTUPLES
##ORIGIN= UXNMR, Bruker Analytische Messtechnik GmbH
##OWNER= pz
$$ XWIN-NMR		Version 3.5
$$ Mon Mar 24 10:22:14 2025 Russian Standard Time (UT+4h)  Yarkov@DPX200
##.OBSERVE FREQUENCY= 200.1313
##.OBSERVE NUCLEUS= ^1H
##.DELAY= (6, 6)
##.ACQUISITION MODE= SIMULTANEOUS
##.ACQUISITION SCHEME= undefined
##.AVERAGES= 8
##.DIGITISER RES= 18
##SPECTROMETER/DATA SYSTEM= spect
##.PULSE SEQUENCE= zg30
##.SOLVENT NAME= CDCl3
##.SHIFT REFERENCE= (INTERNAL, CDCl3, 0, 14.3821)
##AUDIT TRAIL= $$ (NUMBER, WHEN, WHO, WHERE, WHAT)
$$ ##TITLE= Audit trail, XWIN-NMR		Version 3.5
$$ ##JCAMPDX= 5.01
$$ ##ORIGIN= Bruker BioSpin GmbH
$$ ##OWNER= Yarkov
$$ C:/Bruker/XWIN-NMR/data/yarkov2/nmr/H-C/1/audita.txt
$$ ##AUDIT TRAIL=  $$ (NUMBER, WHEN, WHO, WHERE, WHAT)
(   1,<2025-03-24 10:21:10.06 +0400>,<Yarkov>,<DPX200>,
      <created by zg, POWCHK disabled, PULCHK disabled
       configuration hash MD5:
       00 E9 B6 7A A2 85 ED C7 34 08 36 98 17 FE 4E 26
       data hash MD5: 16K
       34 E4 54 E8 45 C8 FE B8 5C 22 81 D3 EE 87 03 D9>)
$$ ##END=
$$ 
$$ hash MD5
$$ 0F CF 47 2C 32 80 8B 8E 20 57 BE EE 7D E0 49 B0
##$RELAX= 
##$RELAX= 
##$RELAX= 
##$RELAX= 
##$RELAX= 
##$RELAX= 
$$ Bruker specific parameters
$$ --------------------------
##$DU= <C:/Bruker/XWIN-NMR>
##$EXPNO= 1
##$NAME= <H-C>
##$PROCNO= 1
##$TYPE= <nmr>
##$USER= <yarkov2>
##$AMP= (0..31)
100 100 100 100 100 100 100 100 100 100 100 100 100 100 100 100 100 100 
100 100 100 100 100 100 100 100 100 100 100 100 100 100 
##$AQSEQ= 0
##$AQ_mod= 1
##$AUNM= <au_zg>
##$AUTOPOS= <>
##$BF1= 200.13
##$BF2= 200.13
##$BF3= 200.13
##$BF4= 200.13
##$BF5= 200.13
##$BF6= 200.13
##$BF7= 200.13
##$BF8= 200.13
##$BYTORDA= 1
##$CFDGTYP= 0
##$CFRGTYP= 5
##$CHEMSTR= <none>
##$CNST= (0..31)
1 1 145 1 1 1 1 1 1 1 1 1 1 1 1 1 1 1 1 1 1 1 1 1 1 1 1 1 1 1 1 1 
##$CPDPRG= <>
##$CPDPRG1= <>
##$CPDPRG2= <>
##$CPDPRG3= <>
##$CPDPRG4= <mlev>
##$CPDPRG5= <mlev>
##$CPDPRG6= <mlev>
##$CPDPRG7= <mlev>
##$CPDPRG8= <mlev>
##$CPDPRGB= <>
##$CPDPRGT= <>
##$D= (0..31)
0 0.7 0 0 0 0 0 0 0 0 0 0.03 0 0 0 0 0 0 0 0 0 0 0 0 0 0 0 0 0 0 0 0 
##$DATE= 1742797269
##$DBL= (0..7)
120 120 120 120 120 120 120 120 
##$DBP= (0..7)
150 150 150 150 150 150 150 150 
##$DBP07= 0
##$DBPNAM0= <>
##$DBPNAM1= <>
##$DBPNAM2= <>
##$DBPNAM3= <>
##$DBPNAM4= <>
##$DBPNAM5= <>
##$DBPNAM6= <>
##$DBPNAM7= <>
##$DBPOAL= (0..7)
0.5 0.5 0.5 0.5 0.5 0.5 0.5 0.5 
##$DBPOFFS= (0..7)
0 0 0 0 0 0 0 0 
##$DE= 6
##$DECBNUC= <off>
##$DECIM= 32
##$DECNUC= <off>
##$DECSTAT= 4
##$DIGMOD= 1
##$DIGTYP= 9
##$DL= (0..7)
0 120 120 120 120 120 120 120 
##$DP= (0..7)
150 150 150 150 150 150 150 150 
##$DP07= 0
##$DPNAME0= <>
##$DPNAME1= <>
##$DPNAME2= <>
##$DPNAME3= <>
##$DPNAME4= <>
##$DPNAME5= <>
##$DPNAME6= <>
##$DPNAME7= <>
##$DPOAL= (0..7)
0.5 0.5 0.5 0.5 0.5 0.5 0.5 0.5 
##$DPOFFS= (0..7)
0 0 0 0 0 0 0 0 
##$DQDMODE= 0
##$DR= 18
##$DS= 0
$$ [...]
##$SUBNAM2= <"">
##$SUBNAM3= <"">
##$SUBNAM4= <"">
##$SUBNAM5= <"">
##$SUBNAM6= <"">
##$SUBNAM7= <"">
##$SUBNAM8= <"">
##$SUBNAM9= <"">
##$SW= 18.0517328524113
##$SWIBOX= (0..15)
0 0 2 0 0 0 0 0 0 0 0 0 0 0 0 0 
##$SW_h= 3612.71676300578
##$TD= 16384
##$TD0= 1
##$TE= 0
##$TE2= 300
##$TE3= 300
##$TEG= 300
##$TL= (0..7)
0 120 120 120 120 120 120 120 
##$TP= (0..7)
150 150 150 150 150 150 150 150 
##$TP07= 0
##$TPNAME0= <>
##$TPNAME1= <>
##$TPNAME2= <>
##$TPNAME3= <>
##$TPNAME4= <>
##$TPNAME5= <>
##$TPNAME6= <>
##$TPNAME7= <>
##$TPOAL= (0..7)
0.5 0.5 0.5 0.5 0.5 0.5 0.5 0.5 
##$TPOFFS= (0..7)
0 0 0 0 0 0 0 0 
##$TUNHIN= 0
##$TUNHOUT= 0
##$TUNXOUT= 0
##$USERA1= <user>
##$USERA2= <user>
##$USERA3= <user>
##$USERA4= <user>
##$USERA5= <user>
##$V9= 5
##$VALIST= <valist>
##$VCLIST= <CCCCCCCCCCCCCCC>
##$VD= 0
##$VDLIST= <DDDDDDDDDDDDDDD>
##$VPLIST= <PPPPPPPPPPPPPPP>
##$VTLIST= <TTTTTTTTTTTTTTT>
##$WBST= 1024
##$WBSW= 4
##$XGAIN= (0..3)
0 0 0 0 
##$XL= 0
##$YL= 0
##$YMAX_a= 705523
##$YMIN_a= -676757
##$ZGOPTNS= <>
##$ZL1= 120
##$ZL2= 120
##$ZL3= 120
##$ZL4= 120
##$ABSF1= 10
##$ABSF2= 0
##$ABSG= 5
##$ABSL= 3
##$ALPHA= 0
##$AQORDER= 0
##$ASSFAC= 0
##$ASSFACI= 0
##$ASSFACX= 0
##$ASSWID= 0
##$AUNMP= <proc_1d>
##$AZFE= 0.1
##$AZFW= 0.1
##$BCFW= 1
##$BC_mod= 2
##$BYTORDP= 1
##$COROFFS= 0
##$CY= 83.5205535888672
##$DATMOD= 1
##$DC= 2
##$DFILT= <>
##$DTYPP= 0
##$F1P= 10.8118882576601
##$F2P= -7.23987719738617
##$FCOR= 0.5
##$FTSIZE= 0
##$FT_mod= 4
##$GAMMA= 1
##$GB= 0.15
##$INTBC= 1
##$INTSCL= 1
##$ISEN= 128
##$LB= 0.25
##$LEV0= 0
##$LPBIN= 0
##$MAXI= 10000
##$MC2= 0
##$MEAN= 0
##$ME_mod= 0
##$MI= 1.114404
##$NCOEF= 0
##$NC_proc= 0
##$NLEV= 6
##$NOISF1= 3.799351
##$NOISF2= 2.8
##$NSP= 1
##$NTH_PI= 0
##$NZP= 0
##$OFFSET= 14.38212
##$PC= 1
##$PHC0= -1181.983
##$PHC1= 6.992248
##$PH_mod= 1
##$PKNL= yes
##$PPARMOD= 0
##$PSCAL= 0
##$PSIGN= 0
##$REVERSE= no
##$SF= 200.129724274929
##$SI= 16384
##$SIGF1= 3
##$SIGF2= 2
##$SINO= 400
##$SIOLD= 16384
##$SREGLST= <1H.CDCl3>
##$SSB= 0
##$STSI= 0
##$STSR= 0
##$SW_p= 3205.1282051282
##$SYMM= 0
##$S_DEV= 0
##$TDeff= 0
##$TDoff= 0
##$TI= <>
##$TILT= no
##$TM1= 0
##$TM2= 0
##$TOPLEV= 0
##$USERP1= <user>
##$USERP2= <user>
##$USERP3= <user>
##$USERP4= <user>
##$USERP5= <user>
##$WDW= 1
##$XDIM= 8192
##$YMAX_p= 0
##$YMIN_p= 0
$$ End of Bruker specific parameters
$$ ---------------------------------
##NTUPLES= NMR FID
##VAR_NAME=  TIME,          FID/REAL,        FID/IMAG
##SYMBOL=    X,             R,               I
##VAR_TYPE=  INDEPENDENT,   DEPENDENT,       DEPENDENT
##VAR_FORM=  AFFN,          ASDF,            ASDF
##VAR_DIM=   8192,          8192,            8192
##UNITS=     SECONDS,       ARBITRARY UNITS, ARBITRARY UNITS
##FACTOR=    0.0002768,     1,               1
##FIRST=     0,             0,               0
##LAST=      2.2672688,     0,               0
##MIN=       0,             -676757,         0
##MAX=       2.2672688,     705523,          0
$$ Real data points
##PAGE= N=1
##DATA TABLE= (X++(R..R)), XYDATA
$$ [...]
2080E1l7K95o45o40K64J347J94k51J05m83o23J52P69J21k51l07l71q02J26Q95
2100i1O26o34k66L68o39j97J284O89o58m35M6j06l60N84P36n46p02L95m61k98
2120f65M29N49Q0q51j19J05P9M23N93K9o88k92L79j60J14P43J95j032l79n6K40
2141b84J95K38N09j093k96L28M49j09M57R3l20q58M43L73J0M01L37o07q11k0N02
2162f3J55j4l1m23m35j77P65L18P3J9Q1n41k25P34M87k10P0J09o61l83L57N31
2184E36l18k98L1m71m69L21Q01J78k94J07l62l08N80O75m0n21j39J44n26K09M39
2205B75M1m24j25l46j30J18N06M34l63l38K92r5K72L12M18j75m03j10j69k40L05
2226E5M16m56n12L9o5j9J14O07Qn62l8O05r6J45K75K28p00j22m6L07k27J92J10
$$ y = [51, 14, 309, -336, -976, -712, 635, 829, 578, 683, 200, -423, -271, 498, 619, 368, 61, -310, -1112, -986, -91, 535, -99, -365, 3, -636, -833, 451, 1140, 482, 47, 93, -13, -373, 211, 947, 401, -301, 94, -367, -665, -236, 313, 393, -458, -577, -472, -393, 30, 623, 652, -36, -328, 51, -109, 5, 748, 943, -89, -468, -524, -284, -89, 149, 658, -435, -731, -403, 46, -63, 394, 487, 167, -691, -248, 125, 135, 536, 873, 266, -545, -565, -63, 92, 78, 47, -376, -811, -988, -223, 95, 168, 187, 268, -273, -498, 236, 723, 513, 583, 692, 31, -352, 5, 536, 218, -80, -49, -520, -989, -668, 133, 311, 17, 124, -238, -546, 34, 709, 669, 148, 9, 153, -373, -164, 275, 316, -108, -233, -579, -709, -591, -85, 349, -14, -352, -60, -155, 117, 429, 847, 672, 269, 159, -10, -250, 55, 471, 15, -497, -458, -523, -542, -428, 179, 187, -375, -413, 192, 96, 241, 516, 744, 44, -78, -124, 183, -44, 148, 258]
2249B58n71k82L00J24j54K27L14k20m47L50N31j81N1M14l13p77P5L76L9p0r7L3
2271b0n02j05N71L9LK6J46m25q3L55M87q3k36K7j91m13M67L65l18j41k8k60j59
2294d78J78M05P4k63LN7k92K11N58J32m25M3q0l07K14K66k20j38j40K73l54p9
2316c62M18K96l37j84n4J21J17L37J88l26m27J53L2m7L21R6N1o18k1L38k09j03
2338b20K76P7m89R7K37k2O4L10k3m11k34N00p8k33M36k29k16k39R6M06k33K20
2360I2L8k86j02N2K82OK8P9l49o3o7K66L98m06K92j19m73j37O14J98m31R6J10
2383A18k43k33M16J13p4k05M78n46j59K71N64l29O6m9l06j13J12M92l68o3J55
2404I7r2k74J16L25ql90K06k10k8QM08j92q6J82o6m15K72K92L42m05k35M54l00
$$ y = [258, -313, -595, -295, -171, -325, -98, 216, -4, -451, -101, 430, 249, 300, 714, 401, -376, -301, 75, 114, 44, -53, -20, -522, -627, -56, -17, -14, 12, 158, -267, -350, 5, 492, 409, 173, 200, 9, -404, 63, 428, 110, -31, -59, -319, -478, -300, 105, 179, -84, -81, -24, -316, -105, 453, 585, 160, 203, 123, -184, 30, 296, 76, -62, -202, 71, -283, -362, 56, 352, 15, -169, -223, -102, 15, 352, 540, 214, -213, -60, -28, -75, 246, 342, 393, -225, -246, 92, -117, -220, 56, 133, -356, -259, -22, -44, 20, 330, 307, -104, -338, 162, 84, -149, 287, 58, -158, -397, -301, 105, -128, 92, 130, -156, -258, -206, 76, 82, 110, 189, -160, -223, -290, -24, 374, -32, 260, 141, -332, -469, 145, 343, -88, 8, 118, -125, -358, 58, 171, 97, -108, 370, -176, -335, -64, 500, 171, 237, 188, -118, -231, -119, 373, 5, -58, 97, 5, -269, -153, 172, 164, -226, -20, -230, -258, -250, 158, -34, -120, 62, -4, -419, -147, 145, 487, 82, -153, 301, 1]
2427Ak40K42K48j29m55J99N4j00J8N78j28m26k6K02J32j9L40j79m10N0k0JK4K5
2451a8P0j03k88K69K0j88L05J54k50l83M23R1k53M39J38l79q7J25J72m00r3M02
2473A66j89j62l29N08J78NJ50k34k68m9L69n6MJ27l8l22j89J22K78m26N48O8o54
2496c93j49O44L27l64j5J88l05qJ89J88r9j03J22o5n05K74L04j34k59q8L29l66
2518b88r0L30K83l31J09K20l14P6K74J37l68k94K04j08K6J83K30k85k77K66K24
2539B07n05L78L20m98J15j00K77j76K91l4j13k31K9J2j94J85Q7J54m48L4J78l1
2561f3L1K22O7l62k7Q5K46k30L42j40k28j27n9L81m15J93L09j74m86J77L33q2
2583gM3L5J08l18j39N46m52J67J64j10j79j36L89o2j62J82K2k04l15L89M22k26
$$ y = [1, -239, 3, 251, 122, -333, -134, -80, -180, -162, 416, 288, -138, -164, 38, 170, 151, 491, 312, -98, -48, -68, -67, -43, -18, 52, -51, -339, -70, -50, -238, 67, 221, -29, -412, 11, 102, -151, 288, 426, 47, -40, 85, 257, -143, -236, 166, -23, -185, -514, -6, 172, 177, 327, 93, -175, -224, 145, 89, 93, 220, 182, -140, -329, -207, 71, -355, 193, 261, -393, -542, 102, 429, 65, 50, 238, -67, -75, 114, 302, 203, 100, 222, 157, -348, -74, 230, 96, -163, -251, 78, -288, -378, -48, 235, -96, 13, 233, -81, -5, 269, 406, 38, -256, -52, -160, -134, 49, 279, -6, -283, -17, 207, -298, 80, 400, -98, 17, -83, 194, 18, 309, 275, 162, -69, -40, -28, -222, -37, 50, 204, -244, -210, -32, -63, -32, 190, 257, -105, -132, -47, 199, -31, 311, 171, -57, -184, -243, 138, -277, -84, 225, 51, -435, -258, 75, -7, 36, 71, 179, -139, -278, 268, -184, -17, 147, 37, -142, -278, 111, 49, -113, 69, 91, -113, -428, -39, 383, 157]
2605A57l4l1P1m13K51L73l37J09J13l57Nl3L11j56J3p0n3o8j1N02j63k53j47K21
2629@j03jL47n8l28OJ66k78L44N3K63n56k73N95k03j52K81K11j86l61L65j33P3
2652G2p9N54n56k18K8K50j80P5L60j67m64q1L80j30J77L26r1n58J84M2K01p9J04
2675A50o0l68N8J14L45l34K49j47k70J46oL65j56Q2J72k13l67J70J31j53J07L4
2697D9k04j09k1P29m09j66K09j19j90PL29p6rmOj9k55L51J74k60J28O9m23Q3m0
2722a70M70k99l09L46j98k78M44J50J39k48J99l9k47J96j3Pl00J0L05k08l83L51
2744g5K29l13l20N00j63J81K60m3l86K7M03n6l20Q3J97k10j88k0L7K00q8K61j99
2767cl58L36L00m29K13K78j51k22p8L24r9n0O1m2l96M1K84Nj65j1L0q3j05O28
$$ y = [157, 123, 92, 163, -250, 1, 374, 37, 146, 259, -98, -93, -126, 185, 29, 42, -28, -81, -149, -160, 342, 179, -74, -221, 0, -103, -104, 243, 185, -143, -137, 29, -249, 95, 148, 411, -145, -418, 177, -26, -178, 103, 314, 128, -233, 132, -1, 72, -7, 547, -9, -227, -199, 51, -129, -54, 306, 139, -325, -406, -26, -156, 21, 347, 256, -302, -118, -76, 125, 46, 150, 90, -278, -220, -106, 239, -95, 154, 7, -263, -117, -123, 242, 86, 168, 340, 127, -240, -70, 61, -92, 15, 49, -155, -264, -285, 444, 35, -131, 78, -41, -231, -224, 105, 29, 20, 16, 22, 3, -252, 99, 273, 13, 141, 210, -213, -130, -170, 300, 1, -308, 38, -160, -438, 6, 156, 295, 47, 246, 207, -40, 156, 143, 150, -150, -140, 165, -43, -426, -75, 154, -159, -479, 21, -142, 39, 299, 256, -130, -103, 300, 244, -76, 7, 204, -6, -194, -214, -177, 23, -65, 196, -3, -361, -25, 275, -154, 59, 337, 186, -36, -114, 210, 111, 61, 122, 80, -316, -275, 9, 14, -151, -162, -132, -215, -320, 308]
2791C08j96J7J38j59j17k49L15J56j78J74N0n32k07K58N28m61P7J70j78j76J77
2812h5L25k8j64q1K88n21L23j4L30l88m1m2j86K14P9K65m37j2K4J43k79M75K99
2835D87k98k92K21p6j35K61J12l69p9j07K49j71J35L13j8j96j10j31m2M24J46
2856C24n0m28QL27n1j45K89K18l86m17L79J15k54J67N8m27j06K71Q7l3R0K15l13
2879f2l50M62R6J5k11N3J7j54O9K47k07J09j79o3q4J90J66J18l23J84O3k61k12
2902c17L35K59l63J09Q7k95o7L06K42j19k75j18l9N4P2L23k26m1R6k60L8Q7O15
2925E03l22m15R7j2O0J0K19K7j27k26K80k84J75K48j54K7l07K65j90J91L77m42
2947@Ll19N17j11l72M07M5k25L1K9J3J18j10J38j69k00L27K0j24j8lJ51o26K60
$$ y = [308, 112, 129, 267, 108, -9, -258, 57, 213, 35, 209, 259, -273, -480, -222, 306, -155, -78, 92, -86, -262, -85, 240, 212, 48, -33, 255, -266, 57, 43, 373, -15, -56, -98, -284, -70, 9, 274, -163, -175, -151, -8, -287, 188, 487, 189, -103, 118, 42, -93, 168, 280, -89, -168, -275, -26, -197, -62, 251, 233, 37, -73, -204, -246, 178, 324, 274, -154, -146, 181, 130, -15, 274, 492, 106, -311, 68, 183, -71, 96, 154, -273, -379, -108, -21, -54, 36, 251, -62, -412, 50, 146, 161, -50, 3, 20, -134, -65, 182, -25, 84, -95, -158, -242, -52, 114, 232, -91, 93, 156, -105, -317, 18, 277, -86, 23, 110, -185, -252, 54, 296, 177, -98, -216, -255, -201, -129, 194, -32, -73, 23, -237, -199, -112, 503, 181, -234, -137, -149, -89, -79, 140, 167, 40, -186, 94, -190, -15, 233, 79, 106, -201, 64, -126, 65, 442, 0, 3, -316, 201, 90, -282, 125, 170, -55, -24, 5, 18, 136, 26, 164, -5, -205, 122, 142, 18, 0, -3, 148, -478, -218]
2971b18J18Q5J16OK11m56j0L31M0l19L83k29j36lK8K05o3j52L61l81l42N30k29
2994a24K06L6j55K01m73K33K20Nk03L12j39l68K69mK08n54L12j47j17K02J08j15
3016h7R1j27K73j50j40L26o2j60j18J68K%lJ4j77j75K23J33r6J92L5j40m05K78
3040a05K2Q6Q5m6m7j21m4P9K05k11L64j43k93Q1J8L57n53L67J12l82j59L46K45
3063B63k03r7L78k45j85rL01k04j50M07q1n10JL78k24J03l7N5k51L9M24J57l21
3086a1%J63j95j28K44J56m98L52j10j04k39M42J37k76l1N6j99qN50r3j70j25J59
3109G2j36PK86O8l12j40N2J04j71J47P7j5l38K15o0k9L8K10p9k15j7N73k87o5
3133a5L60n5m25K09J20l59q5O7N07k63l54K08K6O4j22N65m91j28K27rjJ8K74l53
$$ y = [-218, -100, -15, 101, 107, 318, -138, -148, 183, 223, -96, 287, 58, -78, -81, -53, 152, 89, -63, 298, -83, -425, 105, -124, 82, 118, -37, 164, -309, -76, 144, 149, -54, 258, 119, -249, 20, 16, 224, -330, -18, -165, -282, -80, 28, -87, 4, -123, 150, 0, -140, 186, 124, -36, -154, 14, 16, 16, 13, 27, -150, -325, -102, 31, -65, 127, 162, 22, -383, -105, -83, 3, 88, 42, -5, -126, -170, -91, 114, -97, 267, 124, -169, -88, -70, 287, -266, 101, 213, -169, -328, 18, 263, 60, -37, 341, 96, -89, -98, 203, -1, -151, 256, 175, -335, -334, 44, -180, -77, -114, -59, -310, -271, 153, 310, -11, -11, 152, -43, -171, 73, 229, -269, 83, -27, -131, -370, 72, 209, -67, -98, -42, -241, -249, 301, 208, 38, -87, 72, -64, -57, 229, 297, -15, -155, -103, 1, -170, -23, 54, 39, -299, -84, -144, -173, -135, 75, -4, -219, -236, 337, 50, -15, 345, 290, -135, 74, 194, -165, -250, -183, 324, 61, -293, -85, -59, 5, -117, 448, -43, -171, 56, 47, 46, 64, 338, -15]
3157a5j79M0M30l93L9J20j79j42j76M57P4j79J14J20j49j55L01J12k54J78J28
3178B92m28Q2J83J48k02j48J67p1m86K08L52j62P9J54k32j49R9L91k65J71k87
3199a04K33m58K52L95k22l20p7K76j06r0L32q0j47K1nJ79N8K23J35n58k9N4n0
3222h8j70K08J05p6k73J01P2n5K35K34k08j62ql4K20m8p7M9j21l8K93k26J04Q8
3246A25j27j33j5j04K95j81J47Q4m95K69L35k4K8j67O5r2l28K13M4K55l53K9O9
3269f1r0k9L22j73J34KOk02p8L73r4J0m3M7l38K48PJ87m48J33o1M6K9J22P8k40
3295a13J0L35k29o3K1K84l07J42j72K7j41J5L39L8m72J88J71j59J63L07j56k93
3317f5Q5J87l10L3O7J72k60j18J49l3QK44l00j72J39K42k20O6L96j50Q0m48K29
$$ y = [-15, -194, -154, 276, -117, -78, 42, -137, -279, -455, 2, 76, -103, 11, 131, -18, -173, 128, 240, -14, 164, 292, -136, -54, 129, 277, 75, -73, 94, 23, -463, -255, 97, -65, 14, 168, -64, -213, -114, 277, 12, 183, -104, 129, -329, -77, 318, 96, -224, -301, -25, -131, -221, 111, 31, -116, -95, -100, 79, 137, 360, 495, -63, -92, -38, -88, -258, -50, 55, -21, -294, -193, -121, -176, 59, 293, 85, -77, -85, -119, 101, 53, -24, 25, -96, -134, 159, -67, 37, 125, -2, -135, -150, -254, 41, -140, 7, 91, -404, -135, 200, 176, 204, 37, 102, 10, -318, -105, -61, 194, -159, -130, -61, -151, -180, 142, -31, 103, 105, 111, -91, -169, 204, 110, 120, 77, 124, -214, 34, 41, 228, -220, -87, -148, -102, -73, 49, 127, -113, -103, 232, 3, -60, -39, 245, -62, 80, -92, -65, -206, -191, 148, 186, -286, -98, 73, -86, 77, 384, 228, -65, 20, 207, -103, -70, -3, 169, -91, -209, -60, -93, -85, 159, -141, -313, -174, 68, -152, -86, 310, 160, 240, -208, 21]
3340B1J71J9q1k4j47k79N27k23j50Q3J73j46m4J69l9J07q0KK8j53K00l87M14L2
3364A93k04J99l02r5J48J43k12j3Kj44%J90J52K65m94J25J78l6J97j17K3m32J97
3387c7O9k93K11r8J07j10Q6k7KM0J4O2j36K72O5l84Q9M42m09q6M2J99j94P0J10
3412A06j57j09K2k18M66j73O9J63n5j10p8L48m55L56q3p2k8J7M0j84j24J93q1
3435a47J07j49k07L51o2K45j93R7J18j27K05j07l0J17k06j07J7J80j86J63k1l16
3457b58J47J85l0n2q8J58K08j51n6P5K09l90J16J9k42O5K56k48j31R7K9Kk57J81
3481a56K60N9k88K20k6j7o9o7N8KJ19j53P8O7j08L0j06K13J01k69J91q2M1k43
3505a45M2J34j56J49J18j3j88j25J6J91j9J12l59L53j06R6mk56J19j21K04k44
$$ y = [21, 192, 211, 130, 106, -41, -320, 207, -16, -166, -83, 90, -56, -100, 69, 30, 137, 57, 59, 87, -66, 134, -253, 161, 193, -11, 188, -114, -209, -61, 82, -130, -143, -141, -285, -285, -95, 57, 322, -172, -47, 131, 95, 292, 175, 198, -234, -37, 32, -261, -50, -148, -41, -151, -65, -92, -90, -50, -36, 26, -110, 162, 227, -157, -68, 374, -35, -121, -79, 120, -74, -4, 106, -51, -160, -138, -356, 110, -63, 6, 169, 114, 4, -74, 274, -181, 175, 92, 20, -8, 9, 49, -135, -259, -66, -147, -40, -189, -396, -45, -107, 138, -55, 42, 160, 33, 238, 131, 101, 218, 12, -95, -78, 102, -84, 79, 58, -258, -111, 74, 44, -8, -96, 62, 270, 119, 63, 138, 347, -43, 73, 92, -150, -85, 171, -77, -208, -111, -82, -80, -337, -156, 104, 163, -125, 95, 69, 52, -17, -84, -26, -24, 95, -58, 20, 87, -21, 9, -97, 116, 217, -52, 139, 57, 98, -145, -103, 31, -125, 24, 142, 129, -59, -184, -168, 23, 4, 116, -243, 110, 4, 100, 96, -160, -41, -162, 42, -202]
3527b02K19L9r6M4J54j69j02L11j25K8o3m0k8J73j30k2L11j83k54L05j84K50k64
3550b8J84k33j6q4N2Q8J7j12J71L1r5j42L02J19l22K0m7J28j41n2J72Rk61K91
3574E1j30l6k08L59K12m38LJ54P9M6N4J46l20jJ63k61J56j49q5Q6R3J6Q9K6j95
3599i0K5M7K5q2J99j08m2K21q4k08K00pj53qK10m6l38J99o1K09k74L31j94o5j11
3624b05P4N1J27Q5L5p4k46K61rj51J12k02J64jj82J62QLMj29Op7K34lJ9j94L14
3651A86j96j29L24M9l22O0P9J9k22O3P8k03J72j05J10P5J35j19m0j08P0M8j08
3674h4Q6o2K07k19j7L31n37M56n1J12n67K50p7K37j53j9J73l37K68K6j03J88k1
3697H7l1j92K1Q7q7J94k25J49N3q1QK7k5P9j13j6j05J25kl9n4J99o5%j20J38j39
$$ y = [-202, 17, 56, -40, 4, 158, -11, -113, 198, 73, 101, 38, -2, -30, 143, 13, -9, 302, 119, -135, 170, -14, 236, -28, 156, -77, -93, -177, -125, -37, -20, -132, 39, 70, -25, -167, 135, 254, -68, -48, -95, 33, -108, -160, 12, 21, -240, 51, -79, -115, -323, 36, 248, -190, -187, -33, 46, 92, 146, 292, -28, -29, 134, -127, 29, -120, -205, -119, -26, -10, 79, 105, -90, -65, -18, 7, -75, 124, 16, -26, 195, 111, -97, 103, 96, -57, -65, 145, 99, -239, -40, -101, 108, -166, 165, -29, -94, -205, -131, -80, 47, 132, 167, 93, -153, 108, 99, -52, 60, -142, 22, 21, -161, 1, 9, 12, 16, -113, -107, -184, 50, 47, 66, -128, 186, -10, -139, 185, 234, -88, -28, 51, 70, -152, -89, -11, -214, -42, -147, -37, 38, 173, 54, 14, -94, -24, 24, -84, 2, -60, 147, -72, -89, 242, -295, 161, 110, 222, -345, -95, -172, 65, -88, -107, 66, -271, -3, 23, -80, 108, 87, 56, -136, -115, -28, -115, 79, -146, 3, 56, -25, -17, 10, -15, 64, -49, -65, -170, -45, -47, -86, -140, 59, -6, -6, -126, 12, -127]
3724a27J69Q0k53K91l73J81r5K10J10k3j96j97K64J80r9j31J36k67L20j05N4j45
3746a6J05k41Q1j3J26J11j96J5O6K13l71LJ50L04n65K13J4J3J00j06Q8j64K8L1
3770a1Q7k5k07k5K95k05J99j77k87J92L09j93p8J60qN0j41L91m26r6J40Q8q0o4
3794a12j52K28P2J72l34O4J37m7k00J31J96j00j42R6q2N7k31M7L08k00P1N4J8
3817E1k20j55L0M03j64q2L10p7k01J86lJ23q9m18M41q8j88k9J70p9k8L2j57J16
3841a16K14k30L7R0L9l5j01J9K09k08J68O3j16j8j0k5j70J20k1M8j0j22J95k0
3865@JRo7Rr3K25L1J06l38L14q4l76K95J16j54j65k1K99Lj20r2J90l0L1P5k20
3891e6J42Kj9m10M03j10K37j94J11q4J01n8l8j17R3j6K36j57j60MJ27j25R8q0
$$ y = [-127, 42, 122, -131, 160, -213, -32, -127, 83, 193, 170, -26, -223, 41, 221, 122, -9, 127, -140, 180, 75, 129, -16, 89, -152, -71, -84, 42, 153, -43, -28, 38, 251, -120, -117, 33, 337, -228, -15, -1, 12, 112, 6, 94, -70, -42, -11, 76, 51, -156, -181, 114, -91, 108, -69, -356, -164, 145, -48, -126, 34, 26, 76, -65, 326, -100, -196, -56, 32, -48, -112, -264, -36, 36, 208, -126, -62, 75, 28, -172, -41, 155, 55, -87, 9, -73, -16, -247, -200, 108, -92, -21, 33, 51, -169, -324, -294, 109, -55, -137, 173, 96, -105, 81, 78, 201, 112, -306, 135, 47, -141, -170, 0, -79, -107, -75, -232, -116, 98, -132, -95, -5, 34, -1, -102, -83, 126, -82, 86, 149, 33, 15, 5, -20, -190, -70, -91, -43, -53, -175, 20, 0, 1, 10, -57, -48, -141, 84, 115, 221, -117, 197, 113, -263, 32, 148, -6, -171, -192, 107, 110, -10, -102, 88, 58, 89, 164, -56, 86, 88, 69, -341, 62, -48, 189, -5, 106, 22, 123, 65, 27, -90, 3, -13, 223, 66, -94, -90, 37, -88, 10, -70]
3915g0J22r6j16K17m5O6j41K0M7R8j68J3j74L00j19J5L56k36j52J11P7o1PJ9o9
3940B1j25l7m1M21M5n26R5oM06k97j1J80l1J74k28N3k8K34k44p1O8j20On4J24
3965HJ36k57J76Kn4k25L83k17K4J9n4L4J15o3J5j72K19M4j35k1m3J54k02J21J78
3990A85j79o7J89l09L12j10j58qK33j67p4L1pJ53Qm2K12k48J54o4J8j40J54l9
4014C7J29k71j26L97o7j28K9K2l8j47J92J39ol11J49j71L54j24j31j6K7r5J00
4037e6j19J38j43J76j91J15J81j58j70M26j95P4j00j19k4K09k95L10M2k62Q5J07
4059C1n7M8q3k0k4L8J21j1j82J18j04j9O5j28K48j08M2l8K7j51n8K94J03j34K4
4084D2K5ok30J92p5j21J26L6j29J63j08J37m4j10K4O0J2j93L17j87K2J7O9J65
$$ y = [-70, 52, -44, -160, 57, 12, 78, -63, -43, 4, 102, -66, -53, -227, 73, -46, -31, 325, 89, -63, 48, 125, 64, 71, 90, 21, -104, -141, -182, 239, 284, -242, -147, -153, 253, -44, -55, 125, 94, 268, 40, 93, 65, 299, 55, -16, 52, -68, -62, -116, 8, 144, -113, 63, 65, 11, -214, 169, -48, -24, -5, -59, -25, 90, 27, 42, -130, 89, 133, -2, -23, -66, 88, -114, 7, 185, 6, -61, 128, -181, 131, 21, -137, -145, 88, -79, -153, -122, -129, 24, 32, -10, 202, -46, 108, 44, 62, -78, 76, 37, 166, -105, -231, 166, 99, -29, 0, 22, -16, -163, 29, 168, 162, -149, 0, -171, 183, 59, -72, -88, -61, -156, -56, -175, -37, -180, -4, -195, -80, 101, -57, -227, 199, 4, 78, -22, -141, -165, 44, -251, 59, 101, -161, -76, 31, -26, 22, -61, -81, -105, -67, 54, 43, -139, -21, -125, -144, -79, -207, 41, -67, -25, -63, -36, -187, -245, 49, 152, 18, 42, 67, 61, -169, 23, -52, -173, -47, -11, -140, 23, -85, 52, 8, -102, -78, -18, -6, -199, 118, -69, -47, -30, 39, 204]
4108B04k28K59l49J85p2K5N1k0m3r5R8K3R2k8j1k2j53p2J31J52j60j28N0L07j20
4133G6j09J70k11Q5N3j49m3K24j15k0R1K11j84j24Q9k0l7J00J05k80J01j46K25
4156I2r4j43J17N9J33j90r1QK96j64L2N0n4m0Q8j59J80k44k2L16j54M7j64J96
4180I5r1P3j04r3J36o0r7n0Q7O9MN0j15J26n2O5j62K62j87j08J9j34J94O8K55
4205B50j64r7l7K08l9k24K25J16L3j82p6j52L53k69P2n5m8J79j08q1J68l1k47
4228b06K24k3K3j0k5J0L1N8%qq3q6J53k60O7K06r9J73m49J58n5L45l39K33j58
4253a20J03P0j25M1K56m65L38Q7k49J69j44p2K91k12r2kK61p5j08K5M5j58R5K9
4277a2l1J58n8j67L2J38P3k09K1K87k89K1oRQ9k70N2J87r6o7l0J96o2L1j23K99
$$ y = [204, -24, 235, -114, 71, -1, 24, 75, 55, 12, -83, 15, 38, 130, 102, 91, 69, -84, -156, -25, 127, -33, -161, -111, 196, 76, -33, 137, -74, 11, 64, -85, -128, 96, -19, -39, 52, 263, 79, -45, 44, 24, -13, 87, 192, -88, 13, -133, 92, -2, -145, -28, 31, 164, -26, -117, -109, 187, 23, 55, 105, 51, 11, 99, -60, 120, -124, -146, 170, 16, 63, -101, 95, 4, 77, -27, -120, 16, -44, -141, -191, -104, -35, -31, 19, -96, 30, -22, 43, -119, 143, -44, -152, -133, -267, -73, -5, 250, 86, -11, -48, 160, 121, -103, 122, 238, 271, 89, 13, -139, 214, -55, 17, -38, -86, 93, -15, -96, 72, 41, -206, 18, -5, 18, 8, -17, -7, 24, 82, 82, 74, -9, -95, 58, -202, -135, 71, -28, 145, -304, -146, -201, 144, -195, 38, -120, -17, 53, -72, -31, 225, -240, 98, 185, -64, 105, -39, -111, 180, -32, -124, -126, 135, 60, -48, -23, 22, -136, -41, -12, -43, 115, 57, -110, -78, 60, 133, -76, -55, 232, -57, -36, -42, -33, 56, -214, -162, 25, -71, -138, -168, 28, -34, -3, -126, 173]
4303A73j00j33L03j96j50K03m8q6n5m2l8K83p2o8j13K0J44m0Q7k00K35j43j72
4326b08K54k4J52j72J59L4j19j17P8o0L06k23Q2j89n4r0J28K54l0j62ML2Rl3L4
4351D5k60L28o4J0P0k00lJ86p1j66R6o2J57j03nj31J69o3j32J62P2j05Q7o9J79
4376A27m02J67K12j20LR6k95J52K26k00P3j28k9j31K03K41m13K00K4l74M57o2
4398B7j77K16l13J73K25j50K04r6k19r9K58j9j36K30k17j46m3M17O5k24Q1nK18
4421B70l50Q1R4P6j28m2R4Q2L6k17J30l17P3l3L04r0k2N7j5r1Q6j29Q1K10k06
4446C4j05n6J75J28K7l03P2Q2j35n2J14P0n9rP4j41L21j26k21J56M4j13J02l6
4470D3k2k5r7J36K79m01K31j64o1J40qj82J07Op3J87n9k78K64K3p3k0P1j61K50
$$ y = [173, 73, -60, 243, 47, -103, 100, 52, -34, -89, -131, -169, 114, 42, -26, -139, -119, 25, -15, 72, -128, 107, -36, -208, 46, 22, 174, 2, 161, 195, 76, -41, 37, -23, 283, 60, 142, -47, -101, -191, -63, 191, 161, -1, 3, 35, 44, 11, 45, -215, 113, 49, 59, 129, -71, -74, 112, 41, -125, -29, -91, 66, -37, -42, -173, -4, -67, -199, -37, 35, -70, 17, -52, 127, -275, -108, 104, -16, -13, 83, -212, -60, 166, -34, 39, -89, -118, -249, -46, 195, -218, -18, 6, -368, 89, 27, -150, 66, -247, -74, 151, 1, 205, 109, -110, -209, 49, 30, -106, 124, -93, -239, -282, 135, 200, -24, 57, 52, 270, -80, 1, 95, 171, 43, 1, 95, 177, 213, -4, 126, -191, -118, -151, 153, 63, 41, 98, 83, -8, 78, -51, 30, 240, 34, -71, -127, 48, 176, 203, -100, -28, 54, -81, -133, -19, 51, -8, -17, 57, -84, 237, 111, -110, 46, 90, -23, 79, 43, 21, -4, -101, 35, 314, -87, 144, -20, -81, 59, 51, -131, -24, -18, -91, 96, 37, -241, 23, 46, -27, -47, 24, -137, 113]
4495A13L6K8j60J3j02q9K78l37J12K9J94m6j17mj50J74N8J04o4j94K94k73K18
4518A15j97J67j53r9J28J08j02j0q5J58l7LM7P9o7m9q8lM8k42J94k2J31k92K90
4543B2j5L9J60l37K77j62m0N4j39K85j28N6P2l8j88J7J09J5J55m02P6KK19j60
4567e1R1j49J21J06m7N3k03J0L21m90J73N1j84j85K78L35j53R5j84j94J50R5J18
4590A57j5J8j48m6kJ49l21K57M3L2j93J06k2k22J80J07j23j15J47r8Lj4R4J81
4614A55j59o1Q0J61j41j57K05o5j43J92r9k1J61j70K64k07J85n3k00K5QL34j34
4637A60k21q3J02J48k63O2J19l4j10L94k01N9k27k1J43k0N6k0k67L09k15J1K6
4660i3R3j05O6L6J14kJ69n87L38k65L28P5k8q0k17R2q4J55J18l27K24l5j82L24
$$ y = [113, 149, 177, 17, 30, -72, -161, 117, -220, -108, -79, 115, 69, -48, -52, -202, -28, 30, 134, 70, -124, 170, -103, 115, -82, 85, -68, -167, -39, 69, -33, -43, -128, 30, -7, -4, 43, 122, 55, 6, -82, -85, -37, -279, -85, -107, 24, -268, 22, 7, 46, 206, -131, 146, -16, -56, -2, -141, 144, 16, 72, 144, 106, -82, -65, 44, 59, 214, -188, -112, -110, 109, -51, 40, -109, 12, 118, 71, 124, -79, -69, 252, -238, -65, -14, -198, -383, -105, 230, 77, 172, -12, -206, -56, 39, 157, 142, 160, 12, -34, -36, 113, -208, 49, 92, 124, -69, 37, 15, -207, -27, 80, -43, -158, -11, -109, -106, -120, -26, 155, -4, -65, 15, 176, 35, -122, 83, 18, -125, 67, -32, -53, 108, -62, 202, -5, 180, 127, -73, -48, -40, 294, 160, -61, -144, -42, 106, -157, -95, 24, -10, -120, 274, 73, 132, -95, -116, 27, 7, 63, 43, -224, 85, -130, -119, -93, 0, -105, -39, -3, 111, 109, 278, -309, 29, -236, 92, 167, 139, 59, -158, -66, -150, 5, 123, -204, 20, -15, -197, 127]
4684A27k55J89k3k44L32j03n3J15j46K02j44k3k27R7mq7J45J3k5K16K2k36P5M9
4708A2kL2k29J10L50l18k16L83k57K37m5k8j37M9J33k11R3K2p7O9o5J76o2j32
4732a13L23k14J58n4J05k87J49o1Q5j1m2jj87P7N5Q5j67J58j7j82J34PK76m5l16
4757h5J00p4j16J27j11K17k39L12j91J8K3K00k41K61k39O2k7J3J55K6j19k5k72
4780b25J22L17l12k9O3k3k3M1JK81k24j73K60Kj52K28k21j32K92l9k4J8R3l25
4804a84J90pN8Oq0J47k25L21j28k74k0k9L53k33N7K74k11J1m8R1k5l1j69N1n4
4829a59K16o2K7O0J79k36j60J52n6J90J6k22k01J9Q9J94j28O9P0J61j13k25K05
4852H5m5mJ13j66oq6PL23l11J21J07k09q5L01n6j52J29j37j11J46M8Nm8P9j16
$$ y = [127, -128, 61, 38, -206, 126, 23, -30, 85, -61, 141, -3, -26, -253, -156, -160, -247, -102, -89, -114, 102, 124, -112, -37, 12, 10, 42, -187, -77, 273, -45, -261, 122, -135, 102, 57, 29, -108, -59, 74, -137, -44, -22, -99, -30, -95, 81, 19, -113, 210, -4, 154, 100, 205, -82, 67, 6, 91, 80, 38, 37, -150, -73, -18, 67, -100, 58, 41, -141, -7, 0, 276, 231, -85, 15, -59, -175, -48, -159, 58, -181, 131, -60, -42, -19, 181, -60, 201, -38, 24, -3, 10, 165, 191, 72, 47, -225, -103, 214, -98, -127, -64, -87, -110, -69, -68, 213, -11, -184, 76, 78, -74, 154, -67, -199, 93, 54, 30, 48, 141, -184, 6, -1, 57, 63, -17, 130, -95, 226, 98, -176, -196, -225, 128, -105, -48, 226, 15, 26, -22, 69, 44, 13, -156, -105, -159, 57, -5, 22, 82, 261, 25, -135, 17, -39, 151, 167, -55, -256, -237, -148, 46, -82, -13, 57, 218, 105, -120, 85, 40, 36, 149, -17, -23, -109, -102, 221, -90, 31, 138, -71, -156, 145, 89, -63, 66, -71, -182, -36, 12, 17, -31, 48, -68]
4877f8J57r0J65M4k70R5r2K21j03o7J01Ml1j15P7r2p5K40k01L21j10j95J34J37
4901A87q6j03n2k1j50K67j47K2J76k51OJ29p2Q1J75j80Q6%k08j13J93j11J2J23
4925c7j30Q5q2J81j00J25N6pp6J7m4j01L7L3j7J04J36j62N2L3j34J36j75k72K83
4950e9J24J57k20Q7k09K64J31j79K0l4j27J23m3n4K49l28J17l20N32l78J67k2
4972bj30J16M3m6J72j40P2P6m0k85L26j48q9K54K0j48j43J17jR2l70L25r7M1K0
4997C5QJ6R9J44k68n3J52r4lm5N4j04jj22R5J02j43J6R0M9j78M9J79J76k15l3
5023Ej28J55J10j74l3O3j35P6OJ3K0jr0L1K31j55k17QL41j42J06J71j07k56J33
5048C1j39M01p2l80R0K66j61no7o5k6L3J89r8R7p5O9R7k20J36J37j43o8J6m3p6
$$ y = [-68, 89, -1, 164, 208, -62, 33, -59, 162, 59, -8, 93, 97, 66, -49, 28, -64, -139, 101, -100, 221, 111, -84, 50, 187, 101, -2, -54, -75, -225, 42, -105, -83, 93, -158, -152, -23, -95, -14, 161, -19, 67, 67, -141, -254, -61, -172, -160, -37, -167, -82, -164, 17, -83, 42, 98, 91, 15, 32, -12, -113, -76, -43, -60, 44, 180, 18, 70, 103, -31, 105, -70, -342, -59, 65, 222, 2, 89, -120, 144, 275, 96, 116, 82, -45, 78, 35, -19, 230, -98, 19, -301, 231, -147, 20, -2, -132, -16, 27, -19, 153, 13, 85, 161, 121, -164, 162, 14, -75, 179, 199, 51, -92, 25, 24, 116, -254, 71, -26, 15, 35, 43, 59, 158, 302, 34, -19, 133, 39, 36, -9, 45, -59, -60, -182, -87, 15, -128, -112, -22, 27, -151, -102, 77, 253, 38, 5, -123, 32, 142, -32, -65, -2, -137, -61, -55, -42, -22, -23, -113, -82, 149, -6, -223, -215, 126, -16, 90, 261, 154, -102, 31, -108, 293, 221, -159, -69, 197, 36, 31, -36, -101, -127, -94, 95, -3, 94, 19, 88, 185, -35, 101, 238, 95, 27, 43, 0, -76]
5074g6m6J54k03J8R4q9q7J56L08j91K70l70K31j82j57M29k59p4K17j15k53J65
5096f0j18J99j13j27K20j25Q7J25K3q1J12j45R7J07j44N6j07j28J8O9P1N3l44
5119b55J12n6Q7M6qJ58l3j3j5Mj92L59k65K44j53M9k61J66J02M4o7j17R6r7n1
5144a16M7J60k02K69j58J90l8j28JM3ML0k22J36J1jl8m5K1l8rJ58J82r1k72K20
5170A14q4J7M5j56kP4l7J2o4J5j7K13k76P9L9o0J09L5OM6j60O0J82j96l07M51
5196A38rk49N7M5J48j96J54K5k24L6NJ05J76j1k0k09R0J07j10J17j48L7l07N8
5220a85l7K39L2q2Q8J35l13O3J58R8j70l4J5q6J92j34J42j27k13N3K09k54R7K82
5244A68k35pN8j3J36J09j09Q1j13k6j02J23l30M07o3l04J74p1K31k89J95j34L3
$$ y = [-76, -122, 32, -171, -153, -59, -148, -235, -79, 229, 38, 308, -62, 169, -13, -170, 259, 0, -74, 143, 28, -225, -60, -178, 21, -92, -219, 1, -124, -37, 88, 111, 30, 142, -3, 94, 201, 57, 113, 6, -122, -104, -35, 36, 89, -255, -143, -199, -112, -66, -74, 84, 51, 38, 23, 27, -165, 194, -71, 173, 20, 69, -192, -26, 76, 120, 53, -64, 32, -65, -116, -69, 91, -111, 158, 0, 190, 152, 24, 25, 68, 72, 102, -120, 16, 27, 26, -12, -57, -36, -74, -83, 75, 257, 166, -106, 114, 30, 47, 92, -64, -66, 8, -29, -17, -81, -66, -83, 130, -146, -67, -28, -88, 21, 56, 62, 108, -52, 8, 190, -6, -313, 138, 129, -120, -63, -18, 130, -66, 88, 113, -111, -75, -70, 35, 211, 200, 180, -29, 61, 168, 58, 175, 27, 64, -243, -185, -222, 17, 49, -33, 55, 190, -123, -60, 98, 196, 26, -8, 7, -79, 113, -21, 121, -6, -219, -166, 43, -211, -114, 168, -67, -74, -16, -29, 107, 216, 107, 188, 75, 49, -53, 70, -260, 147, 84, -220, -46, -117, 114, -175, 20, -114, -81]
5267h1J5J79j8J47j04k5K3j08Ol5J3M0m9j41K9P2j44J61J16j53J34M0K0j64K07
5292A80L0k17J24K2j16J6k6j37J72Q7l84K66k5k9K0o6O0j50J37J58J90j42qK68
5316D30m21Q9j34K61j30k1j85j1j36M4L93k49J69j83J40j18L13j15j70K98m13
5337a49R3J51K9r0k37P2K7O1j09J13j61N5J51l5L5J37j24J25k81K60p7K5J18m0
5361A49r1k62K16j00j54K5M6J20P5r8o6J02K28j22l7jJ45j30K12m26M77l00P6
5384H4l30JQ5M1J93j42o9J08m8kO4J12n7J83R0m53K66j23j17J21m4P7j01p1J17
5409a5l9K09j78j21J21j54L56O4k21q7M6J35j02J06j24J20k85J57k3p3J9K64l31
5432a56Q8n0J13K45k21J81m9m1j42r2L09l10N2Q9q7k7k66O56k52o9K6J96j51k09
$$ y = [-81, -66, 113, 95, 242, 138, 113, 136, 28, 34, -1, 12, 52, 3, -138, -109, -37, -181, -20, 96, -57, 77, 117, 137, -27, 180, 210, -7, 117, 139, 23, 39, 13, -124, 48, 135, -249, 17, -8, -37, -17, -83, -23, -173, -36, 122, 312, 170, 162, 430, 9, 98, -36, 225, 95, 74, -111, -122, -258, -214, 179, -70, 99, -84, 56, -62, 251, 136, -34, 264, -149, -56, 95, 124, 34, -203, -131, -104, -43, -152, -39, -200, -145, 6, -29, 6, 143, 19, 144, -137, 123, 46, 71, 189, 149, 58, -204, 12, -88, -242, -217, -171, -51, 24, -74, -140, -38, 190, 68, 31, 30, 175, 45, 257, -169, 308, 8, 84, -246, -245, -160, -119, 74, -68, -137, -29, -77, -79, -15, 97, 40, 223, 313, -140, 126, 3, -114, 7, -37, 40, -61, -132, -15, -54, 155, -23, -144, -23, -177, 179, 243, 22, -65, -19, 116, 14, 120, -4, 116, -169, -12, -35, -108, -89, 175, -156, -68, -118, -5, 240, 19, 200, 151, 110, -32, -124, 185, -125, -73, 16, -71, -98, -364, 292, 40, -29, -3, 193, 42, -167]
5456a67L32k03L8J42Q6k0j17k44J79o3j57L87j44k83K25Jl7Q6n4k7K3J79j83J16
5480I5K7n7P1l27J33KJ6P3J12j31m45M42q7j22K45N7l60K42Q7L0L5L5nj28k02
5505a62L29r9Qj13r3J09j09J54j08r7L41l06L9O2J86J9J1r9m1J48j32M1m6n1k7
5530c6j0R2j42J07K6p9K17k72K61k47K8J52J26m5l46J00JJ42j75O4P7p1P2Mj52
5555a06K43r3J49l19J87q2K1L64k72L6j5j76n4Q0j28K48j53p7k04L63P3l06K27
5578Fo2n1J30j38L47R2k88N4O1j80m6j14J37L7L2l02J0Q1O5J20qk03M04k32L5
5603a3j5Q7J06j17m3P7L4r5l3J08o5k01O6J87k07R9K24j99m8J54n0j92K04K45
5627C13k73q4M1J6J5k62R1J44l43L21l62L6K13o9Q9R8j97J10J10j0K12J07l00
$$ y = [-167, 165, -38, 0, 142, 228, 208, 91, -153, 26, -37, -194, 193, 49, -234, -9, -8, -45, 41, -13, -40, -17, 162, -21, 95, 122, 65, 136, -191, -58, -56, -40, 33, 145, 14, -431, 11, -76, -198, 47, 104, -256, -14, 73, 103, 138, 173, 168, 40, -162, 167, 68, 76, -37, -130, -21, -130, 24, -84, -181, 160, -146, -107, -45, 141, 160, 171, 72, 31, 179, 47, 88, 42, -9, -36, -46, 46, -96, 11, 37, -42, 175, -97, 164, -83, -55, 97, 223, 178, -168, -68, -67, 75, -100, -36, 41, -30, 42, 46, -106, 137, 44, 193, -126, 61, -21, 0, 364, 92, 128, 113, -63, -117, -37, -165, 83, -70, -147, -351, 12, 85, -221, 6, -56, -107, 23, -115, 232, 324, 36, 90, 151, -29, -75, -189, -52, -15, 17, -285, -275, -194, -129, -9, -17, -220, 184, -48, -13, -28, 59, 165, 48, 5, 82, 116, 21, -12, 96, 31, -170, -104, 83, -124, -25, 199, 0, -48, 106, 56, -136, 68, 313, 40, -44, -3, 13, 28, -234, -143, 1, -342, -21, -383, -347, -134, -203, -114, -16, -213, -103, 7, -3, 209, 316, 16]
5650A6k1J15j40R4j62K09k25k9K40r8M4k55M77k74oL0Q8L07n63L26k07J13q8J13
5674A04l6m1o0q6m6LP4J54j54J82r7p6J43j6j93J08J69j16j8J01J76m2k88M1j87
5699b01Q9K17Nj00n0M3j12K50p6Lk01J74j63o7L63j44m3m7o7M5j16K10R4j91N1
5724c4J10k5k65K23NKK32p4J18m23K38M3n8l5k58P0k0J25o6J24K66m10J24k68
5748b56K91l2j17K16j79K40O2k40N1m2L6r9j26R4j01J83j26P4K29l04Q2M7J37
5771A20j30J35P6r9m00K79q5J58K9j46Q4l23M78l72K81q0j09J44J8m8j08J48M7
5794I7J14k35P2l6q6J12p3Q4j62J29O6k7n4J18On4n3R7j14K33k35J44j51J20m9
5819F3j44J04q6J24j00Q9n9J41j36l8j14M6lM3j65L10L4k4k65K04J51j93J44k05
$$ y = [16, -5, 110, -30, 64, -98, 111, -114, -143, 97, -1, 43, -212, 265, -9, -15, 15, 103, 410, -153, 173, -34, 79, -9, 104, 68, 27, -33, -119, -165, -162, -88, 66, -88, 94, -3, -79, 64, 48, -145, -37, 132, 16, -2, 99, 275, 233, -55, -14, -201, -112, 105, 110, 10, -40, 3, -109, 141, 65, 68, -133, 41, -122, -189, 174, 30, -13, -60, -127, -82, -198, 12, 106, -85, -34, 76, 51, -214, 9, 14, 16, 248, 174, 292, -131, 107, 150, 92, 57, -201, -131, -151, -26, -92, 32, 298, -112, 12, -256, 35, 3, -114, 102, -77, 163, 225, -15, 36, -6, 30, -69, -195, -101, -202, -19, -145, -71, 158, -146, -64, -17, 120, -10, 125, 201, 102, -298, -19, -104, 54, 83, -63, 21, -302, 176, -196, 85, 5, -104, 40, 58, 10, -98, 50, 97, 211, -24, 48, 12, -74, 38, -35, 49, -113, 16, 82, 55, 1, 119, 125, 71, 18, 115, 1, 234, -1, 143, -8, 112, 63, -81, 23, -63, 61, -39, 50, -9, 132, -4, -42, -156, -110, -113, -70, -235, 75, 109, 85, -180, 24, 175, -18, 126, -79]
5843g9j03J67J26L3k05q0K26k45J56o6rJ88J27j54Pp3r4P2R2r5J79j96j10N0K67
5868A81q6m8j3J3j55J64j33J67O3n5m9k9Qn9N4P3k9o8Qj69Q6M9K8k03J70j75K09
5895Bj43J06M4q5L3R9k3Jj0p0k0r5o4K47l7P8M9k50j2K72K37m47K89k41m0K6K20
5922A66j75J55j81m8oJ00j43r1M9M9K70k1kO2M8o8k3j30R7j00r6M0P2n0P0r1P6
5949B9k64q2K09p1j11L77j09k7J5J05J20r1K2n3J52k43k9n7P6O9M7k12J26j18
5973a20N7J87l37R9K33j21J45N2q6k49J77M1j69J08J58j75k06J10J38N3O2N3l84
5996a74O8q6J34J59J9o3q1J62r8k00L95k90kJ45o4k40L34j14j15m0K84n9k00J87
6020F1l8J2J46k59J55K2j58Q5o6L4P7m9k26K53j68L54j37J84k59j0o2q8L2Q0k1
$$ y = [-79, -182, -15, 111, 144, -61, -141, 85, -160, -4, -70, -79, 109, 236, 82, 89, 16, -78, -6, 86, -9, 170, -26, -136, -86, 181, 95, 47, 34, 47, -108, 56, -77, 90, 153, 98, 49, 20, 28, -31, 23, 96, 67, -1, 7, -162, -76, -27, 1, -202, -32, -207, 2, -141, -35, 9, -76, -43, 56, 33, 34, 24, -46, -66, -161, -225, 22, -15, 63, 112, -138, -150, 122, 359, -88, 201, -40, -80, -54, 166, -9, 146, -35, -83, -89, 11, -132, -223, -174, -125, 145, 124, 122, 184, 232, 164, 141, 11, 108, 8, -88, -48, 24, -26, 44, -47, 29, -235, -317, -108, -179, -290, 87, -22, -49, -34, 71, 191, 100, 122, 69, 221, -22, -51, -108, -32, 37, 84, -128, -2, -120, -63, 124, -213, -114, 119, -2, 143, 195, 109, -140, 37, 78, -91, 17, 175, 0, -206, -96, 42, 95, 157, 210, -174, -106, -192, -58, 101, 120, 57, -24, 138, 40, -160, 235, -55, -57, 88, 24, -216, 118, 4, -111, -151, 133, 74, -126, 61, 23, 35, 181, -78, 77, 99, -59, 26, -40, -6, 71, 22, -204, 49, -119, 235, 98, 282, 23, 13, -49, -137, -105, -25, -46]
6045d6Q1L7L4j45R2l5o3J3J56j7q7j21O8P9Nj83J70jJ64p2j09q5k1L03k10l2J6
6072iP9k00K97l14J95k16J16J03Q6J6j03l01J79K20k59K09o8J59k4j98P7j36J43
6095E1L8j37O7j20n2J58k42J87j25J22R1M6l2k25L34j95QJ83j47k2Q5Jl4P9l15
6120a96J20PK2J04j27J77j6j44P8J6j04P3n5J57O5k17l5Q6J39L2k30J68n4j65
6144i9R1l1Lr7J18n4k7O4j3n5L3J01k21K00M5K75k95m3J3r0J69l28M4L39J99k25
6170A16r3q2l4J01J06O3j37j14J92k30R8j24j94K23K07p9n7Kj5J1L1J26n1L0k74
6195a78J58Q5p3l2j00P0J10Q3j05J20n8n3j2J46l27J06Q3j19P5M8p7Q6r1K0l1
6220f6L8K12j5k19J68j09m3O8j16J44l5O9j00o8NJ06N6Q9k16l7L80k52n6l6R8
$$ y = [-46, 35, 72, 106, -39, 53, 18, -45, -32, 124, 107, 20, -101, -33, 46, 51, -132, 38, 37, 201, 129, 20, -65, -86, 217, 7, -25, -9, 70, -130, 167, -147, 48, -168, -52, 51, 137, 153, 50, -251, -72, 148, -111, 98, 30, 189, 165, -33, 44, -92, 51, 89, -48, 19, -101, -153, 5, -237, -50, -175, -53, 38, 84, 52, -173, 161, -34, -26, 157, 10, -12, 73, 74, 40, 119, -196, -76, -69, -47, 57, -70, 107, 91, -53, 25, 41, -63, 10, -45, 112, 177, -40, -75, 11, 150, 182, -48, 120, 66, -99, -8, -39, -36, -133, -15, -69, -96, -32, -45, -100, -67, 34, -187, 13, 58, 333, 38, -5, 8, -82, 87, -241, -197, 142, 341, 116, 23, -59, -93, 8, 114, 177, 40, -74, 118, -112, -14, -138, -332, -109, 98, 19, -38, -36, -51, -40, -9, 117, 66, 96, -178, -20, 65, -8, -40, -140, -70, 40, 123, 18, 138, 80, 27, 15, 161, -166, -60, 23, -96, -21, 27, -50, 36, -55, -35, -66, -28, 184, 169, -50, 118, 9, -34, 34, -82, 62, 27, 96, -4, -72, -67, 39, 95, 184, -32, -69, 311, 59, 3, -33, 65]
6245F5J4p7J81k54K08K6j62j4jP9L4q4P2j54P0R0j27O3n1j0p8J98n5J88r0j29
6271BJ08j95J11k49K48j21j02R2J21N4K43m15O6J43k88M8O8J17j16n2J64r2K32
6294A87m6R4j95r8P4j14K55J27k30j20L2K5J46j76l7j21J99n9J5j04P8M7m2K5
6318c8N1p9J83q4k24J75J02n3nn4k9j2Q8j34K03l06J22J63m4n1J4po2K09q3J2
6344E7L8m9j28K56j52j3q4q6R4K11j14j42J27q7p2J19Nm3k6N7j41O9J52J4k6%
6370C6n0k3J13n5j21J17K17o8k78N0L4j06J3J79m2l4R0K00j97k62J57j01O2k6
6394i5P1J63k7j90J06p7n7M5N0j77J61O2L0j16l46N61j55K5j14k9J34j75K16j13
6418d7j05L14j83L4o4n4O8N0R4r2O6j06K11k50L13m2O9j88q1p1J13q8J54k51J94
$$ y = [65, 79, 2, 183, -71, 137, 163, 1, -13, -14, 65, 99, 15, 87, -67, 3, 93, -34, 29, -22, -32, -110, 88, 33, 221, 131, 2, 110, -85, 26, -223, 25, -96, -198, -106, 15, 69, 312, -103, -37, 106, -182, -134, -66, 51, -65, -117, 47, -45, 187, 141, 235, 40, -58, 16, -98, 157, 284, 54, -66, -34, -9, 137, -39, -76, -197, 2, -57, -42, -146, -68, -21, -63, -38, 13, -66, 117, 33, -191, -16, 86, 33, 28, -26, -55, -67, 21, -113, 90, -216, -94, 69, 25, -26, -12, -19, -81, 128, 45, 57, 95, 46, -82, 174, 22, 9, -75, -161, -67, 144, 30, -112, 15, -72, -144, -25, -20, -63, -89, -32, -173, -104, 48, 62, 36, 36, -14, -37, 76, 21, -100, 17, 234, 166, -112, -62, -28, -134, -121, 58, 16, -18, 72, 272, 75, -187, -30, -131, -69, -95, -24, 139, 112, -78, 28, -49, -106, -61, -11, -188, -27, 35, 65, -51, -397, 164, 9, 34, -80, -109, 25, -150, 66, -47, -152, 162, -21, 13, -51, -105, -37, 13, 107, 15, 81, -25, 186, -64, 249, 207, 276, 88, 7, -64, 49, -39, 115, -136, 58]
6443E8j51J72j00o8R0J66N9l23K39L2j65j8L3q9k5J57k02K66j21k06J56J92k78
6466a26J86m4J1Q6k93J14K58j96J75k74N2K03k13j4m1K35j52J52k28j11J96M3
6488A9j00J39Q9l46K44p5O3M3p3Lm4K17k97K24o4j03K72j41K1Pm03J66J28j5o9
6513i5J93p0k56L58m4m6m4q6O1J39p5j76L1K22l09j27K30M4P3M6j64J09q2L8l4
6538f4M0K9lL3K6J40k07k42M29m0q1j58J53K27p0k28j6J02Q7j74q4j14K60J87
6562B32l76Q3NJ03J08o7j96Q8n1J74j74Pj32J74JL0k1k28K81r7K94k11j9Q6J24
6587B18k28j34J01k1q7J8K92j77l8K30l59L17m4k48J54Kj68L32l1O0m57K72j7
6610a3n7K59k69J09j09N1J11k99J96J10j80O2J35N2j29K3o3n3J70qj89J38j58
$$ y = [58, -93, 79, -21, -89, 1, 167, 226, -97, 142, 174, 9, -9, 24, -65, -90, 67, -135, 131, 10, -196, -40, 152, -126, 60, 16, 27, 113, -180, -66, 192, -4, 171, -103, -51, 152, -61, -75, -116, 119, -33, 119, -109, -220, -24, 19, -81, 58, 147, -199, 45, -30, 33, 76, 3, 6, -38, 179, -118, 106, 42, -61, 211, 70, 91, 98, -305, -139, -11, -26, -95, 98, 28, -228, 130, 86, 40, -4, -90, -29, 110, 35, -141, -110, 112, -197, -324, -94, -50, 23, 69, -95, 14, -68, -30, -64, -24, 5, 2, 35, 61, 201, -6, -248, 181, 141, 60, -98, 55, 282, 212, -16, -32, 70, 157, -17, -101, -215, 45, 232, -144, -61, -56, 47, 155, 88, -108, -20, -71, 103, -71, -64, -196, -22, -21, 9, -12, -240, 41, -56, 238, 27, 8, 94, 218, -10, -144, -43, -64, -151, -133, 159, -18, -56, 174, -185, 132, 88, -160, -6, -4, -172, 160, 129, 189, -268, 4, -13, -70, 189, -80, 29, -80, -29, 82, -217, -21, 89, -91, -29, 106, 158, 29, 52, -11, -64, 106, 98, -91, 47, -111]
6633a11Q3o4J00J43j27Np0k88M25Lj52pj73M16l78J79l2j10J66J36k62J98q7j32
6657a39K24j12j72L11n5j31o6J14M0N9r9O1j72J14K52j98L8K9q2j16j5PmK0J18
6682B6L2qn2J24J2Nj23J05j73Q3k7j00N8J5o0J51o0n9K71l68K42k65q5K94Pl3
6708A2M4j16jPR2J03j39n1J80k13L5J43p4o9j02n0J59J66Q8p7k55M4O2j6mJ74
6734A42k45L0j49J10J01o8j11o9L84j59K09l73Q9K22nj5p1n8J56k94J22J3j0M7
6758bk84K67N7J1K0O2K4j06j14J52j32j69K04j1j25J60N8j03p2O2Q1M1k68J66
6782b1JJ98j73j59K06K0M3j71K8P7N6o1j28J81j10l0O2p6J58j71J38m7O3K3J17
6807B24j66j48J47m1j12Q9K17j27m7j75J56j42n0P5NJ18k22K79N2j01l03N12k83
$$ y = [-111, -28, -92, 8, 151, 24, 29, -41, -329, 96, 99, -53, -60, -233, 183, -195, -16, -48, -158, 8, 144, -118, 80, -7, -139, 85, -27, -199, 112, 57, -74, -140, -26, 14, 73, -26, 35, -137, -23, 229, 31, 69, 98, 16, -100, -115, -108, -112, -92, 26, 58, 50, -2, 122, 134, 139, 16, 121, -52, 31, 4, -96, -38, -23, -83, 68, 8, -51, 220, -148, 94, -171, -256, 38, 45, 12, 56, -60, -61, -54, 38, 141, 2, -49, 131, -82, -47, 96, 22, -47, -149, -199, -40, 126, 214, 137, -118, -74, -12, -28, -32, 142, -103, -73, -222, -112, -11, -79, -190, -259, 125, -34, 175, -198, -109, 113, 108, 93, 22, -36, 120, -174, -52, -39, -49, -2, -286, -19, 38, 49, 69, 131, 155, 49, -65, 87, -45, -214, -10, -21, -146, 14, 72, -31, -103, -41, 40, 81, -187, -21, -20, 178, 5, -154, 52, 72, 115, -56, -28, 49, 105, 44, -84, 97, -13, -43, 19, -57, 101, -70, 68, 21, 84, 107, 224, 58, -90, 57, 16, -96, -7, 210, 83, 36, -139, 17, -125, -175, -100, -95, 23, -199, 80, 132, 31, -272, 240, -43]
6830d3N4j58M9Nj3J30j79P5J01m6N9n9K97k36k06J65j47K19l30J59O7j3M0J39
6854A29j44J57k17K79k13j78K17j44P4K85k43Q9J17m17L12j71J6J08j63K01j33
6875c9j6LJ29P0j55J57k12K18j55k48K60m7M8l4k41K17P0K15l31O8J01k8m7J12
6899A15k88J04K13o0Pq0M8Q1o0r9o9o2lO6J85r7P8j29R3Rj26J62R6j83Q3m8J59
6926A95l06o3M05j28j52NQ2j2k6j30J12j60Q6m5M16l48o8K13n5O9l45J77J69J3
6950A04l72J77K41J1k07K41l53K43j77Q9rj69l0K0K91j44M2r1K3J96j17J04j93
6973h0K6P9l7R9Q7J50l70J43o6j19L9L3j54Q7J88j40K0J75j83K26k29J66l03R5
6997f8J46j09r4J24jK90k40O0N7k50L8J95k29M1Q9m1P2L1j22N0k11J50J04P1j21
$$ y = [-43, 11, -147, -98, -93, -106, 24, -155, -80, 21, -25, 34, -25, 272, 36, -170, -5, -152, 67, -263, -104, -37, -50, -10, 129, -15, 142, -75, 204, -9, -187, 30, -114, -40, 245, 2, 91, 208, -209, 103, -68, -52, 56, -107, 94, -39, -55, -52, 77, 147, -8, 149, -63, 155, 0, -248, 12, -35, 13, -21, -262, -45, 25, 240, -91, -23, 78, 50, 3, 115, -173, -69, 144, 84, 91, 11, 59, 140, 80, -19, -88, -150, -153, -87, 98, 1, 79, -50, 43, 52, -74, 88, 184, 1, 84, 36, 195, -111, -174, 231, 103, -49, -44, 38, 26, 0, -130, -18, -178, -92, -137, 279, -69, -137, 76, 21, 90, -255, -78, 91, 104, -268, -91, 150, 161, -46, 195, -158, 85, -92, -3, -12, -181, -211, -191, 100, -44, -2, -93, -70, 126, 9, 113, -80, -54, 25, -12, 87, 174, 324, -46, 97, 31, -88, -49, -16, -170, -83, 105, -35, -15, 160, -23, 203, -26, 140, -163, -68, 78, -31, -125, -1, -2, 288, 48, 108, 165, -85, -47, 148, -81, -40, 49, 8, 80, 111, -11, 39, -172, -22, 82, 153, 32]
7022C2n3J32L9nl4k57J63J1k04J62n6P1nk9K5J76j77j01J17PN4o7l7J9k35K09
7048d3r7J25K3Mk1m2J4r9M3j04J16K18PLk25J10P8k81K2J5K17l6K78l97J10k13
7074a75p4K78k3k9L3n6o5K73j61k2J76O7j96r2K15j04m4j4j54K47r6R9j97O1J00
7099D7p6l9K11r2j77L63k15J12k8mr2j03n3M5L03l96L34k06K18o1j76m5K03j17
7123d4J8Q3L7o5M0Q2k53m0K76l13m1J17ll7r5M5J96m7j8J81j34p1K8JR9o6L49
7150C25k77k14L1O5%K23k32K31k63r9M19l90K70J41j70k21K66q8J74j16L6k48
7172a37J17K20k93J24oK5j03p0J50J5k4q5K64J09k26l73L74J31j33K3k07Q3J78
7195A56l4j33o9n4K13r5N3j86N3J16J54l31L52k20m7m5J92j28K49k10J06k90L76
$$ y = [32, -21, 111, 150, 145, 111, -146, 17, 28, -176, -14, -70, 1, -4, -33, -8, 168, -9, -110, 7, 14, 68, 1, -36, -17, -252, -43, -140, -15, 8, 12, -9, -51, -37, -136, -93, -197, -81, 137, 144, 147, -78, 32, 110, -171, -149, -134, 83, 47, 325, -72, 38, -175, -249, 29, 6, -23, 10, -46, -111, 162, 1, -21, 155, 222, 26, -66, 149, 45, 1, -13, -167, 80, -16, 83, -114, -53, 47, -29, -68, 143, 51, -126, 237, 22, 134, 106, 102, 10, -93, -146, -101, 202, -194, 140, -66, 152, 91, -85, -130, 73, -44, -26, 57, 94, 29, 69, 151, -102, -142, 134, -179, -220, -103, -106, -143, -238, -193, 3, -44, -62, 119, -15, -86, -58, -57, 42, -24, 325, 48, -166, -135, -70, -70, 153, -79, 152, -111, -210, 209, -181, 89, 230, 60, -161, 105, 17, 191, 75, 111, -137, -20, 200, -93, 31, 25, 50, -53, -123, 27, 42, 18, -67, 197, 306, 80, -293, 81, 212, 79, 102, -105, -22, 156, 122, -11, -80, -134, 79, -16, 37, -149, -96, 20, 174, -157, 195, -25, -72, -117, 75, -53, 196, -14, 92, -198, 178]
7218A78k08l3N1p6m8L31j50j28K15J93k36j78K63o6O5k67N8l5O4j2K25r6j23n5
7242f8l9Q8p9L1j6K6K20j45J0q1J26mk63J74qQl7M7j28L09j46K4M2j14P2M2k9
7269F2QK3m0q9K62j68j63J90k23J19k56J75J69K4J86m10n7L0L20k18n6n6M3l9
7293a64J98o5j32R7J00j29M7p4o0K24j42L54k41l5J24p4j75n8K23K05k78o9P5
7316d9Ol1N4j2j19P1J50l09L95l6j41k26K45Lj67J25J59l35P8O2J62j91j26J19
7340a13O6q7J17K31k31P5o4R4j07O2j16J18j42K02qk9p3j22k18K09K68j01M6j34
7364e7J63J08l80J30J0j23L04q2O3j40j55J53K9o2Q1J3k30J13k30L24j14l3J39
7387B4j99J89j13J79O3k25K3l0J08J5L6j43L0J79L4j14o1J3l8N4J6k76L10l08
$$ y = [178, -30, -63, -12, -88, -136, 195, 45, -83, 132, 325, 89, -89, 174, 108, 173, -94, -36, -71, -7, -19, 206, 110, -13, -68, -107, -19, -98, -67, -83, -57, 163, 18, 28, -53, 73, 69, -194, -20, -28, -20, -57, -10, -138, 171, 25, 49, 91, -23, 49, 91, 62, 70, 93, 53, -36, 226, 58, -105, 85, -138, -19, -275, -100, 69, 93, 279, -131, -188, -158, 162, -56, -112, -168, -125, -164, 34, -31, -163, -66, 34, -95, -48, -122, -182, 42, -100, 254, 13, -22, 102, 28, -147, -205, 18, 223, -55, -124, -49, -43, -74, -20, -32, -151, -80, 70, -239, 156, 120, -21, -247, -2, 1, -166, -41, 118, -217, -139, -77, 85, -106, -232, -113, -47, -134, -17, 214, -17, 58, -6, 88, -19, 43, -73, 45, -97, 105, 97, 68, -5, -127, -345, -136, 132, 31, 77, -57, 106, 214, -166, -36, -26, -149, 155, 73, 136, -4, -159, -6, 23, -39, 42, 55, -175, -62, -292, 32, -82, -115, 24, -175, 14, -99, 80, 143, -82, -59, -89, 19, 34, 70, -73, -43, 136, 170, 56, -5, 8, -30, 24, 40, -236, 74, -234]
7411b34P1J85J10r1J5q8R4j09R9qj08R0n9q7J16n6J98j34k03L05J13k79K22j89
7435b7J71j88n0j06L14r6N7j21pNJ3M1R7o5k33J74Q9p7q4N3J36Mj14J43l07J04
7461g4J97o9k14L36k15MJ73j76J10k05j1J73J19j31J60j65l0k46J25J91K21j28
7483A45k99o4K32J60j49J42l89J34L8n7J78k4j44J36j86N8O9n4J98j27L8M6j37
7506e6j13j63L26L1N6J6K3k89K41K0K11n57K10N9OJ02m2j89j6L02j39pJ8K0j37
7531f7J90k53R8J92k24k8J06J12j26j51pJ17J92j98p8K09r4j53K34l2j23j81M31
7554A66j35p6J03M7j70j78K76l7R2j26j41K5O9j3K9J96k23J87J0k16M0N2P8l0
7578B5l7L55m36m6J4J62N6qk10o2K70j80J03P7j46l6K25k21J80j38n3n2K90j66
$$ y = [-234, -163, 22, 132, 41, 56, -32, 62, -47, 52, 44, -64, 26, -33, -120, -4, -60, 138, 4, -199, 106, 219, -60, 162, -27, 144, -44, -94, -200, 114, 18, 75, -46, -53, -48, -35, 6, 103, 38, -195, -21, 68, -9, -93, -40, 96, 100, -14, 129, -178, -74, 123, 54, -160, 176, -39, -35, 138, -38, 72, -133, -144, 29, 148, 17, 177, 12, -18, -264, -139, 52, 273, 145, -154, -218, 14, 174, 25, 167, -222, -88, -50, -107, 71, 47, -97, 39, -147, -89, -20, -74, 124, -3, 35, 81, -56, -169, -332, -6, 25, 81, 97, 120, -169, 72, 92, 303, -254, -44, 15, 21, 123, 81, -108, -124, 178, 39, 32, 50, 70, -67, 123, -130, -32, 160, -64, -92, 14, 126, 0, -151, -158, -41, 151, -47, -125, 84, -10, -163, 71, 39, -84, -265, 166, 31, -45, 58, 105, -65, -243, 33, -4, 88, -38, -179, -154, -85, -98, -69, 127, -96, 91, 101, -115, -75, -23, 55, 25, -12, 343, -93, -139, -125, 37, 93, 85, -125, -187, 83, -97, 6, 83, -63, -99, 126, -95, 85, -53, -106, -158, 132, -34]
7602c4J73k04J63j45J93k20R5k8J90j94P4K15k61Q4j99K75l13J23o5O9n0O0p4
7625g3K72j35M3j35m2O6N5j53K23j56j50K42J7J6j26J26k72J61j6K08k07N0j16
7648a02J04J5r6J70j43k81L44J48n6j23J11rr7J85m18J97J54j3J65k73j25K32
7670H9p0J03j38j19q9R4q3L21k00R8m19L67k4J60Lp5J09j83l9j0J13j27J80j93
7694a32oJ87M8L4nk03J0L0O4j4O5k23J77k26K99J03q7q8j64K55o4q1J5k30J17
7719a19K44j06j47R7j56J52J14R0k5q0p0J1J23J3N8k52mJ63o0j15j75L93K8j86
7743iJ64p4q5q0L2j04n1J31k9l4n4K66k58K7K11k4J76j12j41K9J6K2q5Q6R6l78
7769b62J82J25m9M3k8M0o3RO2r8J2l4K26k35J56j02Ro0j97L17j93J75k93K42K36
$$ y = [-34, 139, -65, 98, -47, 146, -74, 21, -7, 183, -11, 63, 278, 17, 101, -98, 177, -136, -13, -78, -9, -59, 1, -73, 199, 64, 107, -28, -70, -4, 51, -102, 121, -35, -185, 57, 74, 90, -36, 90, -182, -21, -37, 171, -36, 14, -102, 2, 17, -79, 91, -52, -333, 11, 159, 103, -20, 91, 82, -15, 170, -248, -51, 103, 90, 255, -18, -143, 89, 19, 122, -16, -135, -224, -130, -213, 108, -92, 6, -413, -46, -70, 90, 93, 18, 127, -56, -95, -105, 8, -119, 61, -132, -138, 49, 97, 131, 126, -77, -67, -37, 27, 13, 78, -145, 32, -194, 105, 208, 121, 33, -131, 124, 60, -21, -6, -236, -119, 125, 19, -128, -31, -187, -35, 79, 169, 144, 64, -6, 5, 128, 141, 199, -53, -57, 106, 46, -69, -244, 149, 177, -9, 155, 81, -4, -84, -52, -156, -207, -76, -105, -139, -193, 73, -185, -158, 53, 29, 205, 93, -48, -19, -3, 19, -66, 20, 116, -262, -80, 45, -4, 39, 11, 51, -12, -3, 59, -39, -27, -61, 165, -70, 86, -16, -7, -67, -264, 53, -140, 35, -258, -16, 220]
7794B20j98j00J70J40j94m4K3J03j20J9p7R2k84K18R9r5K8J9R6o4j55K58j3j58
7818a7J16j21L3p3O1J61m9j61J12j11K42j26L4k09K6L2Mj92J46Q9N2J14k56L1
7842f2j49J80J52j48m8N0K12j89l08L44j10j16J58O6J9K6l40L29Q0k14MJ15rM
7866D6n1O7J3j63J64k70K70J9k27R1M1K39l38J56j8o1J42j65M6k7J15k21J51j31
7890a12N2n8K60k22K35j22m6J25j24r6L9l9J11o1j01M1Q5m4M1M9J21p0r9k05L42
7915A02Rm0k33J20p1K69j58k63J43R8j02J44K12l51K58k1J44j09j45K6k8K4k46
7938b18QJ90j12L27k76J81q1J13j90j18K97k73M12l69J24J49M7n7l38J76p5K35
7960A52j02l1l0J47J38m25L07K8J1l12P0lkPL1J78j62p7oO8L5r6j54K21N1l44
$$ y = [220, 22, -78, 92, 232, 38, -6, 17, 120, 0, 19, -58, 34, -250, -32, 67, -28, 0, 19, 115, 51, -104, 154, 141, -17, 99, -22, 11, -62, -1, 160, 111, -50, 62, -49, 193, 67, 101, -108, -82, -50, -46, -238, -92, -3, 49, 163, -93, -62, -211, -31, 121, -27, -75, -25, 187, -2, -310, 34, -76, -192, -34, 32, 51, 77, -263, 66, 146, -68, -64, 51, 42, 46, -5, 62, 75, -88, 76, -194, 76, 95, -132, -41, 0, 239, -99, 57, 39, -22, 120, -45, 1, -26, 89, -132, 19, -112, -60, -118, 142, -80, 155, 33, -13, 112, -12, -108, -69, -108, 3, -58, -159, -118, -33, -77, -36, 13, 134, 64, -35, -240, 102, 111, 71, -162, -42, -113, 156, -2, -265, -122, -24, -126, 18, 230, -121, 137, 116, 260, 151, 6, 32, 4, 28, -218, -210, -20, -132, 195, -81, 100, 19, 132, -58, -176, 121, -152, 260, -109, 15, 164, 211, 154, -184, -8, -83, 152, 50, 19, -11, 136, 274, -151, 156, 184, 195, -117, -47, -50, -52, -45, -14, 164, 2, -75, -81, -13, 22, -74, -228, -7, 44, -300]
7986c00L30L18m08J64j12M2j05Jp1J86j52J11OQ7J27j95q2J74l6p0k5j64K31J7
8010G4k89J64j2o3N9pN1N0l22L24Qn0J14n1J45j83p7m1N7J27p6r8K61k22K9J7
8036a1M1M2R3o7j44K66p8k65J91j01p1J62j26N2l8J32J61k05k41J38l7O9R3j51
8060i5L0J82r6K4Q5q2P7o8k9J03k32J63k11L56k29o7K69Ok09j20K53k1m8Q6j86
8085e9j6K57l22K47k26J60r3Q5J06J79k76j59K12k37J51J3r0LK6L3oJ4j47K82
8109A37j63L8p2J41n7r6J56l7p0l0j13J96p6K74l89J61j32R0M3O6K6n4J20j68
8133in1P3J54j37p7R7j63K11k93J71r2N4O9j5pL4k32RK06o1k1j92M4K22j06r9
8159b11L01n0K27k87p7K28mJ6k84O2O0JJ00j2K7K3j48n2J16n8j01Q7L0Lm9J61
$$ y = [-300, 30, 348, -60, 104, -8, 34, -71, -70, -141, 45, -107, 4, 10, 97, 224, 29, -53, 121, 85, 15, -10, -174, 57, 74, -215, -51, -63, -126, -67, -74, -23, 27, -295, 29, 37, -13, 101, 50, 195, 12, -65, -106, -49, 78, 2, -96, 165, -57, -28, -11, 30, 72, 165, 98, -46, 220, 142, -123, 68, -33, -104, 58, -68, -16, -54, 78, 239, 34, -207, -69, -106, -37, 56, -95, -65, 117, 21, 45, 130, 48, 125, 57, 28, 131, -101, 62, -149, 207, -22, -89, 180, 186, -23, -143, 110, 89, 41, 127, -59, -75, 182, -140, 107, -119, 41, -52, 33, 139, 318, 42, -117, 95, -142, 9, 22, -68, -65, -39, -6, -12, 2, -145, 137, -26, 12, -60, 81, 24, -72, 84, 47, -23, -53, -166, 30, -46, 228, -161, 0, -132, -42, 1, 67, 93, 39, 159, -9, -60, 13, 167, 30, -47, 50, -113, 98, -195, -24, -116, -62, 7, -8, -15, 19, -213, -204, 2, -59, -80, -272, -228, -6, -112, -211, 90, 40, 267, -20, -97, 131, 127, 143, -141, -79, -19, -18, 82, 70, 97, 120, -28, -80, 36, -22, -123, -36, -6, -3, -52, 109]
8185A09j05K0j65J61P3j48
$$ y = [109, 4, 24, -141, 20, 93, -55]
8191e5
$$ Imaginary data points
##PAGE= N=2
##DATA TABLE= (X++(I..I)), XYDATA
0@%%%%%%JjQj6J6j6K4l2M0n6O5q1J02j19J45j76K09k43K84l33L90m51N20o01O86
31C65p81Q90j009J140j285J442j619J812k023K255k507K782l084L416l772M165
47B187m597N066n580O147o774P467q235R094j0061J1155j2408J3855j5554J7580
61I342k0040K3109k7063L2376l9938N1643p2385J20234m38705k14307M65048j55703
73b66389R0334K40670k2746k16982L36739M15442l3516j57687J13414j58740l85643
84d5104O539K88432j56932l39534k8055l2650l07758J8723M27194J50840j86263
95b04568P8845J95549q1540K5112M21811K01530k58212j39922P2725j85271k20672
106i4613J80343J38689l36642k97212O4643k2705j42764K18784L44531q3966j93839
$$ y = [0, 0, 0, 0, 0, 0, 0, 1, 0, 8, -8, 8, -8, 16, -16, 24, -32, 33, -48, 54, -65, 80, -96, 113, -130, 154, -179, 211, -240, 280, -321, 365, -416, 474, -535, 605, -680, 762, -857, 955, -1068, 1187, -1320, 1462, -1622, 1794, -1978, 2187, -2410, 2656, -2924, 3223, -3551, 3916, -4319, 4775, -5286, 5869, -6539, 7316, -8238, 9342, -10698, 12411, -14652, 17724, -22214, 29429, -42956, 77278, -361427, -575734, -110686, -266389, -176055, 64615, 41869, -175113, 161626, 577068, 543552, 385865, 499279, 340539, -45104, -38565, 249867, 92935, -246599, -274654, -307304, -615062, -596339, -169145, -18305, -204568, -125723, 69826, -11714, 13398, 435209, 636739, 378527, 238605, 311330, 126059, -94613, 85730, 224419, -112223, -409435, -344792, -367497, -510261, -291477, 53054, -30912, -224751]
117b24751J69757J78817m8105J56046L28196q5694l54189l0255J00259j63850
127B6231p9877J89880p3036m00962j12477J85536k379k6745K63035J36430k36085
138a30449o5921K83647J28795m8659J64324J29231k76393k54977J31165Q9131
148A49894j63509j7194R0756k24201k87638J21472K29465l5526J4605J97765l7572
159C8317k16108J18463L12082K1435q4183J00729m2801k98412n9846K26075L036
170A18787j91611J95L351k40217q0518K82164J59309j16060J7594J21897j09522
181c4631q6061K58029K15164j30308j08290N4531j20827j95818J20786J91035
191A63610j42573j96816L9005k1056j48442J11877K85460m543j66333N4598Q7065
$$ y = [-224751, -54994, 123823, 75718, 231764, 559960, 474266, 120077, 89822, 190081, 26231, -53646, 136234, 63198, -337764, -450241, -264705, -267084, -293829, -30794, 105636, -130449, -196370, 87277, 216072, 167413, 331737, 460968, 184575, -70402, 60763, 149894, -13615, -30809, 59947, -164254, -451892, -330420, -100955, -136481, -121876, 75889, 38317, -177791, -59328, 252754, 274189, 190006, 290735, 247934, -50478, -110324, 115751, 118787, -72824, -72629, -69278, -309495, -390013, -107849, 51460, -64600, -47006, 74891, -34631, -120692, 137337, 352501, 222193, 113903, 168434, 47607, -148211, -27425, 163610, 21037, -175779, -136774, -157830, -306272, -194395, 91065, 86522, -79811, -25213, 61852]
202F1852q6384N5781K58675J8787k34914o3939N5625j12616o2610J80534M5749
213A16540k47749j23596J05036P85l9209J89965J59586j48399j26784J28506Q0567
224I5248m4933J13360J43867j60450k29254M4299Q0148r2035N715J27653j04139
235b0521k43207K2237J69236M186J1576J59820L780j92058L702J97855L6577n0730
247A02453R0560M506k31179j06328J51462M9828j09659J3730L9019j68127j18411
258b82146J65127J50225m5099J6755R3915q5699j18026J41220J80082n5583p5255
269H5516M5599p8587j81864M1040J70010l8535j29943J4101j3051j30388L5471
280a80631K15962N0740j03151K1696N3892q7665l090J97137P4019j49184p2012
$$ y = [61852, -24532, 31249, 289924, 308711, 73797, 9858, 65483, -47133, -109743, 70791, 116540, -131209, -254805, -149769, -148984, -188193, 1772, 161358, 12959, -113825, 14681, 95248, 50315, 163675, 307542, 147092, -82162, -37863, 42285, -49750, -44035, 83618, -20521, -263728, -241491, -72255, -68069, -56493, 103327, 107107, -84951, -81249, 116606, 153183, 102453, 193013, 197519, -33660, -139988, 11474, 61302, -48357, -34627, 4392, -163735, -282146, -117019, 33206, -11893, 4862, 98777, 13078, -104948, 36272, 216354, 160771, 85516, 131115, 52528, -129336, -88296, 81714, 43179, -86764, -72663, -85714, -216102, -180631, 35331, 86071, -17080, 4616, 58508, -29157, -32247, 164890, 238909, 89725, 17713]
291A7713L1834q6866p8996J25739R0926j38987j11282M7744j2734n2627J30484
302c7052J58471p2002j10595O5839N0282n1974P0473J48142o3483j78814j1887
313c2600M5894o4744j466J16576l0326j77654k9429R6705r76M990J38520M6545
325A12035j41747m7711J20661M3601k8996P7798M4372j52465j23074P1646M9081
336B5201n8781K1316N3326j14888j30637P9098J19075j2905J6369Q8339m6489
347C9024j22516N7056J43535j016l9585M5199m2681j54565j3114J23285N509p9787
359c9656J4365l510j20244k1709J51435P3959n7009J0835M2071p3595l8298J34429
371G3073R4438p3786n1274J9561p2569q7500Q0398R9225p1792r0656J8475j9118
$$ y = [17713, 49547, -37319, -116315, 9424, 100350, -38637, -149919, -102175, -114909, -167536, -37052, 121419, 49417, -61178, 4661, 54943, 2969, 73442, 221584, 158101, -20713, -32600, 13294, -51450, -52916, 63660, 33334, -144320, -173749, -77044, -78020, -73030, 65490, 112035, -29712, -77423, 43238, 86839, 57843, 135641, 180013, 27548, -95526, -23880, 25201, -33580, -12264, 41062, -73826, -204463, -125365, -6290, -19195, -2826, 85513, 39024, -83492, -26436, 117099, 116083, 76498, 121697, 79016, -75549, -88663, 34622, 40131, -39656, -25291, -28801, -149045, -170754, -19319, 54640, -2369, 8466, 50537, -23058, -61356, 73073, 167511, 93725, 42451, 62012, -10557, -98057, -17659, 81566, 9774, -80882, -62407, -81525]
383h1525o5057P5820J41908j6144q5000K5080K7470m8886M3524J35075o182j26719
395A9364k8641K6055n4425j4083J00730J2939j28509n4250M9586n995n633J07872
407B5010O3129r2882n8338O9746L1548k1174O9133O7367r2699j10863K9884L8837
419A8698l8932J6655N7153o9793j17618K3810P7997n044J6862Q1689j8732j05903
431f3158J3886J05386J6215j9881M8072q957j19501m0522Q2308K2057m6806J4111
443C210K682j01123m8373R6889O6673l1279J3224M1603n7682n5406Q7157R3731
455A11306l0253l1797J9694n1725q3755M1239Q3384l2680o1411J0580k4569p4188
467a24175L5010J15624J0554n7856J5659K1688m6396J4772J09461K8424p6703
$$ y = [-81525, -146582, -70762, 71146, 55002, -29998, -4918, 22552, -26334, 17190, 152265, 146083, 19364, -9277, 16778, -37647, -51730, 49000, 61939, -66570, -120820, -71234, -77229, -82862, 25010, 88139, -4743, -63081, 6665, 38213, 17039, 86172, 153539, 60840, -50023, -20139, 18698, -20234, -3579, 53574, -16219, -133837, -110027, -32030, -37074, -20212, 61477, 42745, -63158, -49272, 56114, 72329, 52448, 100520, 91563, -27938, -68460, 13848, 35905, -10901, 3210, 5892, -95231, -143604, -46715, 19958, -11321, 1903, 43506, -14176, -69582, 17575, 111306, 81053, 49256, 68950, 17225, -66530, -25291, 58093, 25413, -35998, -25418, -49987, -124175, -89165, 26459, 37013, -20843, -5184, 16504, -29892, -15120, 94341, 122765, 46062]
478D6062k8120R359n2136k3728P8997L0713q6954n2370K3366j8108k2636Q1964
490a3591P5768n1752n5461L8105K3241j5966N6945P4475m9531r0143L923J8043
502A4056l6770J3628O0745m0213j05064p000N0369m603J2646P7232P669q0169
514c7474q825P2055K0856k578N2896Q914r4695n2042M8350J5596l4511J6448J3319
527A8309q1699o4009N4264N7428r393J8797M3010l8193n4332N3917Q0468l897
539G4670j1794K3880l9755q4576Q836O6391j1688m6870L188k1391p2257N157R0346
552a5863L0351l1031J4452J8877m1731m07R1261M6111m6065k3328N339n0044l9912
565d1990N3429L9601n7573m9819O861k3289l1761N9031P6995k0578m0759K5765
$$ y = [46062, 17942, 27301, -24835, -48563, 30434, 61147, -25807, -78177, -54811, -72919, -95555, -13591, 62177, 10425, -45036, -6931, 16310, 344, 57289, 131764, 82233, -7910, -3987, 14056, -22714, -9086, 51659, 11446, -93618, -100618, -50249, -54852, -42206, 35026, 42695, -37474, -46299, 25756, 46612, 44034, 96930, 105844, 11149, -40893, 7457, 23053, -11458, 4990, 18309, -63390, -127399, -73135, -15707, -25100, -6303, 36707, -1486, -55818, -1901, 78567, 74670, 62876, 86756, 47001, -37575, -28739, 37652, 25964, -20906, -17718, -39109, -111366, -106209, -15863, 14488, -16543, -2091, 16786, -24945, -25352, 65909, 112020, 65955, 42627, 47966, -2078, -41990, 11439, 51040, -6533, -56352, -49491, -72780, -104541, -45510, 31485, 10907, -29852, -4087]
577d087J5999j9718M2030P6770j5825p0360r983N104l7081Q42N3246j5667q2597
590f1327k3497K6082r452O683P0778K9073n5379k0909M7826K0414M41M8811K6991
603A06535o4366n6876J9653J0598k5987J4333K2209n9333o9214K2476M4912k849
615c7909J8005M8964j6372n3169K3100O4064R684j529K9247k0837p5342j3365
627b5459M6405j843l1395Q910r390o7988k1335O2642L6673j4225J5169K1586l4477
640a4727j7044O2694M9687j9529j1013O485m3988m8534L2226M3158l0272l9225
652c0082J639k2136m1117L0608O8906L884k7710J2653P738k2593K5335O9641Q080
665H4846m8238j3085M59l7067j0650M8696Q882n9109l1971J0794j2611m889N5310
$$ y = [-4087, 11912, -7806, 34224, 110994, 95169, 24809, 14826, 19930, -17151, -16309, 36937, 21270, -61327, -84824, -58742, -68194, -61511, 9267, 38340, -17039, -37948, 9878, 30292, 30733, 79544, 106535, 42169, -14707, 4946, 15544, -10443, 3890, 26099, -33234, -102448, -79972, -35060, -37909, -19904, 29060, 12688, -40481, -17381, 46683, 56367, 54838, 84085, 63248, -12094, -25459, 20946, 19103, -12292, -3382, -12772, -80760, -102095, -39453, -2780, -17005, -1836, 19750, -14727, -31771, 30923, 80610, 61081, 50068, 56553, 12565, -35969, -3743, 39415, 9143, -30082, -28443, -50579, -91696, -61088, 7818, 11702, -16008, -3355, 4383, -18210, 7125, 76766, 84846, 36608, 23523, 23982, -13085, -23735, 24961, 33843, -25266, -57237, -46443, -59054, -63943, -8633]
678h633L9057l3739k4570K6765J0683l751M4483M1048l9449n2860N752O529k3256
691a1941J1494L1510l3713o2040l23K6700k212J6512M6424m062m7712L672M4762
704A9071J1157L956L3978k460o0877k6950K9813P019j7943J0173m36n3786l3234
717h0519L6217L2154m349J5138K2367k8155k8825L8528M7316l729m939J1863k8811
730B4256m8410J1098L8381j0358k6064K437j8074m3587R423N4712J4112j8351
742a0425J0518P282k6623N018N5915K3107k7327j0841J29l2732j8637L6580K0617
755C2581l6712k7273L236j6959j5769L8790M3167j5196k3240J3174M950r018L0521
768B2252M3662j3751m0421l988J152k1193N913L3565j1643m9658j3193J4043n492
$$ y = [-8633, 30424, -3315, -27885, -1120, 9563, 5812, 50295, 91343, 51894, -966, 4786, 11315, -11941, -447, 31063, -2650, -64690, -65013, -38313, -40525, -24013, 22411, 18349, -29363, -25691, 19071, 30228, 34184, 68162, 65702, 4825, -22125, 7688, 14707, -3236, 6937, 6501, -47285, -80519, -44302, -12148, -16497, -1359, 21008, -7147, -35972, 2556, 49872, 46143, 41204, 53067, 24256, -24154, -13056, 25325, 14967, -11097, -8660, -26734, -70321, -60898, -6186, 7926, -10425, 93, 7375, -19248, -14230, 41685, 64792, 37465, 26624, 26753, -5979, -24616, 11964, 32581, -4131, -31404, -28168, -45127, -60896, -22106, 21061, 5865, -17375, -4201, 749, -8269, 22252, 65914, 52163, 11742, 7754, 8906, -12287, -6374, 27191, 15548, -34110, -47303, -33260, -38752]
781c8752P220M0994J2408l4303j0423K6214Q153K979L2595J3833m1629l1548J4553
794B294O010j3655J2013J2917l6025l9765J3614K3506p35J4204K5363j6286l1973
807b8518J6589L5383L438K161J9189j5454m5560m911K9490J885j4826N491r729
820e372l9810r052L6021J8697o775R935O575k5699q794L9451K8118j2053o311
833B4931L518k5900k6104K0932K6581j4931k0135k80j6196k1860K1259L8770j615
846H970j6793P301P14j6764J5784M1763L690k8437q168k23j9851j211L0140M637
860B1552l2335j5602M615r987J08L4937J9880k3887j5681J3761L577k260K6594
873B5272K2347k3703k9749K487L481q976J1820J8514k0575l4017J570J4447j293
$$ y = [-38752, -31532, 9462, 21870, -12433, -22856, 3358, 11511, 14490, 47085, 60918, 19289, -12259, 2294, 8304, -5351, 6662, 19579, -16446, -56211, -42597, -19091, -19826, -5622, 19741, 3455, -28518, -11929, 23454, 26892, 29053, 48242, 32788, -12772, -17683, 11807, 13692, -1134, 4357, -5372, -45182, -54234, -18213, 484, -6291, 3644, 10219, -15480, -24274, 15177, 43295, 31242, 24931, 28449, 2549, -23555, -2623, 23958, 9027, -11108, -11388, -27584, -49444, -28185, 10585, 8970, -7823, -522, 192, -16572, -788, 40975, 44665, 16228, 8060, 7837, -12014, -13225, 16915, 21552, -10783, -26385, -21770, -31757, -31649, 3288, 23168, -719, -16400, -2639, 938, -1322, 25272, 47619, 23916, -5833, -3346, 135, -8841, 2979, 21493, 918, -33099, -31529, -17082, -18375]
886a8375J1149K6578n218l0223O7K3596N465K770J8689l557l4905j3336J7348
899D8M522p052J0019J64l1503j7177K1623J7901k348R279J0722j9253j8330K0684
913g01K4796k738j492N789j9047k7314Q788K3361m037j1612K712j1030k4509P305
927b9729L1635Q180r564M790R8j7937K906L1700J1224j5762o349j360j9672r201
941a9041K3205J3081j8431j3598J258j0146p273K3732K4012r634j2785O010l20
954G0p236J8420K4910r243k3796k861m54j1239N858K0477o207k6580o600O693
968a7788l304O971K5377N088k2156o154J3933L438K311J9135O618k5074j8180
981i785P001L410m352R106O301k2659k0912Q898J2782R5J0355J4677j1850j9571
$$ y = [-18375, -7226, 19352, 14134, -16089, -16022, 7574, 13039, 15809, 34498, 30941, -3964, -17300, 48, 4570, -2482, 7537, 7701, -23802, -40979, -19356, -1455, -3803, 5476, 16198, -3055, -21385, -701, 24095, 21357, 19865, 25654, 6607, -20707, -11919, 11442, 7405, -4207, -1495, -12525, -37034, -29729, 1906, 10086, 522, 5312, 5410, -12527, -9621, 22079, 33303, 17541, 11192, 9832, -9840, -19041, 4164, 17245, -1186, -14784, -13526, -23672, -30945, -7213, 16799, 7165, -5620, 390, 70, -7166, 11254, 36164, 26921, 3125, 264, -190, -11429, -5571, 14906, 8699, -17881, -24481, -17788, -21092, -14121, 11256, 16344, -5812, -11966, 1967, 5405, 7716, 26851, 33469, 8395, -9785, -2784, 626, -3726, 5380, 11681, -10978, -31890, -22992, -10210, -10115, 240, 14917, 3067, -16504]
995a6504R298K0276K724J946R433j0394k5641j959J5734Q96n994M309p532k4286
1009b7694l725K2387J0342m215O167L420j5819n032K2763J6156n329l012l43j6650
1023e84j3114J3851J4032r800j0321m02j1631j3181J3986K3579j232r760L388
1036a189o33q175J1069K3695J786j4711m489k665j2197J238J8459R69k0042r146
1050a6031K029o697L56K0240J1458j2733q669P058K137R75J6904J2342j4054j5875
1064e60J934M35o010P581J0672j3391k1033j27P771q60P257J5312l694j6422J136
1079i999J3431L313M422J2749l388k0776p161R908K288m081N208j455j9733j0697
1093b5971J1663R673J1O349N302j1903r172J3151J4753p8P68L716j1904j5989
$$ y = [-16504, -7206, 13070, 15794, 17740, 27173, 16779, -8862, -10821, 4913, 5809, -185, 4124, -3408, -27694, -31419, -9032, 1310, -2905, 3262, 6682, -9137, -14169, 8594, 24750, 19421, 16409, 16066, -584, -13698, 153, 14185, 4385, -5936, -6338, -17969, -31150, -17164, 6415, 5183, -4577, -1189, -1822, -9997, 1072, 24767, 26553, 11842, 7353, 4688, -7509, -6271, 12188, 13157, -6885, -16031, -14002, -20699, -20343, -103, 11355, -1378, -10047, -2989, -852, 123, 17027, 29369, 15315, -560, 1374, 1809, -4201, 3380, 14052, 661, -20372, -20499, -12728, -13588, -6331, 8981, 5287, -11135, -9999, 3432, 6745, 11167, 23916, 20528, -248, -7409, 2499, 4787, 706, 5914, 4459, -15274, -25971, -14308, -4635, -4624, 1725, 7027, -4876, -14048, -897, 13856, 13778, 14546, 18262, 6358, -9631]
1107i631N260J2957k471o344L51q496j5161L973J7934M534m771L475m02j1065
1121i857L176J9785P398q086k932k008j1968m684J3614P361j1226q015n88q037
1135a6067m622J5346J4113n859p451L181r21k929J2059J5317n049j3143k271j824
1149a20o542M921J2359m663j6151m464L070k243M666J5403L434j2894m399P469
1163a54K607K378J1646L660j5024j0542M026R91k532O624M087j4101j3118N134
1177a4318P879R01O176Q900p183j1489N300J1243K109K346N478q022j6099o90
1191g469R872N2l535L138m544j4465k393J3397P157p99L599R40r651k213J3269
1206F355Q902l502j166o76j1469q883Q032R001n128o284p19n956p413Q413J4035
$$ y = [-9631, -4371, 8586, 6115, -229, 122, -8374, -23535, -19562, -1628, 2906, -1865, 1610, 1208, -9857, -6681, 13104, 20502, 12416, 9484, 7476, -4492, -9176, 4438, 11799, 573, -7442, -8030, -16067, -20689, -5343, 8770, 2911, -4540, -1359, -2280, -5209, 6850, 22167, 17118, 3975, 1704, -120, -6662, -1741, 10618, 5955, -10196, -14660, -11590, -13833, -9167, 6236, 9670, -3224, -7623, -154, 2453, 4831, 16477, 20137, 5113, -5429, -1403, -412, -2944, 3680, 7767, -6334, -19452, -14318, -6439, -5538, 638, 9538, 2355, -9134, -3834, 7409, 9518, 11864, 17342, 9320, -6779, -7469, 2403, 2455, -1080, 2058, -2486, -16951, -19344, -5947, 1210, 411, 4010, 4950, -4701, -6914, 6355, 15257, 11755, 10589, 9913, -1556, -10439, -2407, 6594, 1466, -4818, -5537, -11493, -18906, -10493, 3542]
1221C542R90m184J922j350n262O571J4158O53r578l206j976q690n28J1072J608
1236E742j1405n649O29l380J915J3143P621o995m329L967L39K07J0673P551r164
1251A0865j1484l09n71l916M639O108p473j2037j86M350M25O435J1001j868r853
1266c874J015P670J742K425P501k038j3661o303M138R97j870L319q93j1862o564
1281a8258P467O574J227N398M571o704o016P459R153L10N61J229q632j0993K015
1296d639P252j636l459M51n723r534L172J1929M184j568K627l11o526J974J1713
1311I906N022m817k321k569q810l525Q094M074o521n052q26m722k243R501R878
1326E069k196l918J863p32j717P710R407l151q609k104j874m921K585P515k206
$$ y = [3542, 4532, 348, 2270, 920, -4342, 2229, 16387, 17040, 7462, 4256, 2280, -6410, -6938, 4134, 5742, -5663, -11312, -10683, -14063, -12148, 995, 8616, 1621, -2708, 1259, 1598, 1805, 12478, 20029, 10865, -619, -928, -1499, -5415, -776, 5332, -2141, -14178, -14364, -10014, -9589, -3154, 7847, 5979, -3874, -2859, 4811, 6553, 8978, 16479, 14441, 780, -5523, -1385, -388, -2258, 1061, 168, -11694, -18258, -10791, -4217, -2990, 2408, 6979, 275, -5741, 1718, 10871, 11181, 11742, 12971, 4339, -6654, -4639, 2613, 977, -2482, -2031, -7754, -17288, -14116, -2187, 1997, 429, 3056, 2745, -3781, -1807, 9906, 14928, 10111, 7790, 5221, -3589, -7114, 980, 5054, -1467, -6519, -7345, -12067, -14310, -4809, 5069, 2873, -1045, 818, 86, -1631, 6079, 15486, 12335, 3726, 1622, -252, -5173, -2588, 4927, 2721]
1341B721j0087l287J935j045L431J0188K346o977k742M343J317J705Q139K116
1355A4103r794p863J963R09j723L784K502q278q246K654M672J394M944N564m333
1370B252o912K458P108R17J627L828m825j0318j706N860P17j883J717k455q892
1385a0507j253P679M299K27K975O74o671j936P894O079j800j269m89p030n794
1400f922M509N581j992l326m51m520m626N629R071M67k729J382j197m098L466
1415B44R083J096n907k609j760n159K96P040J352o335k797Q1k866R65Q916M958
1431F598m567l355J914l18j68O154M697n045o868p13o92j836L647M555m219p283
1447g499o5K841p9L745O908q14o874p82M029J584J378M684j614q485l934L157
$$ y = [2721, -7366, -10653, -8718, -9763, -6332, 3856, 6202, -775, -3517, 826, 2143, 3848, 11987, 14103, 4309, -3554, -1591, -682, -2405, 1379, 3881, -4397, -12643, -9989, -5317, -3923, 1021, 6585, 2252, -4660, -2202, 4906, 5823, 7450, 11278, 6453, -3865, -5571, 289, 1006, -877, 840, -1615, -10507, -11760, -4081, 218, 445, 3420, 4094, -2577, -4513, 3381, 9460, 7660, 6391, 5902, -1128, -6922, -2413, 3168, 1176, -2150, -2601, -7121, -11747, -6118, 2953, 3420, 691, 2073, 876, -3222, 244, 9327, 10423, 4516, 1907, 147, -5012, -4716, 2324, 3676, -2659, -5456, -5375, -8241, -7276, 1640, 6598, 2031, -1324, 590, 272, 104, 6258, 10955, 5910, -958, -1671, -2363, -4199, -552, 4003, -216, -7499, -7564, -4723, -4802, -1057, 5851, 5037, -1837, -2619, 1410, 2994, 4372, 9056, 7442, -1043, -4977, -1820]
1463a820O81m39L264K4p297m320M739M396P04L201K143m801m576L980N184j27
1479D936O90R39n471o886J573M974J26j689O82k801n757J444P594K567j151R36
1495B706p35m771N20P055K705k974j424j575n013j956N101L647l350k455l84k804
1511e707j441N910O081j497k873N13j186j912M489N704k051n374j623p71k611
1526d349J838N538q87n572j375O21p67K703O570R45m949j901K011J75N53M470
1542E624J319n567m561P63M68n49L241J993m921m224J626K805P03L245L693k806
1558B852n377J336L733M02Q15J814l152o193p19L153N20j4J955j721n306o26N318
1575a210K797J58J750J96m109k080M195L244j237j75j007m848l415L049L504r91
$$ y = [-1820, -1139, -1578, 1686, 1710, -5587, -9907, -5168, -772, -68, 3133, 5276, 475, -4101, -121, 5063, 4936, 5626, 6565, 1094, -5792, -4219, 755, 881, -808, -126, -2927, -8684, -7240, 354, 2921, 1770, 2706, 1971, -2800, -2280, 4775, 7480, 4506, 3082, 1507, -3506, -5462, -361, 3286, -64, -2519, -2903, -5707, -7148, -1238, 4843, 3346, 473, 986, -200, -2112, 2377, 8081, 6030, 656, -967, -1738, -4349, -2511, 3027, 2140, -3432, -4807, -4186, -4953, -2250, 4320, 5265, 316, -1585, 426, 601, 1154, 5624, 6943, 1376, -3185, -2422, -1954, -2503, 738, 2731, -2190, -6414, -4788, -1983, -1280, 1965, 5658, 2852, -2525, -1189, 2544, 2946, 3761, 5575, 2423, -3770, -4489, -1336, -816, -830, 1125, -596, -5902, -6528, -1210, 1587, 1745, 3495, 3691, -418, -2498, 1697, 4941, 3704, 3529, 2522, -2326, -5741, -2692, 812, -179]
1591a79j090P3k235k834L043O214O24j505K13j183k684J960M779J45l204j599
1607E38j667l682L20M921J439l651j561K39j317R37N465L056k063k509K68j90
1623E43m08L928K264l649m257l72r44j068K786L108k316m122J40J674M37L007
1639G51M008p01m063k04J740R2Q65K607j118n500k408J656L94j79K324L96m071
1656c411k176K769K895P28K199J309k871l177K335K613j48j1L20l690m370R91
1672c695K830M31p54O46j475l195J364M886J571l06P38o50l207mL964J333k205
1689B272r02j246l369j282L325J881j564j097M2j582m46M061L653p88j710O08
1705A856j248j294K171L051j140l301j242r70j839J447L560m33l119l87P78m84
$$ y = [-179, -1269, -1196, -3431, -6265, -3222, 2992, 3616, 2111, 2324, 1141, -1543, 417, 5196, 5341, 2137, 538, -1129, -4811, -4491, 430, 1869, -1782, -3343, -3104, -4421, -3484, 1981, 5037, 2974, 465, 733, 543, 135, 4063, 6327, 2678, -1579, -1951, -2895, -3963, -1177, 1931, -385, -4507, -4367, -2693, -2256, 751, 4759, 4058, -5, -209, 1531, 1623, 2488, 5095, 3977, -1523, -3931, -2275, -1881, -2060, 264, 660, -3411, -5587, -2818, 77, 805, 3004, 4313, 1442, -1735, 600, 3213, 3065, 3054, 3374, -316, -4686, -3695, -865, -434, -1188, -542, -2017, -5212, -3848, 1038, 2609, 2303, 3041, 2391, -816, -820, 3144, 4477, 2272, 1370, 124, -3245, -4527, -1202, 679, -885, -1982, -1940, -3522, -3968, 93, 3746, 2958, 1248, 1856, 608, -686, 1485, 4536, 3396, 95, -1147, -2117, -3956, -2509, 1051, 618, -2501, -2888, -2110, -2594]
1721b594J837L986Q62k462j510Q76k63K21K588K09l686k649K48Q2k95K137J519
1738A106k460k537J177J913N89K188J772j182l165N34J661N5P39J052k282m132
1754b972m04J742N64k69J600n19l051l50K968J940N73J019l9k725j145K381J443
1771B756q27m29j96l067k249J710K689p21n40L14j522j462K319L310M04p85P6
1788A780r58j782R60L116j12k034j182q03k129L15K957J004k001q62M36j137Q36
1805a596L059J731j607j006K32r35k01J996J778k201k518k66l22n06J682K086
1821A406j346k205L43O04K60J742K239p38k517r0J067k41N60J306o59k907j301
1838b477R33N54J23J329K61k550q36J639J459L60R88R16k205j632J207J229L9
$$ y = [-2594, -757, 3229, 4091, 1629, 119, 995, 732, 953, 3541, 3750, 64, -2585, -2337, -2255, -2550, -413, 1106, -1354, -3891, -2714, -801, -212, 1976, 3748, 2566, -599, -65, 1596, 1651, 2390, 3442, 1160, -2972, -3376, -1634, -1070, -1339, 261, -258, -3309, -3659, -691, 1249, 1822, 2841, 2802, 77, -1068, 1313, 2756, 1929, 1500, 1304, -1763, -4012, -2302, 387, -334, -874, -560, -2082, -3544, -1225, 2085, 2489, 1704, 1780, 822, -960, 0, 3116, 3004, 970, -212, -1015, -3144, -2829, 128, 1132, -869, -1731, -1295, -2432, -1596, 1463, 3194, 1587, 581, 813, -122, -323, 1673, 3451, 1250, -1268, -1534, -1856, -2362, -680, 1406, 60, -2145, -1802, -1198, -938, 804, 3043, 2305, -212, -302, 765, 524, 1084, 2390, 1731, -1176, -2477, -1544, -990, -867, 462, 723, -1827, -2663, -1024, 435, 795, 1783, 2699, 494, -1138, 69, 1298, 1337]
1855A337l9K87k016k408J090J353N3M1P42j135j792P50K462R29l26M31p32j470
1873d43m19J978R00j150l31o58k138k81J940J406j018n59J35j096l80K508J800
1890B194l82j010j1p32p47J411J514o07j817k49r57n39P03K232k41j551l27J12
1908a004j88P74K102N77j593p35K84l75K16J563L79k221j328M35NJ39J155Q84
1926A069j328j534N23Q43R1J464R53j153j656K41J167p4M95O88j206k003PP07
1944g06O27J77N99m51j690m17J511N77L62N79j5j653n92J315J094l03j81k12j314
1963f93q36R67J096j00l71k8p56r54Q90J547P0n99J2m44j002N12J693M70r70l32
1983A72l79q82L46J776J31j229j61k00n81N6J463Q29j063q43K42l95k48J398J046
$$ y = [1337, 1298, 1585, -431, -2839, -1749, -396, -343, -302, 440, -695, -2487, -1737, 725, 1654, 1328, 1759, 1027, -443, -862, 1116, 2016, 866, 535, -123, -2261, -2542, -602, 804, -214, -773, -638, -1734, -2114, 394, 2194, 1812, 802, 791, 59, -688, 723, 2237, 1630, -187, -436, -1393, -1932, -1229, 1003, 762, -789, -1116, -1004, -1192, -418, 1684, 2261, 668, -67, 217, -158, 58, 1621, 2000, -221, -1549, -1114, -1109, -970, 185, 1069, -259, -1793, -1270, -427, -336, 1128, 2081, 928, -728, -487, 680, 606, 1101, 1789, 583, -1420, -1413, -706, -79, 98, 697, 246, -1444, -1861, -350, 227, 589, 1168, 1153, -500, -1092, 223, 1317, 1014, 833, 621, -693, -1529, -562, 534, 434, 63, 35, -721, -1675, -785, 762, 832, 233, 245, -199, -1201, -689, 1004, 1474, 504, 172, -207, -1089, -743, 1033, 1164, -65, -226, -426, -1007, -951, 512, 1341, 278, -565, -323, -718, -966, 432, 1478]
2002A478p35j102j14J06q8R53J183q61j280j16J83p9L39J163m30j236n39O94k3
2021e04L02J156Oj353m66Q40Q1L85N51K27j254p79M79N16j47M17K1r61o72M30
2041g25N99J47J12M40p02q73M47J212mj26N32o38j206J02J007K56k62j10m96q47
2061a135j26J046N87l92J41o2o30m01J358M89k7j87n2o98p07Q59P03l45o44k60
2081d83k27l57M17J168j05o06j90L5k07M23J170K8p38k35J8n83L44Q84J43q82
2101A7p24J26J6k50J274J97p09p38L15M15l2O07N13n66p67Q0K92j04L06Q19q21
2122B66r02rL47p4L14L18j73p94j79O72K33L86k4J60r18k24O58M86j37R7k5p21
2144b43q12P83M11j55J7J23o28p07Q56M03mK11J7j61n98K14R99k4l08k57n7m34
$$ y = [1478, 743, -359, -473, -367, -455, 498, 1681, 820, -460, -576, -393, -472, -133, 1030, 600, -636, -1175, -481, -504, -202, 954, 960, -393, -859, -19, 62, 447, 998, 1225, -29, -808, -329, 187, 40, 457, 478, -483, -1155, -725, -126, 21, 133, 573, -129, -1002, -555, 657, 653, 527, 1059, 421, -785, -683, 324, 580, 318, 208, -288, -1135, -1261, -215, 372, -20, 121, 59, -571, -972, 386, 875, 848, 661, 609, -89, -796, 63, 766, 421, -223, -483, -710, -1067, -650, 518, 413, -193, -383, -348, -555, -132, 1038, 1066, 328, 93, 111, -472, -128, 756, 899, 17, -707, -581, -565, -815, 459, 656, -53, -791, -476, -61, -93, 514, 1027, 461, -306, -226, 66, -38, 268, 1087, 266, -636, -645, -298, -372, -58, 260, 87, -707, -886, -214, 19, 405, 381, 541, -377, -601, 57, 543, 406, 503, 478, -243, -1055, -272, 139, -16, 1, 124, -504, -1211, -355, 48, 44, 255, 272, 111, -487, -273, 726, 702, 394, 137, 80, -354]
2166c54k1N27J28l46j08l6p90K58P63M30k02k68R3j78k38Q64L62k56n00M2k43
2187g3j75L60M80m20n39m3n5j18K48P01J6n37p5J57M5J93O60m0p65k06K56r5R2
2210F7J56J49m95p90L76K44l1K98O03n53m13Q2N06J16M29J5k63o52J2L34o7m8
2232G5R7l76m63m3N24J19K14J41j2l91j55M88K28L3O7j02k93l73J91N23n49J11
2254E4o7m95l0J5N08NL2J5l20N3J68L92K9p9O0j97n32J57O14j33k51j75J44n72
2278f05R5N88J04j37j95j31K56m24P92K65k67m19P5j48n0J82M00L3o72R4j72j98
2300e34M22L72m3m35j07M90RK8J65M1m64r3K58j57j36P03m92j45k50K64NrK10
2323A02L06l38m48L24K27j78J13L72m25l61P1L93k2n8Q3j81l81P2M00p1K2K5K51
$$ y = [-354, -375, 152, 280, -66, -174, -210, -1000, -742, 21, 451, 249, -19, 74, -104, -342, 522, 884, 628, 128, 170, -73, -248, 112, 592, 172, -367, -410, -465, -583, -335, 366, 382, -155, -230, -73, -28, 165, 825, 785, 20, -186, 70, -25, 67, 223, 372, -123, -913, -537, -293, -324, -26, 577, 24, -389, -307, 199, 315, 744, 759, 496, -156, -144, 190, 123, 75, 172, -204, -667, -710, -186, -67, 147, 288, 276, -115, -270, 218, 446, 479, 546, 444, 151, -222, -31, 492, -57, 54, -13, -508, -538, -523, -15, -10, 22, 37, -283, -230, -62, 330, 359, 280, 340, 143, -389, -232, 382, 249, -2, -177, -33, -605, -510, 78, 182, 45, -150, -281, -25, -449, 343, 608, 341, -78, -3, -151, -201, -19, 381, 414, -258, -164, -336, -534, -112, 260, 217, -218, -325, 165, 174, 202, 367, 408, -56, -149, 109, -48, -184, 519, 27, -118, -368, -104, -99, -108, 102, 408, 70, -378, -54, 173, -5, 108, 480, 55, -306, -235, 158, 136, 78, 161, -20, -401, -329, 71, 0, 22, 47, 298]
2346B98n40l7L65K11qm6M3p74J7K51M37k75J48k3j81oj12N00k14L4J23l98k79
2369d66K15L89p9j98J85r9j54J8L70J31k09j63K98m61j64P30q1k44k31J85j47
2390a75l7K78K27k04l47J05J96j58J21K54p0l21LR1p6LL27J82n97q0Q5K6K6J54
2414A3L77n90q7J38J22J58o0K62k48m12J87L19j5j5K61l85l47J96M19l66J32K03
2436B62n39Q2j33J80K48k49L05N4n30J37M79J02l32L52l9l86k13L75p1pM4k1m46
2459c46j51M75P0j42J1K63l66q2K07M78p5j74J50k43k90j05M31j13o7O2L6n75
2481e46J71N81Kl52J12J98k96L2L24J07l83J14L4k00M3J03L55m53p3J54j67k01
2503c41J85L78l8m13L61j56q1K76J49r8n27K16J11n9j12L70p9k90j39L33k3l27
$$ y = [298, -242, -279, 86, 297, 289, 243, 286, -488, -471, -220, 217, -58, 90, 67, -114, -120, -232, 268, 54, 88, 211, -187, -466, -251, 138, 59, -139, 46, -53, -207, -189, 181, 312, 103, -60, 238, -223, -387, 343, 262, 18, -213, -28, -175, -212, 66, 293, 89, -258, -153, 43, -115, 6, 260, 190, -131, -128, -37, -113, -110, 217, 399, -198, -278, -193, -167, -141, 13, 390, -200, -287, -149, -27, 131, 71, 333, 85, -327, -140, 179, 164, 149, 410, 25, -322, -126, 293, -73, 59, 262, -277, -195, -328, -148, 100, -149, 156, 210, -320, -183, 296, 398, 66, 418, 379, -7, -220, 155, 84, 77, 121, 100, -346, -497, -22, 48, -94, -83, 180, -186, -268, -61, 417, 342, 168, 318, 75, -215, -320, 111, -2, -69, -7, 29, -546, -375, 206, 208, -144, -32, 166, -130, -98, 226, 333, -50, 64, 98, -102, -59, 44, 399, -54, -127, 27, -140, -341, -156, 222, 184, -229, 132, -24, -105, 171, 320, 222, -305, -89, 22, -37, -149, 221, 142, -148, -287, 46, 23, -304]
2525c04M13J25k78m7K73R5j43J66M7l47j08p4J69j11K92M1j64l20O6L32q9MJ86
2548B24P6n66L71J96k47m8K52l2m76j77N83Jk65O2J8j08j66K77J61j34K96o0j53
2571H5l25L21L81n54J34Q1j48l05M65L5l98K2L98j67n17K90K79q4lq5K91k08r6
2594a08K44n8mj15k7M4m24M62K61l51N7l7j25M9J02M02n33J45j50K38k52K24L42
2617C86m31K5l08N13l69Q8L65Ln82M26Kl76J77L98O3m70p6J88j4P1J93K8m82o5
2641b47M9J72r1P9J46k67j93K63Q7j0MJ92O4m86K37J07RL2m6L5j86j78M82k64
2665a0l7R4J14l81j66P62j28l10J25k26J69k44R9M67m22m2L61l86k69M52K08l31
2687a01J60k3k49k55L29M93k11r9n9p6k07K7L05q8M8k1n7R5l73N46j33j01j51
$$ y = [-304, 109, 234, -44, -91, 182, 277, 134, 300, 347, 0, -108, -182, -13, -124, 168, 209, 45, -275, -209, 123, 34, 38, 224, 300, -266, 105, 301, 54, 6, 258, 226, -250, -427, 156, 157, -108, -46, -28, -136, -302, -25, 136, 2, 298, 238, 85, -240, 81, 462, -92, 42, 123, -25, -330, 135, 170, -228, -206, 192, 25, -492, -202, 77, -7, -10, -95, 196, -12, -108, 136, 78, 74, -41, -68, -24, -448, 14, 275, -76, -19, -56, -181, -132, -30, 372, -161, -16, -166, 72, -180, 44, 386, -45, -20, -328, 185, -184, -96, 269, 272, -310, 116, 118, -258, -81, 317, 380, -90, -166, 22, 8, 79, 272, 300, -182, -247, -198, -26, -117, -38, 108, -159, -352, -89, -2, -12, -8, 184, 248, -238, -1, 106, 115, 147, 101, 136, -50, -228, 254, -10, -47, 47, 161, -220, -386, 376, 248, -62, 63, -163, 6, -238, -139, 328, -94, -136, 225, -161, -430, 22, 230, -101, 59, 36, -213, -468, -139, 354, 143, 44, -15, -91, -298, -271, 34, -54, -6, -27, -84, 11, -362, 184, 51, -50, -201]
2710b01J86J38l15K93M32p74J01K03O4j95K79J04l15k48q8M22k23L48j5j77k12
2731a93J76J66k91J17M32O0l94l05L45k16J23J56k6k75l60N49j12j81L00P1n29
2752c87K40J78J91j80J22pJ49n22L10J96j19k13R5k49j35K50J15k32mM30m66N7
2774a81J42Q7J47MJ07l0n54L49L77k07m42J15nk61K5J48K16j71J65j6J9l55N48
2797B27J24j13k83N2J84k54L82j69k6k94R5J79l63O2L66l1k76J08j40j30K37L49
2819B86l9k10r6N3k0j55N14o9m67P7R9n0j96K65L43l83k24J83J6J6J83K57m23
2842d0r5kJ29j28Q5K34k20k81J89K49k59J28J47l5l97Q6J64J54JnM0r6j96J58
2866A0K62r8q4j37R8m56M98k11J02k8K56j64l35M27l7Ml44L13r4k01j7M45P1k11
$$ y = [-201, -15, 123, -192, 101, 533, -241, -140, 63, 127, -68, 211, 315, 0, -248, -336, 86, -137, 211, 196, 19, -193, -17, 149, -142, -25, 407, 467, 73, -232, 113, -103, 20, 176, 150, -125, -485, 64, -48, -229, 71, 142, -387, -147, 31, 222, 42, 164, 157, 306, -216, 94, 290, 171, -42, 53, -196, -331, -81, 34, -198, -202, 228, -238, -181, -39, 48, 195, 199, 306, 276, -278, 71, 448, 241, -201, -86, -91, -352, -327, -179, 37, -134, 31, 15, 34, -321, 227, 351, 238, -45, 7, 191, -63, 319, 150, 124, -170, -75, 104, -259, -197, 169, 138, -138, -30, -170, -300, -63, 286, 247, 37, -59, -6, -26, -181, 333, 264, -203, -126, -27, -77, -273, -8, 335, -48, -272, -89, -73, -57, 126, 383, -40, -135, -137, -8, -136, -51, 183, -37, -318, -129, 120, -139, -11, 136, 101, -296, -210, -46, 108, 109, 104, 144, 48, -148, 10, 272, 174, 90, -47, 51, -405, 93, -118, -16, -44, 212, 48, -287, 140, 103, 107, -237, 76, -18, -219, -236, 209, 280, 69]
2890F9Q0k52mL3M71m02J0M1r2k5J2K91r7k08L7J24j10l63N83k09j5k7K73m82N9
2915b03K24L10k95j09L22J94o23K23J36j0m49K70J68k70QJ65q4j86J22L54j26
2936A41j24J98k07j92MJ99j07j8K9K40l91J56Q3M8j87J53J22l42j79M09J59M8
2958B42r4j33N6k52kM77j15k14N7r4k34R1O27k54j60J8l0j41J0L05K03m19J1J49
2982A04r9j58J97K35k23k73K61j74j48K84k2K27l19L0r9l1J31L08k99lL6LL2j28
3006a28L11J15l44P6k7n5j15L40j7l20L2m1K53k08K39n7k05o6O9J86NJ90Kl23
3030h8L3O3K1R5j42J30k28j91M2K47Q1j47K94k01k48J51L69l10K3L39j89k38R6
3053BM7j09K07j90J34k99j73J60M20j49p8K66l63l3R3N57m03m1Qj78n9K50K26
$$ y = [69, 149, -103, -107, -74, 397, -5, 5, 46, -46, -71, -59, 232, 135, -73, -36, 88, -22, -385, 198, -11, -26, -53, 220, -262, -203, 21, 331, 36, -73, 249, 443, -180, 43, 179, 169, -280, -10, 158, -112, -104, 61, -23, -209, -87, 267, 141, 17, 215, 8, -184, -180, 19, -88, -106, -77, 163, -228, -72, 11, 59, -128, 25, 147, -195, -374, 35, 194, 242, 148, 15, 71, -181, -183, 294, 179, -35, 22, -72, -306, -215, 412, 158, -2, 16, -14, -155, -145, 160, 363, -56, -45, 104, 5, -153, 44, 279, 56, -217, 44, -130, -278, 6, -16, 211, -108, -78, -177, -208, -77, 231, -68, -71, -35, -32, 0, -128, 183, 298, -46, 30, 3, -52, -167, 173, 156, -164, -132, -173, 80, -128, 111, 54, -151, -217, -148, 38, 43, 233, 235, -88, -55, 8, 29, 124, -18, 112, -116, -307, -265, -18, 63, -84, 210, 9, -239, -88, 281, -29, -6, 333, 144, -94, 2, 49, -60, 147, -43, 91, -208, -381, -221, 199, 50, -28, 238, -125, -158, -65, 492, 89, 48, 56, -122, -181, 69, 295]
3076B95l87J2J80r7k44O7L17r4j18k76L54j80J43N64j90l66p8L52n14R4N05l03
3098C6n4j94K88k37k2O7J77k09k35K48J21n8J31M7N6l46J23J88k14j0J84J11k46
3121d8j48K19r8j86K65kk00m9P0j6J22O7L27m39j1L64J72l87J70O0j15k10P7O2
3145F6q3M5q2k25k65O89j01M1p6M01o14J39K62N5%j07o6n1j17k3Q6N0r3j44L86
3170A73m74J55J55J0k37J12J36j46P4J64Q1r0k8L5k44LK36k09J19o9j96K91k06
3193a55J75J71j4k36J24R0k6N1O1N3k83J24J7j66p5K16M1k42k98L68r7R4K24j39
3217G8j96k2Q0K31J11m9j46n0j97K68N5j67p9J42j84j52K46R7j20J52p3j21m1
3240a37L4K62J33l84K54Q9k88q0L85K5l10Pn9j78q5N62p6l40J64n5r9O3J25J75
$$ y = [295, -92, -80, 100, 3, -241, -174, 143, 49, -69, -345, 9, -171, -28, 536, 346, -20, -98, 254, -260, -166, 339, 36, -18, -212, 76, -161, -183, -116, 61, -148, -383, -135, -14, -72, 59, 106, 162, -184, -61, 127, -87, -97, 87, 198, -48, -196, 23, -75, -261, 4, 2, -198, -247, -177, -193, -71, -4, 323, -116, -127, 237, 409, 22, 192, 252, 137, -73, 4, 66, -17, 28, -54, -279, -544, 145, 44, 85, 9, 410, -204, -65, 197, 252, 252, 145, 79, 28, -89, -112, -26, 24, -69, -213, 173, -301, -146, 9, 19, -218, -106, 30, -116, -42, 122, 203, 113, 85, 120, -124, -121, 115, -94, 25, -44, -240, 51, -155, 20, 191, 177, -59, 65, 155, 129, 180, 241, 294, 11, 135, 152, -14, -89, 127, 168, -74, -372, -4, -101, -7, 217, 78, -118, -140, -60, 171, 282, 233, 87, 37, -160, 108, 163, -4, -83, 59, -125, -277, -31, 66, -54, 98, 25, -96, -137, -103, 159, 292, -92, 162, 251, -37, -117, 268, 293, -17, -10, -69, -247, -332, 230, 154, -186, -22, -77, -176, -113, 12, 187]
3264A87J27k06O7j43k8O0Q1k01o3o6m3N0K67L5l8o7j43J21J05k29M06J8k92k31
3288b26m8M65l05Q5J83j46j72P4NJ19K44j89K29n05J73j86J96L3j7J01j49pJ45
3311A02p4n4Mj31j4j74N53k36k5L11q7j26PMQ2j63N4J85k74k07K62p7K3M4j38
3336a49J03J4J6J0R0O7J2J48m87K37L4n5k02R5J4k2o2J61J03j74j03J74k18K10
3360A6N7J19j75J11K19k56n5Q3j8j95k7J05k17J09J26N9k03m7N2K67j76j3K78
3383B19m1k04J66J00j97o6K74j06j16k22O1M8l0J75m2k93K17J18L7k49L11L8l03
3406a05J49K85l11n9J28q0O7l16K25O5q2P3o9j19K2j62L04Q1j86J23L9j58L1K29
3430A74j3k57L37l00p7J6K94j67q5J49r9k11J69K7K92j08n7O1j14J01q4J5jJ12
$$ y = [187, 314, 108, 175, 32, 4, 64, 145, -56, -119, -185, -228, -178, 89, 124, 86, 19, -124, -3, 102, -127, 279, 297, 5, -226, -274, 191, -114, -29, 154, 8, -164, -90, -85, 34, 278, 89, 318, -187, -14, -200, -4, 29, 12, 113, -36, -43, 102, 28, -26, -22, -153, -167, -341, 212, -24, -49, 262, 175, 49, 56, 60, 142, -21, 33, 218, -56, -263, -1, -78, -55, -11, -149, -46, -32, -16, -6, 84, 151, 163, 311, -176, 61, 95, 40, -162, -67, -53, -75, -137, 24, 127, -47, -150, 24, -194, 16, 73, 192, 17, 128, 347, 91, 36, 119, 101, -94, -121, -16, -233, -124, 2, 61, -142, -189, -137, 130, -46, -59, 219, 178, -26, 140, 240, 43, -23, 251, 145, 29, -193, -132, -84, -114, 61, 19, -274, -57, 61, 98, -151, 160, 198, -105, 44, 329, 18, -41, 87, 7, 74, -242, -17, 48, -34, 39, -30, -149, -127, -289, 15, 96, -90, 33, 72, -86, -55, 174, 161, -96, 241, -59, -136, -120, 174, 7, -78, 71, -28, -239, -70, -43, 249, 141, 84, 145, 31, 132, 48, 63, 62, 174]
3454A74j10k09O2N0K50m75J66q4J76J60k36K30n1r9oj00J00K13j7o2l77K27J4
3477dj13N8J09m7j98j30J60M0K5K08pk04j62J39L7j20K52K28k82r3Q2P4j18j8
3501h4J64j79r3J4R3J28j10J44j8j73L04o6j3M7K1q1k14J31l5O5N3j03J79j21
3525E3n0k49L63m4j23J28O1j96j7K48l17J71n3l7JK10j82K75r2o7o4m3K4J73k19
3550d6K8k6J39l19J26J21j4n3M8k24J28J23k17J89J61K0j11j5j49J69J78j86j82
3573a12N5L5j04J06J9O7o8l0Q9j88qL23k34m0K70k16N7K36P2j32l29J47J23k23
3597h5J24l4K03l34J70K85m75J32K2Jm8Kk2J6J52J65k47q9Q6Q2j88m2m3J68k28
3622b27Q5J80OR5l62K21o0j33K45n2K77l87J03M6j88J50lLj45K56r6L4k76K45
$$ y = [174, 64, -145, -83, -33, 217, -258, -92, -176, 0, 160, -76, 154, 103, 4, -2, -102, -2, 211, 194, 132, -245, -18, -4, -117, -59, 50, 3, -195, -325, -165, -125, -100, 108, 101, -103, -265, -126, -89, -209, 43, 271, -11, -104, -22, 52, -66, -84, 80, -99, -192, -178, -85, 43, -67, 77, 59, -114, 190, 124, 111, 158, 179, 98, -116, 15, -20, 45, 98, -5, 174, 53, 3, -246, 117, 73, -50, 78, 139, -57, -74, 174, -143, 28, -25, -62, -61, 149, -33, 242, 150, 83, 19, -24, 0, 173, -46, -18, -44, 95, -224, -98, 23, 9, -44, 4, -220, -92, 31, -186, 3, 164, 184, 73, 58, -91, 78, 256, 70, -112, -57, -22, -126, -20, -1, 66, -2, -32, 57, -131, -139, 184, -50, -90, 180, -36, 21, 257, 329, 197, -132, 15, 138, -85, 39, 5, 208, -126, 44, 329, -146, -14, 8, 9, -39, -37, -59, -43, 109, 274, 27, -62, 24, 106, -82, -124, -167, 1, -227, -142, 38, 44, 139, -223, -2, -62, -195, 50, -2, 275, -112, -9, 37, -151, -1, -4, -1, -146, 110, 14, 48, -228, 17]
3646A7k4L1o9J87l2k33L37j05m4l3K1j56m0L58j27k52p3K33n8NjP2O4k16M0Q9
3672iK88k22j19M3J51j17n3L3Kj8O5j04K72j1l27J13N8o2lO3k1j44J53L51l05
3697G7Kl35L91j18j20LK5L0J22j7l7j2m5j00K14j39J07R0K4j66o7J21j45KK26
3722A33K0l62L33r8l7n0K46j54l1o6M24m46Q7O6j25K8r0K18l60J86R4p5J17k41
3746a83l3J06O4K19k47L5J94j52j5J44k14Q2p7rN3M5j14R6Q6q1M3l3k4oJJ23n0
3773E3M7j11o7R5jj2L9N9p8K02k07j59K09j80M6L2l3N1r3M8J3r4K66j51L6M9m8
3800A1O1j14OJ23kn5M5J33j82R4m3k83M65r0j51j21J76j08j00P7J36o8Q8j02N1
3825D7j44K38n4k59L1J22k36R5J95Q7o2P5k17j02P4M4J47R2j54Q3m6j68Q7K38
$$ y = [17, -7, 24, -45, 142, 110, -123, 214, 109, 65, 32, 53, -103, -143, 215, 88, -164, -237, -4, -62, -57, -58, 14, 78, -138, -98, -9, 279, 57, -62, -19, 132, 15, -38, -5, -3, -21, 44, -60, 212, 201, -126, -13, 45, -17, -20, 43, 22, -122, 31, 382, 77, 79, -256, 135, 17, -103, -100, -75, -45, 77, 60, 23, 11, -34, -134, 80, -59, 48, 138, 162, -4, -71, 50, -95, -93, 133, 153, -209, 124, 26, -11, -61, 185, 31, 0, -66, 358, -88, -1, 65, -60, -32, -122, 96, -264, -78, 16, -59, 58, -183, -216, -110, -46, 173, -74, -39, 155, 3, -12, 132, -82, 0, -77, -86, -33, 12, -102, -6, 80, -1, 42, 9, -15, -21, -20, 103, 53, 100, -11, -78, 17, 16, 4, 43, 102, 24, 226, 19, -140, 69, -111, -65, -33, -66, -15, -108, -60, -47, -141, 125, -26, 10, 59, 11, 72, -42, -36, 87, 85, 30, 75, 208, 26, 120, 77, -206, 259, 169, 18, -103, 73, -35, -135, -58, 78, 10, 98, -4, 47, -97, 141, 87, -172, -141, -19, -255, -160, 35, 122, 60, 135, -82, -184, -110, -66, 81, 173, 19, 102, 56, -112, -25, 213]
3849B13j21j22L4l3K18j79M6j02K16j64J05r7L0K8j33L4J19k31P5O6J48k65L7
3872g8Q3j14J66R5k0j45k8M3J28J86k86ok7q1n5K65m8j90J01j55J38K0J25j25
3896ho2M9J12R2j64J45j52l2N4q2O7Q4l72J86K29m9L2M6m5k92J59K42k53P6oj44
3922h8J34O8j14K5j9m0N0j8k17L04j17R3j50n9J1J84k38J53l4K07j00k30M0R3
3946f2L82l78J89j22j76K27j23k30K71M0n1J1J08j43M4j42K2K92k19J3M9j10K10
3969A02j28n4Q9p6K45M9k77QO8N0j23k3L69l26mm7Q5j09o1K31%j36K07M8j17l9
3995C1J64l20J76J9j13M8j00R8m6J9k31L46J03k41n9K73j05j67K5kJ23j54L03
4018A90k47O5J48o8j37j6j5K16j84k9L2O1m9M7k6k11K20j18lL16k24q4J02M8q5
$$ y = [213, 92, -30, 4, -29, 189, 10, 56, -46, 170, 6, 111, 14, 44, 72, -61, -27, 92, -139, -64, 2, 150, -115, -78, 5, -109, 57, 152, 132, -13, -41, 2, 130, 316, 30, 24, -3, -84, -139, 126, 78, -112, -11, -166, -28, -8, 117, -8, -70, -21, 91, 183, 19, 164, 12, -20, 34, -48, 19, 103, -269, -83, 146, 97, 129, 175, 130, -162, -3, 239, -14, 62, 56, -88, 46, 114, 0, 25, 6, -34, 16, -2, -219, 85, -32, 61, -89, -148, -137, 47, -191, -38, -72, 135, 35, -195, -155, -62, 320, -58, 131, 9, -167, 60, -63, -293, -22, 18, -33, -22, 86, -57, -13, -155, -133, 159, -60, -47, 2, -108, 102, -26, -80, 9, -67, 178, 227, -50, -42, 26, 76, -47, -70, 299, -27, -31, -78, 7, -102, -163, 68, 68, -68, 139, 187, 70, 31, 195, -125, 51, 70, -43, 5, -95, 3, -43, -24, -255, 91, 194, -47, -106, 167, 62, -105, -80, -82, 41, -113, 190, -57, 8, 156, 88, -49, -65, -80, 136, -48, -77, -45, 16, -33, 14, -12, -223, -3, -121, -124, 192, -32, -116, -14, 34, -51]
4043e1j5J16j51m2J44K47m60K12Q7j75J31j9m1K6j13K83k49M9q0J32L4l14K68
4066A9O0o3p4J78k22J10o5K94k32n0m5r4M9L7J73q5K3K55l64j6J39j64QK04k0
4091E5k47kL49j21L2q1M1j51J51j38q3Q8lM9K33j52l7j5J39p7K24k89R4Q9k83
4116a35K22j65J71n4J5j45J84l2m2p1K10k51L25m74L44Qj22o6J31k33k8L30p3
4139D9j81J69p3J46k56K54n5L5O9j88LJ9K3m5j08K7L03l77J04j6J81Km1J13m16
4164b59J51J03KK0j8J00k2l14J61K09r7j13q8Q5Q2K01q1r7j04L67l08p8p4J67
4188e%L3qL9lJ0%J36j90J4l12L47r6j34K20j06J46j81J38J2J7Q7j37J52l32J97
4214D4R4j52j16J13R3r6j8K2J11Q7j13j8J04m6l22J43L9N0J2o3J71k25J16J37
$$ y = [-51, -66, 50, -101, -143, 1, 248, -212, 0, 87, -88, 43, 24, -17, 9, -104, 179, -70, -21, -101, 31, 65, -249, 19, 79, 16, -58, 120, -102, 8, -57, 237, 5, -45, -90, -184, -135, -98, 75, -10, 13, 268, -96, -112, 27, -137, -129, 75, 55, -192, -194, 155, 34, 66, -15, 26, -125, 26, -112, -195, -107, -110, -61, 172, 20, -17, -32, 107, 30, 254, -35, 59, 148, -135, 87, -78, 93, 39, 54, -91, 93, 61, 19, -52, 158, -93, 232, -242, 102, 110, -12, -78, 53, -180, -208, 122, 49, -132, 37, -36, 110, -146, 108, 53, 88, 157, -31, -28, -9, 14, -31, -139, -112, 191, -186, -82, -98, 83, 85, 44, 157, -259, -108, -5, -3, 17, -1, 99, 77, -237, -76, 133, 36, -77, -165, -80, 2, 203, 122, 25, -79, 288, -20, -98, -172, -5, -5, 28, 20, 59, 56, 66, 66, 202, 12, 26, -286, 61, -35, -169, 51, -55, 91, -90, 48, 60, 77, 164, 27, 179, -153, 44, 138, -14, -130, -17, 76, -20, -38, -16, 95, 182, 69, 51, 155, 109, -213, -70, -31, 19, 31, -32, 139, -86, 30, 167]
4238A67l33J27j02K20jl14K33j09J84n5q5P2K99k68O9l11K05Kk31J44L8J03p3
4261a9L6r5J76R2j11Q3k15J6m6J84r8n8j9J64ml29M46k13k13J96J21l54K53Q1
4285G4K1r2O8j57J2J5L4J2J82m5k78J26L4l5K32k43Q2l66L14j61K39j71J37Oj31
4310i1k7q7K74P9j11k42L33q3J64j76o2K18j1L2k51k5R4j1lj47J95j43K9L5k73
4335b90L5L04KJ7j06k4K52J8j22k5l4J58j81jK1l03O3J44J34p2p7K79l64K09j6
4360B1J17j96j00J57N5p0P7p5R1j27JM0k05L90j72q9K4o6J40k74J41l1J46r6j9
4385a20J36L3P8oJ29j35k50j14J41j3O7L9J70j79K0j5J46o5R1q6J1o9P2j33J65
4410A13m16L43r3K0q3J93k23K03Q0j77k27L16k71J79j6J5M2K30j40j68J8l4J07
$$ y = [167, -166, -39, -141, 79, 78, -236, -3, -112, 72, 17, -68, 4, 303, 35, 104, -207, -2, 0, -231, -87, -49, 54, -19, 17, -78, 98, 190, 79, 162, -53, -37, -83, 101, 3, -55, -74, 90, 86, -243, 203, -10, -223, -27, 94, -260, -7, 74, 95, 3, 71, -86, -74, -59, -25, -13, 169, 124, -154, -28, 6, -29, 203, -40, 42, -324, -10, -171, 68, -103, 34, 40, -91, -118, -205, 69, 148, 37, -205, 128, 45, 209, 33, -29, 189, 178, 210, -41, -66, 28, 17, 14, -133, 62, -81, -52, -17, -290, -255, 49, 51, 68, -38, -62, 190, 208, 86, 61, 27, 185, 4, 3, 24, -279, -216, -72, 62, -10, -87, 192, -172, 37, 21, 138, -58, -158, -1, 54, -16, 61, -14, 77, -50, -49, -9, -214, 176, 4, -85, -61, -127, 13, -261, -120, -151, -5, -101, -120, 16, 49, 127, 121, 250, 115, -135, -249, -108, -121, -54, -15, 155, -24, -4, -19, 127, 62, 153, 67, 78, 9, 81, -52, 113, -303, 40, -53, -33, -116, 77, -146, 57, 137, -40, -267, 49, -222, -43, -59, -44, -2, 228, 88, -80, -62, -96, 11]
4433A1j10J89j88n0J44J7J58j31j30L1o2L01o6O1j64j0K36k30J58J3q2j66P2r2
4457i0l4J18p9R6rp9k9L64j45k27N4N5l2R2J35r9j5l6n0j6o0J39k2MR9j39j76
4484a81J25P8Pj04J24j44j36J79q8k1L5K61j71K62k35J84k42r1K77j89N1j90J2
4507a97K93J1k02j49L71j39L2m3M2m0J83K48l15j02j59K26k60J18J81q4m1j11
4529a37L14j81N6j40Q7L4k3l9n6K04Q8l90L7J02K34N7j98m5J84k69O3J79j37P3
4553I7NRj22j8L8RJ07k09J58J00k43J10l7R2k59L47k64J0K81j64q8k24J63m0P0
4578g2L29l76R1o7Q0J9J19k53K72k35N2j50J88n6o7K37j17Pno0J80j68j52J31
4602g3j4J18q1J38j00P1j12J63j04kj04R6j38J11j17L3J7k2L38j11r6k0j02K00
$$ y = [11, -99, 90, -98, -148, -4, 13, 171, 40, -90, -59, -121, 180, 114, 175, 11, 1, 237, 7, 165, 178, 96, -70, 2, -90, -124, -6, -85, 11, 2, -77, -106, 258, 113, -114, -60, -5, -37, 55, 190, 91, 76, 40, -10, -26, -86, 53, 31, 35, 134, -5, -181, -56, 22, 29, -75, 49, -95, -231, -52, -140, -161, -126, 135, -36, 226, -9, 175, -67, -158, 119, -70, -19, -209, -197, 96, 107, -95, -244, 127, -12, 20, -23, 19, -21, 162, 410, 95, -7, -166, 60, -200, -82, 99, 15, -26, -137, 177, -4, 52, -88, -1, 33, 10, -29, -85, 119, 207, -183, -146, -44, 190, 247, 49, 4, 188, -81, -18, 161, 24, 97, 102, 111, -11, -29, 9, 18, 125, -84, 74, 174, -69, 41, 4, 96, -163, 184, -80, -70, 211, 47, -41, -265, -102, -142, -72, 257, -119, -28, -95, -15, 4, 123, -130, 142, -93, -41, -191, -3, -59, -126, 111, -6, 1, -4, -64, 116, -52, -204, -73, -87, 31, -50, 88, -12, 59, -53, 110, 6, 4, -100, -4, -142, -31, -148, -115, -98, -120, 218, 107, 11, -9, -111, 89]
4626H9j52j17K30R6j72J00r7K17j10j7m9mo9j34JJ00J34j91k0J46o9Q1q5L8j7
4651g1KN1J21q5J57r8r3j50K11k00k6K49j93Q4K45k17J60j33J69o1n9J36j61l6
4675BL4j21N0K33j01j60k9K5J31m8j20K92l91L81j35Q9j94J63j04q8Q5q4L51j50
4699A11m3j0Q7j6q0k0k16M0K31j03Pm9j1K54j74M0j90P4R9j1Q8j81q7j06K71p
4725bO2k60K00l2Q4J17j84M6j51J80k82K89m4K6m3J56J2j90p8j63J74K96m72N02
4749B43q9l11J41n0J5J27l14R3J50j53K68j1j08K9J3j18J8J29k62k8L91l25K52
4772A00j92J69J18q9p1L9k0J76j49M0j58Rm1k6O6L3k34K58j7n1k96L19p2n2M3
4797i8N7j3Q1j14J4K00j32n5K0l6J72K5l39K11N0j4j68J59rj39l8O5K39k3l08
$$ y = [89, -63, -180, 50, 146, -26, 74, -23, 194, 84, 67, 18, 14, -55, -189, -188, -88, 46, -145, -165, -19, -88, -7, -92, -54, -71, -69, -18, 103, 18, 175, 77, -16, -166, 45, -155, -181, 68, -125, -41, 204, -13, 147, 14, 183, 122, 63, 199, 38, 2, 36, -85, -35, 198, 97, -63, -92, -67, 64, 16, -104, 188, -203, 178, 43, 132, -62, 101, -3, -91, -6, -90, 261, 111, 68, 58, 145, 129, 49, 29, -187, -147, 84, -19, -12, -61, -72, 182, 8, 48, -142, -68, 31, 20, 108, -73, -160, -266, 5, -2, 60, -200, 0, -32, 52, 169, -15, 31, -120, 60, -222, 67, 23, 49, 6, 162, 174, -16, -94, -257, -83, 213, -259, 243, 154, -157, -16, -66, -51, 76, -238, -145, 5, -148, 120, 109, 1, 30, 43, -75, -57, 72, -190, -218, 173, -152, 100, -92, 77, 195, 106, 35, 74, 54, 230, 81, 121, -37, -28, -69, -95, -29, 4, -230, 28, 11, -40, -336, -17, -89, -141, -98, -41, -54, 27, -87, -73, 127, -5, -60, -40, -76, 96, 121, -218, -7, 43, 29, -139, 20, 11, -128, -166, -101, 138, 115, -193]
4822a93L55k4j17j0k04L18k00qJ75q8k02J90N3J29j40r2n0k6K27m0j68P7K63j86
4846C9n1j31L4l6K53p6K27k67j82J12K02o2M8n6n9j26l0q7K70L6J15j77o9NK49
4871A81p1J1j03Q2L7j14j6M6k27J07J18p2k01K17N4M3o9m6r1R9lJK39l49J68n8
4897a7j12J11J60r6j17J73j06J5R7k08J29J8j73J08k9l5pLJ17J13k19r3J99j06
4921g5J28L6R6m10K07O0j6J79j90q4lM8q5pJ49p2n9N7l9J18K98j87l9K6p3j01
4947c8j23K00J45j06k12k1J59R4j39J05J9L8p6J78p6m2q3o3k3J55j8O7m61K34
4971h7J74l10M0J29j3K51n3j72p8Q5K3ln2P1R6k01K71j70K17j57j44l9m4M9J15
4996bO3j75Q9n7L6N3O7rK00k59j70J65j2j30J48o7m9n1l8O9O3J19r9N1n2k3L0
$$ y = [-193, 162, 138, 21, 11, -193, 125, -75, -83, 92, 4, -198, -8, 45, 174, 34, -58, -108, -134, 93, 53, -115, -38, 225, 39, -12, -143, -109, -145, 108, 32, 259, -8, -190, -78, 124, 62, 110, 54, -5, -131, -161, -248, 22, 58, 173, -4, -73, -68, 181, 110, 121, 18, 100, 137, 23, 7, 53, -174, -67, 51, -21, -222, -5, 49, 92, 23, -23, -114, -15, -18, -17, 222, -127, 41, -17, -129, -18, 142, 46, -71, 102, -4, 11, 108, -100, 29, 47, -126, -18, -47, -82, -89, -86, 31, 144, -75, -168, 31, -75, 53, 89, 185, -225, -18, 42, 26, 205, 15, -69, -72, -24, -109, -116, 33, -39, -98, -41, -80, 38, 336, 149, 110, 136, 63, -38, -161, 39, 184, 78, -134, -155, 4, 98, -41, 64, 83, 121, 45, 223, 147, 105, 22, -41, -64, 91, 73, 140, -321, -87, 87, -223, -183, -54, -67, 184, 131, -41, -119, -34, -11, -14, -66, 5, 101, -100, 171, 1, 218, 61, -83, -122, -166, -117, -2, 61, -114, -25, -82, -46, 7, 74, 65, 265, 6, -164, 1, -11, -141, 7, -60, -109, -160, -198, -129, -66, 53, -46, 5, -47, -70, -40]
5023d0K5P1l6J31N8j95O3n7qj1j67K59K9k11J46m0J94k69p3P2Q8m4Q6R8k42J03
5049C0J24k26K56j21k2J82k34M4P5p0j68K78M9l38j62L01j02P1J42or2j01J35
5072D5J56j62K86j97J6k41JR3Q4j97R3N4j69O1p1J26n0K32j61m5K92p4kk16J78
5097A32j42L12k95P3r6j67K18m6n6q1J14L66l81M2J03N2l7r6J37j52n0N5j08o0
5121a63J57l01L98r2j90J43p5R9nJ19J05j32q4R4O2l02L01P6j50j82J14O0mj8
5145C0j2k50P8L9K2R2J22o6pk13L3K19l4K09k98O4r1K32j50l8nJ07r2o2J3R0R
5172D1J50k14j75M1k3K04J33J98j74k8j88J07n3M7j73K07l02K41j67p2J16J78
5194I4j1M4j22Kk10K28L2j54R2l4r8L1J70M8l2J08j16j69J40p4J97r7j07j3J08
$$ y = [-40, -15, 56, 20, 151, 209, 14, 77, 20, 12, 1, -166, 93, 122, -89, 57, 17, 211, -58, -131, -59, 29, -15, 71, 169, -73, 30, 154, -72, 184, 63, 41, 223, -11, 33, 108, 38, -130, 148, 197, -141, -303, -2, -104, -33, 109, 103, 11, -90, 45, 201, 39, 325, 128, 144, -97, -96, -3, 81, -116, -23, 31, -138, -77, -148, -22, -72, 160, -1, -46, 246, 172, 170, -46, 132, -10, 302, 7, 80, -16, -183, 35, -11, -67, -148, -34, 332, -49, -7, 96, 148, 111, 15, 152, 0, -50, 5, -103, -163, -6, -307, 91, -1, -191, -48, -123, -24, -29, 90, 195, 63, -21, 73, 135, -167, 134, 210, 60, -122, -8, 52, 48, 30, 18, -232, -154, -115, -93, -1, 121, 55, 48, -165, -132, 87, 53, 262, -36, 28, -63, 169, 19, -19, -24, 83, -9, -71, -58, 32, 41, 191, -23, -198, -157, -180, 24, 157, 355, 181, 153, -35, 72, 19, 66, -107, 100, -202, 39, -128, -200, -84, 94, 83, 127, 5, 7, -203, 25, 57, -97, -5, -39, -137, -106, 64, 112, 80, 188, 72, -97, 43, -31, 166, 69, -38, -51, 57]
5219E7Q9l25K05p9P9j52j12K64j17R2K39m53J09RK29o9J30k92P8J29l7k17K65
5242A21k47K31j31m4m4r0J49q0J76l1NJ70j98J37j5p6J2j21N6j03K16P0k24Q8
5266B7j84R3PJK74k72J67j34o7J42R0j65j8k4K23j88r7K17K14l71j75K18k11P6
5290a57J72k00J31K1j92M05p0j56l3J45J5k25K59j93o3J45K3k23m2K26k61L52
5312G9k36K87mk01p1K54p8J07n8R5j78j07K28q0l7r6n6L01l28J62M0m0m3oN8N0
5338D2R8r9o8K06k43l1K99j47k6J10k65k4J01j57P2j8p2k1M32N1l53M25j42l9
5362A31q5j51M39m28N1K73l27j5Kj87K86m4j09J24J02j74K4J76J43l0l75K96n9
5385F3l6M7K60l47m6K17l5j05m8k39L30J00k44P5N9J68j72j20j6JL92j23n7J41
$$ y = [57, 146, -179, 26, -53, 26, -126, -238, 26, -91, 1, 240, -213, -104, -95, 134, 65, 195, -97, -19, 110, 73, -144, 121, -126, 105, -26, -70, -114, -204, -55, -135, 41, 10, 15, 185, -13, 124, 109, 33, 45, -76, -20, -123, 93, 163, -61, 27, -157, -64, -57, -56, 218, -54, 113, -21, -88, 54, 144, -21, -39, -63, 160, -28, -125, 92, 306, -65, -240, -22, -233, -157, 15, -185, -54, -33, -225, 180, 110, -46, -79, 66, 81, -144, 115, -78, -141, 4, 27, -196, -238, -12, -273, 79, -157, 130, 126, -75, -146, 108, 30, 137, 79, 174, -4, -111, 117, 37, 0, -96, -152, 149, -179, -17, 23, -17, -60, -66, -8, 42, 140, 41, -27, 179, -64, -95, 204, 57, 31, 141, -124, -148, -47, -204, -132, -150, -222, -243, 189, 240, -113, 312, 170, 131, 46, -105, 334, -94, -43, 230, -97, -112, -110, -297, -11, -55, -164, -40, 62, -112, -88, 88, 231, 201, -174, 122, 63, 27, 74, 334, -13, -59, 158, 123, 18, -30, -269, 61, 161, -83, -8, 51, 219, 47, -73, -89, -88, 304, 181, 124, 265]
5409B65k42r8P7qj34Q8o9M5J00j77N9O5J18O9k05J31j8j72J71M8J62j69o9j60
5433a23j18Q7O1Q4J97m25J04K47Ll7Q1q6l1k76L03o2L8On9Om9k8O9j27KK55k25
5460a03J87J2p9J68q3p7K4l1j72J24L31n20L57j87n5j11R4N2J79l6j56K62J00
5483B80m7Q5j20J7j00m8k19L43j36j35o3P1j75M5P0K40j35J21l07K23j8jR9l5
5507E5l8J17j28p1j71K48n7%n3j05J75Q5Q8j26J25j0j6K7j58J52J9j4j92j56J70
5532c4J49J6l71Q9J52K6k42L32j04Q7k01Q7k6K51l1K71l53K26k17l00J42K53j28
5555G4p8o3k32K82Ko9P7J17j28o3j06K18N4q4j8lP9r7J69l17R1J70j77j07o3K14
5581e8P3N3N9k02mPP0O6P3r4q0J91l28L8o9lJ05K0J22j37K46k88L93k52N9j89
$$ y = [265, 23, -75, 2, -6, -140, -52, -121, -76, 24, -153, -94, -29, 89, 158, -47, 84, 66, -106, 65, 113, 275, 106, 37, -123, -241, -154, -93, -9, 188, -237, -133, 114, 117, 80, 161, 75, 44, -232, 71, 9, 47, 53, -6, 0, -49, -77, -8, -135, -133, 122, -103, 84, 96, 17, 185, 102, 25, 49, 18, -154, -30, 301, -219, 138, -49, -104, -215, -121, -69, 110, 74, -82, 180, 280, 233, 318, 198, 215, 115, 67, -152, 191, 55, -80, -143, -72, -247, -202, -132, 108, -27, 94, -213, 10, -8, -9, 90, 55, 17, 134, 6, -65, -236, 12, -45, -45, -98, -203, -28, 57, 145, 19, 144, 134, 118, 145, -13, 139, 158, 144, -48, -204, -34, 115, 131, -240, -151, 1, 27, -215, 117, 13, 100, -101, -14, -40, 211, 180, 451, 98, 324, 107, -193, -51, 202, 74, -4, -67, -299, -17, -15, -84, -7, 110, -18, -81, -187, 31, 85, 1, -17, -20, 59, -38, 131, -186, -95, 75, -102, -209, -272, -58, 15, 68, 127, -75, -79, -72, -2, 64, 137, 43, -37, 154, -174, -136, -205, -208, -103, -83, 39, -98, 148, -140, 253, 1, 60, -129]
5607a29J47j40K69J16j83n2K03j74q8J20j95J36k18r2J91k2L8J84k65K88J9j21
5629C2J26k51K12pj23QJ0J82j57q8N2k60K20j2K2J01j88K55q1q7j62K13mJ44j02
5654E5j55K9r7J44%nJ27k82M3n3J6L6m2R4N3K27M1j43K07j71j49J42k48J01K07
5679A77n5M2j55k20J3J09J23j60O0J61R6j55j28j3J05J34jo6q5J73j52K06j94
5702A5j21K1%m7J17J73o1j8j10P0j11R0K4L7K14k32n5j63K22M4j5J99l37k70L18
5727Dnj4K9j11P6J39l4J17Kj26j42q9K22K8L8j00k4j11j06kJ76p8K42k76k07K72
5753h0K65j50J08j55J07O9K5j64L5k18K40j72m5J22j75k6K15M7j30m5k1P1Q2J35
5777A40o2k14mL94j93j95L17k06K7n6k3n4M2K48l6J46l06K3j49R9Q4K67l86J42
$$ y = [-129, 18, -122, 147, 263, 80, 28, 231, 57, -31, 89, -106, 30, -188, -280, -89, -111, -73, 111, -154, 134, 153, 32, 158, -93, 119, 112, -11, -3, 7, 189, 32, -56, -4, -264, -44, -56, -34, 67, -121, 134, 53, -34, -196, 17, 13, 157, 55, -100, -71, -168, -24, -24, -29, 98, -184, -141, -194, -178, -142, -184, -90, -37, 190, 231, 88, 295, 124, -25, 117, -131, -30, 177, 122, 164, 9, -211, -198, -89, 34, -126, -66, 95, 191, 36, -92, -105, 0, 134, 133, 67, -18, 155, 3, 209, 15, -106, -85, -85, -132, -15, 158, 97, 79, -31, 39, -72, 18, 42, 79, 293, 61, 6, -157, 65, 109, 94, 293, -44, -314, 4, -1, -15, 14, -97, -21, 118, 84, 201, 203, 77, -65, -154, 68, 96, 134, 34, 10, -101, -207, -209, -33, -111, 131, -145, -352, -80, 185, 35, 143, -12, 95, 164, 189, 25, 60, -158, 82, -90, -135, -13, -188, -214, 1, 48, -82, -127, -148, -77, 5, 140, 78, -136, -140, 254, 61, -134, 183, -23, 4, -52, -75, -129, -87, 161, 125, 271, -35, -12, -161, -62, 22, 289, -97, 45]
5801D5M7O2j38M18m29j46N3QJ20n0R5L1j93kK69k54KM02m02Q3k6O6n8k1n1J64
$$ y = [45, 92, 154, 16, 434, 5, -141, -88, -80, 40, -10, 85, 116, -77, -79, 190, -64, -62, 340, -62, 21, -5, 61, 3, -18, -69, 95]
$$ [...]
8191a70
##END NTUPLES=NMR FID
##END=
